{"text_format":"1","workbook":"xlsx","n_sheets":10,"sheets":["1 - Cover","2 - WAL Summary","3 - Inputs","4- Senior Debt","5 - Sub Debt & Equity","6- Single Asset","7- GDP Deflator","8 - Real Gilt","Charts>>","Chart Format Instructions"],"not_rendered":{"charts":0,"images":0,"macros":1,"external_links":1,"defined_names":16,"comments":1,"pivot_tables":0},"unopened":[],"bounds":{"document_bytes":16777216,"sheet_cells":100000,"rows_first":2000,"rows_last":500,"rows_between":2000,"halvings":0,"cell_chars":16384,"cell_head_chars":4096},"cells_cut":0,"cells_raw":0,"read":"whole","date_system":"1900"}

{"sheet":"1 - Cover","index":0,"n_rows":67,"n_cols":7,"rows_kept":67,"cut":false,"hidden":false,"merged":[]}
[]
[null,"File Name",null,null,null,null,{"$f":"IFERROR(MID(CELL(\"filename\",G2),FIND(\"[\",CELL(\"filename\",G2))+1,FIND(\"]\",CELL(\"filename\",G2))-FIND(\"[\",CELL(\"filename\",G2))-1),\"Please save the file to show here\")","v":"weighted-average-life-example-financial-model.xlsm"}]
[null,"Sheet Name",null,null,null,null,{"$f":"IFERROR(MID(CELL(\"filename\",G2),FIND(\"]\",CELL(\"filename\",G2))+1,255),\"Please save the file to show here\")","v":"1 - Cover"}]
[null,"Description and Purpose of Sheet",null,null,null,null,"Weighted Average Life Calculation Example"]
[null,"Version number",null,null,null,null,1]
[null,"Date",null,null,null,null,{"$f":"TODAY()","v":"2026-05-20"}]
[]
[]
[null,"WAL Example Cover Sheet"]
[]
[null,null,"Purpose"]
[]
[null,null,"The objective is to determine the Weighted Average Life (WAL) of a project‑finance capital structure. WAL measures the average time it takes for lenders to receive their principal back, weighted by the timing of each repayment."]
[null,null,"This is a core metric used by lenders, sponsors, and financial advisers to benchmark debt pricing and compare maturities across structures."]
[null,null,"The calculations in this workbook are a simulation to produce a total cashflow to be discounted (and whose WAL needs to be known)  "]
[]
[null,null,"Scenario"]
[]
[null,null,"This workbook illustrates a stylised project‑finance structure comprising senior debt, subordinated debt and equity. "]
[null,null,"Subordinated debt increases through capitalised interest during early years when no operating cash is available, reflecting typical construction‑period funding in PFI/PPP‑style projects. "]
[null,null,"Once operational, senior debt amortises on a fixed annuity basis, while subordinated debt receives cash interest and limited principal repayments based on mechanics that are standard for project finance projects."]
[]
[null,null,"What the WAL represents"]
[]
[null,null,"WAL is not the tenor of the loan – it reflects effective maturity, which depends on how quickly principal is repaid."]
[null,null,"A back‑ended principal repayment structure → long WAL"]
[null,null,"A front‑loaded or sculpted principal repayment structure → shorter WAL"]
[null,null,"WAL aligns debt pricing to actual risk exposure, since lenders are exposed for longer if principal is repaid later in the life of the asset."]
[]
[null,null,"How to use the WAL"]
{"$rows_left_out":38}
{"sheet":"2 - WAL Summary","index":1,"n_rows":22,"n_cols":6,"rows_kept":22,"cut":false,"hidden":false,"merged":[]}
[]
[null,"File Name",null,{"$f":"IFERROR(MID(CELL(\"filename\",D2),FIND(\"[\",CELL(\"filename\",D2))+1,FIND(\"]\",CELL(\"filename\",D2))-FIND(\"[\",CELL(\"filename\",D2))-1),\"Please save the file to show here\")","v":"weighted-average-life-example-financial-model.xlsm"}]
[null,"Sheet Name",null,{"$f":"IFERROR(MID(CELL(\"filename\",D2),FIND(\"]\",CELL(\"filename\",D2))+1,255),\"Please save the file to show here\")","v":"2 - WAL Summary"}]
[null,"Description and Purpose of Sheet",null,"Weighted Average Life Calculation Example"]
[null,"Version number",null,1]
[null,"Date",null,{"$f":"TODAY()","v":"2026-05-20"}]
[]
[]
[null,"WAL Summary Results"]
[]
[null,"Facility",null,null,"Total Principal","WAL-Principal (years)"]
[null,"Senior Debt",null,null,{"$f":"'3 - Inputs'!D20","v":90000000},{"$f":"'4- Senior Debt'!D20","v":12.097034876276529}]
[null,"Subordinated Debt",null,null,{"$f":"'3 - Inputs'!D28","v":7999999.9999999991},{"$f":"'5 - Sub Debt & Equity'!C20","v":6.1912969695988744}]
[null,"Equity",null,null,{"$f":"'3 - Inputs'!D34","v":1999999.9999999991},{"$f":"'5 - Sub Debt & Equity'!F20","v":23.34372349760546}]
[null,"Weighted average based on proportion of finance",null,null,{"$f":"SUM(E12:E14)","v":100000000},{"$f":"SUMPRODUCT($E12:$E14,F12:F14)/$E15","v":11.849509616168895}]
[]
[null,"Combo ",null,null,{"$f":"'3 - Inputs'!D16","v":100000000},{"$f":"'6- Single Asset'!D23","v":16.407339080397929}]
[]
[null,"Conclusion"]
[null,"We would recommend using the WAL highlighted in green, which is based on (a) principal repayments only, and (b) considering a total combined level of finance for the project. Please see the cover sheet for more information."]
[]
["END"]

{"sheet":"3 - Inputs","index":2,"n_rows":48,"n_cols":9,"rows_kept":48,"cut":false,"hidden":false,"merged":[[45,2,45,15]]}
[]
[null,"File Name",null,{"$f":"IFERROR(MID(CELL(\"filename\",D2),FIND(\"[\",CELL(\"filename\",D2))+1,FIND(\"]\",CELL(\"filename\",D2))-FIND(\"[\",CELL(\"filename\",D2))-1),\"Please save the file to show here\")","v":"weighted-average-life-example-financial-model.xlsm"}]
[null,"Sheet Name",null,{"$f":"IFERROR(MID(CELL(\"filename\",D2),FIND(\"]\",CELL(\"filename\",D2))+1,255),\"Please save the file to show here\")","v":"3 - Inputs"}]
[null,"Description and Purpose of Sheet",null,"Weighted Average Life Calculation Example"]
[null,"Version number",null,1]
[null,"Date",null,{"$f":"TODAY()","v":"2026-05-20"}]
[]
[]
[null,"Inputs"]
[]
[null,null,"Parameter","Value",null,"Parameter","Value",null,"Notes"]
[]
[null,null,"Start Date","2026-04-01"]
[]
[null,null,"Assets and Liabilities Assumptions / Inputs",null,null,"Cashflow Assumptons / Inputs"]
[null,null,"Total Asets",100000000]
[]
[null,null,"Senior Gearing (Senior Debt / Total Assets)",0.9]
[]
[null,null,"Senior Debt Amount",{"$f":"D16*D18","v":90000000}]
[]
[null,null,"Senior Debt Interest Rate",0.05]
[]
[null,null,"Senior Debt Term (years)",20,null,"Average Annual Debt Service",{"$f":"-PMT($D$22,$D$24,$D$20)","v":7221832.8471622188}]
[]
[null,null,"Junior Gearing (Sub-Debt / Equity)",0.8,null,"Assumed ADSCR",1.2]
[]
[null,null,"Subordinated Debt Amount",{"$f":"D16*(1-D18)*D26","v":7999999.9999999991},null,"CFADS",{"$f":"G26*G24","v":8666199.4165946618},null,"[DBFM-PPP Models are back-solved to calculate this CFADS, to which operational expenses are added to backsolve annual revenue / availability payment]"]
[]
[null,null,"Sub Debt Rate ",0.12,null,"Cashflow to pay Jnr Debt and Equity BEFORE Senior Debt Repaid",{"$f":"G28-G24","v":1444366.569432443}]
{"$rows_left_out":19}
{"sheet":"4- Senior Debt","index":3,"n_rows":94,"n_cols":9,"rows_kept":94,"cut":false,"hidden":false,"merged":[[91,2,91,15]]}
[]
[null,"File Name",null,{"$f":"IFERROR(MID(CELL(\"filename\",D2),FIND(\"[\",CELL(\"filename\",D2))+1,FIND(\"]\",CELL(\"filename\",D2))-FIND(\"[\",CELL(\"filename\",D2))-1),\"Please save the file to show here\")","v":"weighted-average-life-example-financial-model.xlsm"}]
[null,"Sheet Name",null,{"$f":"IFERROR(MID(CELL(\"filename\",D2),FIND(\"]\",CELL(\"filename\",D2))+1,255),\"Please save the file to show here\")","v":"4- Senior Debt"}]
[null,"Description and Purpose of Sheet",null,"Weighted Average Life Calculation Example"]
[null,"Version number",null,1]
[null,"Date",null,{"$f":"TODAY()","v":"2026-05-20"}]
[]
[]
[null,"Senior Debt"]
[]
[null,null,"Inputs"]
[null,null,"Parameter","Value"]
[null,null,"Senior Debt Amount",{"$f":"'3 - Inputs'!D20","v":90000000}]
[null,null,"Senior Debt Interest Rate",{"$f":"'3 - Inputs'!D22","v":0.05}]
[null,null,"Senior Debt Tenor (years)",{"$f":"'3 - Inputs'!D24","v":20}]
[]
[null,null,"Total Annual Debt Service",{"$f":"'3 - Inputs'!G24","v":7221832.8471622188}]
[]
[null,null,"Key Results"]
[null,null,"WAL-Principal",{"$f":"SUMPRODUCT(H26:H50,C26:C50)/SUM(H26:H50)","v":12.097034876276529}]
[null,null,"IRR / YtM",{"$f":"IRR(F25:F50)","v":5.0000000000000044E-2}]
[]
[]
[null,null,"Period","Year","Opening Balance","Payment","Interest","Principal","Closing Balance"]
[null,null,null,null,null,{"$f":"-$D$13","v":-90000000}]
[null,null,1,{"$f":"EDATE('3 - Inputs'!$D$13, 12*(ROW()-ROW($D$26)))","v":"2026-04-01"},{"$f":"IF($C26=1,$D$13,I25)","v":90000000},{"$f":"IF(C26<=$D$15,$D$17,0)","v":7221832.8471622188},{"$f":"E26*$D$14","v":4500000},{"$f":"F26-G26","v":2721832.8471622188},{"$f":"E26-H26","v":87278167.152837783}]
[null,null,{"$f":"C26+1","v":2},{"$f":"EDATE('3 - Inputs'!$D$13, 12*(ROW()-ROW($D$26)))","v":"2027-04-01"},{"$f":"IF($A27=1,$C$4,I26)","v":87278167.152837783},{"$f":"IF(C27<=$D$15,$D$17,0)","v":7221832.8471622188},{"$f":"E27*$D$14","v":4363908.3576418897},{"$f":"F27-G27","v":2857924.4895203291},{"$f":"E27-H27","v":84420242.663317457}]
[null,null,{"$f":"C27+1","v":3},{"$f":"EDATE('3 - Inputs'!$D$13, 12*(ROW()-ROW($D$26)))","v":"2028-04-01"},84420242.663317457,7221832.8471622188,4221012.1331658727,3000820.7139963461,81419421.949321106]
[null,null,4,{"$f":"EDATE('3 - Inputs'!$D$13, 12*(ROW()-ROW($D$26)))","v":"2029-04-01"},81419421.949321106,7221832.8471622188,4070971.0974660553,3150861.7496961635,78268560.199624941]
[null,null,5,{"$f":"EDATE('3 - Inputs'!$D$13, 12*(ROW()-ROW($D$26)))","v":"2030-04-01"},78268560.199624941,7221832.8471622188,3913428.0099812471,{"$f":"F30-G30","v":3308404.8371809716},74960155.362443969]
{"$rows_left_out":65}
{"sheet":"5 - Sub Debt & Equity","index":4,"n_rows":54,"n_cols":18,"rows_kept":54,"cut":false,"hidden":false,"merged":[]}
[]
[null,"File Name",null,{"$f":"IFERROR(MID(CELL(\"filename\",D2),FIND(\"[\",CELL(\"filename\",D2))+1,FIND(\"]\",CELL(\"filename\",D2))-FIND(\"[\",CELL(\"filename\",D2))-1),\"Please save the file to show here\")","v":"weighted-average-life-example-financial-model.xlsm"}]
[null,"Sheet Name",null,{"$f":"IFERROR(MID(CELL(\"filename\",D2),FIND(\"]\",CELL(\"filename\",D2))+1,255),\"Please save the file to show here\")","v":"5 - Sub Debt & Equity"}]
[null,"Description and Purpose of Sheet",null,"Weighted Average Life Calculation Example"]
[null,"Version number",null,1]
[null,"Date",null,{"$f":"TODAY()","v":"2026-05-20"}]
[]
[]
[null,"Sub Debt and Equity"]
[]
[null,"Sub-Debt",null,null,"Equity",null,null,"Blended Sub-Debt & Equity"]
[null,"Inputs",null,null,"Inputs",null,null,"Inputs"]
[null,"Parameter","Value",null,"Parameter","Value",null,"Parameter","Value"]
[null,"Subordinated Debt Amount",{"$f":"'3 - Inputs'!D28","v":7999999.9999999991},null,{"$f":"'3 - Inputs'!C34","v":"Ordinary Share Capital"},{"$f":"'3 - Inputs'!D34","v":1999999.9999999991},null,"Total Shareholder Capital",{"$f":"C14+F14","v":9999999.9999999981}]
[null,"Sub Debt Interest Rate (PIK)",{"$f":"'3 - Inputs'!D30","v":0.12}]
[]
[null,"CFADS",{"$f":"'3 - Inputs'!G28","v":8666199.4165946618},null,null,null,null,"Blended Shareholder IRR"]
[]
[null,"Key Results",null,null,"Key Results",null,null,"Key Results"]
[null,"WAL-Principal",{"$f":"SUMPRODUCT($A$28:$A$52,H$28:H$52)/SUM(H$28:H$52)","v":6.1912969695988744},null,"WAL-Principal",{"$f":"SUMPRODUCT($A$28:$A$52,O$28:O$52)/SUM(O$28:O$52)","v":23.34372349760546},null,"WAL-Principal",{"$f":"SUMPRODUCT($A$28:$A$52,R$28:R$52)/SUM(R$28:R$52)","v":19.364869416823737}]
[null,"IRR / YtM",{"$f":"IRR(G26:G42)","v":0.11999999999999988},null,"Equity IRR / YtM",{"$f":"IRR(N27:N52)","v":0.19018440834520534},null,"Equity IRR / YtM",{"$f":"IRR(Q27:Q52)","v":0.1602910926554304}]
[]
[]
[]
[]
["Period","Year","Opening Balance","Change in Balance","Closing Balance","Interest accrued","Payment","WAL Calc",null,"Opening Balance","Change in Balance","Closing Balance","Interest accrued","Payment = Dividends & capital reductions","WAL Calc",null,"Combined Shareholder Cashflow","WAL Calc"]
[null,null,null,null,null,null,{"$f":"-C14","v":-7999999.9999999991},null,null,null,null,null,null,{"$f":"-'3 - Inputs'!D34","v":-1999999.9999999991},null,null,{"$f":"N27+G27","v":-9999999.9999999981}]
[{"$f":"'4- Senior Debt'!C26","v":1},{"$f":"'4- Senior Debt'!D26","v":"2026-04-01"},{"$f":"IF($A28=1,$C$14,E27)","v":7999999.9999999991},{"$f":"-MIN(C28,(G28-F28))","v":-484366.56943244312},{"$f":"C28+D28","v":7515633.4305675561},{"$f":"C28*$C$15","v":959999.99999999988},{"$f":"MIN(C28+F28,$C$17-'4- Senior Debt'!F26)","v":1444366.569432443},{"$f":"MIN(0,D28)","v":-484366.56943244312},null,{"$f":"IF($A28=1,$F$14,L27)","v":1999999.9999999991},{"$f":"-MIN(J28,N28-M28)","v":380368.81669041049},{"$f":"J28+K28","v":2380368.8166904096},{"$f":"J28*$F$21","v":380368.81669041049},{"$f":"$C$17-'4- Senior Debt'!F26-'5 - Sub Debt & Equity'!G28","v":0},{"$f":"MIN(0,K28)","v":0},null,1444366.569432443,{"$f":"H28+O28","v":-484366.56943244312}]
[{"$f":"'4- Senior Debt'!C27","v":2},{"$f":"'4- Senior Debt'!D27","v":"2027-04-01"},{"$f":"IF($A29=1,$C$14,E28)","v":7515633.4305675561},{"$f":"-MIN(C29,(G29-F29))","v":-542490.55776433635},{"$f":"C29+D29","v":6973142.8728032196},{"$f":"C29*$C$15","v":901876.01166810666},{"$f":"MIN(C29+F29,$C$17-'4- Senior Debt'!F27)","v":1444366.569432443},{"$f":"MIN(0,D29)","v":-542490.55776433635},null,{"$f":"IF($A29=1,$F$14,L28)","v":2380368.8166904096},{"$f":"-MIN(J29,N29-M29)","v":452709.03504564206},{"$f":"J29+K29","v":2833077.8517360515},{"$f":"J29*$F$21","v":452709.03504564206},{"$f":"$C$17-'4- Senior Debt'!F27-'5 - Sub Debt & Equity'!G29","v":0},{"$f":"MIN(0,K29)","v":0},null,1444366.569432443,{"$f":"H29+O29","v":-542490.55776433635}]
[{"$f":"'4- Senior Debt'!C28","v":3},{"$f":"'4- Senior Debt'!D28","v":"2028-04-01"},6973142.8728032196,-607589.42469605664,6365553.4481071625,836777.14473638637,{"$f":"MIN(C30+F30,$C$17-'4- Senior Debt'!F28)","v":1444366.569432443},-607589.42469605664,null,{"$f":"IF($A30=1,$F$14,L29)","v":2833077.8517360515},538807.23502832628,3371885.0867643775,{"$f":"J30*$F$21","v":538807.23502832628},{"$f":"$C$17-'4- Senior Debt'!F28-'5 - Sub Debt & Equity'!G30","v":0},0,null,1444366.569432443,-607589.42469605664]
{"$rows_left_out":25}
{"sheet":"6- Single Asset","index":5,"n_rows":63,"n_cols":14,"rows_kept":63,"cut":false,"hidden":false,"merged":[[60,2,60,15]]}
[]
[null,"File Name",null,{"$f":"IFERROR(MID(CELL(\"filename\",D2),FIND(\"[\",CELL(\"filename\",D2))+1,FIND(\"]\",CELL(\"filename\",D2))-FIND(\"[\",CELL(\"filename\",D2))-1),\"Please save the file to show here\")","v":"weighted-average-life-example-financial-model.xlsm"}]
[null,"Sheet Name",null,{"$f":"IFERROR(MID(CELL(\"filename\",D2),FIND(\"]\",CELL(\"filename\",D2))+1,255),\"Please save the file to show here\")","v":"6- Single Asset"}]
[null,"Description and Purpose of Sheet",null,"Weighted Average Life Calculation Example"]
[null,"Version number",null,1]
[null,"Date",null,{"$f":"TODAY()","v":"2026-05-20"}]
[]
[]
[null,"Single Asset"]
[]
[]
[]
[null,null,"Treat the CFADS as a Single Asset",null,null,"Aggregate of the Three Instruments"]
[null,null,"Inputs"]
[null,null,"Parameter","Value"]
[null,null,"Total Capital",{"$f":"'3 - Inputs'!D20+'3 - Inputs'!D28+'3 - Inputs'!D34","v":100000000}]
[null,null,"CFADS",{"$f":"'3 - Inputs'!G28","v":8666199.4165946618}]
[]
[]
[]
[]
[null,null,"Key Results"]
[null,null,"WAL-Principal",{"$f":"SUMPRODUCT(G30:G54,B30:B54)/SUM(G30:G54)","v":16.407339080397929},null,"WAL-Principal",{"$f":"SUMPRODUCT($B$30:$B$54,L$30:L$54)/SUM(L$30:L$54)","v":14.341588715042414}]
[null,null,"IRR / YtM",{"$f":"IRR(E29:E54)","v":7.1099271395101304E-2}]
[]
[]
[]
[null,"Period","Year","Opening Balance","Payment","Interest","Principal","Closing Balance",null,"Total Payment","Total \"Interest\"","Total Net \"Principal\"",null,"Delta between \"Whole Asset\" and Sum-of-the-Liabilities"]
[null,null,null,null,{"$f":"-$D$16","v":-100000000}]
[null,1,{"$f":"EDATE('3 - Inputs'!$D$13, 12*(ROW()-ROW($B$30)))","v":"2026-04-01"},{"$f":"IF($B30=1,$D$16,H29)","v":100000000},{"$f":"$D$17","v":8666199.4165946618},{"$f":"D30*$D$24","v":7109927.1395101305},{"$f":"E30-F30","v":1556272.2770845313},{"$f":"D30-G30","v":98443727.722915471},null,{"$f":"L30+K30","v":8666199.4165946618},{"$f":"'4- Senior Debt'!G26+'5 - Sub Debt & Equity'!F28+'5 - Sub Debt & Equity'!M28","v":5840368.8166904105},{"$f":"'4- Senior Debt'!H26+'5 - Sub Debt & Equity'!D28*-1+'5 - Sub Debt & Equity'!K28*-1","v":2825830.5999042513},null,{"$f":"G30-L30","v":-1269558.32281972}]
{"$rows_left_out":34}
{"sheet":"7- GDP Deflator","index":6,"n_rows":128,"n_cols":5,"rows_kept":128,"cut":false,"hidden":false,"merged":[]}
[]
[null,"File Name",null,{"$f":"IFERROR(MID(CELL(\"filename\",D2),FIND(\"[\",CELL(\"filename\",D2))+1,FIND(\"]\",CELL(\"filename\",D2))-FIND(\"[\",CELL(\"filename\",D2))-1),\"Please save the file to show here\")","v":"weighted-average-life-example-financial-model.xlsm"}]
[null,"Sheet Name",null,{"$f":"IFERROR(MID(CELL(\"filename\",D2),FIND(\"]\",CELL(\"filename\",D2))+1,255),\"Please save the file to show here\")","v":"7- GDP Deflator"}]
[null,"Description and Purpose of Sheet",null,"Weighted Average Life Calculation Example"]
[null,"Version number",null,1]
[null,"Date",null,{"$f":"TODAY()","v":"2026-05-20"}]
[]
[]
[null,"GDP Deflator"]
[null,"GDP Deflator Series - Base Year = 2023. "]
[]
[null,"Taken from TAG Data Book here: ",null,"TAG Data Book"]
[null,null,"(2023=100)"]
[]
[null,null,"Year","GDP Deflator","YoY % change"]
[null,null,1990,44.634926634359687]
[null,null,1991,47.634346188631369,{"$f":"(D17-D16)/(D16)*100","v":6.7198935462408667}]
[null,null,1992,49.198849907533649,{"$f":"((D18-D17)/D17)*100","v":3.2844026297891578}]
[null,null,1993,50.675404157403591,3.0011966796887299]
[null,null,1994,51.611905056108021,1.8480383418266422]
[null,null,1995,52.959494441115908,2.6110049290815809]
[null,null,1996,55.150443433538967,4.1370277710243455]
[null,null,1997,55.071943081014233,{"$f":"((D23-D22)/D22)*100","v":-0.14233856998690217}]
[null,null,1998,55.778238580846526,1.2824960593696308]
[null,null,1999,56.548705003774458,1.3813028925450852]
[null,null,2000,57.184391720912551,1.1241401851654471]
[null,null,2001,58.04831094446515,1.5107605371915866]
[null,null,2002,59.27586539889289,2.1147117538047597]
[null,null,2003,60.690636963905419,2.386758178040794]
[null,null,2004,62.261474705961149,2.5882703175284765]
{"$rows_left_out":99}
{"sheet":"8 - Real Gilt","index":7,"n_rows":24,"n_cols":4,"rows_kept":24,"cut":false,"hidden":false,"merged":[]}
[]
[null,"File Name",null,{"$f":"IFERROR(MID(CELL(\"filename\",D2),FIND(\"[\",CELL(\"filename\",D2))+1,FIND(\"]\",CELL(\"filename\",D2))-FIND(\"[\",CELL(\"filename\",D2))-1),\"Please save the file to show here\")","v":"weighted-average-life-example-financial-model.xlsm"}]
[null,"Sheet Name",null,{"$f":"IFERROR(MID(CELL(\"filename\",D2),FIND(\"]\",CELL(\"filename\",D2))+1,255),\"Please save the file to show here\")","v":"8 - Real Gilt"}]
[null,"Description and Purpose of Sheet",null,"Weighted Average Life Calculation Example"]
[null,"Version number",null,1]
[null,"Date",null,{"$f":"TODAY()","v":"2026-05-20"}]
[]
[]
[null,"Real Gilt"]
[]
[null,"Purpose: To ensure gilt rates are net of inflation, i.e., to go from nominal to real rates. Using real rates from the DMO/BoE is not consistent  given they use index-linked measures which are linked to RPI, and appraisal methods use GDP deflation instead."]
[null,"Its important we ensure consistency across appraisal by using the same deflator data which will be used for inflation adjustments across the rest of the appraisal modelling."]
[]
[null,"Start of the appraisal period",2023]
[null,"End of the appraisal period",2060]
[null,"Length of the appraisal period",{"$f":"C15-C14","v":37}]
[null,"CAGR Appraisal period",{"$f":"((_xlfn.XLOOKUP(C15,'7- GDP Deflator'!$C$16:$C$126,'7- GDP Deflator'!$D$16:$D$126,,0)/_xlfn.XLOOKUP(C14,'7- GDP Deflator'!$C$16:$C$126,'7- GDP Deflator'!$D$16:$D$126,,0))^(1/C16)-1)*100","v":2.3257630423085374}]
[null,"WAL ",{"$f":"'2 - WAL Summary'!F17","v":16.407339080397929}]
[null,"Nearest liquidity benchmark",{"$f":"_xlfn.LET(_xlpm.x,$C$18,_xlpm.b,{5,10,30},INDEX(_xlpm.b,_xlfn.XMATCH(MIN(ABS(_xlpm.b-_xlpm.x)),ABS(_xlpm.b-_xlpm.x),0)))","v":10}]
[null,"Corresponding gilt rate (read off curve using a benchmark maturity)",4.5,"Gilt Rate Yield Curve: https://www.bankofengland.co.uk/statistics/yield-curves > Latest Yield Curve Data > Use GLC Daily Data Current Month"]
[]
[null,"Real gilt rate",{"$f":"((1+C20/100)/(1+C17/100))-1","v":2.1248187094314419E-2}]
[]
["END"]

{"sheet":"Charts>>","index":8,"n_rows":11,"n_cols":3,"rows_kept":11,"cut":false,"hidden":true,"merged":[]}
[]
[]
[]
[]
[]
[]
[]
[]
[]
[]
[null,null,"Charts"]

{"sheet":"Chart Format Instructions","index":9,"n_rows":29,"n_cols":1,"rows_kept":29,"cut":false,"hidden":true,"merged":[[28,0,29,17]]}
["Chart formatting tool"]
[]
["This toolkit allows you to automatically format your charts and graphs to the DfT statistics house style. "]
["Once formatted, the font on the charts and text will be a suitable size for reading and printing when pasted in word or used in presentations."]
[]
["To use the toolkit:"]
[]
["Go to the worksheet containing the chart to be formatted and click on it"]
["Select the appropriate chart type from the DfT tab at the top of the spreadsheet"]
["Click the appropriate button"]
[]
["The chart will be moved to a new sheet, if not already the case, and formatted to a consistent style. "]
["If you want to keep the original chart - take a copy before running the macro"]
["You can reposition the location of any text boxes or labels if you have applied if needed but do not adjust any formatting."]
[]
["Formatting the chart"]
[]
["When you run the macro for either bar or line charts you will be presented with some formatting options for your axes"]
["For bar charts, you will be asked to change the increments for your value axes labels. It is recommended you have no more than 6 values showing."]
["For example, if you have a chart with values ranging from 0 to 1000, you should have increments of 200"]
["For line charts, you will be asked the same as above and also the increments for your category axes. Try to make it so your labels do no overlap"]
["For example, if you have a chart showing data over time from 1990 to 2014, you may want to reduce the frequency of your labels to show one every 3 years"]
["For line charts, you will also be given two different label options to use for your chart. Where possible, move the text box labels and position them on the chart next to the lines and delete the legend above the chart"]
["Where this isn't possible, delete the individual text boxes and leave the legend above the chart"]
[]
["Exporting the chart"]
[]
["When copying and exporting the chart to another location e.g. word, the chart will look better if copied from it's own worksheet (i.e. how the macro places it)."]
["If you do embed it in a worksheet, the chart is set up to retain the original font size, even if the chart is resized. This is to ensure the font is still readable when copied and pasted elsewhere. Please do not adjust the font manaully - it will become small and unreadable when pasted elsewhere."]