{"text_format":"1","workbook":"xlsx","n_sheets":12,"sheets":["STATISTICAL NEIGHBOURS","3-4 year olds ","2 year olds  (FRAS)","2 year olds (WP)","9mth - 2 year","Other EYFF funds","DAF","EYPP","EY Data","Options","Stat Neighbours","Select LAs"],"not_rendered":{"charts":29,"images":0,"macros":1,"external_links":0,"defined_names":54,"comments":0,"pivot_tables":0},"unopened":[],"bounds":{"document_bytes":16777216,"sheet_cells":100000,"rows_first":2000,"rows_last":500,"rows_between":2000,"halvings":0,"cell_chars":16384,"cell_head_chars":4096},"cells_cut":0,"cells_raw":0,"read":"whole","date_system":"1900"}

{"sheet":"STATISTICAL NEIGHBOURS","index":0,"n_rows":27,"n_cols":4,"rows_kept":27,"cut":false,"hidden":false,"merged":[]}
[null,"Early Years Funding Benchmarking Tool: 2025-2026"]
[null,"This worksheet allows you to view data for your own local authority along with your statistical "]
[null,"neighbours, or with your own choice of other local authorities."]
[]
[null,"Choose Local Authorities",null,"Other Local Authorities"]
[]
[null,"1. Please select your local authority"]
[]
[null,"My Local Authority"]
[]
[]
[]
[null,"2. Then either select your statistical neighbours:"]
[]
[]
[]
[]
[null,"Or make your own selection of local authorities \nusing the drop down boxes"]
[]
[null,"3. When you have made your selection, press the \"Create Table\" button to view the benchmarking table"]
[]
[]
[]
[]
[]
[null,"Note: When statistical neighbours are selected, local authorities are shown in order of closeness to your local authority"]
[null,"Cumberland & Westmorland and Furness are now part of the Statisitcal Neighbours data and will be automatically selected as a statistical neighbour."]

{"sheet":"3-4 year olds ","index":1,"n_rows":34,"n_cols":13,"rows_kept":34,"cut":false,"hidden":true,"merged":[[4,1,4,2],[14,3,14,4],[6,1,6,2],[7,1,7,2],[8,1,8,2],[5,1,5,2],[17,9,17,12],[18,1,18,2],[17,3,17,6],[17,7,18,7],[17,8,18,8]]}
[]
[null,{"$f":"CONCATENATE('Select LAs'!B3,\" - Key Budget Statistics\")","v":"No LA selected - Key Budget Statistics"},null,null,null,null,null,null,null,null,"Financial Year 2025-2026"]
[]
[null,null,null,"PVIs","Nursery Schools","Primary Nursery Places","Centrally Retained"]
[null,{"$f":"'Select LAs'!D3","v":"No LA selected"},null,"All providers","Private, Voluntary, Independent","Nursery schools","Primary nursery places"]
["Total FTE","3-4 year old hourly average funding rate (£/hr)1",null,{"$f":"IFERROR(IF(INDEX('EY Data'!E:E, MATCH('Select LAs'!$A$3,'EY Data'!$B:$B, 0))=\"\",\"-\", INDEX('EY Data'!E:E, MATCH('Select LAs'!$A$3,'EY Data'!$B:$B, 0))), 0)","v":0},{"$f":"IFERROR(IF(INDEX('EY Data'!H:H, MATCH('Select LAs'!$A$3,'EY Data'!$B:$B, 0))=\"\",\"-\", INDEX('EY Data'!H:H, MATCH('Select LAs'!$A$3,'EY Data'!$B:$B, 0))), 0)","v":0},{"$f":"IFERROR(IF(INDEX('EY Data'!G:G, MATCH('Select LAs'!$A$3,'EY Data'!$B:$B, 0))=\"\",\"-\", INDEX('EY Data'!G:G, MATCH('Select LAs'!$A$3,'EY Data'!$B:$B, 0))), 0)","v":0},{"$f":"IFERROR(IF(INDEX('EY Data'!F:F, MATCH('Select LAs'!$A$3,'EY Data'!$B:$B, 0))=\"\",\"-\", INDEX('EY Data'!F:F, MATCH('Select LAs'!$A$3,'EY Data'!$B:$B, 0))), 0)","v":0}]
["Total budget","3-4 year old hourly average base rate for statutory hours (£/hr)",null,{"$f":"IFERROR(IF(INDEX('EY Data'!S:S, MATCH('Select LAs'!$A$3,'EY Data'!$B:$B, 0))=\"\",\"-\", INDEX('EY Data'!S:S, MATCH('Select LAs'!$A$3,'EY Data'!$B:$B, 0))), 0)","v":0},{"$f":"IFERROR(IF(INDEX('EY Data'!V:V, MATCH('Select LAs'!$A$3,'EY Data'!$B:$B, 0))=\"\",\"-\", INDEX('EY Data'!V:V, MATCH('Select LAs'!$A$3,'EY Data'!$B:$B, 0))), 0)","v":0},{"$f":"IFERROR(IF(INDEX('EY Data'!U:U, MATCH('Select LAs'!$A$3,'EY Data'!$B:$B, 0))=\"\",\"-\", INDEX('EY Data'!U:U, MATCH('Select LAs'!$A$3,'EY Data'!$B:$B, 0))), 0)","v":0},{"$f":"IFERROR(IF(INDEX('EY Data'!T:T, MATCH('Select LAs'!$A$3,'EY Data'!$B:$B, 0))=\"\",\"-\", INDEX('EY Data'!T:T, MATCH('Select LAs'!$A$3,'EY Data'!$B:$B, 0))), 0)","v":0}]
["Total Hours"]
[null,"Pass-through rate (%)",null,{"$f":"IF(OR('Select LAs'!$A$3 = \"LA No\", 'Select LAs'!$A$3 = 201, 'Select LAs'!$A$3 = 420), \"-\", INDEX('EY Data'!AH:AH, MATCH('Select LAs'!$A$3,'EY Data'!$B:$B, 0)))","v":"-"}]
[]
[null,{"$f":"CONCATENATE(\"Benchmarking against \",IF(_SN=1,\"Statistical Neighbours\",\"Manual Selection\"))","v":"Benchmarking against Manual Selection"}]
[]
[]
[]
[null,null,"Table ordering"]
[]
[]
[null,null,null,"Average funding rate to providers per hour",null,null,null,"Pass-through rate","Funding paid through supplements","SEN Inclusion Fund (top-up grant element) budget"]
[null,"Local Authority",null,"All providers","Private, Voluntary, Independent","Nursery schools","Primary nursery places",null,null,"All providers","Private, Voluntary, Independent","Nursery schools","Primary nursery places"]
[null,"England",null,{"$f":"ROUND(INDEX('EY Data'!E:E, MATCH($B20,'EY Data'!$C:$C, 0)), 5)","v":5.8298699999999997},{"$f":"ROUND(INDEX('EY Data'!H:H, MATCH($B20,'EY Data'!$C:$C, 0)),5)","v":5.6321399999999997},{"$f":"ROUND(INDEX('EY Data'!G:G, MATCH($B20,'EY Data'!$C:$C, 0)), 5)","v":8.8230599999999999},{"$f":"ROUND(INDEX('EY Data'!F:F, MATCH($B20,'EY Data'!$C:$C, 0)), 5)","v":5.8018700000000001},{"$f":"IF(INDEX('EY Data'!AH:AH, MATCH($B20,'EY Data'!$C:$C, 0))=\"-\", \"-\", ROUND(INDEX('EY Data'!AH:AH, MATCH($B20,'EY Data'!$C:$C, 0)), 3))","v":0.97299999999999998},{"$f":"IF(INDEX('EY Data'!AJ:AJ, MATCH($B20,'EY Data'!$C:$C, 0))=\"-\", \"-\", ROUND(INDEX('EY Data'!AJ:AJ, MATCH($B20,'EY Data'!$C:$C, 0)), 3))","v":4.1000000000000002E-2},{"$f":"ROUND(INDEX('EY Data'!Z:Z, MATCH($B20,'EY Data'!$C:$C, 0)), 0)","v":86778014},{"$f":"ROUND(INDEX('EY Data'!AC:AC, MATCH($B20,'EY Data'!$C:$C, 0)), 0)","v":58642880},{"$f":"ROUND(INDEX('EY Data'!AB:AB, MATCH($B20,'EY Data'!$C:$C, 0)), 0)","v":6987352},{"$f":"ROUND(INDEX('EY Data'!AA:AA, MATCH($B20,'EY Data'!$C:$C, 0)), 0)","v":21147782}]
[null,{"$f":"'Select LAs'!G3","v":"No LA selected"},null,{"$f":"IF('Select LAs'!$H3=0,\"-\",IF(INDEX('EY Data'!E:E, MATCH('Select LAs'!$H3,'EY Data'!$B:$B, 0))=\"\",\"-\", ROUND(INDEX('EY Data'!E:E, MATCH('Select LAs'!$H3,'EY Data'!$B:$B, 0)), 5)))","v":5.7127999999999997},{"$f":"IF('Select LAs'!$H3=0,\"-\",IF(INDEX('EY Data'!H:H, MATCH('Select LAs'!$H3,'EY Data'!$B:$B, 0))=\"\",\"-\", ROUND(INDEX('EY Data'!H:H, MATCH('Select LAs'!$H3,'EY Data'!$B:$B, 0)), 5)))","v":5.7127999999999997},{"$f":"IF('Select LAs'!$H3=0,\"-\",IF(INDEX('EY Data'!G:G, MATCH('Select LAs'!$H3,'EY Data'!$B:$B, 0))=\"\",\"-\", ROUND(INDEX('EY Data'!G:G, MATCH('Select LAs'!$H3,'EY Data'!$B:$B, 0)), 5)))","v":0},{"$f":"IF('Select LAs'!$H3=0,\"-\",IF(INDEX('EY Data'!F:F, MATCH('Select LAs'!$H3,'EY Data'!$B:$B, 0))=\"\",\"-\", ROUND(INDEX('EY Data'!F:F, MATCH('Select LAs'!$H3,'EY Data'!$B:$B, 0)), 5)))","v":5.7127999999999997},{"$f":"IF(OR('Select LAs'!$H3=0,'Select LAs'!$H3=201, 'Select LAs'!$H3=420), \"-\",IF(INDEX('EY Data'!AH:AH, MATCH('Select LAs'!$H3,'EY Data'!$B:$B, 0))=\"-\", \"-\", ROUND(INDEX('EY Data'!AH:AH, MATCH('Select LAs'!$H3,'EY Data'!$B:$B, 0)),3)))","v":0.96499999999999997},{"$f":"IF(OR('Select LAs'!$H3=0,'Select LAs'!$H3=201, 'Select LAs'!$H3=420), \"-\",IF(INDEX('EY Data'!AJ:AJ, MATCH('Select LAs'!$H3,'EY Data'!$B:$B, 0))=\"\", \"-\", ROUND(INDEX('EY Data'!AJ:AJ, MATCH('Select LAs'!$H3,'EY Data'!$B:$B, 0)),3)))","v":2.1999999999999999E-2},{"$f":"IF('Select LAs'!$H3=0,\"-\",IF(INDEX('EY Data'!Z:Z, MATCH('Select LAs'!$H3,'EY Data'!$B:$B, 0))=\"\",\"-\", ROUND(INDEX('EY Data'!Z:Z, MATCH('Select LAs'!$H3,'EY Data'!$B:$B, 0)), 0)))","v":88836},{"$f":"IF('Select LAs'!$H3=0,\"-\",IF(INDEX('EY Data'!AC:AC, MATCH('Select LAs'!$H3,'EY Data'!$B:$B, 0))=\"\",\"-\", ROUND(INDEX('EY Data'!AC:AC, MATCH('Select LAs'!$H3,'EY Data'!$B:$B, 0)), 0)))","v":47083},{"$f":"IF('Select LAs'!$H3=0,\"-\",IF(INDEX('EY Data'!AB:AB, MATCH('Select LAs'!$H3,'EY Data'!$B:$B, 0))=\"\",\"-\", ROUND(INDEX('EY Data'!AB:AB, MATCH('Select LAs'!$H3,'EY Data'!$B:$B, 0)), 0)))","v":0},{"$f":"IF('Select LAs'!$H3=0,\"-\",IF(INDEX('EY Data'!AA:AA, MATCH('Select LAs'!$H3,'EY Data'!$B:$B, 0))=\"\",\"-\", ROUND(INDEX('EY Data'!AA:AA, MATCH('Select LAs'!$H3,'EY Data'!$B:$B, 0)), 0)))","v":41753}]
[null,{"$f":"'Select LAs'!G4","v":"No LA selected"},null,{"$f":"IF('Select LAs'!$H4=0,\"-\",IF(INDEX('EY Data'!E:E, MATCH('Select LAs'!$H4,'EY Data'!$B:$B, 0))=\"\",\"-\", ROUND(INDEX('EY Data'!E:E, MATCH('Select LAs'!$H4,'EY Data'!$B:$B, 0)), 5)))","v":5.8853600000000004},{"$f":"IF('Select LAs'!$H4=0,\"-\",IF(INDEX('EY Data'!H:H, MATCH('Select LAs'!$H4,'EY Data'!$B:$B, 0))=\"\",\"-\", ROUND(INDEX('EY Data'!H:H, MATCH('Select LAs'!$H4,'EY Data'!$B:$B, 0)), 5)))","v":5.4835000000000003},{"$f":"IF('Select LAs'!$H4=0,\"-\",IF(INDEX('EY Data'!G:G, MATCH('Select LAs'!$H4,'EY Data'!$B:$B, 0))=\"\",\"-\", ROUND(INDEX('EY Data'!G:G, MATCH('Select LAs'!$H4,'EY Data'!$B:$B, 0)), 5)))","v":10.77059},{"$f":"IF('Select LAs'!$H4=0,\"-\",IF(INDEX('EY Data'!F:F, MATCH('Select LAs'!$H4,'EY Data'!$B:$B, 0))=\"\",\"-\", ROUND(INDEX('EY Data'!F:F, MATCH('Select LAs'!$H4,'EY Data'!$B:$B, 0)), 5)))","v":5.4934900000000004},{"$f":"IF(OR('Select LAs'!$H4=0,'Select LAs'!$H4=201, 'Select LAs'!$H4=420), \"-\",IF(INDEX('EY Data'!AH:AH, MATCH('Select LAs'!$H4,'EY Data'!$B:$B, 0))=\"-\", \"-\", ROUND(INDEX('EY Data'!AH:AH, MATCH('Select LAs'!$H4,'EY Data'!$B:$B, 0)),3)))","v":0.96199999999999997},{"$f":"IF(OR('Select LAs'!$H4=0,'Select LAs'!$H4=201, 'Select LAs'!$H4=420), \"-\",IF(INDEX('EY Data'!AJ:AJ, MATCH('Select LAs'!$H4,'EY Data'!$B:$B, 0))=\"\", \"-\", ROUND(INDEX('EY Data'!AJ:AJ, MATCH('Select LAs'!$H4,'EY Data'!$B:$B, 0)),3)))","v":0.03},{"$f":"IF('Select LAs'!$H4=0,\"-\",IF(INDEX('EY Data'!Z:Z, MATCH('Select LAs'!$H4,'EY Data'!$B:$B, 0))=\"\",\"-\", ROUND(INDEX('EY Data'!Z:Z, MATCH('Select LAs'!$H4,'EY Data'!$B:$B, 0)), 0)))","v":289074},{"$f":"IF('Select LAs'!$H4=0,\"-\",IF(INDEX('EY Data'!AC:AC, MATCH('Select LAs'!$H4,'EY Data'!$B:$B, 0))=\"\",\"-\", ROUND(INDEX('EY Data'!AC:AC, MATCH('Select LAs'!$H4,'EY Data'!$B:$B, 0)), 0)))","v":201074},{"$f":"IF('Select LAs'!$H4=0,\"-\",IF(INDEX('EY Data'!AB:AB, MATCH('Select LAs'!$H4,'EY Data'!$B:$B, 0))=\"\",\"-\", ROUND(INDEX('EY Data'!AB:AB, MATCH('Select LAs'!$H4,'EY Data'!$B:$B, 0)), 0)))","v":27823},{"$f":"IF('Select LAs'!$H4=0,\"-\",IF(INDEX('EY Data'!AA:AA, MATCH('Select LAs'!$H4,'EY Data'!$B:$B, 0))=\"\",\"-\", ROUND(INDEX('EY Data'!AA:AA, MATCH('Select LAs'!$H4,'EY Data'!$B:$B, 0)), 0)))","v":60177}]
["",{"$f":"'Select LAs'!G5","v":"No LA selected"},null,{"$f":"IF('Select LAs'!$H5=0,\"-\",IF(INDEX('EY Data'!E:E, MATCH('Select LAs'!$H5,'EY Data'!$B:$B, 0))=\"\",\"-\", ROUND(INDEX('EY Data'!E:E, MATCH('Select LAs'!$H5,'EY Data'!$B:$B, 0)), 5)))","v":5.82728},{"$f":"IF('Select LAs'!$H5=0,\"-\",IF(INDEX('EY Data'!H:H, MATCH('Select LAs'!$H5,'EY Data'!$B:$B, 0))=\"\",\"-\", ROUND(INDEX('EY Data'!H:H, MATCH('Select LAs'!$H5,'EY Data'!$B:$B, 0)), 5)))","v":5.5724900000000002},{"$f":"IF('Select LAs'!$H5=0,\"-\",IF(INDEX('EY Data'!G:G, MATCH('Select LAs'!$H5,'EY Data'!$B:$B, 0))=\"\",\"-\", ROUND(INDEX('EY Data'!G:G, MATCH('Select LAs'!$H5,'EY Data'!$B:$B, 0)), 5)))","v":10.134259999999999},{"$f":"IF('Select LAs'!$H5=0,\"-\",IF(INDEX('EY Data'!F:F, MATCH('Select LAs'!$H5,'EY Data'!$B:$B, 0))=\"\",\"-\", ROUND(INDEX('EY Data'!F:F, MATCH('Select LAs'!$H5,'EY Data'!$B:$B, 0)), 5)))","v":5.8673299999999999},{"$f":"IF(OR('Select LAs'!$H5=0,'Select LAs'!$H5=201, 'Select LAs'!$H5=420), \"-\",IF(INDEX('EY Data'!AH:AH, MATCH('Select LAs'!$H5,'EY Data'!$B:$B, 0))=\"-\", \"-\", ROUND(INDEX('EY Data'!AH:AH, MATCH('Select LAs'!$H5,'EY Data'!$B:$B, 0)),3)))","v":0.97499999999999998},{"$f":"IF(OR('Select LAs'!$H5=0,'Select LAs'!$H5=201, 'Select LAs'!$H5=420), \"-\",IF(INDEX('EY Data'!AJ:AJ, MATCH('Select LAs'!$H5,'EY Data'!$B:$B, 0))=\"\", \"-\", ROUND(INDEX('EY Data'!AJ:AJ, MATCH('Select LAs'!$H5,'EY Data'!$B:$B, 0)),3)))","v":6.2E-2},{"$f":"IF('Select LAs'!$H5=0,\"-\",IF(INDEX('EY Data'!Z:Z, MATCH('Select LAs'!$H5,'EY Data'!$B:$B, 0))=\"\",\"-\", ROUND(INDEX('EY Data'!Z:Z, MATCH('Select LAs'!$H5,'EY Data'!$B:$B, 0)), 0)))","v":507607},{"$f":"IF('Select LAs'!$H5=0,\"-\",IF(INDEX('EY Data'!AC:AC, MATCH('Select LAs'!$H5,'EY Data'!$B:$B, 0))=\"\",\"-\", ROUND(INDEX('EY Data'!AC:AC, MATCH('Select LAs'!$H5,'EY Data'!$B:$B, 0)), 0)))","v":289336},{"$f":"IF('Select LAs'!$H5=0,\"-\",IF(INDEX('EY Data'!AB:AB, MATCH('Select LAs'!$H5,'EY Data'!$B:$B, 0))=\"\",\"-\", ROUND(INDEX('EY Data'!AB:AB, MATCH('Select LAs'!$H5,'EY Data'!$B:$B, 0)), 0)))","v":15228},{"$f":"IF('Select LAs'!$H5=0,\"-\",IF(INDEX('EY Data'!AA:AA, MATCH('Select LAs'!$H5,'EY Data'!$B:$B, 0))=\"\",\"-\", ROUND(INDEX('EY Data'!AA:AA, MATCH('Select LAs'!$H5,'EY Data'!$B:$B, 0)), 0)))","v":203043}]
["",{"$f":"'Select LAs'!G6","v":"No LA selected"},null,{"$f":"IF('Select LAs'!$H6=0,\"-\",IF(INDEX('EY Data'!E:E, MATCH('Select LAs'!$H6,'EY Data'!$B:$B, 0))=\"\",\"-\", ROUND(INDEX('EY Data'!E:E, MATCH('Select LAs'!$H6,'EY Data'!$B:$B, 0)), 5)))","v":5.68248},{"$f":"IF('Select LAs'!$H6=0,\"-\",IF(INDEX('EY Data'!H:H, MATCH('Select LAs'!$H6,'EY Data'!$B:$B, 0))=\"\",\"-\", ROUND(INDEX('EY Data'!H:H, MATCH('Select LAs'!$H6,'EY Data'!$B:$B, 0)), 5)))","v":5.47241},{"$f":"IF('Select LAs'!$H6=0,\"-\",IF(INDEX('EY Data'!G:G, MATCH('Select LAs'!$H6,'EY Data'!$B:$B, 0))=\"\",\"-\", ROUND(INDEX('EY Data'!G:G, MATCH('Select LAs'!$H6,'EY Data'!$B:$B, 0)), 5)))","v":10.474360000000001},{"$f":"IF('Select LAs'!$H6=0,\"-\",IF(INDEX('EY Data'!F:F, MATCH('Select LAs'!$H6,'EY Data'!$B:$B, 0))=\"\",\"-\", ROUND(INDEX('EY Data'!F:F, MATCH('Select LAs'!$H6,'EY Data'!$B:$B, 0)), 5)))","v":5.7455499999999997},{"$f":"IF(OR('Select LAs'!$H6=0,'Select LAs'!$H6=201, 'Select LAs'!$H6=420), \"-\",IF(INDEX('EY Data'!AH:AH, MATCH('Select LAs'!$H6,'EY Data'!$B:$B, 0))=\"-\", \"-\", ROUND(INDEX('EY Data'!AH:AH, MATCH('Select LAs'!$H6,'EY Data'!$B:$B, 0)),3)))","v":0.96},{"$f":"IF(OR('Select LAs'!$H6=0,'Select LAs'!$H6=201, 'Select LAs'!$H6=420), \"-\",IF(INDEX('EY Data'!AJ:AJ, MATCH('Select LAs'!$H6,'EY Data'!$B:$B, 0))=\"\", \"-\", ROUND(INDEX('EY Data'!AJ:AJ, MATCH('Select LAs'!$H6,'EY Data'!$B:$B, 0)),3)))","v":4.2000000000000003E-2},{"$f":"IF('Select LAs'!$H6=0,\"-\",IF(INDEX('EY Data'!Z:Z, MATCH('Select LAs'!$H6,'EY Data'!$B:$B, 0))=\"\",\"-\", ROUND(INDEX('EY Data'!Z:Z, MATCH('Select LAs'!$H6,'EY Data'!$B:$B, 0)), 0)))","v":167000},{"$f":"IF('Select LAs'!$H6=0,\"-\",IF(INDEX('EY Data'!AC:AC, MATCH('Select LAs'!$H6,'EY Data'!$B:$B, 0))=\"\",\"-\", ROUND(INDEX('EY Data'!AC:AC, MATCH('Select LAs'!$H6,'EY Data'!$B:$B, 0)), 0)))","v":108550},{"$f":"IF('Select LAs'!$H6=0,\"-\",IF(INDEX('EY Data'!AB:AB, MATCH('Select LAs'!$H6,'EY Data'!$B:$B, 0))=\"\",\"-\", ROUND(INDEX('EY Data'!AB:AB, MATCH('Select LAs'!$H6,'EY Data'!$B:$B, 0)), 0)))","v":8350},{"$f":"IF('Select LAs'!$H6=0,\"-\",IF(INDEX('EY Data'!AA:AA, MATCH('Select LAs'!$H6,'EY Data'!$B:$B, 0))=\"\",\"-\", ROUND(INDEX('EY Data'!AA:AA, MATCH('Select LAs'!$H6,'EY Data'!$B:$B, 0)), 0)))","v":50100}]
["",{"$f":"'Select LAs'!G7","v":"No LA selected"},null,{"$f":"IF('Select LAs'!$H7=0,\"-\",IF(INDEX('EY Data'!E:E, MATCH('Select LAs'!$H7,'EY Data'!$B:$B, 0))=\"\",\"-\", ROUND(INDEX('EY Data'!E:E, MATCH('Select LAs'!$H7,'EY Data'!$B:$B, 0)), 5)))","v":5.9001700000000001},{"$f":"IF('Select LAs'!$H7=0,\"-\",IF(INDEX('EY Data'!H:H, MATCH('Select LAs'!$H7,'EY Data'!$B:$B, 0))=\"\",\"-\", ROUND(INDEX('EY Data'!H:H, MATCH('Select LAs'!$H7,'EY Data'!$B:$B, 0)), 5)))","v":5.5742599999999998},{"$f":"IF('Select LAs'!$H7=0,\"-\",IF(INDEX('EY Data'!G:G, MATCH('Select LAs'!$H7,'EY Data'!$B:$B, 0))=\"\",\"-\", ROUND(INDEX('EY Data'!G:G, MATCH('Select LAs'!$H7,'EY Data'!$B:$B, 0)), 5)))","v":9.8797599999999992},{"$f":"IF('Select LAs'!$H7=0,\"-\",IF(INDEX('EY Data'!F:F, MATCH('Select LAs'!$H7,'EY Data'!$B:$B, 0))=\"\",\"-\", ROUND(INDEX('EY Data'!F:F, MATCH('Select LAs'!$H7,'EY Data'!$B:$B, 0)), 5)))","v":5.5591699999999999},{"$f":"IF(OR('Select LAs'!$H7=0,'Select LAs'!$H7=201, 'Select LAs'!$H7=420), \"-\",IF(INDEX('EY Data'!AH:AH, MATCH('Select LAs'!$H7,'EY Data'!$B:$B, 0))=\"-\", \"-\", ROUND(INDEX('EY Data'!AH:AH, MATCH('Select LAs'!$H7,'EY Data'!$B:$B, 0)),3)))","v":0.96899999999999997},{"$f":"IF(OR('Select LAs'!$H7=0,'Select LAs'!$H7=201, 'Select LAs'!$H7=420), \"-\",IF(INDEX('EY Data'!AJ:AJ, MATCH('Select LAs'!$H7,'EY Data'!$B:$B, 0))=\"\", \"-\", ROUND(INDEX('EY Data'!AJ:AJ, MATCH('Select LAs'!$H7,'EY Data'!$B:$B, 0)),3)))","v":4.4999999999999998E-2},{"$f":"IF('Select LAs'!$H7=0,\"-\",IF(INDEX('EY Data'!Z:Z, MATCH('Select LAs'!$H7,'EY Data'!$B:$B, 0))=\"\",\"-\", ROUND(INDEX('EY Data'!Z:Z, MATCH('Select LAs'!$H7,'EY Data'!$B:$B, 0)), 0)))","v":747035},{"$f":"IF('Select LAs'!$H7=0,\"-\",IF(INDEX('EY Data'!AC:AC, MATCH('Select LAs'!$H7,'EY Data'!$B:$B, 0))=\"\",\"-\", ROUND(INDEX('EY Data'!AC:AC, MATCH('Select LAs'!$H7,'EY Data'!$B:$B, 0)), 0)))","v":575217},{"$f":"IF('Select LAs'!$H7=0,\"-\",IF(INDEX('EY Data'!AB:AB, MATCH('Select LAs'!$H7,'EY Data'!$B:$B, 0))=\"\",\"-\", ROUND(INDEX('EY Data'!AB:AB, MATCH('Select LAs'!$H7,'EY Data'!$B:$B, 0)), 0)))","v":59763},{"$f":"IF('Select LAs'!$H7=0,\"-\",IF(INDEX('EY Data'!AA:AA, MATCH('Select LAs'!$H7,'EY Data'!$B:$B, 0))=\"\",\"-\", ROUND(INDEX('EY Data'!AA:AA, MATCH('Select LAs'!$H7,'EY Data'!$B:$B, 0)), 0)))","v":112055}]
["",{"$f":"'Select LAs'!G8","v":"No LA selected"},null,{"$f":"IF('Select LAs'!$H8=0,\"-\",IF(INDEX('EY Data'!E:E, MATCH('Select LAs'!$H8,'EY Data'!$B:$B, 0))=\"\",\"-\", ROUND(INDEX('EY Data'!E:E, MATCH('Select LAs'!$H8,'EY Data'!$B:$B, 0)), 5)))","v":6.2984600000000004},{"$f":"IF('Select LAs'!$H8=0,\"-\",IF(INDEX('EY Data'!H:H, MATCH('Select LAs'!$H8,'EY Data'!$B:$B, 0))=\"\",\"-\", ROUND(INDEX('EY Data'!H:H, MATCH('Select LAs'!$H8,'EY Data'!$B:$B, 0)), 5)))","v":5.6438899999999999},{"$f":"IF('Select LAs'!$H8=0,\"-\",IF(INDEX('EY Data'!G:G, MATCH('Select LAs'!$H8,'EY Data'!$B:$B, 0))=\"\",\"-\", ROUND(INDEX('EY Data'!G:G, MATCH('Select LAs'!$H8,'EY Data'!$B:$B, 0)), 5)))","v":9.8248499999999996},{"$f":"IF('Select LAs'!$H8=0,\"-\",IF(INDEX('EY Data'!F:F, MATCH('Select LAs'!$H8,'EY Data'!$B:$B, 0))=\"\",\"-\", ROUND(INDEX('EY Data'!F:F, MATCH('Select LAs'!$H8,'EY Data'!$B:$B, 0)), 5)))","v":5.6271800000000001},{"$f":"IF(OR('Select LAs'!$H8=0,'Select LAs'!$H8=201, 'Select LAs'!$H8=420), \"-\",IF(INDEX('EY Data'!AH:AH, MATCH('Select LAs'!$H8,'EY Data'!$B:$B, 0))=\"-\", \"-\", ROUND(INDEX('EY Data'!AH:AH, MATCH('Select LAs'!$H8,'EY Data'!$B:$B, 0)),3)))","v":0.97},{"$f":"IF(OR('Select LAs'!$H8=0,'Select LAs'!$H8=201, 'Select LAs'!$H8=420), \"-\",IF(INDEX('EY Data'!AJ:AJ, MATCH('Select LAs'!$H8,'EY Data'!$B:$B, 0))=\"\", \"-\", ROUND(INDEX('EY Data'!AJ:AJ, MATCH('Select LAs'!$H8,'EY Data'!$B:$B, 0)),3)))","v":6.0000000000000001E-3},{"$f":"IF('Select LAs'!$H8=0,\"-\",IF(INDEX('EY Data'!Z:Z, MATCH('Select LAs'!$H8,'EY Data'!$B:$B, 0))=\"\",\"-\", ROUND(INDEX('EY Data'!Z:Z, MATCH('Select LAs'!$H8,'EY Data'!$B:$B, 0)), 0)))","v":65000},{"$f":"IF('Select LAs'!$H8=0,\"-\",IF(INDEX('EY Data'!AC:AC, MATCH('Select LAs'!$H8,'EY Data'!$B:$B, 0))=\"\",\"-\", ROUND(INDEX('EY Data'!AC:AC, MATCH('Select LAs'!$H8,'EY Data'!$B:$B, 0)), 0)))","v":35000},{"$f":"IF('Select LAs'!$H8=0,\"-\",IF(INDEX('EY Data'!AB:AB, MATCH('Select LAs'!$H8,'EY Data'!$B:$B, 0))=\"\",\"-\", ROUND(INDEX('EY Data'!AB:AB, MATCH('Select LAs'!$H8,'EY Data'!$B:$B, 0)), 0)))","v":15000},{"$f":"IF('Select LAs'!$H8=0,\"-\",IF(INDEX('EY Data'!AA:AA, MATCH('Select LAs'!$H8,'EY Data'!$B:$B, 0))=\"\",\"-\", ROUND(INDEX('EY Data'!AA:AA, MATCH('Select LAs'!$H8,'EY Data'!$B:$B, 0)), 0)))","v":15000}]
["",{"$f":"'Select LAs'!G9","v":"No LA selected"},null,{"$f":"IF('Select LAs'!$H9=0,\"-\",IF(INDEX('EY Data'!E:E, MATCH('Select LAs'!$H9,'EY Data'!$B:$B, 0))=\"\",\"-\", ROUND(INDEX('EY Data'!E:E, MATCH('Select LAs'!$H9,'EY Data'!$B:$B, 0)), 5)))","v":6.3},{"$f":"IF('Select LAs'!$H9=0,\"-\",IF(INDEX('EY Data'!H:H, MATCH('Select LAs'!$H9,'EY Data'!$B:$B, 0))=\"\",\"-\", ROUND(INDEX('EY Data'!H:H, MATCH('Select LAs'!$H9,'EY Data'!$B:$B, 0)), 5)))","v":5.8274900000000001},{"$f":"IF('Select LAs'!$H9=0,\"-\",IF(INDEX('EY Data'!G:G, MATCH('Select LAs'!$H9,'EY Data'!$B:$B, 0))=\"\",\"-\", ROUND(INDEX('EY Data'!G:G, MATCH('Select LAs'!$H9,'EY Data'!$B:$B, 0)), 5)))","v":12.30884},{"$f":"IF('Select LAs'!$H9=0,\"-\",IF(INDEX('EY Data'!F:F, MATCH('Select LAs'!$H9,'EY Data'!$B:$B, 0))=\"\",\"-\", ROUND(INDEX('EY Data'!F:F, MATCH('Select LAs'!$H9,'EY Data'!$B:$B, 0)), 5)))","v":5.8260300000000003},{"$f":"IF(OR('Select LAs'!$H9=0,'Select LAs'!$H9=201, 'Select LAs'!$H9=420), \"-\",IF(INDEX('EY Data'!AH:AH, MATCH('Select LAs'!$H9,'EY Data'!$B:$B, 0))=\"-\", \"-\", ROUND(INDEX('EY Data'!AH:AH, MATCH('Select LAs'!$H9,'EY Data'!$B:$B, 0)),3)))","v":0.98299999999999998},{"$f":"IF(OR('Select LAs'!$H9=0,'Select LAs'!$H9=201, 'Select LAs'!$H9=420), \"-\",IF(INDEX('EY Data'!AJ:AJ, MATCH('Select LAs'!$H9,'EY Data'!$B:$B, 0))=\"\", \"-\", ROUND(INDEX('EY Data'!AJ:AJ, MATCH('Select LAs'!$H9,'EY Data'!$B:$B, 0)),3)))","v":3.2000000000000001E-2},{"$f":"IF('Select LAs'!$H9=0,\"-\",IF(INDEX('EY Data'!Z:Z, MATCH('Select LAs'!$H9,'EY Data'!$B:$B, 0))=\"\",\"-\", ROUND(INDEX('EY Data'!Z:Z, MATCH('Select LAs'!$H9,'EY Data'!$B:$B, 0)), 0)))","v":484978},{"$f":"IF('Select LAs'!$H9=0,\"-\",IF(INDEX('EY Data'!AC:AC, MATCH('Select LAs'!$H9,'EY Data'!$B:$B, 0))=\"\",\"-\", ROUND(INDEX('EY Data'!AC:AC, MATCH('Select LAs'!$H9,'EY Data'!$B:$B, 0)), 0)))","v":213459},{"$f":"IF('Select LAs'!$H9=0,\"-\",IF(INDEX('EY Data'!AB:AB, MATCH('Select LAs'!$H9,'EY Data'!$B:$B, 0))=\"\",\"-\", ROUND(INDEX('EY Data'!AB:AB, MATCH('Select LAs'!$H9,'EY Data'!$B:$B, 0)), 0)))","v":35410},{"$f":"IF('Select LAs'!$H9=0,\"-\",IF(INDEX('EY Data'!AA:AA, MATCH('Select LAs'!$H9,'EY Data'!$B:$B, 0))=\"\",\"-\", ROUND(INDEX('EY Data'!AA:AA, MATCH('Select LAs'!$H9,'EY Data'!$B:$B, 0)), 0)))","v":236109}]
["",{"$f":"'Select LAs'!G10","v":"No LA selected"},null,{"$f":"IF('Select LAs'!$H10=0,\"-\",IF(INDEX('EY Data'!E:E, MATCH('Select LAs'!$H10,'EY Data'!$B:$B, 0))=\"\",\"-\", ROUND(INDEX('EY Data'!E:E, MATCH('Select LAs'!$H10,'EY Data'!$B:$B, 0)), 5)))","v":5.8213499999999998},{"$f":"IF('Select LAs'!$H10=0,\"-\",IF(INDEX('EY Data'!H:H, MATCH('Select LAs'!$H10,'EY Data'!$B:$B, 0))=\"\",\"-\", ROUND(INDEX('EY Data'!H:H, MATCH('Select LAs'!$H10,'EY Data'!$B:$B, 0)), 5)))","v":5.7925199999999997},{"$f":"IF('Select LAs'!$H10=0,\"-\",IF(INDEX('EY Data'!G:G, MATCH('Select LAs'!$H10,'EY Data'!$B:$B, 0))=\"\",\"-\", ROUND(INDEX('EY Data'!G:G, MATCH('Select LAs'!$H10,'EY Data'!$B:$B, 0)), 5)))","v":11.99864},{"$f":"IF('Select LAs'!$H10=0,\"-\",IF(INDEX('EY Data'!F:F, MATCH('Select LAs'!$H10,'EY Data'!$B:$B, 0))=\"\",\"-\", ROUND(INDEX('EY Data'!F:F, MATCH('Select LAs'!$H10,'EY Data'!$B:$B, 0)), 5)))","v":5.7467499999999996},{"$f":"IF(OR('Select LAs'!$H10=0,'Select LAs'!$H10=201, 'Select LAs'!$H10=420), \"-\",IF(INDEX('EY Data'!AH:AH, MATCH('Select LAs'!$H10,'EY Data'!$B:$B, 0))=\"-\", \"-\", ROUND(INDEX('EY Data'!AH:AH, MATCH('Select LAs'!$H10,'EY Data'!$B:$B, 0)),3)))","v":1.0009999999999999},{"$f":"IF(OR('Select LAs'!$H10=0,'Select LAs'!$H10=201, 'Select LAs'!$H10=420), \"-\",IF(INDEX('EY Data'!AJ:AJ, MATCH('Select LAs'!$H10,'EY Data'!$B:$B, 0))=\"\", \"-\", ROUND(INDEX('EY Data'!AJ:AJ, MATCH('Select LAs'!$H10,'EY Data'!$B:$B, 0)),3)))","v":8.9999999999999993E-3},{"$f":"IF('Select LAs'!$H10=0,\"-\",IF(INDEX('EY Data'!Z:Z, MATCH('Select LAs'!$H10,'EY Data'!$B:$B, 0))=\"\",\"-\", ROUND(INDEX('EY Data'!Z:Z, MATCH('Select LAs'!$H10,'EY Data'!$B:$B, 0)), 0)))","v":120000},{"$f":"IF('Select LAs'!$H10=0,\"-\",IF(INDEX('EY Data'!AC:AC, MATCH('Select LAs'!$H10,'EY Data'!$B:$B, 0))=\"\",\"-\", ROUND(INDEX('EY Data'!AC:AC, MATCH('Select LAs'!$H10,'EY Data'!$B:$B, 0)), 0)))","v":66600},{"$f":"IF('Select LAs'!$H10=0,\"-\",IF(INDEX('EY Data'!AB:AB, MATCH('Select LAs'!$H10,'EY Data'!$B:$B, 0))=\"\",\"-\", ROUND(INDEX('EY Data'!AB:AB, MATCH('Select LAs'!$H10,'EY Data'!$B:$B, 0)), 0)))","v":2000},{"$f":"IF('Select LAs'!$H10=0,\"-\",IF(INDEX('EY Data'!AA:AA, MATCH('Select LAs'!$H10,'EY Data'!$B:$B, 0))=\"\",\"-\", ROUND(INDEX('EY Data'!AA:AA, MATCH('Select LAs'!$H10,'EY Data'!$B:$B, 0)), 0)))","v":51400}]
["",{"$f":"'Select LAs'!G11","v":"No LA selected"},null,{"$f":"IF('Select LAs'!$H11=0,\"-\",IF(INDEX('EY Data'!E:E, MATCH('Select LAs'!$H11,'EY Data'!$B:$B, 0))=\"\",\"-\", ROUND(INDEX('EY Data'!E:E, MATCH('Select LAs'!$H11,'EY Data'!$B:$B, 0)), 5)))","v":5.9040299999999997},{"$f":"IF('Select LAs'!$H11=0,\"-\",IF(INDEX('EY Data'!H:H, MATCH('Select LAs'!$H11,'EY Data'!$B:$B, 0))=\"\",\"-\", ROUND(INDEX('EY Data'!H:H, MATCH('Select LAs'!$H11,'EY Data'!$B:$B, 0)), 5)))","v":5.6994899999999999},{"$f":"IF('Select LAs'!$H11=0,\"-\",IF(INDEX('EY Data'!G:G, MATCH('Select LAs'!$H11,'EY Data'!$B:$B, 0))=\"\",\"-\", ROUND(INDEX('EY Data'!G:G, MATCH('Select LAs'!$H11,'EY Data'!$B:$B, 0)), 5)))","v":11.10858},{"$f":"IF('Select LAs'!$H11=0,\"-\",IF(INDEX('EY Data'!F:F, MATCH('Select LAs'!$H11,'EY Data'!$B:$B, 0))=\"\",\"-\", ROUND(INDEX('EY Data'!F:F, MATCH('Select LAs'!$H11,'EY Data'!$B:$B, 0)), 5)))","v":5.9455900000000002},{"$f":"IF(OR('Select LAs'!$H11=0,'Select LAs'!$H11=201, 'Select LAs'!$H11=420), \"-\",IF(INDEX('EY Data'!AH:AH, MATCH('Select LAs'!$H11,'EY Data'!$B:$B, 0))=\"-\", \"-\", ROUND(INDEX('EY Data'!AH:AH, MATCH('Select LAs'!$H11,'EY Data'!$B:$B, 0)),3)))","v":0.98},{"$f":"IF(OR('Select LAs'!$H11=0,'Select LAs'!$H11=201, 'Select LAs'!$H11=420), \"-\",IF(INDEX('EY Data'!AJ:AJ, MATCH('Select LAs'!$H11,'EY Data'!$B:$B, 0))=\"\", \"-\", ROUND(INDEX('EY Data'!AJ:AJ, MATCH('Select LAs'!$H11,'EY Data'!$B:$B, 0)),3)))","v":8.1000000000000003E-2},{"$f":"IF('Select LAs'!$H11=0,\"-\",IF(INDEX('EY Data'!Z:Z, MATCH('Select LAs'!$H11,'EY Data'!$B:$B, 0))=\"\",\"-\", ROUND(INDEX('EY Data'!Z:Z, MATCH('Select LAs'!$H11,'EY Data'!$B:$B, 0)), 0)))","v":542400},{"$f":"IF('Select LAs'!$H11=0,\"-\",IF(INDEX('EY Data'!AC:AC, MATCH('Select LAs'!$H11,'EY Data'!$B:$B, 0))=\"\",\"-\", ROUND(INDEX('EY Data'!AC:AC, MATCH('Select LAs'!$H11,'EY Data'!$B:$B, 0)), 0)))","v":361666},{"$f":"IF('Select LAs'!$H11=0,\"-\",IF(INDEX('EY Data'!AB:AB, MATCH('Select LAs'!$H11,'EY Data'!$B:$B, 0))=\"\",\"-\", ROUND(INDEX('EY Data'!AB:AB, MATCH('Select LAs'!$H11,'EY Data'!$B:$B, 0)), 0)))","v":2853},{"$f":"IF('Select LAs'!$H11=0,\"-\",IF(INDEX('EY Data'!AA:AA, MATCH('Select LAs'!$H11,'EY Data'!$B:$B, 0))=\"\",\"-\", ROUND(INDEX('EY Data'!AA:AA, MATCH('Select LAs'!$H11,'EY Data'!$B:$B, 0)), 0)))","v":177881}]
["",{"$f":"'Select LAs'!G12","v":"No LA selected"},null,{"$f":"IF('Select LAs'!$H12=0,\"-\",IF(INDEX('EY Data'!E:E, MATCH('Select LAs'!$H12,'EY Data'!$B:$B, 0))=\"\",\"-\", ROUND(INDEX('EY Data'!E:E, MATCH('Select LAs'!$H12,'EY Data'!$B:$B, 0)), 5)))","v":6.5012999999999996},{"$f":"IF('Select LAs'!$H12=0,\"-\",IF(INDEX('EY Data'!H:H, MATCH('Select LAs'!$H12,'EY Data'!$B:$B, 0))=\"\",\"-\", ROUND(INDEX('EY Data'!H:H, MATCH('Select LAs'!$H12,'EY Data'!$B:$B, 0)), 5)))","v":5.8278800000000004},{"$f":"IF('Select LAs'!$H12=0,\"-\",IF(INDEX('EY Data'!G:G, MATCH('Select LAs'!$H12,'EY Data'!$B:$B, 0))=\"\",\"-\", ROUND(INDEX('EY Data'!G:G, MATCH('Select LAs'!$H12,'EY Data'!$B:$B, 0)), 5)))","v":10.93763},{"$f":"IF('Select LAs'!$H12=0,\"-\",IF(INDEX('EY Data'!F:F, MATCH('Select LAs'!$H12,'EY Data'!$B:$B, 0))=\"\",\"-\", ROUND(INDEX('EY Data'!F:F, MATCH('Select LAs'!$H12,'EY Data'!$B:$B, 0)), 5)))","v":6.1349099999999996},{"$f":"IF(OR('Select LAs'!$H12=0,'Select LAs'!$H12=201, 'Select LAs'!$H12=420), \"-\",IF(INDEX('EY Data'!AH:AH, MATCH('Select LAs'!$H12,'EY Data'!$B:$B, 0))=\"-\", \"-\", ROUND(INDEX('EY Data'!AH:AH, MATCH('Select LAs'!$H12,'EY Data'!$B:$B, 0)),3)))","v":0.96699999999999997},{"$f":"IF(OR('Select LAs'!$H12=0,'Select LAs'!$H12=201, 'Select LAs'!$H12=420), \"-\",IF(INDEX('EY Data'!AJ:AJ, MATCH('Select LAs'!$H12,'EY Data'!$B:$B, 0))=\"\", \"-\", ROUND(INDEX('EY Data'!AJ:AJ, MATCH('Select LAs'!$H12,'EY Data'!$B:$B, 0)),3)))","v":0.03},{"$f":"IF('Select LAs'!$H12=0,\"-\",IF(INDEX('EY Data'!Z:Z, MATCH('Select LAs'!$H12,'EY Data'!$B:$B, 0))=\"\",\"-\", ROUND(INDEX('EY Data'!Z:Z, MATCH('Select LAs'!$H12,'EY Data'!$B:$B, 0)), 0)))","v":2166666},{"$f":"IF('Select LAs'!$H12=0,\"-\",IF(INDEX('EY Data'!AC:AC, MATCH('Select LAs'!$H12,'EY Data'!$B:$B, 0))=\"\",\"-\", ROUND(INDEX('EY Data'!AC:AC, MATCH('Select LAs'!$H12,'EY Data'!$B:$B, 0)), 0)))","v":222222},{"$f":"IF('Select LAs'!$H12=0,\"-\",IF(INDEX('EY Data'!AB:AB, MATCH('Select LAs'!$H12,'EY Data'!$B:$B, 0))=\"\",\"-\", ROUND(INDEX('EY Data'!AB:AB, MATCH('Select LAs'!$H12,'EY Data'!$B:$B, 0)), 0)))","v":972222},{"$f":"IF('Select LAs'!$H12=0,\"-\",IF(INDEX('EY Data'!AA:AA, MATCH('Select LAs'!$H12,'EY Data'!$B:$B, 0))=\"\",\"-\", ROUND(INDEX('EY Data'!AA:AA, MATCH('Select LAs'!$H12,'EY Data'!$B:$B, 0)), 0)))","v":972222}]
[null,{"$f":"'Select LAs'!G13","v":"No LA selected"},null,{"$f":"IF('Select LAs'!$H13=0,\"-\",IF(INDEX('EY Data'!E:E, MATCH('Select LAs'!$H13,'EY Data'!$B:$B, 0))=\"\",\"-\", ROUND(INDEX('EY Data'!E:E, MATCH('Select LAs'!$H13,'EY Data'!$B:$B, 0)), 5)))","v":5.5806800000000001},{"$f":"IF('Select LAs'!$H13=0,\"-\",IF(INDEX('EY Data'!H:H, MATCH('Select LAs'!$H13,'EY Data'!$B:$B, 0))=\"\",\"-\", ROUND(INDEX('EY Data'!H:H, MATCH('Select LAs'!$H13,'EY Data'!$B:$B, 0)), 5)))","v":5.7332299999999998},{"$f":"IF('Select LAs'!$H13=0,\"-\",IF(INDEX('EY Data'!G:G, MATCH('Select LAs'!$H13,'EY Data'!$B:$B, 0))=\"\",\"-\", ROUND(INDEX('EY Data'!G:G, MATCH('Select LAs'!$H13,'EY Data'!$B:$B, 0)), 5)))","v":0},{"$f":"IF('Select LAs'!$H13=0,\"-\",IF(INDEX('EY Data'!F:F, MATCH('Select LAs'!$H13,'EY Data'!$B:$B, 0))=\"\",\"-\", ROUND(INDEX('EY Data'!F:F, MATCH('Select LAs'!$H13,'EY Data'!$B:$B, 0)), 5)))","v":5.4053000000000004},{"$f":"IF(OR('Select LAs'!$H13=0,'Select LAs'!$H13=201, 'Select LAs'!$H13=420), \"-\",IF(INDEX('EY Data'!AH:AH, MATCH('Select LAs'!$H13,'EY Data'!$B:$B, 0))=\"-\", \"-\", ROUND(INDEX('EY Data'!AH:AH, MATCH('Select LAs'!$H13,'EY Data'!$B:$B, 0)),3)))","v":0.96},{"$f":"IF(OR('Select LAs'!$H13=0,'Select LAs'!$H13=201, 'Select LAs'!$H13=420), \"-\",IF(INDEX('EY Data'!AJ:AJ, MATCH('Select LAs'!$H13,'EY Data'!$B:$B, 0))=\"\", \"-\", ROUND(INDEX('EY Data'!AJ:AJ, MATCH('Select LAs'!$H13,'EY Data'!$B:$B, 0)),3)))","v":4.4999999999999998E-2},{"$f":"IF('Select LAs'!$H13=0,\"-\",IF(INDEX('EY Data'!Z:Z, MATCH('Select LAs'!$H13,'EY Data'!$B:$B, 0))=\"\",\"-\", ROUND(INDEX('EY Data'!Z:Z, MATCH('Select LAs'!$H13,'EY Data'!$B:$B, 0)), 0)))","v":120000},{"$f":"IF('Select LAs'!$H13=0,\"-\",IF(INDEX('EY Data'!AC:AC, MATCH('Select LAs'!$H13,'EY Data'!$B:$B, 0))=\"\",\"-\", ROUND(INDEX('EY Data'!AC:AC, MATCH('Select LAs'!$H13,'EY Data'!$B:$B, 0)), 0)))","v":120000},{"$f":"IF('Select LAs'!$H13=0,\"-\",IF(INDEX('EY Data'!AB:AB, MATCH('Select LAs'!$H13,'EY Data'!$B:$B, 0))=\"\",\"-\", ROUND(INDEX('EY Data'!AB:AB, MATCH('Select LAs'!$H13,'EY Data'!$B:$B, 0)), 0)))","v":0},{"$f":"IF('Select LAs'!$H13=0,\"-\",IF(INDEX('EY Data'!AA:AA, MATCH('Select LAs'!$H13,'EY Data'!$B:$B, 0))=\"\",\"-\", ROUND(INDEX('EY Data'!AA:AA, MATCH('Select LAs'!$H13,'EY Data'!$B:$B, 0)), 0)))","v":0}]
[null,"Selection Median",null,{"$f":"IF(COUNT(D$21:D$31)>0,MEDIAN(D$21:D$31),\"-\")","v":5.8853600000000004},5.6994899999999999,10.474360000000001,{"$f":"IF(COUNT(G$21:G$31)>0,MEDIAN(G$21:G$31),\"-\")","v":5.7455499999999997},{"$f":"IF(COUNT(H$21:H$31)>0,MEDIAN(H$21:H$31),\"-\")","v":0.96899999999999997},{"$f":"IF(COUNT(I$21:I$31)>0,MEDIAN(I$21:I$31),\"-\")","v":3.2000000000000001E-2},{"$f":"IF(COUNT(J$21:J$31)>0,MEDIAN(J$21:J$31),\"-\")","v":289074},201074,15000,60177]
[null,"Selection Minimum",null,{"$f":"IF(COUNT(D$21:D$31)>0,MIN(D$21:D$31),\"-\")","v":5.5806800000000001},5.47241,0,{"$f":"IF(COUNT(G$21:G$31)>0,MIN(G$21:G$31),\"-\")","v":5.4053000000000004},{"$f":"IF(COUNT(H$21:H$31)>0,MIN(H$21:H$31),\"-\")","v":0.96},{"$f":"IF(COUNT(I$21:I$31)>0,MIN(I$21:I$31),\"-\")","v":6.0000000000000001E-3},{"$f":"IF(COUNT(J$21:J$31)>0,MIN(J$21:J$31),\"-\")","v":65000},35000,0,0]
[null,"Selection Maximum",null,{"$f":"IF(COUNT(D$21:D$31)>0,MAX(D$21:D$31),\"-\")","v":6.5012999999999996},5.8278800000000004,12.30884,{"$f":"IF(COUNT(G$21:G$31)>0,MAX(G$21:G$31),\"-\")","v":6.1349099999999996},{"$f":"IF(COUNT(H$21:H$31)>0,MAX(H$21:H$31),\"-\")","v":1.0009999999999999},{"$f":"IF(COUNT(I$21:I$31)>0,MAX(I$21:I$31),\"-\")","v":8.1000000000000003E-2},{"$f":"IF(COUNT(J$21:J$31)>0,MAX(J$21:J$31),\"-\")","v":2166666},575217,972222,972222]

{"sheet":"2 year olds  (FRAS)","index":2,"n_rows":42,"n_cols":13,"rows_kept":42,"cut":false,"hidden":true,"merged":[[26,1,26,2],[43,1,43,11],[4,1,4,2],[5,1,5,2],[6,1,6,2],[22,3,22,4],[25,3,25,6],[25,9,25,12],[7,1,7,2],[25,7,26,7],[25,8,26,8]]}
[]
[null,{"$f":"CONCATENATE('Select LAs'!B3,\" - Key Budget Statistics\")","v":"No LA selected - Key Budget Statistics"},null,null,null,null,null,null,null,null,null,null,{"$f":"'3-4 year olds '!$K$2","v":"Financial Year 2025-2026"}]
[]
[]
[null,{"$f":"'Select LAs'!D3","v":"No LA selected"},null,"All providers","Private, Voluntary, Independent","Nursery schools","Primary nursery places"]
[null,"2 year old (FRAS) hourly average funding rate (£/hr)",null,{"$f":"IFERROR(IF(INDEX('EY Data'!AL:AL, MATCH('Select LAs'!$A$3,'EY Data'!$B:$B, 0))=\"\",\"-\", INDEX('EY Data'!AL:AL, MATCH('Select LAs'!$A$3,'EY Data'!$B:$B, 0))), 0)","v":0},{"$f":"IFERROR(IF(INDEX('EY Data'!AO:AO, MATCH('Select LAs'!$A$3,'EY Data'!$B:$B, 0))=\"\",\"-\", INDEX('EY Data'!AO:AO, MATCH('Select LAs'!$A$3,'EY Data'!$B:$B, 0))), 0)","v":0},{"$f":"IFERROR(IF(INDEX('EY Data'!AN:AN, MATCH('Select LAs'!$A$3,'EY Data'!$B:$B, 0))=\"\",\"-\", INDEX('EY Data'!AN:AN, MATCH('Select LAs'!$A$3,'EY Data'!$B:$B, 0))), 0)","v":0},{"$f":"IFERROR(IF(INDEX('EY Data'!AM:AM, MATCH('Select LAs'!$A$3,'EY Data'!$B:$B, 0))=\"\",\"-\", INDEX('EY Data'!AM:AM, MATCH('Select LAs'!$A$3,'EY Data'!$B:$B, 0))), 0)","v":0}]
[null,"2 year old (FRAS) hourly average base rate (£/hr)",null,{"$f":"IFERROR(IF(INDEX('EY Data'!AZ:AZ, MATCH('Select LAs'!$A$3,'EY Data'!$B:$B, 0))=\"\",\"-\", INDEX('EY Data'!AZ:AZ, MATCH('Select LAs'!$A$3,'EY Data'!$B:$B, 0))), 0)","v":0},{"$f":"IFERROR(IF(INDEX('EY Data'!BC:BC, MATCH('Select LAs'!$A$3,'EY Data'!$B:$B, 0))=\"\",\"-\", INDEX('EY Data'!BC:BC, MATCH('Select LAs'!$A$3,'EY Data'!$B:$B, 0))), 0)","v":0},{"$f":"IFERROR(IF(INDEX('EY Data'!BB:BB, MATCH('Select LAs'!$A$3,'EY Data'!$B:$B, 0))=\"\",\"-\", INDEX('EY Data'!BB:BB, MATCH('Select LAs'!$A$3,'EY Data'!$B:$B, 0))), 0)","v":0},{"$f":"IFERROR(IF(INDEX('EY Data'!BA:BA, MATCH('Select LAs'!$A$3,'EY Data'!$B:$B, 0))=\"\",\"-\", INDEX('EY Data'!BA:BA, MATCH('Select LAs'!$A$3,'EY Data'!$B:$B, 0))), 0)","v":0}]
[null,"Pass-through rate (%)",null,{"$f":"IF(OR('Select LAs'!$A$3 = \"LA No\", 'Select LAs'!$A$3 = 201, 'Select LAs'!$A$3 = 420), \"-\", INDEX('EY Data'!BO:BO, MATCH('Select LAs'!$A$3,'EY Data'!$B:$B, 0)))","v":"-"}]
[]
[]
[]
[]
[]
[]
[]
[]
[]
[]
[null,{"$f":"CONCATENATE(\"Benchmarking against \",IF(_SN=1,\"Statistical Neighbours\",\"Manual Selection\"))","v":"Benchmarking against Manual Selection"}]
[]
[]
[]
[null,null,"Table ordering"]
[]
[]
[null,null,null,"Average funding rate to providers per hour",null,null,null,"Pass-through rate","Funding paid through supplements","SEN Inclusion Fund (top-up grant element) budget"]
[null,"Local Authority",null,"All providers","Private, Voluntary, Independent","Nursery schools","Primary nursery places",null,null,"All providers","Private, Voluntary, Independent","Nursery schools","Primary nursery places"]
[null,"England",null,{"$f":"ROUND(INDEX('EY Data'!AL:AL, MATCH($B28,'EY Data'!$C:$C, 0)), 5)","v":8.1780899999999992},{"$f":"ROUND(INDEX('EY Data'!AO:AO, MATCH($B28,'EY Data'!$C:$C, 0)), 5)","v":8.1453000000000007},{"$f":"ROUND(INDEX('EY Data'!AN:AN, MATCH($B28,'EY Data'!$C:$C, 0)), 5)","v":8.5924700000000005},{"$f":"ROUND(INDEX('EY Data'!AM:AM, MATCH($B28,'EY Data'!$C:$C, 0)), 5)","v":8.1698699999999995},{"$f":"IF(INDEX('EY Data'!BO:BO, MATCH($B28,'EY Data'!$C:$C, 0))=\"-\", \"-\", ROUND(INDEX('EY Data'!BO:BO, MATCH($B28,'EY Data'!$C:$C, 0)), 3))","v":0.98799999999999999},{"$f":"IF(INDEX('EY Data'!AJ:AJ, MATCH($B28,'EY Data'!$C:$C, 0))=\"-\", \"-\", ROUND(INDEX('EY Data'!AJ:AJ, MATCH($B28,'EY Data'!$C:$C, 0)), 3))","v":4.1000000000000002E-2},{"$f":"ROUND(INDEX('EY Data'!BG:BG, MATCH($B28,'EY Data'!$C:$C, 0)), 3)","v":10212856.6},{"$f":"ROUND(INDEX('EY Data'!BJ:BJ, MATCH($B28,'EY Data'!$C:$C, 0)), 3)","v":7824160.3799999999},{"$f":"ROUND(INDEX('EY Data'!BI:BI, MATCH($B28,'EY Data'!$C:$C, 0)), 3)","v":978520.28},{"$f":"ROUND(INDEX('EY Data'!BH:BH, MATCH($B28,'EY Data'!$C:$C, 0)), 3)","v":1410175.94}]
[null,{"$f":"'Select LAs'!L3","v":"No LA selected"},null,{"$f":"IF('Select LAs'!$M3=0,\"-\",IF(INDEX('EY Data'!AL:AL, MATCH('Select LAs'!$M3,'EY Data'!$B:$B, 0))=\"\",\"-\", ROUND(INDEX('EY Data'!AL:AL, MATCH('Select LAs'!$M3,'EY Data'!$B:$B, 0)),5)))","v":8.2231699999999996},{"$f":"IF('Select LAs'!$M3=0,\"-\",IF(INDEX('EY Data'!AO:AO, MATCH('Select LAs'!$M3,'EY Data'!$B:$B, 0))=\"\",\"-\", ROUND(INDEX('EY Data'!AO:AO, MATCH('Select LAs'!$M3,'EY Data'!$B:$B, 0)),5)))","v":8.2231699999999996},{"$f":"IF('Select LAs'!$M3=0,\"-\",IF(INDEX('EY Data'!AN:AN, MATCH('Select LAs'!$M3,'EY Data'!$B:$B, 0))=\"\",\"-\", ROUND(INDEX('EY Data'!AN:AN, MATCH('Select LAs'!$M3,'EY Data'!$B:$B, 0)),5)))","v":0},{"$f":"IF('Select LAs'!$M3=0,\"-\",IF(INDEX('EY Data'!AM:AM, MATCH('Select LAs'!$M3,'EY Data'!$B:$B, 0))=\"\",\"-\", ROUND(INDEX('EY Data'!AM:AM, MATCH('Select LAs'!$M3,'EY Data'!$B:$B, 0)),5)))","v":0},{"$f":"IF(OR('Select LAs'!$M3=0,'Select LAs'!$M3=201, 'Select LAs'!$M3=420), \"-\",IF(INDEX('EY Data'!BO:BO, MATCH('Select LAs'!$M3,'EY Data'!$B:$B, 0))=\"-\", \"-\", ROUND(INDEX('EY Data'!BO:BO, MATCH('Select LAs'!$M3,'EY Data'!$B:$B, 0)),3)))","v":0.97499999999999998},{"$f":"IF(OR('Select LAs'!$M3=0,'Select LAs'!$M3=201, 'Select LAs'!$M3=420), \"-\",IF(INDEX('EY Data'!BQ:BQ, MATCH('Select LAs'!$M3,'EY Data'!$B:$B, 0))=\"\", \"-\", ROUND(INDEX('EY Data'!BQ:BQ, MATCH('Select LAs'!$M3,'EY Data'!$B:$B, 0)),3)))","v":0},{"$f":"IF('Select LAs'!$M3=0,\"-\",IF(INDEX('EY Data'!BG:BG, MATCH('Select LAs'!$M3,'EY Data'!$B:$B, 0))=\"\",\"-\",ROUND(INDEX('EY Data'!BG:BG, MATCH('Select LAs'!$M3,'EY Data'!$B:$B, 0)),0)))","v":50848},{"$f":"IF('Select LAs'!$M3=0,\"-\",IF(INDEX('EY Data'!BJ:BJ, MATCH('Select LAs'!$M3,'EY Data'!$B:$B, 0))=\"\",\"-\",ROUND(INDEX('EY Data'!BJ:BJ, MATCH('Select LAs'!$M3,'EY Data'!$B:$B, 0)),0)))","v":50848},{"$f":"IF('Select LAs'!$M3=0,\"-\",IF(INDEX('EY Data'!BI:BI, MATCH('Select LAs'!$M3,'EY Data'!$B:$B, 0))=\"\",\"-\",ROUND(INDEX('EY Data'!BI:BI, MATCH('Select LAs'!$M3,'EY Data'!$B:$B, 0)),0)))","v":0},{"$f":"IF('Select LAs'!$M3=0,\"-\",IF(INDEX('EY Data'!BH:BH, MATCH('Select LAs'!$M3,'EY Data'!$B:$B, 0))=\"\",\"-\",ROUND(INDEX('EY Data'!BH:BH, MATCH('Select LAs'!$M3,'EY Data'!$B:$B, 0)),0)))","v":0}]
[null,{"$f":"'Select LAs'!L4","v":"No LA selected"},null,{"$f":"IF('Select LAs'!$M4=0,\"-\",IF(INDEX('EY Data'!AL:AL, MATCH('Select LAs'!$M4,'EY Data'!$B:$B, 0))=\"\",\"-\", ROUND(INDEX('EY Data'!AL:AL, MATCH('Select LAs'!$M4,'EY Data'!$B:$B, 0)),5)))","v":7.8151799999999998},{"$f":"IF('Select LAs'!$M4=0,\"-\",IF(INDEX('EY Data'!AO:AO, MATCH('Select LAs'!$M4,'EY Data'!$B:$B, 0))=\"\",\"-\", ROUND(INDEX('EY Data'!AO:AO, MATCH('Select LAs'!$M4,'EY Data'!$B:$B, 0)),5)))","v":7.8258200000000002},{"$f":"IF('Select LAs'!$M4=0,\"-\",IF(INDEX('EY Data'!AN:AN, MATCH('Select LAs'!$M4,'EY Data'!$B:$B, 0))=\"\",\"-\", ROUND(INDEX('EY Data'!AN:AN, MATCH('Select LAs'!$M4,'EY Data'!$B:$B, 0)),5)))","v":7.7590399999999997},{"$f":"IF('Select LAs'!$M4=0,\"-\",IF(INDEX('EY Data'!AM:AM, MATCH('Select LAs'!$M4,'EY Data'!$B:$B, 0))=\"\",\"-\", ROUND(INDEX('EY Data'!AM:AM, MATCH('Select LAs'!$M4,'EY Data'!$B:$B, 0)),5)))","v":7.7586700000000004},{"$f":"IF(OR('Select LAs'!$M4=0,'Select LAs'!$M4=201, 'Select LAs'!$M4=420), \"-\",IF(INDEX('EY Data'!BO:BO, MATCH('Select LAs'!$M4,'EY Data'!$B:$B, 0))=\"-\", \"-\", ROUND(INDEX('EY Data'!BO:BO, MATCH('Select LAs'!$M4,'EY Data'!$B:$B, 0)),3)))","v":0.96},{"$f":"IF(OR('Select LAs'!$M4=0,'Select LAs'!$M4=201, 'Select LAs'!$M4=420), \"-\",IF(INDEX('EY Data'!BQ:BQ, MATCH('Select LAs'!$M4,'EY Data'!$B:$B, 0))=\"\", \"-\", ROUND(INDEX('EY Data'!BQ:BQ, MATCH('Select LAs'!$M4,'EY Data'!$B:$B, 0)),3)))","v":2.4E-2},{"$f":"IF('Select LAs'!$M4=0,\"-\",IF(INDEX('EY Data'!BG:BG, MATCH('Select LAs'!$M4,'EY Data'!$B:$B, 0))=\"\",\"-\",ROUND(INDEX('EY Data'!BG:BG, MATCH('Select LAs'!$M4,'EY Data'!$B:$B, 0)),0)))","v":5681},{"$f":"IF('Select LAs'!$M4=0,\"-\",IF(INDEX('EY Data'!BJ:BJ, MATCH('Select LAs'!$M4,'EY Data'!$B:$B, 0))=\"\",\"-\",ROUND(INDEX('EY Data'!BJ:BJ, MATCH('Select LAs'!$M4,'EY Data'!$B:$B, 0)),0)))","v":3977},{"$f":"IF('Select LAs'!$M4=0,\"-\",IF(INDEX('EY Data'!BI:BI, MATCH('Select LAs'!$M4,'EY Data'!$B:$B, 0))=\"\",\"-\",ROUND(INDEX('EY Data'!BI:BI, MATCH('Select LAs'!$M4,'EY Data'!$B:$B, 0)),0)))","v":852},{"$f":"IF('Select LAs'!$M4=0,\"-\",IF(INDEX('EY Data'!BH:BH, MATCH('Select LAs'!$M4,'EY Data'!$B:$B, 0))=\"\",\"-\",ROUND(INDEX('EY Data'!BH:BH, MATCH('Select LAs'!$M4,'EY Data'!$B:$B, 0)),0)))","v":852}]
["",{"$f":"'Select LAs'!L5","v":"No LA selected"},null,{"$f":"IF('Select LAs'!$M5=0,\"-\",IF(INDEX('EY Data'!AL:AL, MATCH('Select LAs'!$M5,'EY Data'!$B:$B, 0))=\"\",\"-\", ROUND(INDEX('EY Data'!AL:AL, MATCH('Select LAs'!$M5,'EY Data'!$B:$B, 0)),5)))","v":15.97851},{"$f":"IF('Select LAs'!$M5=0,\"-\",IF(INDEX('EY Data'!AO:AO, MATCH('Select LAs'!$M5,'EY Data'!$B:$B, 0))=\"\",\"-\", ROUND(INDEX('EY Data'!AO:AO, MATCH('Select LAs'!$M5,'EY Data'!$B:$B, 0)),5)))","v":15.97851},{"$f":"IF('Select LAs'!$M5=0,\"-\",IF(INDEX('EY Data'!AN:AN, MATCH('Select LAs'!$M5,'EY Data'!$B:$B, 0))=\"\",\"-\", ROUND(INDEX('EY Data'!AN:AN, MATCH('Select LAs'!$M5,'EY Data'!$B:$B, 0)),5)))","v":15.97851},{"$f":"IF('Select LAs'!$M5=0,\"-\",IF(INDEX('EY Data'!AM:AM, MATCH('Select LAs'!$M5,'EY Data'!$B:$B, 0))=\"\",\"-\", ROUND(INDEX('EY Data'!AM:AM, MATCH('Select LAs'!$M5,'EY Data'!$B:$B, 0)),5)))","v":15.97851},{"$f":"IF(OR('Select LAs'!$M5=0,'Select LAs'!$M5=201, 'Select LAs'!$M5=420), \"-\",IF(INDEX('EY Data'!BO:BO, MATCH('Select LAs'!$M5,'EY Data'!$B:$B, 0))=\"-\", \"-\", ROUND(INDEX('EY Data'!BO:BO, MATCH('Select LAs'!$M5,'EY Data'!$B:$B, 0)),3)))","v":1.907},{"$f":"IF(OR('Select LAs'!$M5=0,'Select LAs'!$M5=201, 'Select LAs'!$M5=420), \"-\",IF(INDEX('EY Data'!BQ:BQ, MATCH('Select LAs'!$M5,'EY Data'!$B:$B, 0))=\"\", \"-\", ROUND(INDEX('EY Data'!BQ:BQ, MATCH('Select LAs'!$M5,'EY Data'!$B:$B, 0)),3)))","v":0},{"$f":"IF('Select LAs'!$M5=0,\"-\",IF(INDEX('EY Data'!BG:BG, MATCH('Select LAs'!$M5,'EY Data'!$B:$B, 0))=\"\",\"-\",ROUND(INDEX('EY Data'!BG:BG, MATCH('Select LAs'!$M5,'EY Data'!$B:$B, 0)),0)))","v":172393},{"$f":"IF('Select LAs'!$M5=0,\"-\",IF(INDEX('EY Data'!BJ:BJ, MATCH('Select LAs'!$M5,'EY Data'!$B:$B, 0))=\"\",\"-\",ROUND(INDEX('EY Data'!BJ:BJ, MATCH('Select LAs'!$M5,'EY Data'!$B:$B, 0)),0)))","v":108607},{"$f":"IF('Select LAs'!$M5=0,\"-\",IF(INDEX('EY Data'!BI:BI, MATCH('Select LAs'!$M5,'EY Data'!$B:$B, 0))=\"\",\"-\",ROUND(INDEX('EY Data'!BI:BI, MATCH('Select LAs'!$M5,'EY Data'!$B:$B, 0)),0)))","v":8620},{"$f":"IF('Select LAs'!$M5=0,\"-\",IF(INDEX('EY Data'!BH:BH, MATCH('Select LAs'!$M5,'EY Data'!$B:$B, 0))=\"\",\"-\",ROUND(INDEX('EY Data'!BH:BH, MATCH('Select LAs'!$M5,'EY Data'!$B:$B, 0)),0)))","v":55166}]
["",{"$f":"'Select LAs'!L6","v":"No LA selected"},null,{"$f":"IF('Select LAs'!$M6=0,\"-\",IF(INDEX('EY Data'!AL:AL, MATCH('Select LAs'!$M6,'EY Data'!$B:$B, 0))=\"\",\"-\", ROUND(INDEX('EY Data'!AL:AL, MATCH('Select LAs'!$M6,'EY Data'!$B:$B, 0)),5)))","v":8.08535},{"$f":"IF('Select LAs'!$M6=0,\"-\",IF(INDEX('EY Data'!AO:AO, MATCH('Select LAs'!$M6,'EY Data'!$B:$B, 0))=\"\",\"-\", ROUND(INDEX('EY Data'!AO:AO, MATCH('Select LAs'!$M6,'EY Data'!$B:$B, 0)),5)))","v":8.0775799999999993},{"$f":"IF('Select LAs'!$M6=0,\"-\",IF(INDEX('EY Data'!AN:AN, MATCH('Select LAs'!$M6,'EY Data'!$B:$B, 0))=\"\",\"-\", ROUND(INDEX('EY Data'!AN:AN, MATCH('Select LAs'!$M6,'EY Data'!$B:$B, 0)),5)))","v":8.1004699999999996},{"$f":"IF('Select LAs'!$M6=0,\"-\",IF(INDEX('EY Data'!AM:AM, MATCH('Select LAs'!$M6,'EY Data'!$B:$B, 0))=\"\",\"-\", ROUND(INDEX('EY Data'!AM:AM, MATCH('Select LAs'!$M6,'EY Data'!$B:$B, 0)),5)))","v":8.3006700000000002},{"$f":"IF(OR('Select LAs'!$M6=0,'Select LAs'!$M6=201, 'Select LAs'!$M6=420), \"-\",IF(INDEX('EY Data'!BO:BO, MATCH('Select LAs'!$M6,'EY Data'!$B:$B, 0))=\"-\", \"-\", ROUND(INDEX('EY Data'!BO:BO, MATCH('Select LAs'!$M6,'EY Data'!$B:$B, 0)),3)))","v":0.96799999999999997},{"$f":"IF(OR('Select LAs'!$M6=0,'Select LAs'!$M6=201, 'Select LAs'!$M6=420), \"-\",IF(INDEX('EY Data'!BQ:BQ, MATCH('Select LAs'!$M6,'EY Data'!$B:$B, 0))=\"\", \"-\", ROUND(INDEX('EY Data'!BQ:BQ, MATCH('Select LAs'!$M6,'EY Data'!$B:$B, 0)),3)))","v":3.6999999999999998E-2},{"$f":"IF('Select LAs'!$M6=0,\"-\",IF(INDEX('EY Data'!BG:BG, MATCH('Select LAs'!$M6,'EY Data'!$B:$B, 0))=\"\",\"-\",ROUND(INDEX('EY Data'!BG:BG, MATCH('Select LAs'!$M6,'EY Data'!$B:$B, 0)),0)))","v":12000},{"$f":"IF('Select LAs'!$M6=0,\"-\",IF(INDEX('EY Data'!BJ:BJ, MATCH('Select LAs'!$M6,'EY Data'!$B:$B, 0))=\"\",\"-\",ROUND(INDEX('EY Data'!BJ:BJ, MATCH('Select LAs'!$M6,'EY Data'!$B:$B, 0)),0)))","v":7800},{"$f":"IF('Select LAs'!$M6=0,\"-\",IF(INDEX('EY Data'!BI:BI, MATCH('Select LAs'!$M6,'EY Data'!$B:$B, 0))=\"\",\"-\",ROUND(INDEX('EY Data'!BI:BI, MATCH('Select LAs'!$M6,'EY Data'!$B:$B, 0)),0)))","v":600},{"$f":"IF('Select LAs'!$M6=0,\"-\",IF(INDEX('EY Data'!BH:BH, MATCH('Select LAs'!$M6,'EY Data'!$B:$B, 0))=\"\",\"-\",ROUND(INDEX('EY Data'!BH:BH, MATCH('Select LAs'!$M6,'EY Data'!$B:$B, 0)),0)))","v":3600}]
["",{"$f":"'Select LAs'!L7","v":"No LA selected"},null,{"$f":"IF('Select LAs'!$M7=0,\"-\",IF(INDEX('EY Data'!AL:AL, MATCH('Select LAs'!$M7,'EY Data'!$B:$B, 0))=\"\",\"-\", ROUND(INDEX('EY Data'!AL:AL, MATCH('Select LAs'!$M7,'EY Data'!$B:$B, 0)),5)))","v":8.0964299999999998},{"$f":"IF('Select LAs'!$M7=0,\"-\",IF(INDEX('EY Data'!AO:AO, MATCH('Select LAs'!$M7,'EY Data'!$B:$B, 0))=\"\",\"-\", ROUND(INDEX('EY Data'!AO:AO, MATCH('Select LAs'!$M7,'EY Data'!$B:$B, 0)),5)))","v":8.0952599999999997},{"$f":"IF('Select LAs'!$M7=0,\"-\",IF(INDEX('EY Data'!AN:AN, MATCH('Select LAs'!$M7,'EY Data'!$B:$B, 0))=\"\",\"-\", ROUND(INDEX('EY Data'!AN:AN, MATCH('Select LAs'!$M7,'EY Data'!$B:$B, 0)),5)))","v":8.09788},{"$f":"IF('Select LAs'!$M7=0,\"-\",IF(INDEX('EY Data'!AM:AM, MATCH('Select LAs'!$M7,'EY Data'!$B:$B, 0))=\"\",\"-\", ROUND(INDEX('EY Data'!AM:AM, MATCH('Select LAs'!$M7,'EY Data'!$B:$B, 0)),5)))","v":8.1161499999999993},{"$f":"IF(OR('Select LAs'!$M7=0,'Select LAs'!$M7=201, 'Select LAs'!$M7=420), \"-\",IF(INDEX('EY Data'!BO:BO, MATCH('Select LAs'!$M7,'EY Data'!$B:$B, 0))=\"-\", \"-\", ROUND(INDEX('EY Data'!BO:BO, MATCH('Select LAs'!$M7,'EY Data'!$B:$B, 0)),3)))","v":0.97499999999999998},{"$f":"IF(OR('Select LAs'!$M7=0,'Select LAs'!$M7=201, 'Select LAs'!$M7=420), \"-\",IF(INDEX('EY Data'!BQ:BQ, MATCH('Select LAs'!$M7,'EY Data'!$B:$B, 0))=\"\", \"-\", ROUND(INDEX('EY Data'!BQ:BQ, MATCH('Select LAs'!$M7,'EY Data'!$B:$B, 0)),3)))","v":0},{"$f":"IF('Select LAs'!$M7=0,\"-\",IF(INDEX('EY Data'!BG:BG, MATCH('Select LAs'!$M7,'EY Data'!$B:$B, 0))=\"\",\"-\",ROUND(INDEX('EY Data'!BG:BG, MATCH('Select LAs'!$M7,'EY Data'!$B:$B, 0)),0)))","v":150000},{"$f":"IF('Select LAs'!$M7=0,\"-\",IF(INDEX('EY Data'!BJ:BJ, MATCH('Select LAs'!$M7,'EY Data'!$B:$B, 0))=\"\",\"-\",ROUND(INDEX('EY Data'!BJ:BJ, MATCH('Select LAs'!$M7,'EY Data'!$B:$B, 0)),0)))","v":127500},{"$f":"IF('Select LAs'!$M7=0,\"-\",IF(INDEX('EY Data'!BI:BI, MATCH('Select LAs'!$M7,'EY Data'!$B:$B, 0))=\"\",\"-\",ROUND(INDEX('EY Data'!BI:BI, MATCH('Select LAs'!$M7,'EY Data'!$B:$B, 0)),0)))","v":15000},{"$f":"IF('Select LAs'!$M7=0,\"-\",IF(INDEX('EY Data'!BH:BH, MATCH('Select LAs'!$M7,'EY Data'!$B:$B, 0))=\"\",\"-\",ROUND(INDEX('EY Data'!BH:BH, MATCH('Select LAs'!$M7,'EY Data'!$B:$B, 0)),0)))","v":7500}]
["",{"$f":"'Select LAs'!L8","v":"No LA selected"},null,{"$f":"IF('Select LAs'!$M8=0,\"-\",IF(INDEX('EY Data'!AL:AL, MATCH('Select LAs'!$M8,'EY Data'!$B:$B, 0))=\"\",\"-\", ROUND(INDEX('EY Data'!AL:AL, MATCH('Select LAs'!$M8,'EY Data'!$B:$B, 0)),5)))","v":8.0668000000000006},{"$f":"IF('Select LAs'!$M8=0,\"-\",IF(INDEX('EY Data'!AO:AO, MATCH('Select LAs'!$M8,'EY Data'!$B:$B, 0))=\"\",\"-\", ROUND(INDEX('EY Data'!AO:AO, MATCH('Select LAs'!$M8,'EY Data'!$B:$B, 0)),5)))","v":8.0713100000000004},{"$f":"IF('Select LAs'!$M8=0,\"-\",IF(INDEX('EY Data'!AN:AN, MATCH('Select LAs'!$M8,'EY Data'!$B:$B, 0))=\"\",\"-\", ROUND(INDEX('EY Data'!AN:AN, MATCH('Select LAs'!$M8,'EY Data'!$B:$B, 0)),5)))","v":8.0578299999999992},{"$f":"IF('Select LAs'!$M8=0,\"-\",IF(INDEX('EY Data'!AM:AM, MATCH('Select LAs'!$M8,'EY Data'!$B:$B, 0))=\"\",\"-\", ROUND(INDEX('EY Data'!AM:AM, MATCH('Select LAs'!$M8,'EY Data'!$B:$B, 0)),5)))","v":8.0649499999999996},{"$f":"IF(OR('Select LAs'!$M8=0,'Select LAs'!$M8=201, 'Select LAs'!$M8=420), \"-\",IF(INDEX('EY Data'!BO:BO, MATCH('Select LAs'!$M8,'EY Data'!$B:$B, 0))=\"-\", \"-\", ROUND(INDEX('EY Data'!BO:BO, MATCH('Select LAs'!$M8,'EY Data'!$B:$B, 0)),3)))","v":0.96299999999999997},{"$f":"IF(OR('Select LAs'!$M8=0,'Select LAs'!$M8=201, 'Select LAs'!$M8=420), \"-\",IF(INDEX('EY Data'!BQ:BQ, MATCH('Select LAs'!$M8,'EY Data'!$B:$B, 0))=\"\", \"-\", ROUND(INDEX('EY Data'!BQ:BQ, MATCH('Select LAs'!$M8,'EY Data'!$B:$B, 0)),3)))","v":0},{"$f":"IF('Select LAs'!$M8=0,\"-\",IF(INDEX('EY Data'!BG:BG, MATCH('Select LAs'!$M8,'EY Data'!$B:$B, 0))=\"\",\"-\",ROUND(INDEX('EY Data'!BG:BG, MATCH('Select LAs'!$M8,'EY Data'!$B:$B, 0)),0)))","v":15000},{"$f":"IF('Select LAs'!$M8=0,\"-\",IF(INDEX('EY Data'!BJ:BJ, MATCH('Select LAs'!$M8,'EY Data'!$B:$B, 0))=\"\",\"-\",ROUND(INDEX('EY Data'!BJ:BJ, MATCH('Select LAs'!$M8,'EY Data'!$B:$B, 0)),0)))","v":10000},{"$f":"IF('Select LAs'!$M8=0,\"-\",IF(INDEX('EY Data'!BI:BI, MATCH('Select LAs'!$M8,'EY Data'!$B:$B, 0))=\"\",\"-\",ROUND(INDEX('EY Data'!BI:BI, MATCH('Select LAs'!$M8,'EY Data'!$B:$B, 0)),0)))","v":2500},{"$f":"IF('Select LAs'!$M8=0,\"-\",IF(INDEX('EY Data'!BH:BH, MATCH('Select LAs'!$M8,'EY Data'!$B:$B, 0))=\"\",\"-\",ROUND(INDEX('EY Data'!BH:BH, MATCH('Select LAs'!$M8,'EY Data'!$B:$B, 0)),0)))","v":2500}]
["",{"$f":"'Select LAs'!L9","v":"No LA selected"},null,{"$f":"IF('Select LAs'!$M9=0,\"-\",IF(INDEX('EY Data'!AL:AL, MATCH('Select LAs'!$M9,'EY Data'!$B:$B, 0))=\"\",\"-\", ROUND(INDEX('EY Data'!AL:AL, MATCH('Select LAs'!$M9,'EY Data'!$B:$B, 0)),5)))","v":8.3626000000000005},{"$f":"IF('Select LAs'!$M9=0,\"-\",IF(INDEX('EY Data'!AO:AO, MATCH('Select LAs'!$M9,'EY Data'!$B:$B, 0))=\"\",\"-\", ROUND(INDEX('EY Data'!AO:AO, MATCH('Select LAs'!$M9,'EY Data'!$B:$B, 0)),5)))","v":8.3626000000000005},{"$f":"IF('Select LAs'!$M9=0,\"-\",IF(INDEX('EY Data'!AN:AN, MATCH('Select LAs'!$M9,'EY Data'!$B:$B, 0))=\"\",\"-\", ROUND(INDEX('EY Data'!AN:AN, MATCH('Select LAs'!$M9,'EY Data'!$B:$B, 0)),5)))","v":8.3626000000000005},{"$f":"IF('Select LAs'!$M9=0,\"-\",IF(INDEX('EY Data'!AM:AM, MATCH('Select LAs'!$M9,'EY Data'!$B:$B, 0))=\"\",\"-\", ROUND(INDEX('EY Data'!AM:AM, MATCH('Select LAs'!$M9,'EY Data'!$B:$B, 0)),5)))","v":8.3626199999999997},{"$f":"IF(OR('Select LAs'!$M9=0,'Select LAs'!$M9=201, 'Select LAs'!$M9=420), \"-\",IF(INDEX('EY Data'!BO:BO, MATCH('Select LAs'!$M9,'EY Data'!$B:$B, 0))=\"-\", \"-\", ROUND(INDEX('EY Data'!BO:BO, MATCH('Select LAs'!$M9,'EY Data'!$B:$B, 0)),3)))","v":0.99199999999999999},{"$f":"IF(OR('Select LAs'!$M9=0,'Select LAs'!$M9=201, 'Select LAs'!$M9=420), \"-\",IF(INDEX('EY Data'!BQ:BQ, MATCH('Select LAs'!$M9,'EY Data'!$B:$B, 0))=\"\", \"-\", ROUND(INDEX('EY Data'!BQ:BQ, MATCH('Select LAs'!$M9,'EY Data'!$B:$B, 0)),3)))","v":0},{"$f":"IF('Select LAs'!$M9=0,\"-\",IF(INDEX('EY Data'!BG:BG, MATCH('Select LAs'!$M9,'EY Data'!$B:$B, 0))=\"\",\"-\",ROUND(INDEX('EY Data'!BG:BG, MATCH('Select LAs'!$M9,'EY Data'!$B:$B, 0)),0)))","v":108745},{"$f":"IF('Select LAs'!$M9=0,\"-\",IF(INDEX('EY Data'!BJ:BJ, MATCH('Select LAs'!$M9,'EY Data'!$B:$B, 0))=\"\",\"-\",ROUND(INDEX('EY Data'!BJ:BJ, MATCH('Select LAs'!$M9,'EY Data'!$B:$B, 0)),0)))","v":84659},{"$f":"IF('Select LAs'!$M9=0,\"-\",IF(INDEX('EY Data'!BI:BI, MATCH('Select LAs'!$M9,'EY Data'!$B:$B, 0))=\"\",\"-\",ROUND(INDEX('EY Data'!BI:BI, MATCH('Select LAs'!$M9,'EY Data'!$B:$B, 0)),0)))","v":12701},{"$f":"IF('Select LAs'!$M9=0,\"-\",IF(INDEX('EY Data'!BH:BH, MATCH('Select LAs'!$M9,'EY Data'!$B:$B, 0))=\"\",\"-\",ROUND(INDEX('EY Data'!BH:BH, MATCH('Select LAs'!$M9,'EY Data'!$B:$B, 0)),0)))","v":11385}]
["",{"$f":"'Select LAs'!L10","v":"No LA selected"},null,{"$f":"IF('Select LAs'!$M10=0,\"-\",IF(INDEX('EY Data'!AL:AL, MATCH('Select LAs'!$M10,'EY Data'!$B:$B, 0))=\"\",\"-\", ROUND(INDEX('EY Data'!AL:AL, MATCH('Select LAs'!$M10,'EY Data'!$B:$B, 0)),5)))","v":8.2754399999999997},{"$f":"IF('Select LAs'!$M10=0,\"-\",IF(INDEX('EY Data'!AO:AO, MATCH('Select LAs'!$M10,'EY Data'!$B:$B, 0))=\"\",\"-\", ROUND(INDEX('EY Data'!AO:AO, MATCH('Select LAs'!$M10,'EY Data'!$B:$B, 0)),5)))","v":8.2835400000000003},{"$f":"IF('Select LAs'!$M10=0,\"-\",IF(INDEX('EY Data'!AN:AN, MATCH('Select LAs'!$M10,'EY Data'!$B:$B, 0))=\"\",\"-\", ROUND(INDEX('EY Data'!AN:AN, MATCH('Select LAs'!$M10,'EY Data'!$B:$B, 0)),5)))","v":8.1999999999999993},{"$f":"IF('Select LAs'!$M10=0,\"-\",IF(INDEX('EY Data'!AM:AM, MATCH('Select LAs'!$M10,'EY Data'!$B:$B, 0))=\"\",\"-\", ROUND(INDEX('EY Data'!AM:AM, MATCH('Select LAs'!$M10,'EY Data'!$B:$B, 0)),5)))","v":8.1999999999999993},{"$f":"IF(OR('Select LAs'!$M10=0,'Select LAs'!$M10=201, 'Select LAs'!$M10=420), \"-\",IF(INDEX('EY Data'!BO:BO, MATCH('Select LAs'!$M10,'EY Data'!$B:$B, 0))=\"-\", \"-\", ROUND(INDEX('EY Data'!BO:BO, MATCH('Select LAs'!$M10,'EY Data'!$B:$B, 0)),3)))","v":1.016},{"$f":"IF(OR('Select LAs'!$M10=0,'Select LAs'!$M10=201, 'Select LAs'!$M10=420), \"-\",IF(INDEX('EY Data'!BQ:BQ, MATCH('Select LAs'!$M10,'EY Data'!$B:$B, 0))=\"\", \"-\", ROUND(INDEX('EY Data'!BQ:BQ, MATCH('Select LAs'!$M10,'EY Data'!$B:$B, 0)),3)))","v":0},{"$f":"IF('Select LAs'!$M10=0,\"-\",IF(INDEX('EY Data'!BG:BG, MATCH('Select LAs'!$M10,'EY Data'!$B:$B, 0))=\"\",\"-\",ROUND(INDEX('EY Data'!BG:BG, MATCH('Select LAs'!$M10,'EY Data'!$B:$B, 0)),0)))","v":30000},{"$f":"IF('Select LAs'!$M10=0,\"-\",IF(INDEX('EY Data'!BJ:BJ, MATCH('Select LAs'!$M10,'EY Data'!$B:$B, 0))=\"\",\"-\",ROUND(INDEX('EY Data'!BJ:BJ, MATCH('Select LAs'!$M10,'EY Data'!$B:$B, 0)),0)))","v":30000},{"$f":"IF('Select LAs'!$M10=0,\"-\",IF(INDEX('EY Data'!BI:BI, MATCH('Select LAs'!$M10,'EY Data'!$B:$B, 0))=\"\",\"-\",ROUND(INDEX('EY Data'!BI:BI, MATCH('Select LAs'!$M10,'EY Data'!$B:$B, 0)),0)))","v":0},{"$f":"IF('Select LAs'!$M10=0,\"-\",IF(INDEX('EY Data'!BH:BH, MATCH('Select LAs'!$M10,'EY Data'!$B:$B, 0))=\"\",\"-\",ROUND(INDEX('EY Data'!BH:BH, MATCH('Select LAs'!$M10,'EY Data'!$B:$B, 0)),0)))","v":0}]
["",{"$f":"'Select LAs'!L11","v":"No LA selected"},null,{"$f":"IF('Select LAs'!$M11=0,\"-\",IF(INDEX('EY Data'!AL:AL, MATCH('Select LAs'!$M11,'EY Data'!$B:$B, 0))=\"\",\"-\", ROUND(INDEX('EY Data'!AL:AL, MATCH('Select LAs'!$M11,'EY Data'!$B:$B, 0)),5)))","v":8.3428000000000004},{"$f":"IF('Select LAs'!$M11=0,\"-\",IF(INDEX('EY Data'!AO:AO, MATCH('Select LAs'!$M11,'EY Data'!$B:$B, 0))=\"\",\"-\", ROUND(INDEX('EY Data'!AO:AO, MATCH('Select LAs'!$M11,'EY Data'!$B:$B, 0)),5)))","v":8.3250700000000002},{"$f":"IF('Select LAs'!$M11=0,\"-\",IF(INDEX('EY Data'!AN:AN, MATCH('Select LAs'!$M11,'EY Data'!$B:$B, 0))=\"\",\"-\", ROUND(INDEX('EY Data'!AN:AN, MATCH('Select LAs'!$M11,'EY Data'!$B:$B, 0)),5)))","v":8.5969200000000008},{"$f":"IF('Select LAs'!$M11=0,\"-\",IF(INDEX('EY Data'!AM:AM, MATCH('Select LAs'!$M11,'EY Data'!$B:$B, 0))=\"\",\"-\", ROUND(INDEX('EY Data'!AM:AM, MATCH('Select LAs'!$M11,'EY Data'!$B:$B, 0)),5)))","v":8.3784200000000002},{"$f":"IF(OR('Select LAs'!$M11=0,'Select LAs'!$M11=201, 'Select LAs'!$M11=420), \"-\",IF(INDEX('EY Data'!BO:BO, MATCH('Select LAs'!$M11,'EY Data'!$B:$B, 0))=\"-\", \"-\", ROUND(INDEX('EY Data'!BO:BO, MATCH('Select LAs'!$M11,'EY Data'!$B:$B, 0)),3)))","v":0.97099999999999997},{"$f":"IF(OR('Select LAs'!$M11=0,'Select LAs'!$M11=201, 'Select LAs'!$M11=420), \"-\",IF(INDEX('EY Data'!BQ:BQ, MATCH('Select LAs'!$M11,'EY Data'!$B:$B, 0))=\"\", \"-\", ROUND(INDEX('EY Data'!BQ:BQ, MATCH('Select LAs'!$M11,'EY Data'!$B:$B, 0)),3)))","v":6.9000000000000006E-2},{"$f":"IF('Select LAs'!$M11=0,\"-\",IF(INDEX('EY Data'!BG:BG, MATCH('Select LAs'!$M11,'EY Data'!$B:$B, 0))=\"\",\"-\",ROUND(INDEX('EY Data'!BG:BG, MATCH('Select LAs'!$M11,'EY Data'!$B:$B, 0)),0)))","v":13085},{"$f":"IF('Select LAs'!$M11=0,\"-\",IF(INDEX('EY Data'!BJ:BJ, MATCH('Select LAs'!$M11,'EY Data'!$B:$B, 0))=\"\",\"-\",ROUND(INDEX('EY Data'!BJ:BJ, MATCH('Select LAs'!$M11,'EY Data'!$B:$B, 0)),0)))","v":11365},{"$f":"IF('Select LAs'!$M11=0,\"-\",IF(INDEX('EY Data'!BI:BI, MATCH('Select LAs'!$M11,'EY Data'!$B:$B, 0))=\"\",\"-\",ROUND(INDEX('EY Data'!BI:BI, MATCH('Select LAs'!$M11,'EY Data'!$B:$B, 0)),0)))","v":642},{"$f":"IF('Select LAs'!$M11=0,\"-\",IF(INDEX('EY Data'!BH:BH, MATCH('Select LAs'!$M11,'EY Data'!$B:$B, 0))=\"\",\"-\",ROUND(INDEX('EY Data'!BH:BH, MATCH('Select LAs'!$M11,'EY Data'!$B:$B, 0)),0)))","v":1079}]
["",{"$f":"'Select LAs'!L12","v":"No LA selected"},null,{"$f":"IF('Select LAs'!$M12=0,\"-\",IF(INDEX('EY Data'!AL:AL, MATCH('Select LAs'!$M12,'EY Data'!$B:$B, 0))=\"\",\"-\", ROUND(INDEX('EY Data'!AL:AL, MATCH('Select LAs'!$M12,'EY Data'!$B:$B, 0)),5)))","v":8.9465800000000009},{"$f":"IF('Select LAs'!$M12=0,\"-\",IF(INDEX('EY Data'!AO:AO, MATCH('Select LAs'!$M12,'EY Data'!$B:$B, 0))=\"\",\"-\", ROUND(INDEX('EY Data'!AO:AO, MATCH('Select LAs'!$M12,'EY Data'!$B:$B, 0)),5)))","v":8.6406600000000005},{"$f":"IF('Select LAs'!$M12=0,\"-\",IF(INDEX('EY Data'!AN:AN, MATCH('Select LAs'!$M12,'EY Data'!$B:$B, 0))=\"\",\"-\", ROUND(INDEX('EY Data'!AN:AN, MATCH('Select LAs'!$M12,'EY Data'!$B:$B, 0)),5)))","v":10.447520000000001},{"$f":"IF('Select LAs'!$M12=0,\"-\",IF(INDEX('EY Data'!AM:AM, MATCH('Select LAs'!$M12,'EY Data'!$B:$B, 0))=\"\",\"-\", ROUND(INDEX('EY Data'!AM:AM, MATCH('Select LAs'!$M12,'EY Data'!$B:$B, 0)),5)))","v":10.171340000000001},{"$f":"IF(OR('Select LAs'!$M12=0,'Select LAs'!$M12=201, 'Select LAs'!$M12=420), \"-\",IF(INDEX('EY Data'!BO:BO, MATCH('Select LAs'!$M12,'EY Data'!$B:$B, 0))=\"-\", \"-\", ROUND(INDEX('EY Data'!BO:BO, MATCH('Select LAs'!$M12,'EY Data'!$B:$B, 0)),3)))","v":0.99399999999999999},{"$f":"IF(OR('Select LAs'!$M12=0,'Select LAs'!$M12=201, 'Select LAs'!$M12=420), \"-\",IF(INDEX('EY Data'!BQ:BQ, MATCH('Select LAs'!$M12,'EY Data'!$B:$B, 0))=\"\", \"-\", ROUND(INDEX('EY Data'!BQ:BQ, MATCH('Select LAs'!$M12,'EY Data'!$B:$B, 0)),3)))","v":0},{"$f":"IF('Select LAs'!$M12=0,\"-\",IF(INDEX('EY Data'!BG:BG, MATCH('Select LAs'!$M12,'EY Data'!$B:$B, 0))=\"\",\"-\",ROUND(INDEX('EY Data'!BG:BG, MATCH('Select LAs'!$M12,'EY Data'!$B:$B, 0)),0)))","v":916668},{"$f":"IF('Select LAs'!$M12=0,\"-\",IF(INDEX('EY Data'!BJ:BJ, MATCH('Select LAs'!$M12,'EY Data'!$B:$B, 0))=\"\",\"-\",ROUND(INDEX('EY Data'!BJ:BJ, MATCH('Select LAs'!$M12,'EY Data'!$B:$B, 0)),0)))","v":222222},{"$f":"IF('Select LAs'!$M12=0,\"-\",IF(INDEX('EY Data'!BI:BI, MATCH('Select LAs'!$M12,'EY Data'!$B:$B, 0))=\"\",\"-\",ROUND(INDEX('EY Data'!BI:BI, MATCH('Select LAs'!$M12,'EY Data'!$B:$B, 0)),0)))","v":222223},{"$f":"IF('Select LAs'!$M12=0,\"-\",IF(INDEX('EY Data'!BH:BH, MATCH('Select LAs'!$M12,'EY Data'!$B:$B, 0))=\"\",\"-\",ROUND(INDEX('EY Data'!BH:BH, MATCH('Select LAs'!$M12,'EY Data'!$B:$B, 0)),0)))","v":472223}]
[null,{"$f":"'Select LAs'!L13","v":"No LA selected"},null,{"$f":"IF('Select LAs'!$M13=0,\"-\",IF(INDEX('EY Data'!AL:AL, MATCH('Select LAs'!$M13,'EY Data'!$B:$B, 0))=\"\",\"-\", ROUND(INDEX('EY Data'!AL:AL, MATCH('Select LAs'!$M13,'EY Data'!$B:$B, 0)),5)))","v":9.0625300000000006},{"$f":"IF('Select LAs'!$M13=0,\"-\",IF(INDEX('EY Data'!AO:AO, MATCH('Select LAs'!$M13,'EY Data'!$B:$B, 0))=\"\",\"-\", ROUND(INDEX('EY Data'!AO:AO, MATCH('Select LAs'!$M13,'EY Data'!$B:$B, 0)),5)))","v":9.0625300000000006},{"$f":"IF('Select LAs'!$M13=0,\"-\",IF(INDEX('EY Data'!AN:AN, MATCH('Select LAs'!$M13,'EY Data'!$B:$B, 0))=\"\",\"-\", ROUND(INDEX('EY Data'!AN:AN, MATCH('Select LAs'!$M13,'EY Data'!$B:$B, 0)),5)))","v":0},{"$f":"IF('Select LAs'!$M13=0,\"-\",IF(INDEX('EY Data'!AM:AM, MATCH('Select LAs'!$M13,'EY Data'!$B:$B, 0))=\"\",\"-\", ROUND(INDEX('EY Data'!AM:AM, MATCH('Select LAs'!$M13,'EY Data'!$B:$B, 0)),5)))","v":0},{"$f":"IF(OR('Select LAs'!$M13=0,'Select LAs'!$M13=201, 'Select LAs'!$M13=420), \"-\",IF(INDEX('EY Data'!BO:BO, MATCH('Select LAs'!$M13,'EY Data'!$B:$B, 0))=\"-\", \"-\", ROUND(INDEX('EY Data'!BO:BO, MATCH('Select LAs'!$M13,'EY Data'!$B:$B, 0)),3)))","v":1.0249999999999999},{"$f":"IF(OR('Select LAs'!$M13=0,'Select LAs'!$M13=201, 'Select LAs'!$M13=420), \"-\",IF(INDEX('EY Data'!BQ:BQ, MATCH('Select LAs'!$M13,'EY Data'!$B:$B, 0))=\"\", \"-\", ROUND(INDEX('EY Data'!BQ:BQ, MATCH('Select LAs'!$M13,'EY Data'!$B:$B, 0)),3)))","v":0},{"$f":"IF('Select LAs'!$M13=0,\"-\",IF(INDEX('EY Data'!BG:BG, MATCH('Select LAs'!$M13,'EY Data'!$B:$B, 0))=\"\",\"-\",ROUND(INDEX('EY Data'!BG:BG, MATCH('Select LAs'!$M13,'EY Data'!$B:$B, 0)),0)))","v":120000},{"$f":"IF('Select LAs'!$M13=0,\"-\",IF(INDEX('EY Data'!BJ:BJ, MATCH('Select LAs'!$M13,'EY Data'!$B:$B, 0))=\"\",\"-\",ROUND(INDEX('EY Data'!BJ:BJ, MATCH('Select LAs'!$M13,'EY Data'!$B:$B, 0)),0)))","v":120000},{"$f":"IF('Select LAs'!$M13=0,\"-\",IF(INDEX('EY Data'!BI:BI, MATCH('Select LAs'!$M13,'EY Data'!$B:$B, 0))=\"\",\"-\",ROUND(INDEX('EY Data'!BI:BI, MATCH('Select LAs'!$M13,'EY Data'!$B:$B, 0)),0)))","v":0},{"$f":"IF('Select LAs'!$M13=0,\"-\",IF(INDEX('EY Data'!BH:BH, MATCH('Select LAs'!$M13,'EY Data'!$B:$B, 0))=\"\",\"-\",ROUND(INDEX('EY Data'!BH:BH, MATCH('Select LAs'!$M13,'EY Data'!$B:$B, 0)),0)))","v":0}]
[null,"Selection Median",null,{"$f":"IF(COUNT(D$29:D$39)>0,MEDIAN(D$29:D$39),\"-\")","v":8.2754399999999997},8.2835400000000003,8.1004699999999996,{"$f":"IF(COUNT(G$29:G$39)>0,MEDIAN(G$29:G$39),\"-\")","v":8.1999999999999993},{"$f":"IF(COUNT(H$29:H$39)>0,MEDIAN(H$29:H$39),\"-\")","v":0.97499999999999998},{"$f":"IF(COUNT(I$29:I$39)>0,MEDIAN(I$29:I$39),\"-\")","v":0},{"$f":"IF(COUNT(J$29:J$39)>0,MEDIAN(J$29:J$39),\"-\")","v":50848},{"$f":"IF(COUNT(K$29:K$39)>0,MEDIAN(K$29:K$39),\"-\")","v":50848},852,2500]
[null,"Selection Minimum",null,{"$f":"IF(COUNT(D$29:D$39)>0,MIN(D$29:D$39),\"-\")","v":7.8151799999999998},7.8258200000000002,0,{"$f":"IF(COUNT(G$29:G$39)>0,MIN(G$29:G$39),\"-\")","v":0},{"$f":"IF(COUNT(H$29:H$39)>0,MIN(H$29:H$39),\"-\")","v":0.96},{"$f":"IF(COUNT(I$29:I$39)>0,MIN(I$29:I$39),\"-\")","v":0},{"$f":"IF(COUNT(J$29:J$39)>0,MIN(J$29:J$39),\"-\")","v":5681},{"$f":"IF(COUNT(K$29:K$39)>0,MIN(K$29:K$39),\"-\")","v":3977},0,0]
[null,"Selection Maximum",null,{"$f":"IF(COUNT(D$29:D$39)>0,MAX(D$29:D$39),\"-\")","v":15.97851},15.97851,15.97851,{"$f":"IF(COUNT(G$29:G$39)>0,MAX(G$29:G$39),\"-\")","v":15.97851},{"$f":"IF(COUNT(H$29:H$39)>0,MAX(H$29:H$39),\"-\")","v":1.907},{"$f":"IF(COUNT(I$29:I$39)>0,MAX(I$29:I$39),\"-\")","v":6.9000000000000006E-2},{"$f":"IF(COUNT(J$29:J$39)>0,MAX(J$29:J$39),\"-\")","v":916668},{"$f":"IF(COUNT(K$29:K$39)>0,MAX(K$29:K$39),\"-\")","v":222222},222223,472223]

{"sheet":"2 year olds (WP)","index":3,"n_rows":42,"n_cols":13,"rows_kept":42,"cut":false,"hidden":true,"merged":[[43,1,43,11],[4,1,4,2],[22,3,22,4],[26,1,26,2],[25,3,25,6],[6,1,6,2],[5,1,5,2],[25,9,25,12],[7,1,7,2],[25,7,26,7],[25,8,26,8]]}
[]
[null,{"$f":"CONCATENATE('Select LAs'!B3,\" - Key Budget Statistics\")","v":"No LA selected - Key Budget Statistics"},null,null,null,null,null,null,null,null,null,null,{"$f":"'3-4 year olds '!$K$2","v":"Financial Year 2025-2026"}]
[]
[]
[null,{"$f":"'Select LAs'!D3","v":"No LA selected"},null,"All providers","Private, Voluntary, Independent","Nursery schools","Primary nursery places"]
[null,"2 year old (WP) hourly average funding rate (£/hr)",null,{"$f":"IFERROR(IF(INDEX('EY Data'!BS:BS, MATCH('Select LAs'!$A$3,'EY Data'!$B:$B, 0))=\"\",\"-\", INDEX('EY Data'!BS:BS, MATCH('Select LAs'!$A$3,'EY Data'!$B:$B, 0))), 0)","v":0},{"$f":"IFERROR(IF(INDEX('EY Data'!BV:BV, MATCH('Select LAs'!$A$3,'EY Data'!$B:$B, 0))=\"\",\"-\", INDEX('EY Data'!BV:BV, MATCH('Select LAs'!$A$3,'EY Data'!$B:$B, 0))), 0)","v":0},{"$f":"IFERROR(IF(INDEX('EY Data'!BU:BU, MATCH('Select LAs'!$A$3,'EY Data'!$B:$B, 0))=\"\",\"-\", INDEX('EY Data'!BU:BU, MATCH('Select LAs'!$A$3,'EY Data'!$B:$B, 0))), 0)","v":0},{"$f":"IFERROR(IF(INDEX('EY Data'!BT:BT, MATCH('Select LAs'!$A$3,'EY Data'!$B:$B, 0))=\"\",\"-\", INDEX('EY Data'!BT:BT, MATCH('Select LAs'!$A$3,'EY Data'!$B:$B, 0))), 0)","v":0}]
[null,"2 year old (WP) hourly average base rate (£/hr)",null,{"$f":"IFERROR(IF(INDEX('EY Data'!CF:CF, MATCH('Select LAs'!$A$3,'EY Data'!$B:$B, 0))=\"\",\"-\", INDEX('EY Data'!CF:CF, MATCH('Select LAs'!$A$3,'EY Data'!$B:$B, 0))), 0)","v":0},{"$f":"IFERROR(IF(INDEX('EY Data'!CI:CI, MATCH('Select LAs'!$A$3,'EY Data'!$B:$B, 0))=\"\",\"-\", INDEX('EY Data'!CI:CI, MATCH('Select LAs'!$A$3,'EY Data'!$B:$B, 0))), 0)","v":0},{"$f":"IFERROR(IF(INDEX('EY Data'!CH:CH, MATCH('Select LAs'!$A$3,'EY Data'!$B:$B, 0))=\"\",\"-\", INDEX('EY Data'!CH:CH, MATCH('Select LAs'!$A$3,'EY Data'!$B:$B, 0))), 0)","v":0},{"$f":"IFERROR(IF(INDEX('EY Data'!CG:CG, MATCH('Select LAs'!$A$3,'EY Data'!$B:$B, 0))=\"\",\"-\", INDEX('EY Data'!CG:CG, MATCH('Select LAs'!$A$3,'EY Data'!$B:$B, 0))), 0)","v":0}]
[null,"Pass-through rate (%)",null,{"$f":"IF(OR('Select LAs'!$A$3 = \"LA No\", 'Select LAs'!$A$3 = 201, 'Select LAs'!$A$3 = 420), \"-\", INDEX('EY Data'!CU:CU, MATCH('Select LAs'!$A$3,'EY Data'!$B:$B, 0)))","v":"-"}]
[]
[]
[]
[]
[]
[]
[]
[]
[]
[]
[null,{"$f":"CONCATENATE(\"Benchmarking against \",IF(_SN=1,\"Statistical Neighbours\",\"Manual Selection\"))","v":"Benchmarking against Manual Selection"}]
[]
[]
[]
[null,null,"Table ordering"]
[]
[]
[null,null,null,"Average funding rate to providers per hour",null,null,null,"Pass-through rate","Funding paid through supplements","SEN Inclusion Fund (top-up grant element) budget"]
[null,"Local Authority",null,"All providers","Private, Voluntary, Independent","Nursery schools","Primary nursery places",null,null,"All providers","Private, Voluntary, Independent","Nursery schools","Primary nursery places"]
[null,"England",null,{"$f":"ROUND(INDEX('EY Data'!BS:BS, MATCH($B28,'EY Data'!$C:$C, 0)), 5)","v":7.9558},{"$f":"ROUND(INDEX('EY Data'!BV:BV, MATCH($B28,'EY Data'!$C:$C, 0)), 5)","v":7.93865},{"$f":"ROUND(INDEX('EY Data'!BU:BU, MATCH($B28,'EY Data'!$C:$C, 0)), 5)","v":8.3906799999999997},{"$f":"ROUND(INDEX('EY Data'!BT:BT, MATCH($B28,'EY Data'!$C:$C, 0)), 5)","v":7.8838499999999998},{"$f":"IF(INDEX('EY Data'!CU:CU, MATCH($B28,'EY Data'!$C:$C, 0))=\"-\", \"-\", ROUND(INDEX('EY Data'!CU:CU, MATCH($B28,'EY Data'!$C:$C, 0)), 3))","v":0.97199999999999998},{"$f":"IF(INDEX('EY Data'!CW:CW, MATCH($B28,'EY Data'!$C:$C, 0))=\"-\", \"-\", ROUND(INDEX('EY Data'!CW:CW, MATCH($B28,'EY Data'!$C:$C, 0)), 3))","v":1.2E-2},{"$f":"ROUND(INDEX('EY Data'!CM:CM, MATCH($B28,'EY Data'!$C:$C, 0)), 3)","v":14766272.84},{"$f":"ROUND(INDEX('EY Data'!CP:CP, MATCH($B28,'EY Data'!$C:$C, 0)), 3)","v":12037185.779999999},{"$f":"ROUND(INDEX('EY Data'!CO:CO, MATCH($B28,'EY Data'!$C:$C, 0)), 3)","v":957702.65},{"$f":"ROUND(INDEX('EY Data'!CN:CN, MATCH($B28,'EY Data'!$C:$C, 0)), 3)","v":1771384.41}]
[null,{"$f":"'Select LAs'!Q3","v":"No LA selected"},null,{"$f":"IF('Select LAs'!$R3=0,\"-\",IF(INDEX('EY Data'!BS:BS, MATCH('Select LAs'!$R3,'EY Data'!$B:$B, 0))=\"\",\"-\", ROUND(INDEX('EY Data'!BS:BS, MATCH('Select LAs'!$R3,'EY Data'!$B:$B, 0)),5)))","v":8.1455500000000001},{"$f":"IF('Select LAs'!$R3=0,\"-\",IF(INDEX('EY Data'!BV:BV, MATCH('Select LAs'!$R3,'EY Data'!$B:$B, 0))=\"\",\"-\", ROUND(INDEX('EY Data'!BV:BV, MATCH('Select LAs'!$R3,'EY Data'!$B:$B, 0)),5)))","v":8.1455500000000001},{"$f":"IF('Select LAs'!$R3=0,\"-\",IF(INDEX('EY Data'!BU:BU, MATCH('Select LAs'!$R3,'EY Data'!$B:$B, 0))=\"\",\"-\", ROUND(INDEX('EY Data'!BU:BU, MATCH('Select LAs'!$R3,'EY Data'!$B:$B, 0)),5)))","v":0},{"$f":"IF('Select LAs'!$R3=0,\"-\",IF(INDEX('EY Data'!BT:BT, MATCH('Select LAs'!$R3,'EY Data'!$B:$B, 0))=\"\",\"-\", ROUND(INDEX('EY Data'!BT:BT, MATCH('Select LAs'!$R3,'EY Data'!$B:$B, 0)),5)))","v":0},{"$f":"IF(OR('Select LAs'!$R3=0,'Select LAs'!$R3=201, 'Select LAs'!$R3=420), \"-\",IF(INDEX('EY Data'!CU:CU, MATCH('Select LAs'!$R3,'EY Data'!$B:$B, 0))=\"-\", \"-\", ROUND(INDEX('EY Data'!CU:CU, MATCH('Select LAs'!$R3,'EY Data'!$B:$B, 0)),3)))","v":0.96599999999999997},{"$f":"IF(OR('Select LAs'!$R3=0,'Select LAs'!$R3=201, 'Select LAs'!$R3=420), \"-\",IF(INDEX('EY Data'!CW:CW, MATCH('Select LAs'!$R3,'EY Data'!$B:$B, 0))=\"\", \"-\", INDEX('EY Data'!CW:CW, MATCH('Select LAs'!$R3,'EY Data'!$B:$B, 0))))","v":0},{"$f":"IF('Select LAs'!$R3=0,\"-\",IF(INDEX('EY Data'!CM:CM, MATCH('Select LAs'!$R3,'EY Data'!$B:$B, 0))=\"\",\"-\",ROUND(INDEX('EY Data'!CM:CM, MATCH('Select LAs'!$R3,'EY Data'!$B:$B, 0)),0)))","v":4068},{"$f":"IF('Select LAs'!$R3=0,\"-\",IF(INDEX('EY Data'!CP:CP, MATCH('Select LAs'!$R3,'EY Data'!$B:$B, 0))=\"\",\"-\",ROUND(INDEX('EY Data'!CP:CP, MATCH('Select LAs'!$R3,'EY Data'!$B:$B, 0)),0)))","v":4068},{"$f":"IF('Select LAs'!$R3=0,\"-\",IF(INDEX('EY Data'!CO:CO, MATCH('Select LAs'!$R3,'EY Data'!$B:$B, 0))=\"\",\"-\",ROUND(INDEX('EY Data'!CO:CO, MATCH('Select LAs'!$R3,'EY Data'!$B:$B, 0)),0)))","v":0},{"$f":"IF('Select LAs'!$R3=0,\"-\",IF(INDEX('EY Data'!CN:CN, MATCH('Select LAs'!$R3,'EY Data'!$B:$B, 0))=\"\",\"-\",ROUND(INDEX('EY Data'!CN:CN, MATCH('Select LAs'!$R3,'EY Data'!$B:$B, 0)),0)))","v":0}]
[null,{"$f":"'Select LAs'!Q4","v":"No LA selected"},null,{"$f":"IF('Select LAs'!$R4=0,\"-\",IF(INDEX('EY Data'!BS:BS, MATCH('Select LAs'!$R4,'EY Data'!$B:$B, 0))=\"\",\"-\", ROUND(INDEX('EY Data'!BS:BS, MATCH('Select LAs'!$R4,'EY Data'!$B:$B, 0)),5)))","v":7.8140700000000001},{"$f":"IF('Select LAs'!$R4=0,\"-\",IF(INDEX('EY Data'!BV:BV, MATCH('Select LAs'!$R4,'EY Data'!$B:$B, 0))=\"\",\"-\", ROUND(INDEX('EY Data'!BV:BV, MATCH('Select LAs'!$R4,'EY Data'!$B:$B, 0)),5)))","v":7.8075999999999999},{"$f":"IF('Select LAs'!$R4=0,\"-\",IF(INDEX('EY Data'!BU:BU, MATCH('Select LAs'!$R4,'EY Data'!$B:$B, 0))=\"\",\"-\", ROUND(INDEX('EY Data'!BU:BU, MATCH('Select LAs'!$R4,'EY Data'!$B:$B, 0)),5)))","v":8.2275799999999997},{"$f":"IF('Select LAs'!$R4=0,\"-\",IF(INDEX('EY Data'!BT:BT, MATCH('Select LAs'!$R4,'EY Data'!$B:$B, 0))=\"\",\"-\", ROUND(INDEX('EY Data'!BT:BT, MATCH('Select LAs'!$R4,'EY Data'!$B:$B, 0)),5)))","v":7.9249700000000001},{"$f":"IF(OR('Select LAs'!$R4=0,'Select LAs'!$R4=201, 'Select LAs'!$R4=420), \"-\",IF(INDEX('EY Data'!CU:CU, MATCH('Select LAs'!$R4,'EY Data'!$B:$B, 0))=\"-\", \"-\", ROUND(INDEX('EY Data'!CU:CU, MATCH('Select LAs'!$R4,'EY Data'!$B:$B, 0)),3)))","v":0.96},{"$f":"IF(OR('Select LAs'!$R4=0,'Select LAs'!$R4=201, 'Select LAs'!$R4=420), \"-\",IF(INDEX('EY Data'!CW:CW, MATCH('Select LAs'!$R4,'EY Data'!$B:$B, 0))=\"\", \"-\", INDEX('EY Data'!CW:CW, MATCH('Select LAs'!$R4,'EY Data'!$B:$B, 0))))","v":2.207943868770253E-2},{"$f":"IF('Select LAs'!$R4=0,\"-\",IF(INDEX('EY Data'!CM:CM, MATCH('Select LAs'!$R4,'EY Data'!$B:$B, 0))=\"\",\"-\",ROUND(INDEX('EY Data'!CM:CM, MATCH('Select LAs'!$R4,'EY Data'!$B:$B, 0)),0)))","v":16146},{"$f":"IF('Select LAs'!$R4=0,\"-\",IF(INDEX('EY Data'!CP:CP, MATCH('Select LAs'!$R4,'EY Data'!$B:$B, 0))=\"\",\"-\",ROUND(INDEX('EY Data'!CP:CP, MATCH('Select LAs'!$R4,'EY Data'!$B:$B, 0)),0)))","v":16146},{"$f":"IF('Select LAs'!$R4=0,\"-\",IF(INDEX('EY Data'!CO:CO, MATCH('Select LAs'!$R4,'EY Data'!$B:$B, 0))=\"\",\"-\",ROUND(INDEX('EY Data'!CO:CO, MATCH('Select LAs'!$R4,'EY Data'!$B:$B, 0)),0)))","v":0},{"$f":"IF('Select LAs'!$R4=0,\"-\",IF(INDEX('EY Data'!CN:CN, MATCH('Select LAs'!$R4,'EY Data'!$B:$B, 0))=\"\",\"-\",ROUND(INDEX('EY Data'!CN:CN, MATCH('Select LAs'!$R4,'EY Data'!$B:$B, 0)),0)))","v":0}]
["",{"$f":"'Select LAs'!Q5","v":"No LA selected"},null,{"$f":"IF('Select LAs'!$R5=0,\"-\",IF(INDEX('EY Data'!BS:BS, MATCH('Select LAs'!$R5,'EY Data'!$B:$B, 0))=\"\",\"-\", ROUND(INDEX('EY Data'!BS:BS, MATCH('Select LAs'!$R5,'EY Data'!$B:$B, 0)),5)))","v":8.0485699999999998},{"$f":"IF('Select LAs'!$R5=0,\"-\",IF(INDEX('EY Data'!BV:BV, MATCH('Select LAs'!$R5,'EY Data'!$B:$B, 0))=\"\",\"-\", ROUND(INDEX('EY Data'!BV:BV, MATCH('Select LAs'!$R5,'EY Data'!$B:$B, 0)),5)))","v":8.0420599999999993},{"$f":"IF('Select LAs'!$R5=0,\"-\",IF(INDEX('EY Data'!BU:BU, MATCH('Select LAs'!$R5,'EY Data'!$B:$B, 0))=\"\",\"-\", ROUND(INDEX('EY Data'!BU:BU, MATCH('Select LAs'!$R5,'EY Data'!$B:$B, 0)),5)))","v":8.1321700000000003},{"$f":"IF('Select LAs'!$R5=0,\"-\",IF(INDEX('EY Data'!BT:BT, MATCH('Select LAs'!$R5,'EY Data'!$B:$B, 0))=\"\",\"-\", ROUND(INDEX('EY Data'!BT:BT, MATCH('Select LAs'!$R5,'EY Data'!$B:$B, 0)),5)))","v":8.1008200000000006},{"$f":"IF(OR('Select LAs'!$R5=0,'Select LAs'!$R5=201, 'Select LAs'!$R5=420), \"-\",IF(INDEX('EY Data'!CU:CU, MATCH('Select LAs'!$R5,'EY Data'!$B:$B, 0))=\"-\", \"-\", ROUND(INDEX('EY Data'!CU:CU, MATCH('Select LAs'!$R5,'EY Data'!$B:$B, 0)),3)))","v":0.96},{"$f":"IF(OR('Select LAs'!$R5=0,'Select LAs'!$R5=201, 'Select LAs'!$R5=420), \"-\",IF(INDEX('EY Data'!CW:CW, MATCH('Select LAs'!$R5,'EY Data'!$B:$B, 0))=\"\", \"-\", INDEX('EY Data'!CW:CW, MATCH('Select LAs'!$R5,'EY Data'!$B:$B, 0))))","v":1.0894532752409545E-2},{"$f":"IF('Select LAs'!$R5=0,\"-\",IF(INDEX('EY Data'!CM:CM, MATCH('Select LAs'!$R5,'EY Data'!$B:$B, 0))=\"\",\"-\",ROUND(INDEX('EY Data'!CM:CM, MATCH('Select LAs'!$R5,'EY Data'!$B:$B, 0)),0)))","v":400000},{"$f":"IF('Select LAs'!$R5=0,\"-\",IF(INDEX('EY Data'!CP:CP, MATCH('Select LAs'!$R5,'EY Data'!$B:$B, 0))=\"\",\"-\",ROUND(INDEX('EY Data'!CP:CP, MATCH('Select LAs'!$R5,'EY Data'!$B:$B, 0)),0)))","v":360000},{"$f":"IF('Select LAs'!$R5=0,\"-\",IF(INDEX('EY Data'!CO:CO, MATCH('Select LAs'!$R5,'EY Data'!$B:$B, 0))=\"\",\"-\",ROUND(INDEX('EY Data'!CO:CO, MATCH('Select LAs'!$R5,'EY Data'!$B:$B, 0)),0)))","v":8000},{"$f":"IF('Select LAs'!$R5=0,\"-\",IF(INDEX('EY Data'!CN:CN, MATCH('Select LAs'!$R5,'EY Data'!$B:$B, 0))=\"\",\"-\",ROUND(INDEX('EY Data'!CN:CN, MATCH('Select LAs'!$R5,'EY Data'!$B:$B, 0)),0)))","v":32000}]
["",{"$f":"'Select LAs'!Q6","v":"No LA selected"},null,{"$f":"IF('Select LAs'!$R6=0,\"-\",IF(INDEX('EY Data'!BS:BS, MATCH('Select LAs'!$R6,'EY Data'!$B:$B, 0))=\"\",\"-\", ROUND(INDEX('EY Data'!BS:BS, MATCH('Select LAs'!$R6,'EY Data'!$B:$B, 0)),5)))","v":7.8669900000000004},{"$f":"IF('Select LAs'!$R6=0,\"-\",IF(INDEX('EY Data'!BV:BV, MATCH('Select LAs'!$R6,'EY Data'!$B:$B, 0))=\"\",\"-\", ROUND(INDEX('EY Data'!BV:BV, MATCH('Select LAs'!$R6,'EY Data'!$B:$B, 0)),5)))","v":7.8315799999999998},{"$f":"IF('Select LAs'!$R6=0,\"-\",IF(INDEX('EY Data'!BU:BU, MATCH('Select LAs'!$R6,'EY Data'!$B:$B, 0))=\"\",\"-\", ROUND(INDEX('EY Data'!BU:BU, MATCH('Select LAs'!$R6,'EY Data'!$B:$B, 0)),5)))","v":8.2419799999999999},{"$f":"IF('Select LAs'!$R6=0,\"-\",IF(INDEX('EY Data'!BT:BT, MATCH('Select LAs'!$R6,'EY Data'!$B:$B, 0))=\"\",\"-\", ROUND(INDEX('EY Data'!BT:BT, MATCH('Select LAs'!$R6,'EY Data'!$B:$B, 0)),5)))","v":9.6003500000000006},{"$f":"IF(OR('Select LAs'!$R6=0,'Select LAs'!$R6=201, 'Select LAs'!$R6=420), \"-\",IF(INDEX('EY Data'!CU:CU, MATCH('Select LAs'!$R6,'EY Data'!$B:$B, 0))=\"-\", \"-\", ROUND(INDEX('EY Data'!CU:CU, MATCH('Select LAs'!$R6,'EY Data'!$B:$B, 0)),3)))","v":0.96},{"$f":"IF(OR('Select LAs'!$R6=0,'Select LAs'!$R6=201, 'Select LAs'!$R6=420), \"-\",IF(INDEX('EY Data'!CW:CW, MATCH('Select LAs'!$R6,'EY Data'!$B:$B, 0))=\"\", \"-\", INDEX('EY Data'!CW:CW, MATCH('Select LAs'!$R6,'EY Data'!$B:$B, 0))))","v":0},{"$f":"IF('Select LAs'!$R6=0,\"-\",IF(INDEX('EY Data'!CM:CM, MATCH('Select LAs'!$R6,'EY Data'!$B:$B, 0))=\"\",\"-\",ROUND(INDEX('EY Data'!CM:CM, MATCH('Select LAs'!$R6,'EY Data'!$B:$B, 0)),0)))","v":78000},{"$f":"IF('Select LAs'!$R6=0,\"-\",IF(INDEX('EY Data'!CP:CP, MATCH('Select LAs'!$R6,'EY Data'!$B:$B, 0))=\"\",\"-\",ROUND(INDEX('EY Data'!CP:CP, MATCH('Select LAs'!$R6,'EY Data'!$B:$B, 0)),0)))","v":50700},{"$f":"IF('Select LAs'!$R6=0,\"-\",IF(INDEX('EY Data'!CO:CO, MATCH('Select LAs'!$R6,'EY Data'!$B:$B, 0))=\"\",\"-\",ROUND(INDEX('EY Data'!CO:CO, MATCH('Select LAs'!$R6,'EY Data'!$B:$B, 0)),0)))","v":3900},{"$f":"IF('Select LAs'!$R6=0,\"-\",IF(INDEX('EY Data'!CN:CN, MATCH('Select LAs'!$R6,'EY Data'!$B:$B, 0))=\"\",\"-\",ROUND(INDEX('EY Data'!CN:CN, MATCH('Select LAs'!$R6,'EY Data'!$B:$B, 0)),0)))","v":23400}]
["",{"$f":"'Select LAs'!Q7","v":"No LA selected"},null,{"$f":"IF('Select LAs'!$R7=0,\"-\",IF(INDEX('EY Data'!BS:BS, MATCH('Select LAs'!$R7,'EY Data'!$B:$B, 0))=\"\",\"-\", ROUND(INDEX('EY Data'!BS:BS, MATCH('Select LAs'!$R7,'EY Data'!$B:$B, 0)),5)))","v":7.9634},{"$f":"IF('Select LAs'!$R7=0,\"-\",IF(INDEX('EY Data'!BV:BV, MATCH('Select LAs'!$R7,'EY Data'!$B:$B, 0))=\"\",\"-\", ROUND(INDEX('EY Data'!BV:BV, MATCH('Select LAs'!$R7,'EY Data'!$B:$B, 0)),5)))","v":7.94076},{"$f":"IF('Select LAs'!$R7=0,\"-\",IF(INDEX('EY Data'!BU:BU, MATCH('Select LAs'!$R7,'EY Data'!$B:$B, 0))=\"\",\"-\", ROUND(INDEX('EY Data'!BU:BU, MATCH('Select LAs'!$R7,'EY Data'!$B:$B, 0)),5)))","v":8.1717899999999997},{"$f":"IF('Select LAs'!$R7=0,\"-\",IF(INDEX('EY Data'!BT:BT, MATCH('Select LAs'!$R7,'EY Data'!$B:$B, 0))=\"\",\"-\", ROUND(INDEX('EY Data'!BT:BT, MATCH('Select LAs'!$R7,'EY Data'!$B:$B, 0)),5)))","v":9.2726100000000002},{"$f":"IF(OR('Select LAs'!$R7=0,'Select LAs'!$R7=201, 'Select LAs'!$R7=420), \"-\",IF(INDEX('EY Data'!CU:CU, MATCH('Select LAs'!$R7,'EY Data'!$B:$B, 0))=\"-\", \"-\", ROUND(INDEX('EY Data'!CU:CU, MATCH('Select LAs'!$R7,'EY Data'!$B:$B, 0)),3)))","v":0.96899999999999997},{"$f":"IF(OR('Select LAs'!$R7=0,'Select LAs'!$R7=201, 'Select LAs'!$R7=420), \"-\",IF(INDEX('EY Data'!CW:CW, MATCH('Select LAs'!$R7,'EY Data'!$B:$B, 0))=\"\", \"-\", INDEX('EY Data'!CW:CW, MATCH('Select LAs'!$R7,'EY Data'!$B:$B, 0))))","v":1.6588844649411676E-2},{"$f":"IF('Select LAs'!$R7=0,\"-\",IF(INDEX('EY Data'!CM:CM, MATCH('Select LAs'!$R7,'EY Data'!$B:$B, 0))=\"\",\"-\",ROUND(INDEX('EY Data'!CM:CM, MATCH('Select LAs'!$R7,'EY Data'!$B:$B, 0)),0)))","v":200000},{"$f":"IF('Select LAs'!$R7=0,\"-\",IF(INDEX('EY Data'!CP:CP, MATCH('Select LAs'!$R7,'EY Data'!$B:$B, 0))=\"\",\"-\",ROUND(INDEX('EY Data'!CP:CP, MATCH('Select LAs'!$R7,'EY Data'!$B:$B, 0)),0)))","v":170000},{"$f":"IF('Select LAs'!$R7=0,\"-\",IF(INDEX('EY Data'!CO:CO, MATCH('Select LAs'!$R7,'EY Data'!$B:$B, 0))=\"\",\"-\",ROUND(INDEX('EY Data'!CO:CO, MATCH('Select LAs'!$R7,'EY Data'!$B:$B, 0)),0)))","v":20000},{"$f":"IF('Select LAs'!$R7=0,\"-\",IF(INDEX('EY Data'!CN:CN, MATCH('Select LAs'!$R7,'EY Data'!$B:$B, 0))=\"\",\"-\",ROUND(INDEX('EY Data'!CN:CN, MATCH('Select LAs'!$R7,'EY Data'!$B:$B, 0)),0)))","v":10000}]
["",{"$f":"'Select LAs'!Q8","v":"No LA selected"},null,{"$f":"IF('Select LAs'!$R8=0,\"-\",IF(INDEX('EY Data'!BS:BS, MATCH('Select LAs'!$R8,'EY Data'!$B:$B, 0))=\"\",\"-\", ROUND(INDEX('EY Data'!BS:BS, MATCH('Select LAs'!$R8,'EY Data'!$B:$B, 0)),5)))","v":8.0640800000000006},{"$f":"IF('Select LAs'!$R8=0,\"-\",IF(INDEX('EY Data'!BV:BV, MATCH('Select LAs'!$R8,'EY Data'!$B:$B, 0))=\"\",\"-\", ROUND(INDEX('EY Data'!BV:BV, MATCH('Select LAs'!$R8,'EY Data'!$B:$B, 0)),5)))","v":8.0560600000000004},{"$f":"IF('Select LAs'!$R8=0,\"-\",IF(INDEX('EY Data'!BU:BU, MATCH('Select LAs'!$R8,'EY Data'!$B:$B, 0))=\"\",\"-\", ROUND(INDEX('EY Data'!BU:BU, MATCH('Select LAs'!$R8,'EY Data'!$B:$B, 0)),5)))","v":0},{"$f":"IF('Select LAs'!$R8=0,\"-\",IF(INDEX('EY Data'!BT:BT, MATCH('Select LAs'!$R8,'EY Data'!$B:$B, 0))=\"\",\"-\", ROUND(INDEX('EY Data'!BT:BT, MATCH('Select LAs'!$R8,'EY Data'!$B:$B, 0)),5)))","v":0},{"$f":"IF(OR('Select LAs'!$R8=0,'Select LAs'!$R8=201, 'Select LAs'!$R8=420), \"-\",IF(INDEX('EY Data'!CU:CU, MATCH('Select LAs'!$R8,'EY Data'!$B:$B, 0))=\"-\", \"-\", ROUND(INDEX('EY Data'!CU:CU, MATCH('Select LAs'!$R8,'EY Data'!$B:$B, 0)),3)))","v":0.96199999999999997},{"$f":"IF(OR('Select LAs'!$R8=0,'Select LAs'!$R8=201, 'Select LAs'!$R8=420), \"-\",IF(INDEX('EY Data'!CW:CW, MATCH('Select LAs'!$R8,'EY Data'!$B:$B, 0))=\"\", \"-\", INDEX('EY Data'!CW:CW, MATCH('Select LAs'!$R8,'EY Data'!$B:$B, 0))))","v":0},{"$f":"IF('Select LAs'!$R8=0,\"-\",IF(INDEX('EY Data'!CM:CM, MATCH('Select LAs'!$R8,'EY Data'!$B:$B, 0))=\"\",\"-\",ROUND(INDEX('EY Data'!CM:CM, MATCH('Select LAs'!$R8,'EY Data'!$B:$B, 0)),0)))","v":15000},{"$f":"IF('Select LAs'!$R8=0,\"-\",IF(INDEX('EY Data'!CP:CP, MATCH('Select LAs'!$R8,'EY Data'!$B:$B, 0))=\"\",\"-\",ROUND(INDEX('EY Data'!CP:CP, MATCH('Select LAs'!$R8,'EY Data'!$B:$B, 0)),0)))","v":10000},{"$f":"IF('Select LAs'!$R8=0,\"-\",IF(INDEX('EY Data'!CO:CO, MATCH('Select LAs'!$R8,'EY Data'!$B:$B, 0))=\"\",\"-\",ROUND(INDEX('EY Data'!CO:CO, MATCH('Select LAs'!$R8,'EY Data'!$B:$B, 0)),0)))","v":2500},{"$f":"IF('Select LAs'!$R8=0,\"-\",IF(INDEX('EY Data'!CN:CN, MATCH('Select LAs'!$R8,'EY Data'!$B:$B, 0))=\"\",\"-\",ROUND(INDEX('EY Data'!CN:CN, MATCH('Select LAs'!$R8,'EY Data'!$B:$B, 0)),0)))","v":2500}]
["",{"$f":"'Select LAs'!Q9","v":"No LA selected"},null,{"$f":"IF('Select LAs'!$R9=0,\"-\",IF(INDEX('EY Data'!BS:BS, MATCH('Select LAs'!$R9,'EY Data'!$B:$B, 0))=\"\",\"-\", ROUND(INDEX('EY Data'!BS:BS, MATCH('Select LAs'!$R9,'EY Data'!$B:$B, 0)),5)))","v":8.3308},{"$f":"IF('Select LAs'!$R9=0,\"-\",IF(INDEX('EY Data'!BV:BV, MATCH('Select LAs'!$R9,'EY Data'!$B:$B, 0))=\"\",\"-\", ROUND(INDEX('EY Data'!BV:BV, MATCH('Select LAs'!$R9,'EY Data'!$B:$B, 0)),5)))","v":8.3308},{"$f":"IF('Select LAs'!$R9=0,\"-\",IF(INDEX('EY Data'!BU:BU, MATCH('Select LAs'!$R9,'EY Data'!$B:$B, 0))=\"\",\"-\", ROUND(INDEX('EY Data'!BU:BU, MATCH('Select LAs'!$R9,'EY Data'!$B:$B, 0)),5)))","v":8.3308099999999996},{"$f":"IF('Select LAs'!$R9=0,\"-\",IF(INDEX('EY Data'!BT:BT, MATCH('Select LAs'!$R9,'EY Data'!$B:$B, 0))=\"\",\"-\", ROUND(INDEX('EY Data'!BT:BT, MATCH('Select LAs'!$R9,'EY Data'!$B:$B, 0)),5)))","v":8.3307300000000009},{"$f":"IF(OR('Select LAs'!$R9=0,'Select LAs'!$R9=201, 'Select LAs'!$R9=420), \"-\",IF(INDEX('EY Data'!CU:CU, MATCH('Select LAs'!$R9,'EY Data'!$B:$B, 0))=\"-\", \"-\", ROUND(INDEX('EY Data'!CU:CU, MATCH('Select LAs'!$R9,'EY Data'!$B:$B, 0)),3)))","v":0.99},{"$f":"IF(OR('Select LAs'!$R9=0,'Select LAs'!$R9=201, 'Select LAs'!$R9=420), \"-\",IF(INDEX('EY Data'!CW:CW, MATCH('Select LAs'!$R9,'EY Data'!$B:$B, 0))=\"\", \"-\", INDEX('EY Data'!CW:CW, MATCH('Select LAs'!$R9,'EY Data'!$B:$B, 0))))","v":0},{"$f":"IF('Select LAs'!$R9=0,\"-\",IF(INDEX('EY Data'!CM:CM, MATCH('Select LAs'!$R9,'EY Data'!$B:$B, 0))=\"\",\"-\",ROUND(INDEX('EY Data'!CM:CM, MATCH('Select LAs'!$R9,'EY Data'!$B:$B, 0)),0)))","v":129862},{"$f":"IF('Select LAs'!$R9=0,\"-\",IF(INDEX('EY Data'!CP:CP, MATCH('Select LAs'!$R9,'EY Data'!$B:$B, 0))=\"\",\"-\",ROUND(INDEX('EY Data'!CP:CP, MATCH('Select LAs'!$R9,'EY Data'!$B:$B, 0)),0)))","v":122487},{"$f":"IF('Select LAs'!$R9=0,\"-\",IF(INDEX('EY Data'!CO:CO, MATCH('Select LAs'!$R9,'EY Data'!$B:$B, 0))=\"\",\"-\",ROUND(INDEX('EY Data'!CO:CO, MATCH('Select LAs'!$R9,'EY Data'!$B:$B, 0)),0)))","v":6483},{"$f":"IF('Select LAs'!$R9=0,\"-\",IF(INDEX('EY Data'!CN:CN, MATCH('Select LAs'!$R9,'EY Data'!$B:$B, 0))=\"\",\"-\",ROUND(INDEX('EY Data'!CN:CN, MATCH('Select LAs'!$R9,'EY Data'!$B:$B, 0)),0)))","v":892}]
["",{"$f":"'Select LAs'!Q10","v":"No LA selected"},null,{"$f":"IF('Select LAs'!$R10=0,\"-\",IF(INDEX('EY Data'!BS:BS, MATCH('Select LAs'!$R10,'EY Data'!$B:$B, 0))=\"\",\"-\", ROUND(INDEX('EY Data'!BS:BS, MATCH('Select LAs'!$R10,'EY Data'!$B:$B, 0)),5)))","v":8.2358700000000002},{"$f":"IF('Select LAs'!$R10=0,\"-\",IF(INDEX('EY Data'!BV:BV, MATCH('Select LAs'!$R10,'EY Data'!$B:$B, 0))=\"\",\"-\", ROUND(INDEX('EY Data'!BV:BV, MATCH('Select LAs'!$R10,'EY Data'!$B:$B, 0)),5)))","v":8.2369199999999996},{"$f":"IF('Select LAs'!$R10=0,\"-\",IF(INDEX('EY Data'!BU:BU, MATCH('Select LAs'!$R10,'EY Data'!$B:$B, 0))=\"\",\"-\", ROUND(INDEX('EY Data'!BU:BU, MATCH('Select LAs'!$R10,'EY Data'!$B:$B, 0)),5)))","v":8.1999999999999993},{"$f":"IF('Select LAs'!$R10=0,\"-\",IF(INDEX('EY Data'!BT:BT, MATCH('Select LAs'!$R10,'EY Data'!$B:$B, 0))=\"\",\"-\", ROUND(INDEX('EY Data'!BT:BT, MATCH('Select LAs'!$R10,'EY Data'!$B:$B, 0)),5)))","v":8.1999999999999993},{"$f":"IF(OR('Select LAs'!$R10=0,'Select LAs'!$R10=201, 'Select LAs'!$R10=420), \"-\",IF(INDEX('EY Data'!CU:CU, MATCH('Select LAs'!$R10,'EY Data'!$B:$B, 0))=\"-\", \"-\", ROUND(INDEX('EY Data'!CU:CU, MATCH('Select LAs'!$R10,'EY Data'!$B:$B, 0)),3)))","v":1.0109999999999999},{"$f":"IF(OR('Select LAs'!$R10=0,'Select LAs'!$R10=201, 'Select LAs'!$R10=420), \"-\",IF(INDEX('EY Data'!CW:CW, MATCH('Select LAs'!$R10,'EY Data'!$B:$B, 0))=\"\", \"-\", INDEX('EY Data'!CW:CW, MATCH('Select LAs'!$R10,'EY Data'!$B:$B, 0))))","v":0},{"$f":"IF('Select LAs'!$R10=0,\"-\",IF(INDEX('EY Data'!CM:CM, MATCH('Select LAs'!$R10,'EY Data'!$B:$B, 0))=\"\",\"-\",ROUND(INDEX('EY Data'!CM:CM, MATCH('Select LAs'!$R10,'EY Data'!$B:$B, 0)),0)))","v":30000},{"$f":"IF('Select LAs'!$R10=0,\"-\",IF(INDEX('EY Data'!CP:CP, MATCH('Select LAs'!$R10,'EY Data'!$B:$B, 0))=\"\",\"-\",ROUND(INDEX('EY Data'!CP:CP, MATCH('Select LAs'!$R10,'EY Data'!$B:$B, 0)),0)))","v":30000},{"$f":"IF('Select LAs'!$R10=0,\"-\",IF(INDEX('EY Data'!CO:CO, MATCH('Select LAs'!$R10,'EY Data'!$B:$B, 0))=\"\",\"-\",ROUND(INDEX('EY Data'!CO:CO, MATCH('Select LAs'!$R10,'EY Data'!$B:$B, 0)),0)))","v":0},{"$f":"IF('Select LAs'!$R10=0,\"-\",IF(INDEX('EY Data'!CN:CN, MATCH('Select LAs'!$R10,'EY Data'!$B:$B, 0))=\"\",\"-\",ROUND(INDEX('EY Data'!CN:CN, MATCH('Select LAs'!$R10,'EY Data'!$B:$B, 0)),0)))","v":0}]
["",{"$f":"'Select LAs'!Q11","v":"No LA selected"},null,{"$f":"IF('Select LAs'!$R11=0,\"-\",IF(INDEX('EY Data'!BS:BS, MATCH('Select LAs'!$R11,'EY Data'!$B:$B, 0))=\"\",\"-\", ROUND(INDEX('EY Data'!BS:BS, MATCH('Select LAs'!$R11,'EY Data'!$B:$B, 0)),5)))","v":8.2474699999999999},{"$f":"IF('Select LAs'!$R11=0,\"-\",IF(INDEX('EY Data'!BV:BV, MATCH('Select LAs'!$R11,'EY Data'!$B:$B, 0))=\"\",\"-\", ROUND(INDEX('EY Data'!BV:BV, MATCH('Select LAs'!$R11,'EY Data'!$B:$B, 0)),5)))","v":8.2474699999999999},{"$f":"IF('Select LAs'!$R11=0,\"-\",IF(INDEX('EY Data'!BU:BU, MATCH('Select LAs'!$R11,'EY Data'!$B:$B, 0))=\"\",\"-\", ROUND(INDEX('EY Data'!BU:BU, MATCH('Select LAs'!$R11,'EY Data'!$B:$B, 0)),5)))","v":8.2474699999999999},{"$f":"IF('Select LAs'!$R11=0,\"-\",IF(INDEX('EY Data'!BT:BT, MATCH('Select LAs'!$R11,'EY Data'!$B:$B, 0))=\"\",\"-\", ROUND(INDEX('EY Data'!BT:BT, MATCH('Select LAs'!$R11,'EY Data'!$B:$B, 0)),5)))","v":8.2474699999999999},{"$f":"IF(OR('Select LAs'!$R11=0,'Select LAs'!$R11=201, 'Select LAs'!$R11=420), \"-\",IF(INDEX('EY Data'!CU:CU, MATCH('Select LAs'!$R11,'EY Data'!$B:$B, 0))=\"-\", \"-\", ROUND(INDEX('EY Data'!CU:CU, MATCH('Select LAs'!$R11,'EY Data'!$B:$B, 0)),3)))","v":0.96},{"$f":"IF(OR('Select LAs'!$R11=0,'Select LAs'!$R11=201, 'Select LAs'!$R11=420), \"-\",IF(INDEX('EY Data'!CW:CW, MATCH('Select LAs'!$R11,'EY Data'!$B:$B, 0))=\"\", \"-\", INDEX('EY Data'!CW:CW, MATCH('Select LAs'!$R11,'EY Data'!$B:$B, 0))))","v":5.7883800525124804E-2},{"$f":"IF('Select LAs'!$R11=0,\"-\",IF(INDEX('EY Data'!CM:CM, MATCH('Select LAs'!$R11,'EY Data'!$B:$B, 0))=\"\",\"-\",ROUND(INDEX('EY Data'!CM:CM, MATCH('Select LAs'!$R11,'EY Data'!$B:$B, 0)),0)))","v":31075},{"$f":"IF('Select LAs'!$R11=0,\"-\",IF(INDEX('EY Data'!CP:CP, MATCH('Select LAs'!$R11,'EY Data'!$B:$B, 0))=\"\",\"-\",ROUND(INDEX('EY Data'!CP:CP, MATCH('Select LAs'!$R11,'EY Data'!$B:$B, 0)),0)))","v":26989},{"$f":"IF('Select LAs'!$R11=0,\"-\",IF(INDEX('EY Data'!CO:CO, MATCH('Select LAs'!$R11,'EY Data'!$B:$B, 0))=\"\",\"-\",ROUND(INDEX('EY Data'!CO:CO, MATCH('Select LAs'!$R11,'EY Data'!$B:$B, 0)),0)))","v":1524},{"$f":"IF('Select LAs'!$R11=0,\"-\",IF(INDEX('EY Data'!CN:CN, MATCH('Select LAs'!$R11,'EY Data'!$B:$B, 0))=\"\",\"-\",ROUND(INDEX('EY Data'!CN:CN, MATCH('Select LAs'!$R11,'EY Data'!$B:$B, 0)),0)))","v":2562}]
["",{"$f":"'Select LAs'!Q12","v":"No LA selected"},null,{"$f":"IF('Select LAs'!$R12=0,\"-\",IF(INDEX('EY Data'!BS:BS, MATCH('Select LAs'!$R12,'EY Data'!$B:$B, 0))=\"\",\"-\", ROUND(INDEX('EY Data'!BS:BS, MATCH('Select LAs'!$R12,'EY Data'!$B:$B, 0)),5)))","v":8.8092199999999998},{"$f":"IF('Select LAs'!$R12=0,\"-\",IF(INDEX('EY Data'!BV:BV, MATCH('Select LAs'!$R12,'EY Data'!$B:$B, 0))=\"\",\"-\", ROUND(INDEX('EY Data'!BV:BV, MATCH('Select LAs'!$R12,'EY Data'!$B:$B, 0)),5)))","v":8.6710100000000008},{"$f":"IF('Select LAs'!$R12=0,\"-\",IF(INDEX('EY Data'!BU:BU, MATCH('Select LAs'!$R12,'EY Data'!$B:$B, 0))=\"\",\"-\", ROUND(INDEX('EY Data'!BU:BU, MATCH('Select LAs'!$R12,'EY Data'!$B:$B, 0)),5)))","v":8.51},{"$f":"IF('Select LAs'!$R12=0,\"-\",IF(INDEX('EY Data'!BT:BT, MATCH('Select LAs'!$R12,'EY Data'!$B:$B, 0))=\"\",\"-\", ROUND(INDEX('EY Data'!BT:BT, MATCH('Select LAs'!$R12,'EY Data'!$B:$B, 0)),5)))","v":9.7439800000000005},{"$f":"IF(OR('Select LAs'!$R12=0,'Select LAs'!$R12=201, 'Select LAs'!$R12=420), \"-\",IF(INDEX('EY Data'!CU:CU, MATCH('Select LAs'!$R12,'EY Data'!$B:$B, 0))=\"-\", \"-\", ROUND(INDEX('EY Data'!CU:CU, MATCH('Select LAs'!$R12,'EY Data'!$B:$B, 0)),3)))","v":0.97899999999999998},{"$f":"IF(OR('Select LAs'!$R12=0,'Select LAs'!$R12=201, 'Select LAs'!$R12=420), \"-\",IF(INDEX('EY Data'!CW:CW, MATCH('Select LAs'!$R12,'EY Data'!$B:$B, 0))=\"\", \"-\", INDEX('EY Data'!CW:CW, MATCH('Select LAs'!$R12,'EY Data'!$B:$B, 0))))","v":5.9545265371376997E-3},{"$f":"IF('Select LAs'!$R12=0,\"-\",IF(INDEX('EY Data'!CM:CM, MATCH('Select LAs'!$R12,'EY Data'!$B:$B, 0))=\"\",\"-\",ROUND(INDEX('EY Data'!CM:CM, MATCH('Select LAs'!$R12,'EY Data'!$B:$B, 0)),0)))","v":694444},{"$f":"IF('Select LAs'!$R12=0,\"-\",IF(INDEX('EY Data'!CP:CP, MATCH('Select LAs'!$R12,'EY Data'!$B:$B, 0))=\"\",\"-\",ROUND(INDEX('EY Data'!CP:CP, MATCH('Select LAs'!$R12,'EY Data'!$B:$B, 0)),0)))","v":222222},{"$f":"IF('Select LAs'!$R12=0,\"-\",IF(INDEX('EY Data'!CO:CO, MATCH('Select LAs'!$R12,'EY Data'!$B:$B, 0))=\"\",\"-\",ROUND(INDEX('EY Data'!CO:CO, MATCH('Select LAs'!$R12,'EY Data'!$B:$B, 0)),0)))","v":0},{"$f":"IF('Select LAs'!$R12=0,\"-\",IF(INDEX('EY Data'!CN:CN, MATCH('Select LAs'!$R12,'EY Data'!$B:$B, 0))=\"\",\"-\",ROUND(INDEX('EY Data'!CN:CN, MATCH('Select LAs'!$R12,'EY Data'!$B:$B, 0)),0)))","v":472222}]
[null,{"$f":"'Select LAs'!Q13","v":"No LA selected"},null,{"$f":"IF('Select LAs'!$R13=0,\"-\",IF(INDEX('EY Data'!BS:BS, MATCH('Select LAs'!$R13,'EY Data'!$B:$B, 0))=\"\",\"-\", ROUND(INDEX('EY Data'!BS:BS, MATCH('Select LAs'!$R13,'EY Data'!$B:$B, 0)),5)))","v":8.9939800000000005},{"$f":"IF('Select LAs'!$R13=0,\"-\",IF(INDEX('EY Data'!BV:BV, MATCH('Select LAs'!$R13,'EY Data'!$B:$B, 0))=\"\",\"-\", ROUND(INDEX('EY Data'!BV:BV, MATCH('Select LAs'!$R13,'EY Data'!$B:$B, 0)),5)))","v":8.9939800000000005},{"$f":"IF('Select LAs'!$R13=0,\"-\",IF(INDEX('EY Data'!BU:BU, MATCH('Select LAs'!$R13,'EY Data'!$B:$B, 0))=\"\",\"-\", ROUND(INDEX('EY Data'!BU:BU, MATCH('Select LAs'!$R13,'EY Data'!$B:$B, 0)),5)))","v":0},{"$f":"IF('Select LAs'!$R13=0,\"-\",IF(INDEX('EY Data'!BT:BT, MATCH('Select LAs'!$R13,'EY Data'!$B:$B, 0))=\"\",\"-\", ROUND(INDEX('EY Data'!BT:BT, MATCH('Select LAs'!$R13,'EY Data'!$B:$B, 0)),5)))","v":0},{"$f":"IF(OR('Select LAs'!$R13=0,'Select LAs'!$R13=201, 'Select LAs'!$R13=420), \"-\",IF(INDEX('EY Data'!CU:CU, MATCH('Select LAs'!$R13,'EY Data'!$B:$B, 0))=\"-\", \"-\", ROUND(INDEX('EY Data'!CU:CU, MATCH('Select LAs'!$R13,'EY Data'!$B:$B, 0)),3)))","v":1.0169999999999999},{"$f":"IF(OR('Select LAs'!$R13=0,'Select LAs'!$R13=201, 'Select LAs'!$R13=420), \"-\",IF(INDEX('EY Data'!CW:CW, MATCH('Select LAs'!$R13,'EY Data'!$B:$B, 0))=\"\", \"-\", INDEX('EY Data'!CW:CW, MATCH('Select LAs'!$R13,'EY Data'!$B:$B, 0))))","v":0},{"$f":"IF('Select LAs'!$R13=0,\"-\",IF(INDEX('EY Data'!CM:CM, MATCH('Select LAs'!$R13,'EY Data'!$B:$B, 0))=\"\",\"-\",ROUND(INDEX('EY Data'!CM:CM, MATCH('Select LAs'!$R13,'EY Data'!$B:$B, 0)),0)))","v":120000},{"$f":"IF('Select LAs'!$R13=0,\"-\",IF(INDEX('EY Data'!CP:CP, MATCH('Select LAs'!$R13,'EY Data'!$B:$B, 0))=\"\",\"-\",ROUND(INDEX('EY Data'!CP:CP, MATCH('Select LAs'!$R13,'EY Data'!$B:$B, 0)),0)))","v":120000},{"$f":"IF('Select LAs'!$R13=0,\"-\",IF(INDEX('EY Data'!CO:CO, MATCH('Select LAs'!$R13,'EY Data'!$B:$B, 0))=\"\",\"-\",ROUND(INDEX('EY Data'!CO:CO, MATCH('Select LAs'!$R13,'EY Data'!$B:$B, 0)),0)))","v":0},{"$f":"IF('Select LAs'!$R13=0,\"-\",IF(INDEX('EY Data'!CN:CN, MATCH('Select LAs'!$R13,'EY Data'!$B:$B, 0))=\"\",\"-\",ROUND(INDEX('EY Data'!CN:CN, MATCH('Select LAs'!$R13,'EY Data'!$B:$B, 0)),0)))","v":0}]
[null,"Selection Median",null,{"$f":"IF(COUNT(D$29:D$39)>0,MEDIAN(D$29:D$39),\"-\")","v":8.1455500000000001},8.1455500000000001,8.1999999999999993,{"$f":"IF(COUNT(G$29:G$39)>0,MEDIAN(G$29:G$39),\"-\")","v":8.1999999999999993},{"$f":"IF(COUNT(H$29:H$39)>0,MEDIAN(H$29:H$39),\"-\")","v":0.96599999999999997},{"$f":"IF(COUNT(I$29:I$39)>0,MEDIAN(I$29:I$39),\"-\")","v":0},{"$f":"IF(COUNT(J$29:J$39)>0,MEDIAN(J$29:J$39),\"-\")","v":78000},{"$f":"IF(COUNT(K$29:K$39)>0,MEDIAN(K$29:K$39),\"-\")","v":50700},1524,2500]
[null,"Selection Minimum",null,{"$f":"IF(COUNT(D$29:D$39)>0,MIN(D$29:D$39),\"-\")","v":7.8140700000000001},7.8075999999999999,0,{"$f":"IF(COUNT(G$29:G$39)>0,MIN(G$29:G$39),\"-\")","v":0},{"$f":"IF(COUNT(H$29:H$39)>0,MIN(H$29:H$39),\"-\")","v":0.96},{"$f":"IF(COUNT(I$29:I$39)>0,MIN(I$29:I$39),\"-\")","v":0},{"$f":"IF(COUNT(J$29:J$39)>0,MIN(J$29:J$39),\"-\")","v":4068},{"$f":"IF(COUNT(K$29:K$39)>0,MIN(K$29:K$39),\"-\")","v":4068},0,0]
[null,"Selection Maximum",null,{"$f":"IF(COUNT(D$29:D$39)>0,MAX(D$29:D$39),\"-\")","v":8.9939800000000005},8.9939800000000005,8.51,{"$f":"IF(COUNT(G$29:G$39)>0,MAX(G$29:G$39),\"-\")","v":9.7439800000000005},{"$f":"IF(COUNT(H$29:H$39)>0,MAX(H$29:H$39),\"-\")","v":1.0169999999999999},{"$f":"IF(COUNT(I$29:I$39)>0,MAX(I$29:I$39),\"-\")","v":5.7883800525124804E-2},{"$f":"IF(COUNT(J$29:J$39)>0,MAX(J$29:J$39),\"-\")","v":694444},{"$f":"IF(COUNT(K$29:K$39)>0,MAX(K$29:K$39),\"-\")","v":360000},20000,472222]

{"sheet":"9mth - 2 year","index":4,"n_rows":42,"n_cols":13,"rows_kept":42,"cut":false,"hidden":true,"merged":[[26,1,26,2],[43,1,43,11],[4,1,4,2],[5,1,5,2],[6,1,6,2],[22,3,22,4],[25,3,25,6],[25,9,25,12],[7,1,7,2],[25,7,26,7],[25,8,26,8]]}
[]
[null,{"$f":"CONCATENATE('Select LAs'!B3,\" - Key Budget Statistics\")","v":"No LA selected - Key Budget Statistics"},null,null,null,null,null,null,null,null,null,null,{"$f":"'3-4 year olds '!$K$2","v":"Financial Year 2025-2026"}]
[]
[]
[null,{"$f":"'Select LAs'!D3","v":"No LA selected"},null,"All providers","Private, Voluntary, Independent","Nursery schools","Primary nursery places"]
[null,"9mth - 2 year old hourly average funding rate (£/hr)",null,{"$f":"IFERROR(IF(INDEX('EY Data'!CY:CY, MATCH('Select LAs'!$A$3,'EY Data'!$B:$B, 0))=\"\",\"-\", INDEX('EY Data'!CY:CY, MATCH('Select LAs'!$A$3,'EY Data'!$B:$B, 0))), 0)","v":0},{"$f":"IFERROR(IF(INDEX('EY Data'!DB:DB, MATCH('Select LAs'!$A$3,'EY Data'!$B:$B, 0))=\"\",\"-\", INDEX('EY Data'!DB:DB, MATCH('Select LAs'!$A$3,'EY Data'!$B:$B, 0))), 0)","v":0},{"$f":"IFERROR(IF(INDEX('EY Data'!DA:DA, MATCH('Select LAs'!$A$3,'EY Data'!$B:$B, 0))=\"\",\"-\", INDEX('EY Data'!DA:DA, MATCH('Select LAs'!$A$3,'EY Data'!$B:$B, 0))), 0)","v":0},{"$f":"IFERROR(IF(INDEX('EY Data'!CZ:CZ, MATCH('Select LAs'!$A$3,'EY Data'!$B:$B, 0))=\"\",\"-\", INDEX('EY Data'!CZ:CZ, MATCH('Select LAs'!$A$3,'EY Data'!$B:$B, 0))), 0)","v":0}]
[null,"9mth - 2 year old hourly average\nbase rate (£/hr)",null,{"$f":"IFERROR(IF(INDEX('EY Data'!DL:DL, MATCH('Select LAs'!$A$3,'EY Data'!$B:$B, 0))=\"\",\"-\", INDEX('EY Data'!DL:DL, MATCH('Select LAs'!$A$3,'EY Data'!$B:$B, 0))), 0)","v":0},{"$f":"IFERROR(IF(INDEX('EY Data'!DO:DO, MATCH('Select LAs'!$A$3,'EY Data'!$B:$B, 0))=\"\",\"-\", INDEX('EY Data'!DO:DO, MATCH('Select LAs'!$A$3,'EY Data'!$B:$B, 0))), 0)","v":0},{"$f":"IFERROR(IF(INDEX('EY Data'!DN:DN, MATCH('Select LAs'!$A$3,'EY Data'!$B:$B, 0))=\"\",\"-\", INDEX('EY Data'!DN:DN, MATCH('Select LAs'!$A$3,'EY Data'!$B:$B, 0))), 0)","v":0},{"$f":"IFERROR(IF(INDEX('EY Data'!DM:DM, MATCH('Select LAs'!$A$3,'EY Data'!$B:$B, 0))=\"\",\"-\", INDEX('EY Data'!DM:DM, MATCH('Select LAs'!$A$3,'EY Data'!$B:$B, 0))), 0)","v":0}]
[null,"Pass-through rate (%)",null,{"$f":"IF(OR('Select LAs'!$A$3 = \"LA No\", 'Select LAs'!$A$3 = 201, 'Select LAs'!$A$3 = 420), \"-\", INDEX('EY Data'!EA:EA, MATCH('Select LAs'!$A$3,'EY Data'!$B:$B, 0)))","v":"-"}]
[]
[]
[]
[]
[]
[]
[]
[]
[]
[]
[null,{"$f":"CONCATENATE(\"Benchmarking against \",IF(_SN=1,\"Statistical Neighbours\",\"Manual Selection\"))","v":"Benchmarking against Manual Selection"}]
[]
[]
[]
[null,null,"Table ordering"]
[]
[]
[null,null,null,"Average funding rate to providers per hour",null,null,null,"Pass-through rate","Funding paid through supplements","SEN Inclusion Fund (top-up grant element) budget"]
[null,"Local Authority",null,"All providers","Private, Voluntary, Independent","Nursery schools","Primary nursery places",null,null,"All providers","Private, Voluntary, Independent","Nursery schools","Primary nursery places"]
[null,"England",null,{"$f":"ROUND(INDEX('EY Data'!CY:CY, MATCH($B28,'EY Data'!$C:$C, 0)), 5)","v":10.834910000000001},{"$f":"ROUND(INDEX('EY Data'!DB:DB, MATCH($B28,'EY Data'!$C:$C, 0)), 5)","v":10.821059999999999},{"$f":"ROUND(INDEX('EY Data'!DA:DA, MATCH($B28,'EY Data'!$C:$C, 0)), 5)","v":11.73597},{"$f":"ROUND(INDEX('EY Data'!CZ:CZ, MATCH($B28,'EY Data'!$C:$C, 0)), 5)","v":10.70444},{"$f":"IF(INDEX('EY Data'!EA:EA, MATCH($B28,'EY Data'!$C:$C, 0))=\"-\", \"-\", ROUND(INDEX('EY Data'!EA:EA, MATCH($B28,'EY Data'!$C:$C, 0)), 3))","v":0.97199999999999998},{"$f":"IF(INDEX('EY Data'!EC:EC, MATCH($B28,'EY Data'!$C:$C, 0))=\"-\", \"-\", ROUND(INDEX('EY Data'!EC:EC, MATCH($B28,'EY Data'!$C:$C, 0)), 3))","v":0},{"$f":"ROUND(INDEX('EY Data'!DS:DS, MATCH($B28,'EY Data'!$C:$C, 0)), 3)","v":10526987.48},{"$f":"ROUND(INDEX('EY Data'!DV:DV, MATCH($B28,'EY Data'!$C:$C, 0)), 3)","v":9103085.5399999991},{"$f":"ROUND(INDEX('EY Data'!DU:DU, MATCH($B28,'EY Data'!$C:$C, 0)), 3)","v":482574.2},{"$f":"ROUND(INDEX('EY Data'!DT:DT, MATCH($B28,'EY Data'!$C:$C, 0)), 3)","v":35566995.079999998}]
[null,{"$f":"'Select LAs'!Q17","v":"No LA selected"},null,{"$f":"IF('Select LAs'!$R17=0,\"-\",IF(INDEX('EY Data'!CY:CY, MATCH('Select LAs'!$R17,'EY Data'!$B:$B, 0))=\"\",\"-\", ROUND(INDEX('EY Data'!CY:CY, MATCH('Select LAs'!$R17,'EY Data'!$B:$B, 0)),5)))","v":11.15578},{"$f":"IF('Select LAs'!$R17=0,\"-\",IF(INDEX('EY Data'!DB:DB, MATCH('Select LAs'!$R17,'EY Data'!$B:$B, 0))=\"\",\"-\", ROUND(INDEX('EY Data'!DB:DB, MATCH('Select LAs'!$R17,'EY Data'!$B:$B, 0)),5)))","v":11.15578},{"$f":"IF('Select LAs'!$R17=0,\"-\",IF(INDEX('EY Data'!DA:DA, MATCH('Select LAs'!$R17,'EY Data'!$B:$B, 0))=\"\",\"-\", ROUND(INDEX('EY Data'!DA:DA, MATCH('Select LAs'!$R17,'EY Data'!$B:$B, 0)),5)))","v":0},{"$f":"IF('Select LAs'!$R17=0,\"-\",IF(INDEX('EY Data'!CZ:CZ, MATCH('Select LAs'!$R17,'EY Data'!$B:$B, 0))=\"\",\"-\", ROUND(INDEX('EY Data'!CZ:CZ, MATCH('Select LAs'!$R17,'EY Data'!$B:$B, 0)),5)))","v":0},{"$f":"IF(OR('Select LAs'!$R17=0,'Select LAs'!$R17=201, 'Select LAs'!$R17=420), \"-\",IF(INDEX('EY Data'!EA:EA, MATCH('Select LAs'!$R17,'EY Data'!$B:$B, 0))=\"-\", \"-\", ROUND(INDEX('EY Data'!EA:EA, MATCH('Select LAs'!$R17,'EY Data'!$B:$B, 0)),3)))","v":0.97},{"$f":"IF(OR('Select LAs'!$R17=0,'Select LAs'!$R17=201, 'Select LAs'!$R17=420), \"-\",IF(INDEX('EY Data'!EC:EC, MATCH('Select LAs'!$R17,'EY Data'!$B:$B, 0))=\"\", \"-\", INDEX('EY Data'!EC:EC, MATCH('Select LAs'!$R17,'EY Data'!$B:$B, 0))))","v":0},{"$f":"IF('Select LAs'!$R17=0,\"-\",IF(INDEX('EY Data'!DS:DS, MATCH('Select LAs'!$R17,'EY Data'!$B:$B, 0))=\"\",\"-\",ROUND(INDEX('EY Data'!DS:DS, MATCH('Select LAs'!$R17,'EY Data'!$B:$B, 0)),0)))","v":44817},{"$f":"IF('Select LAs'!$R17=0,\"-\",IF(INDEX('EY Data'!DV:DV, MATCH('Select LAs'!$R17,'EY Data'!$B:$B, 0))=\"\",\"-\",ROUND(INDEX('EY Data'!DV:DV, MATCH('Select LAs'!$R17,'EY Data'!$B:$B, 0)),0)))","v":44817},{"$f":"IF('Select LAs'!$R17=0,\"-\",IF(INDEX('EY Data'!DU:DU, MATCH('Select LAs'!$R17,'EY Data'!$B:$B, 0))=\"\",\"-\",ROUND(INDEX('EY Data'!DU:DU, MATCH('Select LAs'!$R17,'EY Data'!$B:$B, 0)),0)))","v":0},{"$f":"IF('Select LAs'!$R17=0,\"-\",IF(INDEX('EY Data'!DT:DT, MATCH('Select LAs'!$R17,'EY Data'!$B:$B, 0))=\"\",\"-\",ROUND(INDEX('EY Data'!DT:DT, MATCH('Select LAs'!$R17,'EY Data'!$B:$B, 0)),0)))","v":0}]
[null,{"$f":"'Select LAs'!Q18","v":"No LA selected"},null,{"$f":"IF('Select LAs'!$R18=0,\"-\",IF(INDEX('EY Data'!CY:CY, MATCH('Select LAs'!$R18,'EY Data'!$B:$B, 0))=\"\",\"-\", ROUND(INDEX('EY Data'!CY:CY, MATCH('Select LAs'!$R18,'EY Data'!$B:$B, 0)),5)))","v":10.6381},{"$f":"IF('Select LAs'!$R18=0,\"-\",IF(INDEX('EY Data'!DB:DB, MATCH('Select LAs'!$R18,'EY Data'!$B:$B, 0))=\"\",\"-\", ROUND(INDEX('EY Data'!DB:DB, MATCH('Select LAs'!$R18,'EY Data'!$B:$B, 0)),5)))","v":10.6381},{"$f":"IF('Select LAs'!$R18=0,\"-\",IF(INDEX('EY Data'!DA:DA, MATCH('Select LAs'!$R18,'EY Data'!$B:$B, 0))=\"\",\"-\", ROUND(INDEX('EY Data'!DA:DA, MATCH('Select LAs'!$R18,'EY Data'!$B:$B, 0)),5)))","v":0},{"$f":"IF('Select LAs'!$R18=0,\"-\",IF(INDEX('EY Data'!CZ:CZ, MATCH('Select LAs'!$R18,'EY Data'!$B:$B, 0))=\"\",\"-\", ROUND(INDEX('EY Data'!CZ:CZ, MATCH('Select LAs'!$R18,'EY Data'!$B:$B, 0)),5)))","v":0},{"$f":"IF(OR('Select LAs'!$R18=0,'Select LAs'!$R18=201, 'Select LAs'!$R18=420), \"-\",IF(INDEX('EY Data'!EA:EA, MATCH('Select LAs'!$R18,'EY Data'!$B:$B, 0))=\"-\", \"-\", ROUND(INDEX('EY Data'!EA:EA, MATCH('Select LAs'!$R18,'EY Data'!$B:$B, 0)),3)))","v":0.96},{"$f":"IF(OR('Select LAs'!$R18=0,'Select LAs'!$R18=201, 'Select LAs'!$R18=420), \"-\",IF(INDEX('EY Data'!EC:EC, MATCH('Select LAs'!$R18,'EY Data'!$B:$B, 0))=\"\", \"-\", INDEX('EY Data'!EC:EC, MATCH('Select LAs'!$R18,'EY Data'!$B:$B, 0))))","v":"No Base Rate"},{"$f":"IF('Select LAs'!$R18=0,\"-\",IF(INDEX('EY Data'!DS:DS, MATCH('Select LAs'!$R18,'EY Data'!$B:$B, 0))=\"\",\"-\",ROUND(INDEX('EY Data'!DS:DS, MATCH('Select LAs'!$R18,'EY Data'!$B:$B, 0)),0)))","v":5980},{"$f":"IF('Select LAs'!$R18=0,\"-\",IF(INDEX('EY Data'!DV:DV, MATCH('Select LAs'!$R18,'EY Data'!$B:$B, 0))=\"\",\"-\",ROUND(INDEX('EY Data'!DV:DV, MATCH('Select LAs'!$R18,'EY Data'!$B:$B, 0)),0)))","v":5980},{"$f":"IF('Select LAs'!$R18=0,\"-\",IF(INDEX('EY Data'!DU:DU, MATCH('Select LAs'!$R18,'EY Data'!$B:$B, 0))=\"\",\"-\",ROUND(INDEX('EY Data'!DU:DU, MATCH('Select LAs'!$R18,'EY Data'!$B:$B, 0)),0)))","v":0},{"$f":"IF('Select LAs'!$R18=0,\"-\",IF(INDEX('EY Data'!DT:DT, MATCH('Select LAs'!$R18,'EY Data'!$B:$B, 0))=\"\",\"-\",ROUND(INDEX('EY Data'!DT:DT, MATCH('Select LAs'!$R18,'EY Data'!$B:$B, 0)),0)))","v":0}]
["",{"$f":"'Select LAs'!Q19","v":"No LA selected"},null,{"$f":"IF('Select LAs'!$R19=0,\"-\",IF(INDEX('EY Data'!CY:CY, MATCH('Select LAs'!$R19,'EY Data'!$B:$B, 0))=\"\",\"-\", ROUND(INDEX('EY Data'!CY:CY, MATCH('Select LAs'!$R19,'EY Data'!$B:$B, 0)),5)))","v":11.00057},{"$f":"IF('Select LAs'!$R19=0,\"-\",IF(INDEX('EY Data'!DB:DB, MATCH('Select LAs'!$R19,'EY Data'!$B:$B, 0))=\"\",\"-\", ROUND(INDEX('EY Data'!DB:DB, MATCH('Select LAs'!$R19,'EY Data'!$B:$B, 0)),5)))","v":10.999029999999999},{"$f":"IF('Select LAs'!$R19=0,\"-\",IF(INDEX('EY Data'!DA:DA, MATCH('Select LAs'!$R19,'EY Data'!$B:$B, 0))=\"\",\"-\", ROUND(INDEX('EY Data'!DA:DA, MATCH('Select LAs'!$R19,'EY Data'!$B:$B, 0)),5)))","v":11.130850000000001},{"$f":"IF('Select LAs'!$R19=0,\"-\",IF(INDEX('EY Data'!CZ:CZ, MATCH('Select LAs'!$R19,'EY Data'!$B:$B, 0))=\"\",\"-\", ROUND(INDEX('EY Data'!CZ:CZ, MATCH('Select LAs'!$R19,'EY Data'!$B:$B, 0)),5)))","v":10.9857},{"$f":"IF(OR('Select LAs'!$R19=0,'Select LAs'!$R19=201, 'Select LAs'!$R19=420), \"-\",IF(INDEX('EY Data'!EA:EA, MATCH('Select LAs'!$R19,'EY Data'!$B:$B, 0))=\"-\", \"-\", ROUND(INDEX('EY Data'!EA:EA, MATCH('Select LAs'!$R19,'EY Data'!$B:$B, 0)),3)))","v":0.96299999999999997},{"$f":"IF(OR('Select LAs'!$R19=0,'Select LAs'!$R19=201, 'Select LAs'!$R19=420), \"-\",IF(INDEX('EY Data'!EC:EC, MATCH('Select LAs'!$R19,'EY Data'!$B:$B, 0))=\"\", \"-\", INDEX('EY Data'!EC:EC, MATCH('Select LAs'!$R19,'EY Data'!$B:$B, 0))))","v":"No Base Rate"},{"$f":"IF('Select LAs'!$R19=0,\"-\",IF(INDEX('EY Data'!DS:DS, MATCH('Select LAs'!$R19,'EY Data'!$B:$B, 0))=\"\",\"-\",ROUND(INDEX('EY Data'!DS:DS, MATCH('Select LAs'!$R19,'EY Data'!$B:$B, 0)),0)))","v":286500},{"$f":"IF('Select LAs'!$R19=0,\"-\",IF(INDEX('EY Data'!DV:DV, MATCH('Select LAs'!$R19,'EY Data'!$B:$B, 0))=\"\",\"-\",ROUND(INDEX('EY Data'!DV:DV, MATCH('Select LAs'!$R19,'EY Data'!$B:$B, 0)),0)))","v":275900},{"$f":"IF('Select LAs'!$R19=0,\"-\",IF(INDEX('EY Data'!DU:DU, MATCH('Select LAs'!$R19,'EY Data'!$B:$B, 0))=\"\",\"-\",ROUND(INDEX('EY Data'!DU:DU, MATCH('Select LAs'!$R19,'EY Data'!$B:$B, 0)),0)))","v":4011},{"$f":"IF('Select LAs'!$R19=0,\"-\",IF(INDEX('EY Data'!DT:DT, MATCH('Select LAs'!$R19,'EY Data'!$B:$B, 0))=\"\",\"-\",ROUND(INDEX('EY Data'!DT:DT, MATCH('Select LAs'!$R19,'EY Data'!$B:$B, 0)),0)))","v":6590}]
["",{"$f":"'Select LAs'!Q20","v":"No LA selected"},null,{"$f":"IF('Select LAs'!$R20=0,\"-\",IF(INDEX('EY Data'!CY:CY, MATCH('Select LAs'!$R20,'EY Data'!$B:$B, 0))=\"\",\"-\", ROUND(INDEX('EY Data'!CY:CY, MATCH('Select LAs'!$R20,'EY Data'!$B:$B, 0)),5)))","v":10.861459999999999},{"$f":"IF('Select LAs'!$R20=0,\"-\",IF(INDEX('EY Data'!DB:DB, MATCH('Select LAs'!$R20,'EY Data'!$B:$B, 0))=\"\",\"-\", ROUND(INDEX('EY Data'!DB:DB, MATCH('Select LAs'!$R20,'EY Data'!$B:$B, 0)),5)))","v":10.861459999999999},{"$f":"IF('Select LAs'!$R20=0,\"-\",IF(INDEX('EY Data'!DA:DA, MATCH('Select LAs'!$R20,'EY Data'!$B:$B, 0))=\"\",\"-\", ROUND(INDEX('EY Data'!DA:DA, MATCH('Select LAs'!$R20,'EY Data'!$B:$B, 0)),5)))","v":0},{"$f":"IF('Select LAs'!$R20=0,\"-\",IF(INDEX('EY Data'!CZ:CZ, MATCH('Select LAs'!$R20,'EY Data'!$B:$B, 0))=\"\",\"-\", ROUND(INDEX('EY Data'!CZ:CZ, MATCH('Select LAs'!$R20,'EY Data'!$B:$B, 0)),5)))","v":0},{"$f":"IF(OR('Select LAs'!$R20=0,'Select LAs'!$R20=201, 'Select LAs'!$R20=420), \"-\",IF(INDEX('EY Data'!EA:EA, MATCH('Select LAs'!$R20,'EY Data'!$B:$B, 0))=\"-\", \"-\", ROUND(INDEX('EY Data'!EA:EA, MATCH('Select LAs'!$R20,'EY Data'!$B:$B, 0)),3)))","v":0.96},{"$f":"IF(OR('Select LAs'!$R20=0,'Select LAs'!$R20=201, 'Select LAs'!$R20=420), \"-\",IF(INDEX('EY Data'!EC:EC, MATCH('Select LAs'!$R20,'EY Data'!$B:$B, 0))=\"\", \"-\", INDEX('EY Data'!EC:EC, MATCH('Select LAs'!$R20,'EY Data'!$B:$B, 0))))","v":0},{"$f":"IF('Select LAs'!$R20=0,\"-\",IF(INDEX('EY Data'!DS:DS, MATCH('Select LAs'!$R20,'EY Data'!$B:$B, 0))=\"\",\"-\",ROUND(INDEX('EY Data'!DS:DS, MATCH('Select LAs'!$R20,'EY Data'!$B:$B, 0)),0)))","v":9100},{"$f":"IF('Select LAs'!$R20=0,\"-\",IF(INDEX('EY Data'!DV:DV, MATCH('Select LAs'!$R20,'EY Data'!$B:$B, 0))=\"\",\"-\",ROUND(INDEX('EY Data'!DV:DV, MATCH('Select LAs'!$R20,'EY Data'!$B:$B, 0)),0)))","v":9100},{"$f":"IF('Select LAs'!$R20=0,\"-\",IF(INDEX('EY Data'!DU:DU, MATCH('Select LAs'!$R20,'EY Data'!$B:$B, 0))=\"\",\"-\",ROUND(INDEX('EY Data'!DU:DU, MATCH('Select LAs'!$R20,'EY Data'!$B:$B, 0)),0)))","v":0},{"$f":"IF('Select LAs'!$R20=0,\"-\",IF(INDEX('EY Data'!DT:DT, MATCH('Select LAs'!$R20,'EY Data'!$B:$B, 0))=\"\",\"-\",ROUND(INDEX('EY Data'!DT:DT, MATCH('Select LAs'!$R20,'EY Data'!$B:$B, 0)),0)))","v":0}]
["",{"$f":"'Select LAs'!Q21","v":"No LA selected"},null,{"$f":"IF('Select LAs'!$R21=0,\"-\",IF(INDEX('EY Data'!CY:CY, MATCH('Select LAs'!$R21,'EY Data'!$B:$B, 0))=\"\",\"-\", ROUND(INDEX('EY Data'!CY:CY, MATCH('Select LAs'!$R21,'EY Data'!$B:$B, 0)),5)))","v":10.94529},{"$f":"IF('Select LAs'!$R21=0,\"-\",IF(INDEX('EY Data'!DB:DB, MATCH('Select LAs'!$R21,'EY Data'!$B:$B, 0))=\"\",\"-\", ROUND(INDEX('EY Data'!DB:DB, MATCH('Select LAs'!$R21,'EY Data'!$B:$B, 0)),5)))","v":10.945869999999999},{"$f":"IF('Select LAs'!$R21=0,\"-\",IF(INDEX('EY Data'!DA:DA, MATCH('Select LAs'!$R21,'EY Data'!$B:$B, 0))=\"\",\"-\", ROUND(INDEX('EY Data'!DA:DA, MATCH('Select LAs'!$R21,'EY Data'!$B:$B, 0)),5)))","v":10.905480000000001},{"$f":"IF('Select LAs'!$R21=0,\"-\",IF(INDEX('EY Data'!CZ:CZ, MATCH('Select LAs'!$R21,'EY Data'!$B:$B, 0))=\"\",\"-\", ROUND(INDEX('EY Data'!CZ:CZ, MATCH('Select LAs'!$R21,'EY Data'!$B:$B, 0)),5)))","v":0},{"$f":"IF(OR('Select LAs'!$R21=0,'Select LAs'!$R21=201, 'Select LAs'!$R21=420), \"-\",IF(INDEX('EY Data'!EA:EA, MATCH('Select LAs'!$R21,'EY Data'!$B:$B, 0))=\"-\", \"-\", ROUND(INDEX('EY Data'!EA:EA, MATCH('Select LAs'!$R21,'EY Data'!$B:$B, 0)),3)))","v":0.96799999999999997},{"$f":"IF(OR('Select LAs'!$R21=0,'Select LAs'!$R21=201, 'Select LAs'!$R21=420), \"-\",IF(INDEX('EY Data'!EC:EC, MATCH('Select LAs'!$R21,'EY Data'!$B:$B, 0))=\"\", \"-\", INDEX('EY Data'!EC:EC, MATCH('Select LAs'!$R21,'EY Data'!$B:$B, 0))))","v":"No Base Rate"},{"$f":"IF('Select LAs'!$R21=0,\"-\",IF(INDEX('EY Data'!DS:DS, MATCH('Select LAs'!$R21,'EY Data'!$B:$B, 0))=\"\",\"-\",ROUND(INDEX('EY Data'!DS:DS, MATCH('Select LAs'!$R21,'EY Data'!$B:$B, 0)),0)))","v":200000},{"$f":"IF('Select LAs'!$R21=0,\"-\",IF(INDEX('EY Data'!DV:DV, MATCH('Select LAs'!$R21,'EY Data'!$B:$B, 0))=\"\",\"-\",ROUND(INDEX('EY Data'!DV:DV, MATCH('Select LAs'!$R21,'EY Data'!$B:$B, 0)),0)))","v":200000},{"$f":"IF('Select LAs'!$R21=0,\"-\",IF(INDEX('EY Data'!DU:DU, MATCH('Select LAs'!$R21,'EY Data'!$B:$B, 0))=\"\",\"-\",ROUND(INDEX('EY Data'!DU:DU, MATCH('Select LAs'!$R21,'EY Data'!$B:$B, 0)),0)))","v":0},{"$f":"IF('Select LAs'!$R21=0,\"-\",IF(INDEX('EY Data'!DT:DT, MATCH('Select LAs'!$R21,'EY Data'!$B:$B, 0))=\"\",\"-\",ROUND(INDEX('EY Data'!DT:DT, MATCH('Select LAs'!$R21,'EY Data'!$B:$B, 0)),0)))","v":0}]
["",{"$f":"'Select LAs'!Q22","v":"No LA selected"},null,{"$f":"IF('Select LAs'!$R22=0,\"-\",IF(INDEX('EY Data'!CY:CY, MATCH('Select LAs'!$R22,'EY Data'!$B:$B, 0))=\"\",\"-\", ROUND(INDEX('EY Data'!CY:CY, MATCH('Select LAs'!$R22,'EY Data'!$B:$B, 0)),5)))","v":10.99737},{"$f":"IF('Select LAs'!$R22=0,\"-\",IF(INDEX('EY Data'!DB:DB, MATCH('Select LAs'!$R22,'EY Data'!$B:$B, 0))=\"\",\"-\", ROUND(INDEX('EY Data'!DB:DB, MATCH('Select LAs'!$R22,'EY Data'!$B:$B, 0)),5)))","v":10.99737},{"$f":"IF('Select LAs'!$R22=0,\"-\",IF(INDEX('EY Data'!DA:DA, MATCH('Select LAs'!$R22,'EY Data'!$B:$B, 0))=\"\",\"-\", ROUND(INDEX('EY Data'!DA:DA, MATCH('Select LAs'!$R22,'EY Data'!$B:$B, 0)),5)))","v":0},{"$f":"IF('Select LAs'!$R22=0,\"-\",IF(INDEX('EY Data'!CZ:CZ, MATCH('Select LAs'!$R22,'EY Data'!$B:$B, 0))=\"\",\"-\", ROUND(INDEX('EY Data'!CZ:CZ, MATCH('Select LAs'!$R22,'EY Data'!$B:$B, 0)),5)))","v":0},{"$f":"IF(OR('Select LAs'!$R22=0,'Select LAs'!$R22=201, 'Select LAs'!$R22=420), \"-\",IF(INDEX('EY Data'!EA:EA, MATCH('Select LAs'!$R22,'EY Data'!$B:$B, 0))=\"-\", \"-\", ROUND(INDEX('EY Data'!EA:EA, MATCH('Select LAs'!$R22,'EY Data'!$B:$B, 0)),3)))","v":0.96},{"$f":"IF(OR('Select LAs'!$R22=0,'Select LAs'!$R22=201, 'Select LAs'!$R22=420), \"-\",IF(INDEX('EY Data'!EC:EC, MATCH('Select LAs'!$R22,'EY Data'!$B:$B, 0))=\"\", \"-\", INDEX('EY Data'!EC:EC, MATCH('Select LAs'!$R22,'EY Data'!$B:$B, 0))))","v":0},{"$f":"IF('Select LAs'!$R22=0,\"-\",IF(INDEX('EY Data'!DS:DS, MATCH('Select LAs'!$R22,'EY Data'!$B:$B, 0))=\"\",\"-\",ROUND(INDEX('EY Data'!DS:DS, MATCH('Select LAs'!$R22,'EY Data'!$B:$B, 0)),0)))","v":5000},{"$f":"IF('Select LAs'!$R22=0,\"-\",IF(INDEX('EY Data'!DV:DV, MATCH('Select LAs'!$R22,'EY Data'!$B:$B, 0))=\"\",\"-\",ROUND(INDEX('EY Data'!DV:DV, MATCH('Select LAs'!$R22,'EY Data'!$B:$B, 0)),0)))","v":5000},{"$f":"IF('Select LAs'!$R22=0,\"-\",IF(INDEX('EY Data'!DU:DU, MATCH('Select LAs'!$R22,'EY Data'!$B:$B, 0))=\"\",\"-\",ROUND(INDEX('EY Data'!DU:DU, MATCH('Select LAs'!$R22,'EY Data'!$B:$B, 0)),0)))","v":0},{"$f":"IF('Select LAs'!$R22=0,\"-\",IF(INDEX('EY Data'!DT:DT, MATCH('Select LAs'!$R22,'EY Data'!$B:$B, 0))=\"\",\"-\",ROUND(INDEX('EY Data'!DT:DT, MATCH('Select LAs'!$R22,'EY Data'!$B:$B, 0)),0)))","v":0}]
["",{"$f":"'Select LAs'!Q23","v":"No LA selected"},null,{"$f":"IF('Select LAs'!$R23=0,\"-\",IF(INDEX('EY Data'!CY:CY, MATCH('Select LAs'!$R23,'EY Data'!$B:$B, 0))=\"\",\"-\", ROUND(INDEX('EY Data'!CY:CY, MATCH('Select LAs'!$R23,'EY Data'!$B:$B, 0)),5)))","v":11.22902},{"$f":"IF('Select LAs'!$R23=0,\"-\",IF(INDEX('EY Data'!DB:DB, MATCH('Select LAs'!$R23,'EY Data'!$B:$B, 0))=\"\",\"-\", ROUND(INDEX('EY Data'!DB:DB, MATCH('Select LAs'!$R23,'EY Data'!$B:$B, 0)),5)))","v":11.19059},{"$f":"IF('Select LAs'!$R23=0,\"-\",IF(INDEX('EY Data'!DA:DA, MATCH('Select LAs'!$R23,'EY Data'!$B:$B, 0))=\"\",\"-\", ROUND(INDEX('EY Data'!DA:DA, MATCH('Select LAs'!$R23,'EY Data'!$B:$B, 0)),5)))","v":11.87312},{"$f":"IF('Select LAs'!$R23=0,\"-\",IF(INDEX('EY Data'!CZ:CZ, MATCH('Select LAs'!$R23,'EY Data'!$B:$B, 0))=\"\",\"-\", ROUND(INDEX('EY Data'!CZ:CZ, MATCH('Select LAs'!$R23,'EY Data'!$B:$B, 0)),5)))","v":0},{"$f":"IF(OR('Select LAs'!$R23=0,'Select LAs'!$R23=201, 'Select LAs'!$R23=420), \"-\",IF(INDEX('EY Data'!EA:EA, MATCH('Select LAs'!$R23,'EY Data'!$B:$B, 0))=\"-\", \"-\", ROUND(INDEX('EY Data'!EA:EA, MATCH('Select LAs'!$R23,'EY Data'!$B:$B, 0)),3)))","v":0.97599999999999998},{"$f":"IF(OR('Select LAs'!$R23=0,'Select LAs'!$R23=201, 'Select LAs'!$R23=420), \"-\",IF(INDEX('EY Data'!EC:EC, MATCH('Select LAs'!$R23,'EY Data'!$B:$B, 0))=\"\", \"-\", INDEX('EY Data'!EC:EC, MATCH('Select LAs'!$R23,'EY Data'!$B:$B, 0))))","v":0},{"$f":"IF('Select LAs'!$R23=0,\"-\",IF(INDEX('EY Data'!DS:DS, MATCH('Select LAs'!$R23,'EY Data'!$B:$B, 0))=\"\",\"-\",ROUND(INDEX('EY Data'!DS:DS, MATCH('Select LAs'!$R23,'EY Data'!$B:$B, 0)),0)))","v":35000},{"$f":"IF('Select LAs'!$R23=0,\"-\",IF(INDEX('EY Data'!DV:DV, MATCH('Select LAs'!$R23,'EY Data'!$B:$B, 0))=\"\",\"-\",ROUND(INDEX('EY Data'!DV:DV, MATCH('Select LAs'!$R23,'EY Data'!$B:$B, 0)),0)))","v":15405},{"$f":"IF('Select LAs'!$R23=0,\"-\",IF(INDEX('EY Data'!DU:DU, MATCH('Select LAs'!$R23,'EY Data'!$B:$B, 0))=\"\",\"-\",ROUND(INDEX('EY Data'!DU:DU, MATCH('Select LAs'!$R23,'EY Data'!$B:$B, 0)),0)))","v":2555},{"$f":"IF('Select LAs'!$R23=0,\"-\",IF(INDEX('EY Data'!DT:DT, MATCH('Select LAs'!$R23,'EY Data'!$B:$B, 0))=\"\",\"-\",ROUND(INDEX('EY Data'!DT:DT, MATCH('Select LAs'!$R23,'EY Data'!$B:$B, 0)),0)))","v":17040}]
["",{"$f":"'Select LAs'!Q24","v":"No LA selected"},null,{"$f":"IF('Select LAs'!$R24=0,\"-\",IF(INDEX('EY Data'!CY:CY, MATCH('Select LAs'!$R24,'EY Data'!$B:$B, 0))=\"\",\"-\", ROUND(INDEX('EY Data'!CY:CY, MATCH('Select LAs'!$R24,'EY Data'!$B:$B, 0)),5)))","v":11.40605},{"$f":"IF('Select LAs'!$R24=0,\"-\",IF(INDEX('EY Data'!DB:DB, MATCH('Select LAs'!$R24,'EY Data'!$B:$B, 0))=\"\",\"-\", ROUND(INDEX('EY Data'!DB:DB, MATCH('Select LAs'!$R24,'EY Data'!$B:$B, 0)),5)))","v":11.40605},{"$f":"IF('Select LAs'!$R24=0,\"-\",IF(INDEX('EY Data'!DA:DA, MATCH('Select LAs'!$R24,'EY Data'!$B:$B, 0))=\"\",\"-\", ROUND(INDEX('EY Data'!DA:DA, MATCH('Select LAs'!$R24,'EY Data'!$B:$B, 0)),5)))","v":0},{"$f":"IF('Select LAs'!$R24=0,\"-\",IF(INDEX('EY Data'!CZ:CZ, MATCH('Select LAs'!$R24,'EY Data'!$B:$B, 0))=\"\",\"-\", ROUND(INDEX('EY Data'!CZ:CZ, MATCH('Select LAs'!$R24,'EY Data'!$B:$B, 0)),5)))","v":0},{"$f":"IF(OR('Select LAs'!$R24=0,'Select LAs'!$R24=201, 'Select LAs'!$R24=420), \"-\",IF(INDEX('EY Data'!EA:EA, MATCH('Select LAs'!$R24,'EY Data'!$B:$B, 0))=\"-\", \"-\", ROUND(INDEX('EY Data'!EA:EA, MATCH('Select LAs'!$R24,'EY Data'!$B:$B, 0)),3)))","v":1.0269999999999999},{"$f":"IF(OR('Select LAs'!$R24=0,'Select LAs'!$R24=201, 'Select LAs'!$R24=420), \"-\",IF(INDEX('EY Data'!EC:EC, MATCH('Select LAs'!$R24,'EY Data'!$B:$B, 0))=\"\", \"-\", INDEX('EY Data'!EC:EC, MATCH('Select LAs'!$R24,'EY Data'!$B:$B, 0))))","v":0},{"$f":"IF('Select LAs'!$R24=0,\"-\",IF(INDEX('EY Data'!DS:DS, MATCH('Select LAs'!$R24,'EY Data'!$B:$B, 0))=\"\",\"-\",ROUND(INDEX('EY Data'!DS:DS, MATCH('Select LAs'!$R24,'EY Data'!$B:$B, 0)),0)))","v":20000},{"$f":"IF('Select LAs'!$R24=0,\"-\",IF(INDEX('EY Data'!DV:DV, MATCH('Select LAs'!$R24,'EY Data'!$B:$B, 0))=\"\",\"-\",ROUND(INDEX('EY Data'!DV:DV, MATCH('Select LAs'!$R24,'EY Data'!$B:$B, 0)),0)))","v":20000},{"$f":"IF('Select LAs'!$R24=0,\"-\",IF(INDEX('EY Data'!DU:DU, MATCH('Select LAs'!$R24,'EY Data'!$B:$B, 0))=\"\",\"-\",ROUND(INDEX('EY Data'!DU:DU, MATCH('Select LAs'!$R24,'EY Data'!$B:$B, 0)),0)))","v":0},{"$f":"IF('Select LAs'!$R24=0,\"-\",IF(INDEX('EY Data'!DT:DT, MATCH('Select LAs'!$R24,'EY Data'!$B:$B, 0))=\"\",\"-\",ROUND(INDEX('EY Data'!DT:DT, MATCH('Select LAs'!$R24,'EY Data'!$B:$B, 0)),0)))","v":0}]
["",{"$f":"'Select LAs'!Q25","v":"No LA selected"},null,{"$f":"IF('Select LAs'!$R25=0,\"-\",IF(INDEX('EY Data'!CY:CY, MATCH('Select LAs'!$R25,'EY Data'!$B:$B, 0))=\"\",\"-\", ROUND(INDEX('EY Data'!CY:CY, MATCH('Select LAs'!$R25,'EY Data'!$B:$B, 0)),5)))","v":11.25225},{"$f":"IF('Select LAs'!$R25=0,\"-\",IF(INDEX('EY Data'!DB:DB, MATCH('Select LAs'!$R25,'EY Data'!$B:$B, 0))=\"\",\"-\", ROUND(INDEX('EY Data'!DB:DB, MATCH('Select LAs'!$R25,'EY Data'!$B:$B, 0)),5)))","v":11.25224},{"$f":"IF('Select LAs'!$R25=0,\"-\",IF(INDEX('EY Data'!DA:DA, MATCH('Select LAs'!$R25,'EY Data'!$B:$B, 0))=\"\",\"-\", ROUND(INDEX('EY Data'!DA:DA, MATCH('Select LAs'!$R25,'EY Data'!$B:$B, 0)),5)))","v":13.77},{"$f":"IF('Select LAs'!$R25=0,\"-\",IF(INDEX('EY Data'!CZ:CZ, MATCH('Select LAs'!$R25,'EY Data'!$B:$B, 0))=\"\",\"-\", ROUND(INDEX('EY Data'!CZ:CZ, MATCH('Select LAs'!$R25,'EY Data'!$B:$B, 0)),5)))","v":13.77},{"$f":"IF(OR('Select LAs'!$R25=0,'Select LAs'!$R25=201, 'Select LAs'!$R25=420), \"-\",IF(INDEX('EY Data'!EA:EA, MATCH('Select LAs'!$R25,'EY Data'!$B:$B, 0))=\"-\", \"-\", ROUND(INDEX('EY Data'!EA:EA, MATCH('Select LAs'!$R25,'EY Data'!$B:$B, 0)),3)))","v":0.96},{"$f":"IF(OR('Select LAs'!$R25=0,'Select LAs'!$R25=201, 'Select LAs'!$R25=420), \"-\",IF(INDEX('EY Data'!EC:EC, MATCH('Select LAs'!$R25,'EY Data'!$B:$B, 0))=\"\", \"-\", INDEX('EY Data'!EC:EC, MATCH('Select LAs'!$R25,'EY Data'!$B:$B, 0))))","v":"No Base Rate"},{"$f":"IF('Select LAs'!$R25=0,\"-\",IF(INDEX('EY Data'!DS:DS, MATCH('Select LAs'!$R25,'EY Data'!$B:$B, 0))=\"\",\"-\",ROUND(INDEX('EY Data'!DS:DS, MATCH('Select LAs'!$R25,'EY Data'!$B:$B, 0)),0)))","v":11040},{"$f":"IF('Select LAs'!$R25=0,\"-\",IF(INDEX('EY Data'!DV:DV, MATCH('Select LAs'!$R25,'EY Data'!$B:$B, 0))=\"\",\"-\",ROUND(INDEX('EY Data'!DV:DV, MATCH('Select LAs'!$R25,'EY Data'!$B:$B, 0)),0)))","v":11040},{"$f":"IF('Select LAs'!$R25=0,\"-\",IF(INDEX('EY Data'!DU:DU, MATCH('Select LAs'!$R25,'EY Data'!$B:$B, 0))=\"\",\"-\",ROUND(INDEX('EY Data'!DU:DU, MATCH('Select LAs'!$R25,'EY Data'!$B:$B, 0)),0)))","v":0},{"$f":"IF('Select LAs'!$R25=0,\"-\",IF(INDEX('EY Data'!DT:DT, MATCH('Select LAs'!$R25,'EY Data'!$B:$B, 0))=\"\",\"-\",ROUND(INDEX('EY Data'!DT:DT, MATCH('Select LAs'!$R25,'EY Data'!$B:$B, 0)),0)))","v":0}]
["",{"$f":"'Select LAs'!Q26","v":"No LA selected"},null,{"$f":"IF('Select LAs'!$R26=0,\"-\",IF(INDEX('EY Data'!CY:CY, MATCH('Select LAs'!$R26,'EY Data'!$B:$B, 0))=\"\",\"-\", ROUND(INDEX('EY Data'!CY:CY, MATCH('Select LAs'!$R26,'EY Data'!$B:$B, 0)),5)))","v":12.07498},{"$f":"IF('Select LAs'!$R26=0,\"-\",IF(INDEX('EY Data'!DB:DB, MATCH('Select LAs'!$R26,'EY Data'!$B:$B, 0))=\"\",\"-\", ROUND(INDEX('EY Data'!DB:DB, MATCH('Select LAs'!$R26,'EY Data'!$B:$B, 0)),5)))","v":11.92},{"$f":"IF('Select LAs'!$R26=0,\"-\",IF(INDEX('EY Data'!DA:DA, MATCH('Select LAs'!$R26,'EY Data'!$B:$B, 0))=\"\",\"-\", ROUND(INDEX('EY Data'!DA:DA, MATCH('Select LAs'!$R26,'EY Data'!$B:$B, 0)),5)))","v":14.43587},{"$f":"IF('Select LAs'!$R26=0,\"-\",IF(INDEX('EY Data'!CZ:CZ, MATCH('Select LAs'!$R26,'EY Data'!$B:$B, 0))=\"\",\"-\", ROUND(INDEX('EY Data'!CZ:CZ, MATCH('Select LAs'!$R26,'EY Data'!$B:$B, 0)),5)))","v":11.92},{"$f":"IF(OR('Select LAs'!$R26=0,'Select LAs'!$R26=201, 'Select LAs'!$R26=420), \"-\",IF(INDEX('EY Data'!EA:EA, MATCH('Select LAs'!$R26,'EY Data'!$B:$B, 0))=\"-\", \"-\", ROUND(INDEX('EY Data'!EA:EA, MATCH('Select LAs'!$R26,'EY Data'!$B:$B, 0)),3)))","v":0.97699999999999998},{"$f":"IF(OR('Select LAs'!$R26=0,'Select LAs'!$R26=201, 'Select LAs'!$R26=420), \"-\",IF(INDEX('EY Data'!EC:EC, MATCH('Select LAs'!$R26,'EY Data'!$B:$B, 0))=\"\", \"-\", INDEX('EY Data'!EC:EC, MATCH('Select LAs'!$R26,'EY Data'!$B:$B, 0))))","v":0},{"$f":"IF('Select LAs'!$R26=0,\"-\",IF(INDEX('EY Data'!DS:DS, MATCH('Select LAs'!$R26,'EY Data'!$B:$B, 0))=\"\",\"-\",ROUND(INDEX('EY Data'!DS:DS, MATCH('Select LAs'!$R26,'EY Data'!$B:$B, 0)),0)))","v":472222},{"$f":"IF('Select LAs'!$R26=0,\"-\",IF(INDEX('EY Data'!DV:DV, MATCH('Select LAs'!$R26,'EY Data'!$B:$B, 0))=\"\",\"-\",ROUND(INDEX('EY Data'!DV:DV, MATCH('Select LAs'!$R26,'EY Data'!$B:$B, 0)),0)))","v":0},{"$f":"IF('Select LAs'!$R26=0,\"-\",IF(INDEX('EY Data'!DU:DU, MATCH('Select LAs'!$R26,'EY Data'!$B:$B, 0))=\"\",\"-\",ROUND(INDEX('EY Data'!DU:DU, MATCH('Select LAs'!$R26,'EY Data'!$B:$B, 0)),0)))","v":472222},{"$f":"IF('Select LAs'!$R26=0,\"-\",IF(INDEX('EY Data'!DT:DT, MATCH('Select LAs'!$R26,'EY Data'!$B:$B, 0))=\"\",\"-\",ROUND(INDEX('EY Data'!DT:DT, MATCH('Select LAs'!$R26,'EY Data'!$B:$B, 0)),0)))","v":0}]
[null,{"$f":"'Select LAs'!Q27","v":"No LA selected"},null,{"$f":"IF('Select LAs'!$R27=0,\"-\",IF(INDEX('EY Data'!CY:CY, MATCH('Select LAs'!$R27,'EY Data'!$B:$B, 0))=\"\",\"-\", ROUND(INDEX('EY Data'!CY:CY, MATCH('Select LAs'!$R27,'EY Data'!$B:$B, 0)),5)))","v":12.12876},{"$f":"IF('Select LAs'!$R27=0,\"-\",IF(INDEX('EY Data'!DB:DB, MATCH('Select LAs'!$R27,'EY Data'!$B:$B, 0))=\"\",\"-\", ROUND(INDEX('EY Data'!DB:DB, MATCH('Select LAs'!$R27,'EY Data'!$B:$B, 0)),5)))","v":12.12876},{"$f":"IF('Select LAs'!$R27=0,\"-\",IF(INDEX('EY Data'!DA:DA, MATCH('Select LAs'!$R27,'EY Data'!$B:$B, 0))=\"\",\"-\", ROUND(INDEX('EY Data'!DA:DA, MATCH('Select LAs'!$R27,'EY Data'!$B:$B, 0)),5)))","v":0},{"$f":"IF('Select LAs'!$R27=0,\"-\",IF(INDEX('EY Data'!CZ:CZ, MATCH('Select LAs'!$R27,'EY Data'!$B:$B, 0))=\"\",\"-\", ROUND(INDEX('EY Data'!CZ:CZ, MATCH('Select LAs'!$R27,'EY Data'!$B:$B, 0)),5)))","v":0},{"$f":"IF(OR('Select LAs'!$R27=0,'Select LAs'!$R27=201, 'Select LAs'!$R27=420), \"-\",IF(INDEX('EY Data'!EA:EA, MATCH('Select LAs'!$R27,'EY Data'!$B:$B, 0))=\"-\", \"-\", ROUND(INDEX('EY Data'!EA:EA, MATCH('Select LAs'!$R27,'EY Data'!$B:$B, 0)),3)))","v":1.0049999999999999},{"$f":"IF(OR('Select LAs'!$R27=0,'Select LAs'!$R27=201, 'Select LAs'!$R27=420), \"-\",IF(INDEX('EY Data'!EC:EC, MATCH('Select LAs'!$R27,'EY Data'!$B:$B, 0))=\"\", \"-\", INDEX('EY Data'!EC:EC, MATCH('Select LAs'!$R27,'EY Data'!$B:$B, 0))))","v":0},{"$f":"IF('Select LAs'!$R27=0,\"-\",IF(INDEX('EY Data'!DS:DS, MATCH('Select LAs'!$R27,'EY Data'!$B:$B, 0))=\"\",\"-\",ROUND(INDEX('EY Data'!DS:DS, MATCH('Select LAs'!$R27,'EY Data'!$B:$B, 0)),0)))","v":120000},{"$f":"IF('Select LAs'!$R27=0,\"-\",IF(INDEX('EY Data'!DV:DV, MATCH('Select LAs'!$R27,'EY Data'!$B:$B, 0))=\"\",\"-\",ROUND(INDEX('EY Data'!DV:DV, MATCH('Select LAs'!$R27,'EY Data'!$B:$B, 0)),0)))","v":120000},{"$f":"IF('Select LAs'!$R27=0,\"-\",IF(INDEX('EY Data'!DU:DU, MATCH('Select LAs'!$R27,'EY Data'!$B:$B, 0))=\"\",\"-\",ROUND(INDEX('EY Data'!DU:DU, MATCH('Select LAs'!$R27,'EY Data'!$B:$B, 0)),0)))","v":0},{"$f":"IF('Select LAs'!$R27=0,\"-\",IF(INDEX('EY Data'!DT:DT, MATCH('Select LAs'!$R27,'EY Data'!$B:$B, 0))=\"\",\"-\",ROUND(INDEX('EY Data'!DT:DT, MATCH('Select LAs'!$R27,'EY Data'!$B:$B, 0)),0)))","v":0}]
[null,"Selection Median",null,{"$f":"IF(COUNT(D$29:D$39)>0,MEDIAN(D$29:D$39),\"-\")","v":11.15578},{"$f":"IF(COUNT(E$29:E$39)>0,MEDIAN(E$29:E$39),\"-\")","v":11.15578},0,{"$f":"IF(COUNT(G$29:G$39)>0,MEDIAN(G$29:G$39),\"-\")","v":0},{"$f":"IF(COUNT(H$29:H$39)>0,MEDIAN(H$29:H$39),\"-\")","v":0.96799999999999997},{"$f":"IF(COUNT(I$29:I$39)>0,MEDIAN(I$29:I$39),\"-\")","v":0},{"$f":"IF(COUNT(J$29:J$39)>0,MEDIAN(J$29:J$39),\"-\")","v":35000},{"$f":"IF(COUNT(K$29:K$39)>0,MEDIAN(K$29:K$39),\"-\")","v":15405},0,0]
[null,"Selection Minimum",null,{"$f":"IF(COUNT(D$29:D$39)>0,MIN(D$29:D$39),\"-\")","v":10.6381},10.6381,0,{"$f":"IF(COUNT(G$29:G$39)>0,MIN(G$29:G$39),\"-\")","v":0},{"$f":"IF(COUNT(H$29:H$39)>0,MIN(H$29:H$39),\"-\")","v":0.96},{"$f":"IF(COUNT(I$29:I$39)>0,MIN(I$29:I$39),\"-\")","v":0},{"$f":"IF(COUNT(J$29:J$39)>0,MIN(J$29:J$39),\"-\")","v":5000},{"$f":"IF(COUNT(K$29:K$39)>0,MIN(K$29:K$39),\"-\")","v":0},0,0]
[null,"Selection Maximum",null,{"$f":"IF(COUNT(D$29:D$39)>0,MAX(D$29:D$39),\"-\")","v":12.12876},12.12876,14.43587,{"$f":"IF(COUNT(G$29:G$39)>0,MAX(G$29:G$39),\"-\")","v":13.77},{"$f":"IF(COUNT(H$29:H$39)>0,MAX(H$29:H$39),\"-\")","v":1.0269999999999999},{"$f":"IF(COUNT(I$29:I$39)>0,MAX(I$29:I$39),\"-\")","v":0},{"$f":"IF(COUNT(J$29:J$39)>0,MAX(J$29:J$39),\"-\")","v":472222},{"$f":"IF(COUNT(K$29:K$39)>0,MAX(K$29:K$39),\"-\")","v":275900},472222,17040]

{"sheet":"Other EYFF funds","index":5,"n_rows":29,"n_cols":19,"rows_kept":29,"cut":false,"hidden":true,"merged":[[13,1,13,2],[30,1,30,10],[31,2,31,10],[9,3,9,4],[12,3,12,6],[12,7,12,10],[12,11,12,14],[12,15,12,18]]}
[]
[null,{"$f":"'Select LAs'!B3","v":"No LA selected"},null,null,null,null,null,null,null,null,null,null,null,null,null,{"$f":"'3-4 year olds '!K2","v":"Financial Year 2025-2026"}]
[]
[null,null,null,"PVIs","Nursery Schools","Primary Nursery Places"]
[]
[null,{"$f":"CONCATENATE(\"Benchmarking against \",IF(_SN=1,\"Statistical Neighbours\",\"Manual Selection\"))","v":"Benchmarking against Manual Selection"}]
[]
[]
[]
[null,null,"Table ordering"]
[]
[]
[null,null,null,"3-4 year olds",null,null,null,"2 year olds (FRAS)",null,null,null,"2 year olds (WP)",null,null,null,"9mth - 2 year olds"]
[null,"Local Authority",null,"Total EYFF Budget","SEN Inclusion Fund (top-up grant element) budget","Contingency funding","Central spend","Total EYFF Budget","SEN Inclusion Fund (top-up grant element) budget","Contingency funding","Central spend","Total EYFF Budget","SEN Inclusion Fund (top-up grant element) budget","Contingency funding","Central spend","Total EYFF Budget","SEN Inclusion Fund (top-up grant element) budget","Contingency funding","Central spend"]
[null,"England",null,{"$f":"ROUND(INDEX('EY Data'!X:X, MATCH($B15,'EY Data'!$C:$C, 0)), 0)","v":3554262593},{"$f":"ROUND(INDEX('EY Data'!Z:Z, MATCH($B15,'EY Data'!$C:$C, 0)), 0)","v":86778014},{"$f":"ROUND(INDEX('EY Data'!AE:AE, MATCH($B15,'EY Data'!$C:$C, 0)), 0)","v":30617803},{"$f":"ROUND(INDEX('EY Data'!AF:AF, MATCH($B15,'EY Data'!$C:$C, 0)), 0)","v":137637448},{"$f":"ROUND(INDEX('EY Data'!BE:BE, MATCH($B15,'EY Data'!$C:$C, 0)), 0)","v":558030146},{"$f":"ROUND(INDEX('EY Data'!BG:BG, MATCH($B15,'EY Data'!$C:$C, 0)), 0)","v":10212857},{"$f":"ROUND(INDEX('EY Data'!BL:BL, MATCH($B15,'EY Data'!$C:$C, 0)), 0)","v":2987135},{"$f":"ROUND(INDEX('EY Data'!BM:BM, MATCH($B15,'EY Data'!$C:$C, 0)), 0)","v":15060990},{"$f":"ROUND(INDEX('EY Data'!CK:CK, MATCH($B15,'EY Data'!$C:$C, 0)), 0)","v":884818292},{"$f":"ROUND(INDEX('EY Data'!CM:CM, MATCH($B15,'EY Data'!$C:$C, 0)), 0)","v":14766273},{"$f":"ROUND(INDEX('EY Data'!CR:CR, MATCH($B15,'EY Data'!$C:$C, 0)), 0)","v":6509565},{"$f":"ROUND(INDEX('EY Data'!CS:CS, MATCH($B15,'EY Data'!$C:$C, 0)), 0)","v":25652806},{"$f":"ROUND(INDEX('EY Data'!DQ:DQ, MATCH($B15,'EY Data'!$C:$C, 0)), 0)","v":697693914},{"$f":"ROUND(INDEX('EY Data'!DS:DS, MATCH($B15,'EY Data'!$C:$C, 0)), 0)","v":10526987},{"$f":"ROUND(INDEX('EY Data'!DX:DX, MATCH($B15,'EY Data'!$C:$C, 0)), 0)","v":5987592},{"$f":"ROUND(INDEX('EY Data'!DY:DY, MATCH($B15,'EY Data'!$C:$C, 0)), 0)","v":19102937}]
[null,{"$f":"'Select LAs'!Q31","v":"No LA selected"},null,{"$f":"IF('Select LAs'!$M3=0,\"-\",IF(INDEX('EY Data'!X:X, MATCH('Select LAs'!$M3,'EY Data'!$B:$B, 0))=\"\",\"-\",ROUND(INDEX('EY Data'!X:X, MATCH('Select LAs'!$M3,'EY Data'!$B:$B, 0)),0)))","v":17678389},{"$f":"IF('Select LAs'!$M3=0,\"-\",IF(INDEX('EY Data'!Z:Z, MATCH('Select LAs'!$M3,'EY Data'!$B:$B, 0))=\"\",\"-\",ROUND(INDEX('EY Data'!Z:Z, MATCH('Select LAs'!$M3,'EY Data'!$B:$B, 0)),0)))","v":88836},{"$f":"IF('Select LAs'!$M3=0,\"-\",IF(INDEX('EY Data'!AE:AE, MATCH('Select LAs'!$M3,'EY Data'!$B:$B, 0))=\"\",\"-\",ROUND(INDEX('EY Data'!AE:AE, MATCH('Select LAs'!$M3,'EY Data'!$B:$B, 0)),0)))","v":0},{"$f":"IF('Select LAs'!$M3=0,\"-\",IF(INDEX('EY Data'!AF:AF, MATCH('Select LAs'!$M3,'EY Data'!$B:$B, 0))=\"\",\"-\",ROUND(INDEX('EY Data'!AF:AF, MATCH('Select LAs'!$M3,'EY Data'!$B:$B, 0)),0)))","v":644407},{"$f":"IF('Select LAs'!$M3=0,\"-\",IF(INDEX('EY Data'!BE:BE, MATCH('Select LAs'!$M3,'EY Data'!$B:$B, 0))=\"\",\"-\",ROUND(INDEX('EY Data'!BE:BE, MATCH('Select LAs'!$M3,'EY Data'!$B:$B, 0)),0)))","v":4976820},{"$f":"IF('Select LAs'!$M3=0,\"-\",IF(INDEX('EY Data'!BG:BG, MATCH('Select LAs'!$M3,'EY Data'!$B:$B, 0))=\"\",\"-\",ROUND(INDEX('EY Data'!BG:BG, MATCH('Select LAs'!$M3,'EY Data'!$B:$B, 0)),0)))","v":50848},{"$f":"IF('Select LAs'!$M3=0,\"-\",IF(INDEX('EY Data'!BL:BL, MATCH('Select LAs'!$M3,'EY Data'!$B:$B, 0))=\"\",\"-\",ROUND(INDEX('EY Data'!BL:BL, MATCH('Select LAs'!$M3,'EY Data'!$B:$B, 0)),0)))","v":0},{"$f":"IF('Select LAs'!$M3=0,\"-\",IF(INDEX('EY Data'!BM:BM, MATCH('Select LAs'!$M3,'EY Data'!$B:$B, 0))=\"\",\"-\",ROUND(INDEX('EY Data'!BM:BM, MATCH('Select LAs'!$M3,'EY Data'!$B:$B, 0)),0)))","v":76563},{"$f":"IF('Select LAs'!$M3=0,\"-\",IF(INDEX('EY Data'!CK:CK, MATCH('Select LAs'!$M3,'EY Data'!$B:$B, 0))=\"\",\"-\",ROUND(INDEX('EY Data'!CK:CK, MATCH('Select LAs'!$M3,'EY Data'!$B:$B, 0)),0)))","v":5965985},{"$f":"IF('Select LAs'!$M3=0,\"-\",IF(INDEX('EY Data'!CM:CM, MATCH('Select LAs'!$M3,'EY Data'!$B:$B, 0))=\"\",\"-\",ROUND(INDEX('EY Data'!CM:CM, MATCH('Select LAs'!$M3,'EY Data'!$B:$B, 0)),0)))","v":4068},{"$f":"IF('Select LAs'!$M3=0,\"-\",IF(INDEX('EY Data'!CR:CR, MATCH('Select LAs'!$M3,'EY Data'!$B:$B, 0))=\"\",\"-\",ROUND(INDEX('EY Data'!CR:CR, MATCH('Select LAs'!$M3,'EY Data'!$B:$B, 0)),0)))","v":0},{"$f":"IF('Select LAs'!$M3=0,\"-\",IF(INDEX('EY Data'!CS:CS, MATCH('Select LAs'!$M3,'EY Data'!$B:$B, 0))=\"\",\"-\",ROUND(INDEX('EY Data'!CS:CS, MATCH('Select LAs'!$M3,'EY Data'!$B:$B, 0)),0)))","v":248752},{"$f":"IF('Select LAs'!$M3=0,\"-\",IF(INDEX('EY Data'!DQ:DQ, MATCH('Select LAs'!$M3,'EY Data'!$B:$B, 0))=\"\",\"-\",ROUND(INDEX('EY Data'!DQ:DQ, MATCH('Select LAs'!$M3,'EY Data'!$B:$B, 0)),0)))","v":8918672},{"$f":"IF('Select LAs'!$M3=0,\"-\",IF(INDEX('EY Data'!DS:DS, MATCH('Select LAs'!$M3,'EY Data'!$B:$B, 0))=\"\",\"-\",ROUND(INDEX('EY Data'!DS:DS, MATCH('Select LAs'!$M3,'EY Data'!$B:$B, 0)),0)))","v":44817},{"$f":"IF('Select LAs'!$M3=0,\"-\",IF(INDEX('EY Data'!DX:DX, MATCH('Select LAs'!$M3,'EY Data'!$B:$B, 0))=\"\",\"-\",ROUND(INDEX('EY Data'!DX:DX, MATCH('Select LAs'!$M3,'EY Data'!$B:$B, 0)),0)))","v":0},{"$f":"IF('Select LAs'!$M3=0,\"-\",IF(INDEX('EY Data'!DY:DY, MATCH('Select LAs'!$M3,'EY Data'!$B:$B, 0))=\"\",\"-\",ROUND(INDEX('EY Data'!DY:DY, MATCH('Select LAs'!$M3,'EY Data'!$B:$B, 0)),0)))","v":277221}]
[{"$f":"'Select LAs'!P32","v":0},{"$f":"'Select LAs'!Q32","v":"No LA selected"},null,{"$f":"IF('Select LAs'!$M4=0,\"-\",IF(INDEX('EY Data'!X:X, MATCH('Select LAs'!$M4,'EY Data'!$B:$B, 0))=\"\",\"-\",ROUND(INDEX('EY Data'!X:X, MATCH('Select LAs'!$M4,'EY Data'!$B:$B, 0)),0)))","v":10946688},{"$f":"IF('Select LAs'!$M4=0,\"-\",IF(INDEX('EY Data'!Z:Z, MATCH('Select LAs'!$M4,'EY Data'!$B:$B, 0))=\"\",\"-\",ROUND(INDEX('EY Data'!Z:Z, MATCH('Select LAs'!$M4,'EY Data'!$B:$B, 0)),0)))","v":289074},{"$f":"IF('Select LAs'!$M4=0,\"-\",IF(INDEX('EY Data'!AE:AE, MATCH('Select LAs'!$M4,'EY Data'!$B:$B, 0))=\"\",\"-\",ROUND(INDEX('EY Data'!AE:AE, MATCH('Select LAs'!$M4,'EY Data'!$B:$B, 0)),0)))","v":0},{"$f":"IF('Select LAs'!$M4=0,\"-\",IF(INDEX('EY Data'!AF:AF, MATCH('Select LAs'!$M4,'EY Data'!$B:$B, 0))=\"\",\"-\",ROUND(INDEX('EY Data'!AF:AF, MATCH('Select LAs'!$M4,'EY Data'!$B:$B, 0)),0)))","v":492117},{"$f":"IF('Select LAs'!$M4=0,\"-\",IF(INDEX('EY Data'!BE:BE, MATCH('Select LAs'!$M4,'EY Data'!$B:$B, 0))=\"\",\"-\",ROUND(INDEX('EY Data'!BE:BE, MATCH('Select LAs'!$M4,'EY Data'!$B:$B, 0)),0)))","v":2171003},{"$f":"IF('Select LAs'!$M4=0,\"-\",IF(INDEX('EY Data'!BG:BG, MATCH('Select LAs'!$M4,'EY Data'!$B:$B, 0))=\"\",\"-\",ROUND(INDEX('EY Data'!BG:BG, MATCH('Select LAs'!$M4,'EY Data'!$B:$B, 0)),0)))","v":5681},{"$f":"IF('Select LAs'!$M4=0,\"-\",IF(INDEX('EY Data'!BL:BL, MATCH('Select LAs'!$M4,'EY Data'!$B:$B, 0))=\"\",\"-\",ROUND(INDEX('EY Data'!BL:BL, MATCH('Select LAs'!$M4,'EY Data'!$B:$B, 0)),0)))","v":0},{"$f":"IF('Select LAs'!$M4=0,\"-\",IF(INDEX('EY Data'!BM:BM, MATCH('Select LAs'!$M4,'EY Data'!$B:$B, 0))=\"\",\"-\",ROUND(INDEX('EY Data'!BM:BM, MATCH('Select LAs'!$M4,'EY Data'!$B:$B, 0)),0)))","v":87553},{"$f":"IF('Select LAs'!$M4=0,\"-\",IF(INDEX('EY Data'!CK:CK, MATCH('Select LAs'!$M4,'EY Data'!$B:$B, 0))=\"\",\"-\",ROUND(INDEX('EY Data'!CK:CK, MATCH('Select LAs'!$M4,'EY Data'!$B:$B, 0)),0)))","v":3895916},{"$f":"IF('Select LAs'!$M4=0,\"-\",IF(INDEX('EY Data'!CM:CM, MATCH('Select LAs'!$M4,'EY Data'!$B:$B, 0))=\"\",\"-\",ROUND(INDEX('EY Data'!CM:CM, MATCH('Select LAs'!$M4,'EY Data'!$B:$B, 0)),0)))","v":16146},{"$f":"IF('Select LAs'!$M4=0,\"-\",IF(INDEX('EY Data'!CR:CR, MATCH('Select LAs'!$M4,'EY Data'!$B:$B, 0))=\"\",\"-\",ROUND(INDEX('EY Data'!CR:CR, MATCH('Select LAs'!$M4,'EY Data'!$B:$B, 0)),0)))","v":0},{"$f":"IF('Select LAs'!$M4=0,\"-\",IF(INDEX('EY Data'!CS:CS, MATCH('Select LAs'!$M4,'EY Data'!$B:$B, 0))=\"\",\"-\",ROUND(INDEX('EY Data'!CS:CS, MATCH('Select LAs'!$M4,'EY Data'!$B:$B, 0)),0)))","v":161363},{"$f":"IF('Select LAs'!$M4=0,\"-\",IF(INDEX('EY Data'!DQ:DQ, MATCH('Select LAs'!$M4,'EY Data'!$B:$B, 0))=\"\",\"-\",ROUND(INDEX('EY Data'!DQ:DQ, MATCH('Select LAs'!$M4,'EY Data'!$B:$B, 0)),0)))","v":5736603},{"$f":"IF('Select LAs'!$M4=0,\"-\",IF(INDEX('EY Data'!DS:DS, MATCH('Select LAs'!$M4,'EY Data'!$B:$B, 0))=\"\",\"-\",ROUND(INDEX('EY Data'!DS:DS, MATCH('Select LAs'!$M4,'EY Data'!$B:$B, 0)),0)))","v":5980},{"$f":"IF('Select LAs'!$M4=0,\"-\",IF(INDEX('EY Data'!DX:DX, MATCH('Select LAs'!$M4,'EY Data'!$B:$B, 0))=\"\",\"-\",ROUND(INDEX('EY Data'!DX:DX, MATCH('Select LAs'!$M4,'EY Data'!$B:$B, 0)),0)))","v":0},{"$f":"IF('Select LAs'!$M4=0,\"-\",IF(INDEX('EY Data'!DY:DY, MATCH('Select LAs'!$M4,'EY Data'!$B:$B, 0))=\"\",\"-\",ROUND(INDEX('EY Data'!DY:DY, MATCH('Select LAs'!$M4,'EY Data'!$B:$B, 0)),0)))","v":239245}]
[{"$f":"'Select LAs'!P33","v":0},{"$f":"'Select LAs'!Q33","v":"No LA selected"},null,{"$f":"IF('Select LAs'!$M5=0,\"-\",IF(INDEX('EY Data'!X:X, MATCH('Select LAs'!$M5,'EY Data'!$B:$B, 0))=\"\",\"-\",ROUND(INDEX('EY Data'!X:X, MATCH('Select LAs'!$M5,'EY Data'!$B:$B, 0)),0)))","v":22812189},{"$f":"IF('Select LAs'!$M5=0,\"-\",IF(INDEX('EY Data'!Z:Z, MATCH('Select LAs'!$M5,'EY Data'!$B:$B, 0))=\"\",\"-\",ROUND(INDEX('EY Data'!Z:Z, MATCH('Select LAs'!$M5,'EY Data'!$B:$B, 0)),0)))","v":507607},{"$f":"IF('Select LAs'!$M5=0,\"-\",IF(INDEX('EY Data'!AE:AE, MATCH('Select LAs'!$M5,'EY Data'!$B:$B, 0))=\"\",\"-\",ROUND(INDEX('EY Data'!AE:AE, MATCH('Select LAs'!$M5,'EY Data'!$B:$B, 0)),0)))","v":0},{"$f":"IF('Select LAs'!$M5=0,\"-\",IF(INDEX('EY Data'!AF:AF, MATCH('Select LAs'!$M5,'EY Data'!$B:$B, 0))=\"\",\"-\",ROUND(INDEX('EY Data'!AF:AF, MATCH('Select LAs'!$M5,'EY Data'!$B:$B, 0)),0)))","v":731600},{"$f":"IF('Select LAs'!$M5=0,\"-\",IF(INDEX('EY Data'!BE:BE, MATCH('Select LAs'!$M5,'EY Data'!$B:$B, 0))=\"\",\"-\",ROUND(INDEX('EY Data'!BE:BE, MATCH('Select LAs'!$M5,'EY Data'!$B:$B, 0)),0)))","v":7511086},{"$f":"IF('Select LAs'!$M5=0,\"-\",IF(INDEX('EY Data'!BG:BG, MATCH('Select LAs'!$M5,'EY Data'!$B:$B, 0))=\"\",\"-\",ROUND(INDEX('EY Data'!BG:BG, MATCH('Select LAs'!$M5,'EY Data'!$B:$B, 0)),0)))","v":172393},{"$f":"IF('Select LAs'!$M5=0,\"-\",IF(INDEX('EY Data'!BL:BL, MATCH('Select LAs'!$M5,'EY Data'!$B:$B, 0))=\"\",\"-\",ROUND(INDEX('EY Data'!BL:BL, MATCH('Select LAs'!$M5,'EY Data'!$B:$B, 0)),0)))","v":0},{"$f":"IF('Select LAs'!$M5=0,\"-\",IF(INDEX('EY Data'!BM:BM, MATCH('Select LAs'!$M5,'EY Data'!$B:$B, 0))=\"\",\"-\",ROUND(INDEX('EY Data'!BM:BM, MATCH('Select LAs'!$M5,'EY Data'!$B:$B, 0)),0)))","v":123300},{"$f":"IF('Select LAs'!$M5=0,\"-\",IF(INDEX('EY Data'!CK:CK, MATCH('Select LAs'!$M5,'EY Data'!$B:$B, 0))=\"\",\"-\",ROUND(INDEX('EY Data'!CK:CK, MATCH('Select LAs'!$M5,'EY Data'!$B:$B, 0)),0)))","v":8185939},{"$f":"IF('Select LAs'!$M5=0,\"-\",IF(INDEX('EY Data'!CM:CM, MATCH('Select LAs'!$M5,'EY Data'!$B:$B, 0))=\"\",\"-\",ROUND(INDEX('EY Data'!CM:CM, MATCH('Select LAs'!$M5,'EY Data'!$B:$B, 0)),0)))","v":400000},{"$f":"IF('Select LAs'!$M5=0,\"-\",IF(INDEX('EY Data'!CR:CR, MATCH('Select LAs'!$M5,'EY Data'!$B:$B, 0))=\"\",\"-\",ROUND(INDEX('EY Data'!CR:CR, MATCH('Select LAs'!$M5,'EY Data'!$B:$B, 0)),0)))","v":0},{"$f":"IF('Select LAs'!$M5=0,\"-\",IF(INDEX('EY Data'!CS:CS, MATCH('Select LAs'!$M5,'EY Data'!$B:$B, 0))=\"\",\"-\",ROUND(INDEX('EY Data'!CS:CS, MATCH('Select LAs'!$M5,'EY Data'!$B:$B, 0)),0)))","v":273500},{"$f":"IF('Select LAs'!$M5=0,\"-\",IF(INDEX('EY Data'!DQ:DQ, MATCH('Select LAs'!$M5,'EY Data'!$B:$B, 0))=\"\",\"-\",ROUND(INDEX('EY Data'!DQ:DQ, MATCH('Select LAs'!$M5,'EY Data'!$B:$B, 0)),0)))","v":12495803},{"$f":"IF('Select LAs'!$M5=0,\"-\",IF(INDEX('EY Data'!DS:DS, MATCH('Select LAs'!$M5,'EY Data'!$B:$B, 0))=\"\",\"-\",ROUND(INDEX('EY Data'!DS:DS, MATCH('Select LAs'!$M5,'EY Data'!$B:$B, 0)),0)))","v":286500},{"$f":"IF('Select LAs'!$M5=0,\"-\",IF(INDEX('EY Data'!DX:DX, MATCH('Select LAs'!$M5,'EY Data'!$B:$B, 0))=\"\",\"-\",ROUND(INDEX('EY Data'!DX:DX, MATCH('Select LAs'!$M5,'EY Data'!$B:$B, 0)),0)))","v":0},{"$f":"IF('Select LAs'!$M5=0,\"-\",IF(INDEX('EY Data'!DY:DY, MATCH('Select LAs'!$M5,'EY Data'!$B:$B, 0))=\"\",\"-\",ROUND(INDEX('EY Data'!DY:DY, MATCH('Select LAs'!$M5,'EY Data'!$B:$B, 0)),0)))","v":405900}]
[{"$f":"'Select LAs'!P34","v":0},{"$f":"'Select LAs'!Q34","v":"No LA selected"},null,{"$f":"IF('Select LAs'!$M6=0,\"-\",IF(INDEX('EY Data'!X:X, MATCH('Select LAs'!$M6,'EY Data'!$B:$B, 0))=\"\",\"-\",ROUND(INDEX('EY Data'!X:X, MATCH('Select LAs'!$M6,'EY Data'!$B:$B, 0)),0)))","v":16067345},{"$f":"IF('Select LAs'!$M6=0,\"-\",IF(INDEX('EY Data'!Z:Z, MATCH('Select LAs'!$M6,'EY Data'!$B:$B, 0))=\"\",\"-\",ROUND(INDEX('EY Data'!Z:Z, MATCH('Select LAs'!$M6,'EY Data'!$B:$B, 0)),0)))","v":167000},{"$f":"IF('Select LAs'!$M6=0,\"-\",IF(INDEX('EY Data'!AE:AE, MATCH('Select LAs'!$M6,'EY Data'!$B:$B, 0))=\"\",\"-\",ROUND(INDEX('EY Data'!AE:AE, MATCH('Select LAs'!$M6,'EY Data'!$B:$B, 0)),0)))","v":165032},{"$f":"IF('Select LAs'!$M6=0,\"-\",IF(INDEX('EY Data'!AF:AF, MATCH('Select LAs'!$M6,'EY Data'!$B:$B, 0))=\"\",\"-\",ROUND(INDEX('EY Data'!AF:AF, MATCH('Select LAs'!$M6,'EY Data'!$B:$B, 0)),0)))","v":668518},{"$f":"IF('Select LAs'!$M6=0,\"-\",IF(INDEX('EY Data'!BE:BE, MATCH('Select LAs'!$M6,'EY Data'!$B:$B, 0))=\"\",\"-\",ROUND(INDEX('EY Data'!BE:BE, MATCH('Select LAs'!$M6,'EY Data'!$B:$B, 0)),0)))","v":3815851},{"$f":"IF('Select LAs'!$M6=0,\"-\",IF(INDEX('EY Data'!BG:BG, MATCH('Select LAs'!$M6,'EY Data'!$B:$B, 0))=\"\",\"-\",ROUND(INDEX('EY Data'!BG:BG, MATCH('Select LAs'!$M6,'EY Data'!$B:$B, 0)),0)))","v":12000},{"$f":"IF('Select LAs'!$M6=0,\"-\",IF(INDEX('EY Data'!BL:BL, MATCH('Select LAs'!$M6,'EY Data'!$B:$B, 0))=\"\",\"-\",ROUND(INDEX('EY Data'!BL:BL, MATCH('Select LAs'!$M6,'EY Data'!$B:$B, 0)),0)))","v":15321},{"$f":"IF('Select LAs'!$M6=0,\"-\",IF(INDEX('EY Data'!BM:BM, MATCH('Select LAs'!$M6,'EY Data'!$B:$B, 0))=\"\",\"-\",ROUND(INDEX('EY Data'!BM:BM, MATCH('Select LAs'!$M6,'EY Data'!$B:$B, 0)),0)))","v":158883},{"$f":"IF('Select LAs'!$M6=0,\"-\",IF(INDEX('EY Data'!CK:CK, MATCH('Select LAs'!$M6,'EY Data'!$B:$B, 0))=\"\",\"-\",ROUND(INDEX('EY Data'!CK:CK, MATCH('Select LAs'!$M6,'EY Data'!$B:$B, 0)),0)))","v":5657583},{"$f":"IF('Select LAs'!$M6=0,\"-\",IF(INDEX('EY Data'!CM:CM, MATCH('Select LAs'!$M6,'EY Data'!$B:$B, 0))=\"\",\"-\",ROUND(INDEX('EY Data'!CM:CM, MATCH('Select LAs'!$M6,'EY Data'!$B:$B, 0)),0)))","v":78000},{"$f":"IF('Select LAs'!$M6=0,\"-\",IF(INDEX('EY Data'!CR:CR, MATCH('Select LAs'!$M6,'EY Data'!$B:$B, 0))=\"\",\"-\",ROUND(INDEX('EY Data'!CR:CR, MATCH('Select LAs'!$M6,'EY Data'!$B:$B, 0)),0)))","v":136667},{"$f":"IF('Select LAs'!$M6=0,\"-\",IF(INDEX('EY Data'!CS:CS, MATCH('Select LAs'!$M6,'EY Data'!$B:$B, 0))=\"\",\"-\",ROUND(INDEX('EY Data'!CS:CS, MATCH('Select LAs'!$M6,'EY Data'!$B:$B, 0)),0)))","v":214676},{"$f":"IF('Select LAs'!$M6=0,\"-\",IF(INDEX('EY Data'!DQ:DQ, MATCH('Select LAs'!$M6,'EY Data'!$B:$B, 0))=\"\",\"-\",ROUND(INDEX('EY Data'!DQ:DQ, MATCH('Select LAs'!$M6,'EY Data'!$B:$B, 0)),0)))","v":8616369},{"$f":"IF('Select LAs'!$M6=0,\"-\",IF(INDEX('EY Data'!DS:DS, MATCH('Select LAs'!$M6,'EY Data'!$B:$B, 0))=\"\",\"-\",ROUND(INDEX('EY Data'!DS:DS, MATCH('Select LAs'!$M6,'EY Data'!$B:$B, 0)),0)))","v":9100},{"$f":"IF('Select LAs'!$M6=0,\"-\",IF(INDEX('EY Data'!DX:DX, MATCH('Select LAs'!$M6,'EY Data'!$B:$B, 0))=\"\",\"-\",ROUND(INDEX('EY Data'!DX:DX, MATCH('Select LAs'!$M6,'EY Data'!$B:$B, 0)),0)))","v":88420},{"$f":"IF('Select LAs'!$M6=0,\"-\",IF(INDEX('EY Data'!DY:DY, MATCH('Select LAs'!$M6,'EY Data'!$B:$B, 0))=\"\",\"-\",ROUND(INDEX('EY Data'!DY:DY, MATCH('Select LAs'!$M6,'EY Data'!$B:$B, 0)),0)))","v":363079}]
[{"$f":"'Select LAs'!P35","v":0},{"$f":"'Select LAs'!Q35","v":"No LA selected"},null,{"$f":"IF('Select LAs'!$M7=0,\"-\",IF(INDEX('EY Data'!X:X, MATCH('Select LAs'!$M7,'EY Data'!$B:$B, 0))=\"\",\"-\",ROUND(INDEX('EY Data'!X:X, MATCH('Select LAs'!$M7,'EY Data'!$B:$B, 0)),0)))","v":38784173},{"$f":"IF('Select LAs'!$M7=0,\"-\",IF(INDEX('EY Data'!Z:Z, MATCH('Select LAs'!$M7,'EY Data'!$B:$B, 0))=\"\",\"-\",ROUND(INDEX('EY Data'!Z:Z, MATCH('Select LAs'!$M7,'EY Data'!$B:$B, 0)),0)))","v":747035},{"$f":"IF('Select LAs'!$M7=0,\"-\",IF(INDEX('EY Data'!AE:AE, MATCH('Select LAs'!$M7,'EY Data'!$B:$B, 0))=\"\",\"-\",ROUND(INDEX('EY Data'!AE:AE, MATCH('Select LAs'!$M7,'EY Data'!$B:$B, 0)),0)))","v":0},{"$f":"IF('Select LAs'!$M7=0,\"-\",IF(INDEX('EY Data'!AF:AF, MATCH('Select LAs'!$M7,'EY Data'!$B:$B, 0))=\"\",\"-\",ROUND(INDEX('EY Data'!AF:AF, MATCH('Select LAs'!$M7,'EY Data'!$B:$B, 0)),0)))","v":474715},{"$f":"IF('Select LAs'!$M7=0,\"-\",IF(INDEX('EY Data'!BE:BE, MATCH('Select LAs'!$M7,'EY Data'!$B:$B, 0))=\"\",\"-\",ROUND(INDEX('EY Data'!BE:BE, MATCH('Select LAs'!$M7,'EY Data'!$B:$B, 0)),0)))","v":8799206},{"$f":"IF('Select LAs'!$M7=0,\"-\",IF(INDEX('EY Data'!BG:BG, MATCH('Select LAs'!$M7,'EY Data'!$B:$B, 0))=\"\",\"-\",ROUND(INDEX('EY Data'!BG:BG, MATCH('Select LAs'!$M7,'EY Data'!$B:$B, 0)),0)))","v":150000},{"$f":"IF('Select LAs'!$M7=0,\"-\",IF(INDEX('EY Data'!BL:BL, MATCH('Select LAs'!$M7,'EY Data'!$B:$B, 0))=\"\",\"-\",ROUND(INDEX('EY Data'!BL:BL, MATCH('Select LAs'!$M7,'EY Data'!$B:$B, 0)),0)))","v":50580},{"$f":"IF('Select LAs'!$M7=0,\"-\",IF(INDEX('EY Data'!BM:BM, MATCH('Select LAs'!$M7,'EY Data'!$B:$B, 0))=\"\",\"-\",ROUND(INDEX('EY Data'!BM:BM, MATCH('Select LAs'!$M7,'EY Data'!$B:$B, 0)),0)))","v":62326},{"$f":"IF('Select LAs'!$M7=0,\"-\",IF(INDEX('EY Data'!CK:CK, MATCH('Select LAs'!$M7,'EY Data'!$B:$B, 0))=\"\",\"-\",ROUND(INDEX('EY Data'!CK:CK, MATCH('Select LAs'!$M7,'EY Data'!$B:$B, 0)),0)))","v":11728954},{"$f":"IF('Select LAs'!$M7=0,\"-\",IF(INDEX('EY Data'!CM:CM, MATCH('Select LAs'!$M7,'EY Data'!$B:$B, 0))=\"\",\"-\",ROUND(INDEX('EY Data'!CM:CM, MATCH('Select LAs'!$M7,'EY Data'!$B:$B, 0)),0)))","v":200000},{"$f":"IF('Select LAs'!$M7=0,\"-\",IF(INDEX('EY Data'!CR:CR, MATCH('Select LAs'!$M7,'EY Data'!$B:$B, 0))=\"\",\"-\",ROUND(INDEX('EY Data'!CR:CR, MATCH('Select LAs'!$M7,'EY Data'!$B:$B, 0)),0)))","v":195930},{"$f":"IF('Select LAs'!$M7=0,\"-\",IF(INDEX('EY Data'!CS:CS, MATCH('Select LAs'!$M7,'EY Data'!$B:$B, 0))=\"\",\"-\",ROUND(INDEX('EY Data'!CS:CS, MATCH('Select LAs'!$M7,'EY Data'!$B:$B, 0)),0)))","v":83972},{"$f":"IF('Select LAs'!$M7=0,\"-\",IF(INDEX('EY Data'!DQ:DQ, MATCH('Select LAs'!$M7,'EY Data'!$B:$B, 0))=\"\",\"-\",ROUND(INDEX('EY Data'!DQ:DQ, MATCH('Select LAs'!$M7,'EY Data'!$B:$B, 0)),0)))","v":17713154},{"$f":"IF('Select LAs'!$M7=0,\"-\",IF(INDEX('EY Data'!DS:DS, MATCH('Select LAs'!$M7,'EY Data'!$B:$B, 0))=\"\",\"-\",ROUND(INDEX('EY Data'!DS:DS, MATCH('Select LAs'!$M7,'EY Data'!$B:$B, 0)),0)))","v":200000},{"$f":"IF('Select LAs'!$M7=0,\"-\",IF(INDEX('EY Data'!DX:DX, MATCH('Select LAs'!$M7,'EY Data'!$B:$B, 0))=\"\",\"-\",ROUND(INDEX('EY Data'!DX:DX, MATCH('Select LAs'!$M7,'EY Data'!$B:$B, 0)),0)))","v":199390},{"$f":"IF('Select LAs'!$M7=0,\"-\",IF(INDEX('EY Data'!DY:DY, MATCH('Select LAs'!$M7,'EY Data'!$B:$B, 0))=\"\",\"-\",ROUND(INDEX('EY Data'!DY:DY, MATCH('Select LAs'!$M7,'EY Data'!$B:$B, 0)),0)))","v":91466}]
[{"$f":"'Select LAs'!P36","v":0},{"$f":"'Select LAs'!Q36","v":"No LA selected"},null,{"$f":"IF('Select LAs'!$M8=0,\"-\",IF(INDEX('EY Data'!X:X, MATCH('Select LAs'!$M8,'EY Data'!$B:$B, 0))=\"\",\"-\",ROUND(INDEX('EY Data'!X:X, MATCH('Select LAs'!$M8,'EY Data'!$B:$B, 0)),0)))","v":20610141},{"$f":"IF('Select LAs'!$M8=0,\"-\",IF(INDEX('EY Data'!Z:Z, MATCH('Select LAs'!$M8,'EY Data'!$B:$B, 0))=\"\",\"-\",ROUND(INDEX('EY Data'!Z:Z, MATCH('Select LAs'!$M8,'EY Data'!$B:$B, 0)),0)))","v":65000},{"$f":"IF('Select LAs'!$M8=0,\"-\",IF(INDEX('EY Data'!AE:AE, MATCH('Select LAs'!$M8,'EY Data'!$B:$B, 0))=\"\",\"-\",ROUND(INDEX('EY Data'!AE:AE, MATCH('Select LAs'!$M8,'EY Data'!$B:$B, 0)),0)))","v":0},{"$f":"IF('Select LAs'!$M8=0,\"-\",IF(INDEX('EY Data'!AF:AF, MATCH('Select LAs'!$M8,'EY Data'!$B:$B, 0))=\"\",\"-\",ROUND(INDEX('EY Data'!AF:AF, MATCH('Select LAs'!$M8,'EY Data'!$B:$B, 0)),0)))","v":578469},{"$f":"IF('Select LAs'!$M8=0,\"-\",IF(INDEX('EY Data'!BE:BE, MATCH('Select LAs'!$M8,'EY Data'!$B:$B, 0))=\"\",\"-\",ROUND(INDEX('EY Data'!BE:BE, MATCH('Select LAs'!$M8,'EY Data'!$B:$B, 0)),0)))","v":4500768},{"$f":"IF('Select LAs'!$M8=0,\"-\",IF(INDEX('EY Data'!BG:BG, MATCH('Select LAs'!$M8,'EY Data'!$B:$B, 0))=\"\",\"-\",ROUND(INDEX('EY Data'!BG:BG, MATCH('Select LAs'!$M8,'EY Data'!$B:$B, 0)),0)))","v":15000},{"$f":"IF('Select LAs'!$M8=0,\"-\",IF(INDEX('EY Data'!BL:BL, MATCH('Select LAs'!$M8,'EY Data'!$B:$B, 0))=\"\",\"-\",ROUND(INDEX('EY Data'!BL:BL, MATCH('Select LAs'!$M8,'EY Data'!$B:$B, 0)),0)))","v":0},{"$f":"IF('Select LAs'!$M8=0,\"-\",IF(INDEX('EY Data'!BM:BM, MATCH('Select LAs'!$M8,'EY Data'!$B:$B, 0))=\"\",\"-\",ROUND(INDEX('EY Data'!BM:BM, MATCH('Select LAs'!$M8,'EY Data'!$B:$B, 0)),0)))","v":172644},{"$f":"IF('Select LAs'!$M8=0,\"-\",IF(INDEX('EY Data'!CK:CK, MATCH('Select LAs'!$M8,'EY Data'!$B:$B, 0))=\"\",\"-\",ROUND(INDEX('EY Data'!CK:CK, MATCH('Select LAs'!$M8,'EY Data'!$B:$B, 0)),0)))","v":5007396},{"$f":"IF('Select LAs'!$M8=0,\"-\",IF(INDEX('EY Data'!CM:CM, MATCH('Select LAs'!$M8,'EY Data'!$B:$B, 0))=\"\",\"-\",ROUND(INDEX('EY Data'!CM:CM, MATCH('Select LAs'!$M8,'EY Data'!$B:$B, 0)),0)))","v":15000},{"$f":"IF('Select LAs'!$M8=0,\"-\",IF(INDEX('EY Data'!CR:CR, MATCH('Select LAs'!$M8,'EY Data'!$B:$B, 0))=\"\",\"-\",ROUND(INDEX('EY Data'!CR:CR, MATCH('Select LAs'!$M8,'EY Data'!$B:$B, 0)),0)))","v":0},{"$f":"IF('Select LAs'!$M8=0,\"-\",IF(INDEX('EY Data'!CS:CS, MATCH('Select LAs'!$M8,'EY Data'!$B:$B, 0))=\"\",\"-\",ROUND(INDEX('EY Data'!CS:CS, MATCH('Select LAs'!$M8,'EY Data'!$B:$B, 0)),0)))","v":193767},{"$f":"IF('Select LAs'!$M8=0,\"-\",IF(INDEX('EY Data'!DQ:DQ, MATCH('Select LAs'!$M8,'EY Data'!$B:$B, 0))=\"\",\"-\",ROUND(INDEX('EY Data'!DQ:DQ, MATCH('Select LAs'!$M8,'EY Data'!$B:$B, 0)),0)))","v":7455457},{"$f":"IF('Select LAs'!$M8=0,\"-\",IF(INDEX('EY Data'!DS:DS, MATCH('Select LAs'!$M8,'EY Data'!$B:$B, 0))=\"\",\"-\",ROUND(INDEX('EY Data'!DS:DS, MATCH('Select LAs'!$M8,'EY Data'!$B:$B, 0)),0)))","v":5000},{"$f":"IF('Select LAs'!$M8=0,\"-\",IF(INDEX('EY Data'!DX:DX, MATCH('Select LAs'!$M8,'EY Data'!$B:$B, 0))=\"\",\"-\",ROUND(INDEX('EY Data'!DX:DX, MATCH('Select LAs'!$M8,'EY Data'!$B:$B, 0)),0)))","v":0},{"$f":"IF('Select LAs'!$M8=0,\"-\",IF(INDEX('EY Data'!DY:DY, MATCH('Select LAs'!$M8,'EY Data'!$B:$B, 0))=\"\",\"-\",ROUND(INDEX('EY Data'!DY:DY, MATCH('Select LAs'!$M8,'EY Data'!$B:$B, 0)),0)))","v":305702}]
[{"$f":"'Select LAs'!P37","v":0},{"$f":"'Select LAs'!Q37","v":"No LA selected"},null,{"$f":"IF('Select LAs'!$M9=0,\"-\",IF(INDEX('EY Data'!X:X, MATCH('Select LAs'!$M9,'EY Data'!$B:$B, 0))=\"\",\"-\",ROUND(INDEX('EY Data'!X:X, MATCH('Select LAs'!$M9,'EY Data'!$B:$B, 0)),0)))","v":22275706},{"$f":"IF('Select LAs'!$M9=0,\"-\",IF(INDEX('EY Data'!Z:Z, MATCH('Select LAs'!$M9,'EY Data'!$B:$B, 0))=\"\",\"-\",ROUND(INDEX('EY Data'!Z:Z, MATCH('Select LAs'!$M9,'EY Data'!$B:$B, 0)),0)))","v":484978},{"$f":"IF('Select LAs'!$M9=0,\"-\",IF(INDEX('EY Data'!AE:AE, MATCH('Select LAs'!$M9,'EY Data'!$B:$B, 0))=\"\",\"-\",ROUND(INDEX('EY Data'!AE:AE, MATCH('Select LAs'!$M9,'EY Data'!$B:$B, 0)),0)))","v":13703},{"$f":"IF('Select LAs'!$M9=0,\"-\",IF(INDEX('EY Data'!AF:AF, MATCH('Select LAs'!$M9,'EY Data'!$B:$B, 0))=\"\",\"-\",ROUND(INDEX('EY Data'!AF:AF, MATCH('Select LAs'!$M9,'EY Data'!$B:$B, 0)),0)))","v":540287},{"$f":"IF('Select LAs'!$M9=0,\"-\",IF(INDEX('EY Data'!BE:BE, MATCH('Select LAs'!$M9,'EY Data'!$B:$B, 0))=\"\",\"-\",ROUND(INDEX('EY Data'!BE:BE, MATCH('Select LAs'!$M9,'EY Data'!$B:$B, 0)),0)))","v":3354269},{"$f":"IF('Select LAs'!$M9=0,\"-\",IF(INDEX('EY Data'!BG:BG, MATCH('Select LAs'!$M9,'EY Data'!$B:$B, 0))=\"\",\"-\",ROUND(INDEX('EY Data'!BG:BG, MATCH('Select LAs'!$M9,'EY Data'!$B:$B, 0)),0)))","v":108745},{"$f":"IF('Select LAs'!$M9=0,\"-\",IF(INDEX('EY Data'!BL:BL, MATCH('Select LAs'!$M9,'EY Data'!$B:$B, 0))=\"\",\"-\",ROUND(INDEX('EY Data'!BL:BL, MATCH('Select LAs'!$M9,'EY Data'!$B:$B, 0)),0)))","v":0},{"$f":"IF('Select LAs'!$M9=0,\"-\",IF(INDEX('EY Data'!BM:BM, MATCH('Select LAs'!$M9,'EY Data'!$B:$B, 0))=\"\",\"-\",ROUND(INDEX('EY Data'!BM:BM, MATCH('Select LAs'!$M9,'EY Data'!$B:$B, 0)),0)))","v":110688},{"$f":"IF('Select LAs'!$M9=0,\"-\",IF(INDEX('EY Data'!CK:CK, MATCH('Select LAs'!$M9,'EY Data'!$B:$B, 0))=\"\",\"-\",ROUND(INDEX('EY Data'!CK:CK, MATCH('Select LAs'!$M9,'EY Data'!$B:$B, 0)),0)))","v":4557492},{"$f":"IF('Select LAs'!$M9=0,\"-\",IF(INDEX('EY Data'!CM:CM, MATCH('Select LAs'!$M9,'EY Data'!$B:$B, 0))=\"\",\"-\",ROUND(INDEX('EY Data'!CM:CM, MATCH('Select LAs'!$M9,'EY Data'!$B:$B, 0)),0)))","v":129862},{"$f":"IF('Select LAs'!$M9=0,\"-\",IF(INDEX('EY Data'!CR:CR, MATCH('Select LAs'!$M9,'EY Data'!$B:$B, 0))=\"\",\"-\",ROUND(INDEX('EY Data'!CR:CR, MATCH('Select LAs'!$M9,'EY Data'!$B:$B, 0)),0)))","v":6798},{"$f":"IF('Select LAs'!$M9=0,\"-\",IF(INDEX('EY Data'!CS:CS, MATCH('Select LAs'!$M9,'EY Data'!$B:$B, 0))=\"\",\"-\",ROUND(INDEX('EY Data'!CS:CS, MATCH('Select LAs'!$M9,'EY Data'!$B:$B, 0)),0)))","v":202255},{"$f":"IF('Select LAs'!$M9=0,\"-\",IF(INDEX('EY Data'!DQ:DQ, MATCH('Select LAs'!$M9,'EY Data'!$B:$B, 0))=\"\",\"-\",ROUND(INDEX('EY Data'!DQ:DQ, MATCH('Select LAs'!$M9,'EY Data'!$B:$B, 0)),0)))","v":5659412},{"$f":"IF('Select LAs'!$M9=0,\"-\",IF(INDEX('EY Data'!DS:DS, MATCH('Select LAs'!$M9,'EY Data'!$B:$B, 0))=\"\",\"-\",ROUND(INDEX('EY Data'!DS:DS, MATCH('Select LAs'!$M9,'EY Data'!$B:$B, 0)),0)))","v":35000},{"$f":"IF('Select LAs'!$M9=0,\"-\",IF(INDEX('EY Data'!DX:DX, MATCH('Select LAs'!$M9,'EY Data'!$B:$B, 0))=\"\",\"-\",ROUND(INDEX('EY Data'!DX:DX, MATCH('Select LAs'!$M9,'EY Data'!$B:$B, 0)),0)))","v":4094},{"$f":"IF('Select LAs'!$M9=0,\"-\",IF(INDEX('EY Data'!DY:DY, MATCH('Select LAs'!$M9,'EY Data'!$B:$B, 0))=\"\",\"-\",ROUND(INDEX('EY Data'!DY:DY, MATCH('Select LAs'!$M9,'EY Data'!$B:$B, 0)),0)))","v":300798}]
[{"$f":"'Select LAs'!P38","v":0},{"$f":"'Select LAs'!Q38","v":"No LA selected"},null,{"$f":"IF('Select LAs'!$M10=0,\"-\",IF(INDEX('EY Data'!X:X, MATCH('Select LAs'!$M10,'EY Data'!$B:$B, 0))=\"\",\"-\",ROUND(INDEX('EY Data'!X:X, MATCH('Select LAs'!$M10,'EY Data'!$B:$B, 0)),0)))","v":13080682},{"$f":"IF('Select LAs'!$M10=0,\"-\",IF(INDEX('EY Data'!Z:Z, MATCH('Select LAs'!$M10,'EY Data'!$B:$B, 0))=\"\",\"-\",ROUND(INDEX('EY Data'!Z:Z, MATCH('Select LAs'!$M10,'EY Data'!$B:$B, 0)),0)))","v":120000},{"$f":"IF('Select LAs'!$M10=0,\"-\",IF(INDEX('EY Data'!AE:AE, MATCH('Select LAs'!$M10,'EY Data'!$B:$B, 0))=\"\",\"-\",ROUND(INDEX('EY Data'!AE:AE, MATCH('Select LAs'!$M10,'EY Data'!$B:$B, 0)),0)))","v":325000},{"$f":"IF('Select LAs'!$M10=0,\"-\",IF(INDEX('EY Data'!AF:AF, MATCH('Select LAs'!$M10,'EY Data'!$B:$B, 0))=\"\",\"-\",ROUND(INDEX('EY Data'!AF:AF, MATCH('Select LAs'!$M10,'EY Data'!$B:$B, 0)),0)))","v":735985},{"$f":"IF('Select LAs'!$M10=0,\"-\",IF(INDEX('EY Data'!BE:BE, MATCH('Select LAs'!$M10,'EY Data'!$B:$B, 0))=\"\",\"-\",ROUND(INDEX('EY Data'!BE:BE, MATCH('Select LAs'!$M10,'EY Data'!$B:$B, 0)),0)))","v":3261050},{"$f":"IF('Select LAs'!$M10=0,\"-\",IF(INDEX('EY Data'!BG:BG, MATCH('Select LAs'!$M10,'EY Data'!$B:$B, 0))=\"\",\"-\",ROUND(INDEX('EY Data'!BG:BG, MATCH('Select LAs'!$M10,'EY Data'!$B:$B, 0)),0)))","v":30000},{"$f":"IF('Select LAs'!$M10=0,\"-\",IF(INDEX('EY Data'!BL:BL, MATCH('Select LAs'!$M10,'EY Data'!$B:$B, 0))=\"\",\"-\",ROUND(INDEX('EY Data'!BL:BL, MATCH('Select LAs'!$M10,'EY Data'!$B:$B, 0)),0)))","v":82000},{"$f":"IF('Select LAs'!$M10=0,\"-\",IF(INDEX('EY Data'!BM:BM, MATCH('Select LAs'!$M10,'EY Data'!$B:$B, 0))=\"\",\"-\",ROUND(INDEX('EY Data'!BM:BM, MATCH('Select LAs'!$M10,'EY Data'!$B:$B, 0)),0)))","v":99319},{"$f":"IF('Select LAs'!$M10=0,\"-\",IF(INDEX('EY Data'!CK:CK, MATCH('Select LAs'!$M10,'EY Data'!$B:$B, 0))=\"\",\"-\",ROUND(INDEX('EY Data'!CK:CK, MATCH('Select LAs'!$M10,'EY Data'!$B:$B, 0)),0)))","v":6858783},{"$f":"IF('Select LAs'!$M10=0,\"-\",IF(INDEX('EY Data'!CM:CM, MATCH('Select LAs'!$M10,'EY Data'!$B:$B, 0))=\"\",\"-\",ROUND(INDEX('EY Data'!CM:CM, MATCH('Select LAs'!$M10,'EY Data'!$B:$B, 0)),0)))","v":30000},{"$f":"IF('Select LAs'!$M10=0,\"-\",IF(INDEX('EY Data'!CR:CR, MATCH('Select LAs'!$M10,'EY Data'!$B:$B, 0))=\"\",\"-\",ROUND(INDEX('EY Data'!CR:CR, MATCH('Select LAs'!$M10,'EY Data'!$B:$B, 0)),0)))","v":173000},{"$f":"IF('Select LAs'!$M10=0,\"-\",IF(INDEX('EY Data'!CS:CS, MATCH('Select LAs'!$M10,'EY Data'!$B:$B, 0))=\"\",\"-\",ROUND(INDEX('EY Data'!CS:CS, MATCH('Select LAs'!$M10,'EY Data'!$B:$B, 0)),0)))","v":108295},{"$f":"IF('Select LAs'!$M10=0,\"-\",IF(INDEX('EY Data'!DQ:DQ, MATCH('Select LAs'!$M10,'EY Data'!$B:$B, 0))=\"\",\"-\",ROUND(INDEX('EY Data'!DQ:DQ, MATCH('Select LAs'!$M10,'EY Data'!$B:$B, 0)),0)))","v":8738407},{"$f":"IF('Select LAs'!$M10=0,\"-\",IF(INDEX('EY Data'!DS:DS, MATCH('Select LAs'!$M10,'EY Data'!$B:$B, 0))=\"\",\"-\",ROUND(INDEX('EY Data'!DS:DS, MATCH('Select LAs'!$M10,'EY Data'!$B:$B, 0)),0)))","v":20000},{"$f":"IF('Select LAs'!$M10=0,\"-\",IF(INDEX('EY Data'!DX:DX, MATCH('Select LAs'!$M10,'EY Data'!$B:$B, 0))=\"\",\"-\",ROUND(INDEX('EY Data'!DX:DX, MATCH('Select LAs'!$M10,'EY Data'!$B:$B, 0)),0)))","v":220000},{"$f":"IF('Select LAs'!$M10=0,\"-\",IF(INDEX('EY Data'!DY:DY, MATCH('Select LAs'!$M10,'EY Data'!$B:$B, 0))=\"\",\"-\",ROUND(INDEX('EY Data'!DY:DY, MATCH('Select LAs'!$M10,'EY Data'!$B:$B, 0)),0)))","v":70390}]
[{"$f":"'Select LAs'!P39","v":0},{"$f":"'Select LAs'!Q39","v":"No LA selected"},null,{"$f":"IF('Select LAs'!$M11=0,\"-\",IF(INDEX('EY Data'!X:X, MATCH('Select LAs'!$M11,'EY Data'!$B:$B, 0))=\"\",\"-\",ROUND(INDEX('EY Data'!X:X, MATCH('Select LAs'!$M11,'EY Data'!$B:$B, 0)),0)))","v":22571767},{"$f":"IF('Select LAs'!$M11=0,\"-\",IF(INDEX('EY Data'!Z:Z, MATCH('Select LAs'!$M11,'EY Data'!$B:$B, 0))=\"\",\"-\",ROUND(INDEX('EY Data'!Z:Z, MATCH('Select LAs'!$M11,'EY Data'!$B:$B, 0)),0)))","v":542400},{"$f":"IF('Select LAs'!$M11=0,\"-\",IF(INDEX('EY Data'!AE:AE, MATCH('Select LAs'!$M11,'EY Data'!$B:$B, 0))=\"\",\"-\",ROUND(INDEX('EY Data'!AE:AE, MATCH('Select LAs'!$M11,'EY Data'!$B:$B, 0)),0)))","v":0},{"$f":"IF('Select LAs'!$M11=0,\"-\",IF(INDEX('EY Data'!AF:AF, MATCH('Select LAs'!$M11,'EY Data'!$B:$B, 0))=\"\",\"-\",ROUND(INDEX('EY Data'!AF:AF, MATCH('Select LAs'!$M11,'EY Data'!$B:$B, 0)),0)))","v":962112},{"$f":"IF('Select LAs'!$M11=0,\"-\",IF(INDEX('EY Data'!BE:BE, MATCH('Select LAs'!$M11,'EY Data'!$B:$B, 0))=\"\",\"-\",ROUND(INDEX('EY Data'!BE:BE, MATCH('Select LAs'!$M11,'EY Data'!$B:$B, 0)),0)))","v":3932505},{"$f":"IF('Select LAs'!$M11=0,\"-\",IF(INDEX('EY Data'!BG:BG, MATCH('Select LAs'!$M11,'EY Data'!$B:$B, 0))=\"\",\"-\",ROUND(INDEX('EY Data'!BG:BG, MATCH('Select LAs'!$M11,'EY Data'!$B:$B, 0)),0)))","v":13085},{"$f":"IF('Select LAs'!$M11=0,\"-\",IF(INDEX('EY Data'!BL:BL, MATCH('Select LAs'!$M11,'EY Data'!$B:$B, 0))=\"\",\"-\",ROUND(INDEX('EY Data'!BL:BL, MATCH('Select LAs'!$M11,'EY Data'!$B:$B, 0)),0)))","v":0},{"$f":"IF('Select LAs'!$M11=0,\"-\",IF(INDEX('EY Data'!BM:BM, MATCH('Select LAs'!$M11,'EY Data'!$B:$B, 0))=\"\",\"-\",ROUND(INDEX('EY Data'!BM:BM, MATCH('Select LAs'!$M11,'EY Data'!$B:$B, 0)),0)))","v":140826},{"$f":"IF('Select LAs'!$M11=0,\"-\",IF(INDEX('EY Data'!CK:CK, MATCH('Select LAs'!$M11,'EY Data'!$B:$B, 0))=\"\",\"-\",ROUND(INDEX('EY Data'!CK:CK, MATCH('Select LAs'!$M11,'EY Data'!$B:$B, 0)),0)))","v":7996549},{"$f":"IF('Select LAs'!$M11=0,\"-\",IF(INDEX('EY Data'!CM:CM, MATCH('Select LAs'!$M11,'EY Data'!$B:$B, 0))=\"\",\"-\",ROUND(INDEX('EY Data'!CM:CM, MATCH('Select LAs'!$M11,'EY Data'!$B:$B, 0)),0)))","v":31075},{"$f":"IF('Select LAs'!$M11=0,\"-\",IF(INDEX('EY Data'!CR:CR, MATCH('Select LAs'!$M11,'EY Data'!$B:$B, 0))=\"\",\"-\",ROUND(INDEX('EY Data'!CR:CR, MATCH('Select LAs'!$M11,'EY Data'!$B:$B, 0)),0)))","v":0},{"$f":"IF('Select LAs'!$M11=0,\"-\",IF(INDEX('EY Data'!CS:CS, MATCH('Select LAs'!$M11,'EY Data'!$B:$B, 0))=\"\",\"-\",ROUND(INDEX('EY Data'!CS:CS, MATCH('Select LAs'!$M11,'EY Data'!$B:$B, 0)),0)))","v":245132},{"$f":"IF('Select LAs'!$M11=0,\"-\",IF(INDEX('EY Data'!DQ:DQ, MATCH('Select LAs'!$M11,'EY Data'!$B:$B, 0))=\"\",\"-\",ROUND(INDEX('EY Data'!DQ:DQ, MATCH('Select LAs'!$M11,'EY Data'!$B:$B, 0)),0)))","v":11918677},{"$f":"IF('Select LAs'!$M11=0,\"-\",IF(INDEX('EY Data'!DS:DS, MATCH('Select LAs'!$M11,'EY Data'!$B:$B, 0))=\"\",\"-\",ROUND(INDEX('EY Data'!DS:DS, MATCH('Select LAs'!$M11,'EY Data'!$B:$B, 0)),0)))","v":11040},{"$f":"IF('Select LAs'!$M11=0,\"-\",IF(INDEX('EY Data'!DX:DX, MATCH('Select LAs'!$M11,'EY Data'!$B:$B, 0))=\"\",\"-\",ROUND(INDEX('EY Data'!DX:DX, MATCH('Select LAs'!$M11,'EY Data'!$B:$B, 0)),0)))","v":0},{"$f":"IF('Select LAs'!$M11=0,\"-\",IF(INDEX('EY Data'!DY:DY, MATCH('Select LAs'!$M11,'EY Data'!$B:$B, 0))=\"\",\"-\",ROUND(INDEX('EY Data'!DY:DY, MATCH('Select LAs'!$M11,'EY Data'!$B:$B, 0)),0)))","v":497024}]
[{"$f":"'Select LAs'!P40","v":0},{"$f":"'Select LAs'!Q40","v":"No LA selected"},null,{"$f":"IF('Select LAs'!$M12=0,\"-\",IF(INDEX('EY Data'!X:X, MATCH('Select LAs'!$M12,'EY Data'!$B:$B, 0))=\"\",\"-\",ROUND(INDEX('EY Data'!X:X, MATCH('Select LAs'!$M12,'EY Data'!$B:$B, 0)),0)))","v":84226425},{"$f":"IF('Select LAs'!$M12=0,\"-\",IF(INDEX('EY Data'!Z:Z, MATCH('Select LAs'!$M12,'EY Data'!$B:$B, 0))=\"\",\"-\",ROUND(INDEX('EY Data'!Z:Z, MATCH('Select LAs'!$M12,'EY Data'!$B:$B, 0)),0)))","v":2166666},{"$f":"IF('Select LAs'!$M12=0,\"-\",IF(INDEX('EY Data'!AE:AE, MATCH('Select LAs'!$M12,'EY Data'!$B:$B, 0))=\"\",\"-\",ROUND(INDEX('EY Data'!AE:AE, MATCH('Select LAs'!$M12,'EY Data'!$B:$B, 0)),0)))","v":0},{"$f":"IF('Select LAs'!$M12=0,\"-\",IF(INDEX('EY Data'!AF:AF, MATCH('Select LAs'!$M12,'EY Data'!$B:$B, 0))=\"\",\"-\",ROUND(INDEX('EY Data'!AF:AF, MATCH('Select LAs'!$M12,'EY Data'!$B:$B, 0)),0)))","v":2426547},{"$f":"IF('Select LAs'!$M12=0,\"-\",IF(INDEX('EY Data'!BE:BE, MATCH('Select LAs'!$M12,'EY Data'!$B:$B, 0))=\"\",\"-\",ROUND(INDEX('EY Data'!BE:BE, MATCH('Select LAs'!$M12,'EY Data'!$B:$B, 0)),0)))","v":17868175},{"$f":"IF('Select LAs'!$M12=0,\"-\",IF(INDEX('EY Data'!BG:BG, MATCH('Select LAs'!$M12,'EY Data'!$B:$B, 0))=\"\",\"-\",ROUND(INDEX('EY Data'!BG:BG, MATCH('Select LAs'!$M12,'EY Data'!$B:$B, 0)),0)))","v":916668},{"$f":"IF('Select LAs'!$M12=0,\"-\",IF(INDEX('EY Data'!BL:BL, MATCH('Select LAs'!$M12,'EY Data'!$B:$B, 0))=\"\",\"-\",ROUND(INDEX('EY Data'!BL:BL, MATCH('Select LAs'!$M12,'EY Data'!$B:$B, 0)),0)))","v":0},{"$f":"IF('Select LAs'!$M12=0,\"-\",IF(INDEX('EY Data'!BM:BM, MATCH('Select LAs'!$M12,'EY Data'!$B:$B, 0))=\"\",\"-\",ROUND(INDEX('EY Data'!BM:BM, MATCH('Select LAs'!$M12,'EY Data'!$B:$B, 0)),0)))","v":1819910},{"$f":"IF('Select LAs'!$M12=0,\"-\",IF(INDEX('EY Data'!CK:CK, MATCH('Select LAs'!$M12,'EY Data'!$B:$B, 0))=\"\",\"-\",ROUND(INDEX('EY Data'!CK:CK, MATCH('Select LAs'!$M12,'EY Data'!$B:$B, 0)),0)))","v":23948433},{"$f":"IF('Select LAs'!$M12=0,\"-\",IF(INDEX('EY Data'!CM:CM, MATCH('Select LAs'!$M12,'EY Data'!$B:$B, 0))=\"\",\"-\",ROUND(INDEX('EY Data'!CM:CM, MATCH('Select LAs'!$M12,'EY Data'!$B:$B, 0)),0)))","v":694444},{"$f":"IF('Select LAs'!$M12=0,\"-\",IF(INDEX('EY Data'!CR:CR, MATCH('Select LAs'!$M12,'EY Data'!$B:$B, 0))=\"\",\"-\",ROUND(INDEX('EY Data'!CR:CR, MATCH('Select LAs'!$M12,'EY Data'!$B:$B, 0)),0)))","v":0},{"$f":"IF('Select LAs'!$M12=0,\"-\",IF(INDEX('EY Data'!CS:CS, MATCH('Select LAs'!$M12,'EY Data'!$B:$B, 0))=\"\",\"-\",ROUND(INDEX('EY Data'!CS:CS, MATCH('Select LAs'!$M12,'EY Data'!$B:$B, 0)),0)))","v":1213274},{"$f":"IF('Select LAs'!$M12=0,\"-\",IF(INDEX('EY Data'!DQ:DQ, MATCH('Select LAs'!$M12,'EY Data'!$B:$B, 0))=\"\",\"-\",ROUND(INDEX('EY Data'!DQ:DQ, MATCH('Select LAs'!$M12,'EY Data'!$B:$B, 0)),0)))","v":36320741},{"$f":"IF('Select LAs'!$M12=0,\"-\",IF(INDEX('EY Data'!DS:DS, MATCH('Select LAs'!$M12,'EY Data'!$B:$B, 0))=\"\",\"-\",ROUND(INDEX('EY Data'!DS:DS, MATCH('Select LAs'!$M12,'EY Data'!$B:$B, 0)),0)))","v":472222},{"$f":"IF('Select LAs'!$M12=0,\"-\",IF(INDEX('EY Data'!DX:DX, MATCH('Select LAs'!$M12,'EY Data'!$B:$B, 0))=\"\",\"-\",ROUND(INDEX('EY Data'!DX:DX, MATCH('Select LAs'!$M12,'EY Data'!$B:$B, 0)),0)))","v":0},{"$f":"IF('Select LAs'!$M12=0,\"-\",IF(INDEX('EY Data'!DY:DY, MATCH('Select LAs'!$M12,'EY Data'!$B:$B, 0))=\"\",\"-\",ROUND(INDEX('EY Data'!DY:DY, MATCH('Select LAs'!$M12,'EY Data'!$B:$B, 0)),0)))","v":606637}]
[{"$f":"'Select LAs'!P41","v":0},{"$f":"'Select LAs'!Q41","v":"No LA selected"},null,{"$f":"IF('Select LAs'!$M13=0,\"-\",IF(INDEX('EY Data'!X:X, MATCH('Select LAs'!$M13,'EY Data'!$B:$B, 0))=\"\",\"-\",ROUND(INDEX('EY Data'!X:X, MATCH('Select LAs'!$M13,'EY Data'!$B:$B, 0)),0)))","v":22556459},{"$f":"IF('Select LAs'!$M13=0,\"-\",IF(INDEX('EY Data'!Z:Z, MATCH('Select LAs'!$M13,'EY Data'!$B:$B, 0))=\"\",\"-\",ROUND(INDEX('EY Data'!Z:Z, MATCH('Select LAs'!$M13,'EY Data'!$B:$B, 0)),0)))","v":120000},{"$f":"IF('Select LAs'!$M13=0,\"-\",IF(INDEX('EY Data'!AE:AE, MATCH('Select LAs'!$M13,'EY Data'!$B:$B, 0))=\"\",\"-\",ROUND(INDEX('EY Data'!AE:AE, MATCH('Select LAs'!$M13,'EY Data'!$B:$B, 0)),0)))","v":770000},{"$f":"IF('Select LAs'!$M13=0,\"-\",IF(INDEX('EY Data'!AF:AF, MATCH('Select LAs'!$M13,'EY Data'!$B:$B, 0))=\"\",\"-\",ROUND(INDEX('EY Data'!AF:AF, MATCH('Select LAs'!$M13,'EY Data'!$B:$B, 0)),0)))","v":1001938},{"$f":"IF('Select LAs'!$M13=0,\"-\",IF(INDEX('EY Data'!BE:BE, MATCH('Select LAs'!$M13,'EY Data'!$B:$B, 0))=\"\",\"-\",ROUND(INDEX('EY Data'!BE:BE, MATCH('Select LAs'!$M13,'EY Data'!$B:$B, 0)),0)))","v":4364018},{"$f":"IF('Select LAs'!$M13=0,\"-\",IF(INDEX('EY Data'!BG:BG, MATCH('Select LAs'!$M13,'EY Data'!$B:$B, 0))=\"\",\"-\",ROUND(INDEX('EY Data'!BG:BG, MATCH('Select LAs'!$M13,'EY Data'!$B:$B, 0)),0)))","v":120000},{"$f":"IF('Select LAs'!$M13=0,\"-\",IF(INDEX('EY Data'!BL:BL, MATCH('Select LAs'!$M13,'EY Data'!$B:$B, 0))=\"\",\"-\",ROUND(INDEX('EY Data'!BL:BL, MATCH('Select LAs'!$M13,'EY Data'!$B:$B, 0)),0)))","v":0},{"$f":"IF('Select LAs'!$M13=0,\"-\",IF(INDEX('EY Data'!BM:BM, MATCH('Select LAs'!$M13,'EY Data'!$B:$B, 0))=\"\",\"-\",ROUND(INDEX('EY Data'!BM:BM, MATCH('Select LAs'!$M13,'EY Data'!$B:$B, 0)),0)))","v":221409},{"$f":"IF('Select LAs'!$M13=0,\"-\",IF(INDEX('EY Data'!CK:CK, MATCH('Select LAs'!$M13,'EY Data'!$B:$B, 0))=\"\",\"-\",ROUND(INDEX('EY Data'!CK:CK, MATCH('Select LAs'!$M13,'EY Data'!$B:$B, 0)),0)))","v":6083419},{"$f":"IF('Select LAs'!$M13=0,\"-\",IF(INDEX('EY Data'!CM:CM, MATCH('Select LAs'!$M13,'EY Data'!$B:$B, 0))=\"\",\"-\",ROUND(INDEX('EY Data'!CM:CM, MATCH('Select LAs'!$M13,'EY Data'!$B:$B, 0)),0)))","v":120000},{"$f":"IF('Select LAs'!$M13=0,\"-\",IF(INDEX('EY Data'!CR:CR, MATCH('Select LAs'!$M13,'EY Data'!$B:$B, 0))=\"\",\"-\",ROUND(INDEX('EY Data'!CR:CR, MATCH('Select LAs'!$M13,'EY Data'!$B:$B, 0)),0)))","v":0},{"$f":"IF('Select LAs'!$M13=0,\"-\",IF(INDEX('EY Data'!CS:CS, MATCH('Select LAs'!$M13,'EY Data'!$B:$B, 0))=\"\",\"-\",ROUND(INDEX('EY Data'!CS:CS, MATCH('Select LAs'!$M13,'EY Data'!$B:$B, 0)),0)))","v":253476},{"$f":"IF('Select LAs'!$M13=0,\"-\",IF(INDEX('EY Data'!DQ:DQ, MATCH('Select LAs'!$M13,'EY Data'!$B:$B, 0))=\"\",\"-\",ROUND(INDEX('EY Data'!DQ:DQ, MATCH('Select LAs'!$M13,'EY Data'!$B:$B, 0)),0)))","v":9047455},{"$f":"IF('Select LAs'!$M13=0,\"-\",IF(INDEX('EY Data'!DS:DS, MATCH('Select LAs'!$M13,'EY Data'!$B:$B, 0))=\"\",\"-\",ROUND(INDEX('EY Data'!DS:DS, MATCH('Select LAs'!$M13,'EY Data'!$B:$B, 0)),0)))","v":120000},{"$f":"IF('Select LAs'!$M13=0,\"-\",IF(INDEX('EY Data'!DX:DX, MATCH('Select LAs'!$M13,'EY Data'!$B:$B, 0))=\"\",\"-\",ROUND(INDEX('EY Data'!DX:DX, MATCH('Select LAs'!$M13,'EY Data'!$B:$B, 0)),0)))","v":0},{"$f":"IF('Select LAs'!$M13=0,\"-\",IF(INDEX('EY Data'!DY:DY, MATCH('Select LAs'!$M13,'EY Data'!$B:$B, 0))=\"\",\"-\",ROUND(INDEX('EY Data'!DY:DY, MATCH('Select LAs'!$M13,'EY Data'!$B:$B, 0)),0)))","v":376977}]
[null,"Selection Median",null,{"$f":"IF(COUNT(D$16:D$26)>0,MEDIAN(D$16:D$26),\"-\")","v":22275706},289074,0,668518,{"$f":"IF(COUNT(H$16:H$26)>0,MEDIAN(H$16:H$26),\"-\")","v":4364018},{"$f":"IF(COUNT(I$16:I$26)>0,MEDIAN(I$16:I$26),\"-\")","v":50848},{"$f":"IF(COUNT(J$16:J$26)>0,MEDIAN(J$16:J$26),\"-\")","v":0},{"$f":"IF(COUNT(K$16:K$26)>0,MEDIAN(K$16:K$26),\"-\")","v":123300},{"$f":"IF(COUNT(L$16:L$26)>0,MEDIAN(L$16:L$26),\"-\")","v":6083419},{"$f":"IF(COUNT(M$16:M$26)>0,MEDIAN(M$16:M$26),\"-\")","v":78000},{"$f":"IF(COUNT(N$16:N$26)>0,MEDIAN(N$16:N$26),\"-\")","v":0},{"$f":"IF(COUNT(O$16:O$26)>0,MEDIAN(O$16:O$26),\"-\")","v":214676},{"$f":"IF(COUNT(P$16:P$26)>0,MEDIAN(P$16:P$26),\"-\")","v":8918672},{"$f":"IF(COUNT(Q$16:Q$26)>0,MEDIAN(Q$16:Q$26),\"-\")","v":35000},{"$f":"IF(COUNT(R$16:R$26)>0,MEDIAN(R$16:R$26),\"-\")","v":0},{"$f":"IF(COUNT(S$16:S$26)>0,MEDIAN(S$16:S$26),\"-\")","v":305702}]
[null,"Selection Minimum",null,{"$f":"IF(COUNT(D$16:D$26)>0,MIN(D$16:D$26),\"-\")","v":10946688},65000,0,474715,{"$f":"IF(COUNT(H$16:H$26)>0,MIN(H$16:H$26),\"-\")","v":2171003},{"$f":"IF(COUNT(I$16:I$26)>0,MIN(I$16:I$26),\"-\")","v":5681},{"$f":"IF(COUNT(J$16:J$26)>0,MIN(J$16:J$26),\"-\")","v":0},{"$f":"IF(COUNT(K$16:K$26)>0,MIN(K$16:K$26),\"-\")","v":62326},{"$f":"IF(COUNT(L$16:L$26)>0,MIN(L$16:L$26),\"-\")","v":3895916},{"$f":"IF(COUNT(M$16:M$26)>0,MIN(M$16:M$26),\"-\")","v":4068},{"$f":"IF(COUNT(N$16:N$26)>0,MIN(N$16:N$26),\"-\")","v":0},{"$f":"IF(COUNT(O$16:O$26)>0,MIN(O$16:O$26),\"-\")","v":83972},{"$f":"IF(COUNT(P$16:P$26)>0,MIN(P$16:P$26),\"-\")","v":5659412},{"$f":"IF(COUNT(Q$16:Q$26)>0,MIN(Q$16:Q$26),\"-\")","v":5000},{"$f":"IF(COUNT(R$16:R$26)>0,MIN(R$16:R$26),\"-\")","v":0},{"$f":"IF(COUNT(S$16:S$26)>0,MIN(S$16:S$26),\"-\")","v":70390}]
[null,"Selection Maximum",null,{"$f":"IF(COUNT(D$16:D$26)>0,MAX(D$16:D$26),\"-\")","v":84226425},2166666,770000,2426547,{"$f":"IF(COUNT(H$16:H$26)>0,MAX(H$16:H$26),\"-\")","v":17868175},{"$f":"IF(COUNT(I$16:I$26)>0,MAX(I$16:I$26),\"-\")","v":916668},{"$f":"IF(COUNT(J$16:J$26)>0,MAX(J$16:J$26),\"-\")","v":82000},{"$f":"IF(COUNT(K$16:K$26)>0,MAX(K$16:K$26),\"-\")","v":1819910},{"$f":"IF(COUNT(L$16:L$26)>0,MAX(L$16:L$26),\"-\")","v":23948433},{"$f":"IF(COUNT(M$16:M$26)>0,MAX(M$16:M$26),\"-\")","v":694444},{"$f":"IF(COUNT(N$16:N$26)>0,MAX(N$16:N$26),\"-\")","v":195930},{"$f":"IF(COUNT(O$16:O$26)>0,MAX(O$16:O$26),\"-\")","v":1213274},{"$f":"IF(COUNT(P$16:P$26)>0,MAX(P$16:P$26),\"-\")","v":36320741},{"$f":"IF(COUNT(Q$16:Q$26)>0,MAX(Q$16:Q$26),\"-\")","v":472222},{"$f":"IF(COUNT(R$16:R$26)>0,MAX(R$16:R$26),\"-\")","v":220000},{"$f":"IF(COUNT(S$16:S$26)>0,MAX(S$16:S$26),\"-\")","v":606637}]

{"sheet":"DAF","index":6,"n_rows":25,"n_cols":8,"rows_kept":25,"cut":false,"hidden":true,"merged":[[3,1,3,2],[4,1,4,2],[6,1,7,7],[9,1,9,2]]}
[]
[null,{"$f":"CONCATENATE('Select LAs'!B3,\" - Key Budget Statistics\")","v":"No LA selected - Key Budget Statistics"}]
[null,null,null,null,null,null,null,{"$f":"'3-4 year olds '!K2","v":"Financial Year 2025-2026"}]
[null,{"$f":"'Select LAs'!D3","v":"No LA selected"},null,"All establishments"]
[null,"Disability Access Fund - total",null,{"$f":"IF('Select LAs'!$A$3=\"LA No\", \"-\", INDEX('EY Data'!EO:EO, MATCH('Select LAs'!$A$3,'EY Data'!$B:$B, 0)))","v":"-"}]
[]
[null,{"$f":"CONCATENATE(\"Benchmarking against \",IF(_SN=1,\"Statistical Neighbours\",\"Manual Selection\"))","v":"Benchmarking against Manual Selection"}]
[]
[]
[null,"Local Authority",null,"Disability Access Fund\n3-4 year olds","Disability Access Fund\n2 year olds (FRAS)","Disability Access Fund\n2 year olds (WP)","Disability Access Fund\n9 mth -  2 year olds","Disability Access Fund\nAll Providers"]
[null,"England",null,{"$f":"ROUND(INDEX('EY Data'!EK:EK, MATCH($B11,'EY Data'!$C:$C, 0)), 0)","v":28226195},{"$f":"ROUND(INDEX('EY Data'!EL:EL, MATCH($B11,'EY Data'!$C:$C, 0)), 0)","v":4386632},{"$f":"ROUND(INDEX('EY Data'!EM:EM, MATCH($B11,'EY Data'!$C:$C, 0)), 0)","v":3974927},{"$f":"ROUND(INDEX('EY Data'!EN:EN, MATCH($B11,'EY Data'!$C:$C, 0)), 0)","v":2457379},{"$f":"ROUND(INDEX('EY Data'!EO:EO, MATCH($B11,'EY Data'!$C:$C, 0)), 0)","v":39045133}]
[null,{"$f":"'Select LAs'!B3","v":"No LA selected"},null,{"$f":"IF(OR('Select LAs'!$B3=0, 'Select LAs'!$B3=\"No LA selected\"),\"-\",IF(INDEX('EY Data'!EK:EK, MATCH('Select LAs'!$A3,'EY Data'!$B:$B, 0))=\"\",\"-\",ROUND(INDEX('EY Data'!EK:EK, MATCH('Select LAs'!$A3,'EY Data'!$B:$B, 0)),0)))","v":"-"},{"$f":"IF(OR('Select LAs'!$B3=0, 'Select LAs'!$B3=\"No LA selected\"),\"-\",IF(INDEX('EY Data'!EL:EL, MATCH('Select LAs'!$A3,'EY Data'!$B:$B, 0))=\"\",\"-\",ROUND(INDEX('EY Data'!EL:EL, MATCH('Select LAs'!$A3,'EY Data'!$B:$B, 0)),0)))","v":"-"},{"$f":"IF(OR('Select LAs'!$B3=0, 'Select LAs'!$B3=\"No LA selected\"),\"-\",IF(INDEX('EY Data'!EM:EM, MATCH('Select LAs'!$A3,'EY Data'!$B:$B, 0))=\"\",\"-\",ROUND(INDEX('EY Data'!EM:EM, MATCH('Select LAs'!$A3,'EY Data'!$B:$B, 0)),0)))","v":"-"},{"$f":"IF(OR('Select LAs'!$B3=0, 'Select LAs'!$B3=\"No LA selected\"),\"-\",IF(INDEX('EY Data'!EN:EN, MATCH('Select LAs'!$A3,'EY Data'!$B:$B, 0))=\"\",\"-\",ROUND(INDEX('EY Data'!EN:EN, MATCH('Select LAs'!$A3,'EY Data'!$B:$B, 0)),0)))","v":"-"},{"$f":"IF(OR('Select LAs'!$B3=0, 'Select LAs'!$B3=\"No LA selected\"),\"-\",IF(INDEX('EY Data'!EO:EO, MATCH('Select LAs'!$A3,'EY Data'!$B:$B, 0))=\"\",\"-\",ROUND(INDEX('EY Data'!EO:EO, MATCH('Select LAs'!$A3,'EY Data'!$B:$B, 0)),0)))","v":"-"}]
[null,{"$f":"'Select LAs'!B4","v":"No LA selected"},null,{"$f":"IF(OR('Select LAs'!$B4=0, 'Select LAs'!$B4=\"No LA selected\"),\"-\",IF(INDEX('EY Data'!EK:EK, MATCH('Select LAs'!$A4,'EY Data'!$B:$B, 0))=\"\",\"-\",ROUND(INDEX('EY Data'!EK:EK, MATCH('Select LAs'!$A4,'EY Data'!$B:$B, 0)),0)))","v":"-"},{"$f":"IF(OR('Select LAs'!$B4=0, 'Select LAs'!$B4=\"No LA selected\"),\"-\",IF(INDEX('EY Data'!EL:EL, MATCH('Select LAs'!$A4,'EY Data'!$B:$B, 0))=\"\",\"-\",ROUND(INDEX('EY Data'!EL:EL, MATCH('Select LAs'!$A4,'EY Data'!$B:$B, 0)),0)))","v":"-"},{"$f":"IF(OR('Select LAs'!$B4=0, 'Select LAs'!$B4=\"No LA selected\"),\"-\",IF(INDEX('EY Data'!EM:EM, MATCH('Select LAs'!$A4,'EY Data'!$B:$B, 0))=\"\",\"-\",ROUND(INDEX('EY Data'!EM:EM, MATCH('Select LAs'!$A4,'EY Data'!$B:$B, 0)),0)))","v":"-"},{"$f":"IF(OR('Select LAs'!$B4=0, 'Select LAs'!$B4=\"No LA selected\"),\"-\",IF(INDEX('EY Data'!EN:EN, MATCH('Select LAs'!$A4,'EY Data'!$B:$B, 0))=\"\",\"-\",ROUND(INDEX('EY Data'!EN:EN, MATCH('Select LAs'!$A4,'EY Data'!$B:$B, 0)),0)))","v":"-"},{"$f":"IF(OR('Select LAs'!$B4=0, 'Select LAs'!$B4=\"No LA selected\"),\"-\",IF(INDEX('EY Data'!EO:EO, MATCH('Select LAs'!$A4,'EY Data'!$B:$B, 0))=\"\",\"-\",ROUND(INDEX('EY Data'!EO:EO, MATCH('Select LAs'!$A4,'EY Data'!$B:$B, 0)),0)))","v":"-"}]
[null,{"$f":"'Select LAs'!B5","v":"No LA selected"},null,{"$f":"IF(OR('Select LAs'!$B5=0, 'Select LAs'!$B5=\"No LA selected\"),\"-\",IF(INDEX('EY Data'!EK:EK, MATCH('Select LAs'!$A5,'EY Data'!$B:$B, 0))=\"\",\"-\",ROUND(INDEX('EY Data'!EK:EK, MATCH('Select LAs'!$A5,'EY Data'!$B:$B, 0)),0)))","v":"-"},{"$f":"IF(OR('Select LAs'!$B5=0, 'Select LAs'!$B5=\"No LA selected\"),\"-\",IF(INDEX('EY Data'!EL:EL, MATCH('Select LAs'!$A5,'EY Data'!$B:$B, 0))=\"\",\"-\",ROUND(INDEX('EY Data'!EL:EL, MATCH('Select LAs'!$A5,'EY Data'!$B:$B, 0)),0)))","v":"-"},{"$f":"IF(OR('Select LAs'!$B5=0, 'Select LAs'!$B5=\"No LA selected\"),\"-\",IF(INDEX('EY Data'!EM:EM, MATCH('Select LAs'!$A5,'EY Data'!$B:$B, 0))=\"\",\"-\",ROUND(INDEX('EY Data'!EM:EM, MATCH('Select LAs'!$A5,'EY Data'!$B:$B, 0)),0)))","v":"-"},{"$f":"IF(OR('Select LAs'!$B5=0, 'Select LAs'!$B5=\"No LA selected\"),\"-\",IF(INDEX('EY Data'!EN:EN, MATCH('Select LAs'!$A5,'EY Data'!$B:$B, 0))=\"\",\"-\",ROUND(INDEX('EY Data'!EN:EN, MATCH('Select LAs'!$A5,'EY Data'!$B:$B, 0)),0)))","v":"-"},{"$f":"IF(OR('Select LAs'!$B5=0, 'Select LAs'!$B5=\"No LA selected\"),\"-\",IF(INDEX('EY Data'!EO:EO, MATCH('Select LAs'!$A5,'EY Data'!$B:$B, 0))=\"\",\"-\",ROUND(INDEX('EY Data'!EO:EO, MATCH('Select LAs'!$A5,'EY Data'!$B:$B, 0)),0)))","v":"-"}]
[null,{"$f":"'Select LAs'!B6","v":"No LA selected"},null,{"$f":"IF(OR('Select LAs'!$B6=0, 'Select LAs'!$B6=\"No LA selected\"),\"-\",IF(INDEX('EY Data'!EK:EK, MATCH('Select LAs'!$A6,'EY Data'!$B:$B, 0))=\"\",\"-\",ROUND(INDEX('EY Data'!EK:EK, MATCH('Select LAs'!$A6,'EY Data'!$B:$B, 0)),0)))","v":"-"},{"$f":"IF(OR('Select LAs'!$B6=0, 'Select LAs'!$B6=\"No LA selected\"),\"-\",IF(INDEX('EY Data'!EL:EL, MATCH('Select LAs'!$A6,'EY Data'!$B:$B, 0))=\"\",\"-\",ROUND(INDEX('EY Data'!EL:EL, MATCH('Select LAs'!$A6,'EY Data'!$B:$B, 0)),0)))","v":"-"},{"$f":"IF(OR('Select LAs'!$B6=0, 'Select LAs'!$B6=\"No LA selected\"),\"-\",IF(INDEX('EY Data'!EM:EM, MATCH('Select LAs'!$A6,'EY Data'!$B:$B, 0))=\"\",\"-\",ROUND(INDEX('EY Data'!EM:EM, MATCH('Select LAs'!$A6,'EY Data'!$B:$B, 0)),0)))","v":"-"},{"$f":"IF(OR('Select LAs'!$B6=0, 'Select LAs'!$B6=\"No LA selected\"),\"-\",IF(INDEX('EY Data'!EN:EN, MATCH('Select LAs'!$A6,'EY Data'!$B:$B, 0))=\"\",\"-\",ROUND(INDEX('EY Data'!EN:EN, MATCH('Select LAs'!$A6,'EY Data'!$B:$B, 0)),0)))","v":"-"},{"$f":"IF(OR('Select LAs'!$B6=0, 'Select LAs'!$B6=\"No LA selected\"),\"-\",IF(INDEX('EY Data'!EO:EO, MATCH('Select LAs'!$A6,'EY Data'!$B:$B, 0))=\"\",\"-\",ROUND(INDEX('EY Data'!EO:EO, MATCH('Select LAs'!$A6,'EY Data'!$B:$B, 0)),0)))","v":"-"}]
[null,{"$f":"'Select LAs'!B7","v":"No LA selected"},null,{"$f":"IF(OR('Select LAs'!$B7=0, 'Select LAs'!$B7=\"No LA selected\"),\"-\",IF(INDEX('EY Data'!EK:EK, MATCH('Select LAs'!$A7,'EY Data'!$B:$B, 0))=\"\",\"-\",ROUND(INDEX('EY Data'!EK:EK, MATCH('Select LAs'!$A7,'EY Data'!$B:$B, 0)),0)))","v":"-"},{"$f":"IF(OR('Select LAs'!$B7=0, 'Select LAs'!$B7=\"No LA selected\"),\"-\",IF(INDEX('EY Data'!EL:EL, MATCH('Select LAs'!$A7,'EY Data'!$B:$B, 0))=\"\",\"-\",ROUND(INDEX('EY Data'!EL:EL, MATCH('Select LAs'!$A7,'EY Data'!$B:$B, 0)),0)))","v":"-"},{"$f":"IF(OR('Select LAs'!$B7=0, 'Select LAs'!$B7=\"No LA selected\"),\"-\",IF(INDEX('EY Data'!EM:EM, MATCH('Select LAs'!$A7,'EY Data'!$B:$B, 0))=\"\",\"-\",ROUND(INDEX('EY Data'!EM:EM, MATCH('Select LAs'!$A7,'EY Data'!$B:$B, 0)),0)))","v":"-"},{"$f":"IF(OR('Select LAs'!$B7=0, 'Select LAs'!$B7=\"No LA selected\"),\"-\",IF(INDEX('EY Data'!EN:EN, MATCH('Select LAs'!$A7,'EY Data'!$B:$B, 0))=\"\",\"-\",ROUND(INDEX('EY Data'!EN:EN, MATCH('Select LAs'!$A7,'EY Data'!$B:$B, 0)),0)))","v":"-"},{"$f":"IF(OR('Select LAs'!$B7=0, 'Select LAs'!$B7=\"No LA selected\"),\"-\",IF(INDEX('EY Data'!EO:EO, MATCH('Select LAs'!$A7,'EY Data'!$B:$B, 0))=\"\",\"-\",ROUND(INDEX('EY Data'!EO:EO, MATCH('Select LAs'!$A7,'EY Data'!$B:$B, 0)),0)))","v":"-"}]
[null,{"$f":"'Select LAs'!B8","v":"No LA selected"},null,{"$f":"IF(OR('Select LAs'!$B8=0, 'Select LAs'!$B8=\"No LA selected\"),\"-\",IF(INDEX('EY Data'!EK:EK, MATCH('Select LAs'!$A8,'EY Data'!$B:$B, 0))=\"\",\"-\",ROUND(INDEX('EY Data'!EK:EK, MATCH('Select LAs'!$A8,'EY Data'!$B:$B, 0)),0)))","v":"-"},{"$f":"IF(OR('Select LAs'!$B8=0, 'Select LAs'!$B8=\"No LA selected\"),\"-\",IF(INDEX('EY Data'!EL:EL, MATCH('Select LAs'!$A8,'EY Data'!$B:$B, 0))=\"\",\"-\",ROUND(INDEX('EY Data'!EL:EL, MATCH('Select LAs'!$A8,'EY Data'!$B:$B, 0)),0)))","v":"-"},{"$f":"IF(OR('Select LAs'!$B8=0, 'Select LAs'!$B8=\"No LA selected\"),\"-\",IF(INDEX('EY Data'!EM:EM, MATCH('Select LAs'!$A8,'EY Data'!$B:$B, 0))=\"\",\"-\",ROUND(INDEX('EY Data'!EM:EM, MATCH('Select LAs'!$A8,'EY Data'!$B:$B, 0)),0)))","v":"-"},{"$f":"IF(OR('Select LAs'!$B8=0, 'Select LAs'!$B8=\"No LA selected\"),\"-\",IF(INDEX('EY Data'!EN:EN, MATCH('Select LAs'!$A8,'EY Data'!$B:$B, 0))=\"\",\"-\",ROUND(INDEX('EY Data'!EN:EN, MATCH('Select LAs'!$A8,'EY Data'!$B:$B, 0)),0)))","v":"-"},{"$f":"IF(OR('Select LAs'!$B8=0, 'Select LAs'!$B8=\"No LA selected\"),\"-\",IF(INDEX('EY Data'!EO:EO, MATCH('Select LAs'!$A8,'EY Data'!$B:$B, 0))=\"\",\"-\",ROUND(INDEX('EY Data'!EO:EO, MATCH('Select LAs'!$A8,'EY Data'!$B:$B, 0)),0)))","v":"-"}]
[null,{"$f":"'Select LAs'!B9","v":"No LA selected"},null,{"$f":"IF(OR('Select LAs'!$B9=0, 'Select LAs'!$B9=\"No LA selected\"),\"-\",IF(INDEX('EY Data'!EK:EK, MATCH('Select LAs'!$A9,'EY Data'!$B:$B, 0))=\"\",\"-\",ROUND(INDEX('EY Data'!EK:EK, MATCH('Select LAs'!$A9,'EY Data'!$B:$B, 0)),0)))","v":"-"},{"$f":"IF(OR('Select LAs'!$B9=0, 'Select LAs'!$B9=\"No LA selected\"),\"-\",IF(INDEX('EY Data'!EL:EL, MATCH('Select LAs'!$A9,'EY Data'!$B:$B, 0))=\"\",\"-\",ROUND(INDEX('EY Data'!EL:EL, MATCH('Select LAs'!$A9,'EY Data'!$B:$B, 0)),0)))","v":"-"},{"$f":"IF(OR('Select LAs'!$B9=0, 'Select LAs'!$B9=\"No LA selected\"),\"-\",IF(INDEX('EY Data'!EM:EM, MATCH('Select LAs'!$A9,'EY Data'!$B:$B, 0))=\"\",\"-\",ROUND(INDEX('EY Data'!EM:EM, MATCH('Select LAs'!$A9,'EY Data'!$B:$B, 0)),0)))","v":"-"},{"$f":"IF(OR('Select LAs'!$B9=0, 'Select LAs'!$B9=\"No LA selected\"),\"-\",IF(INDEX('EY Data'!EN:EN, MATCH('Select LAs'!$A9,'EY Data'!$B:$B, 0))=\"\",\"-\",ROUND(INDEX('EY Data'!EN:EN, MATCH('Select LAs'!$A9,'EY Data'!$B:$B, 0)),0)))","v":"-"},{"$f":"IF(OR('Select LAs'!$B9=0, 'Select LAs'!$B9=\"No LA selected\"),\"-\",IF(INDEX('EY Data'!EO:EO, MATCH('Select LAs'!$A9,'EY Data'!$B:$B, 0))=\"\",\"-\",ROUND(INDEX('EY Data'!EO:EO, MATCH('Select LAs'!$A9,'EY Data'!$B:$B, 0)),0)))","v":"-"}]
[null,{"$f":"'Select LAs'!B10","v":"No LA selected"},null,{"$f":"IF(OR('Select LAs'!$B10=0, 'Select LAs'!$B10=\"No LA selected\"),\"-\",IF(INDEX('EY Data'!EK:EK, MATCH('Select LAs'!$A10,'EY Data'!$B:$B, 0))=\"\",\"-\",ROUND(INDEX('EY Data'!EK:EK, MATCH('Select LAs'!$A10,'EY Data'!$B:$B, 0)),0)))","v":"-"},{"$f":"IF(OR('Select LAs'!$B10=0, 'Select LAs'!$B10=\"No LA selected\"),\"-\",IF(INDEX('EY Data'!EL:EL, MATCH('Select LAs'!$A10,'EY Data'!$B:$B, 0))=\"\",\"-\",ROUND(INDEX('EY Data'!EL:EL, MATCH('Select LAs'!$A10,'EY Data'!$B:$B, 0)),0)))","v":"-"},{"$f":"IF(OR('Select LAs'!$B10=0, 'Select LAs'!$B10=\"No LA selected\"),\"-\",IF(INDEX('EY Data'!EM:EM, MATCH('Select LAs'!$A10,'EY Data'!$B:$B, 0))=\"\",\"-\",ROUND(INDEX('EY Data'!EM:EM, MATCH('Select LAs'!$A10,'EY Data'!$B:$B, 0)),0)))","v":"-"},{"$f":"IF(OR('Select LAs'!$B10=0, 'Select LAs'!$B10=\"No LA selected\"),\"-\",IF(INDEX('EY Data'!EN:EN, MATCH('Select LAs'!$A10,'EY Data'!$B:$B, 0))=\"\",\"-\",ROUND(INDEX('EY Data'!EN:EN, MATCH('Select LAs'!$A10,'EY Data'!$B:$B, 0)),0)))","v":"-"},{"$f":"IF(OR('Select LAs'!$B10=0, 'Select LAs'!$B10=\"No LA selected\"),\"-\",IF(INDEX('EY Data'!EO:EO, MATCH('Select LAs'!$A10,'EY Data'!$B:$B, 0))=\"\",\"-\",ROUND(INDEX('EY Data'!EO:EO, MATCH('Select LAs'!$A10,'EY Data'!$B:$B, 0)),0)))","v":"-"}]
[null,{"$f":"'Select LAs'!B11","v":"No LA selected"},null,{"$f":"IF(OR('Select LAs'!$B11=0, 'Select LAs'!$B11=\"No LA selected\"),\"-\",IF(INDEX('EY Data'!EK:EK, MATCH('Select LAs'!$A11,'EY Data'!$B:$B, 0))=\"\",\"-\",ROUND(INDEX('EY Data'!EK:EK, MATCH('Select LAs'!$A11,'EY Data'!$B:$B, 0)),0)))","v":"-"},{"$f":"IF(OR('Select LAs'!$B11=0, 'Select LAs'!$B11=\"No LA selected\"),\"-\",IF(INDEX('EY Data'!EL:EL, MATCH('Select LAs'!$A11,'EY Data'!$B:$B, 0))=\"\",\"-\",ROUND(INDEX('EY Data'!EL:EL, MATCH('Select LAs'!$A11,'EY Data'!$B:$B, 0)),0)))","v":"-"},{"$f":"IF(OR('Select LAs'!$B11=0, 'Select LAs'!$B11=\"No LA selected\"),\"-\",IF(INDEX('EY Data'!EM:EM, MATCH('Select LAs'!$A11,'EY Data'!$B:$B, 0))=\"\",\"-\",ROUND(INDEX('EY Data'!EM:EM, MATCH('Select LAs'!$A11,'EY Data'!$B:$B, 0)),0)))","v":"-"},{"$f":"IF(OR('Select LAs'!$B11=0, 'Select LAs'!$B11=\"No LA selected\"),\"-\",IF(INDEX('EY Data'!EN:EN, MATCH('Select LAs'!$A11,'EY Data'!$B:$B, 0))=\"\",\"-\",ROUND(INDEX('EY Data'!EN:EN, MATCH('Select LAs'!$A11,'EY Data'!$B:$B, 0)),0)))","v":"-"},{"$f":"IF(OR('Select LAs'!$B11=0, 'Select LAs'!$B11=\"No LA selected\"),\"-\",IF(INDEX('EY Data'!EO:EO, MATCH('Select LAs'!$A11,'EY Data'!$B:$B, 0))=\"\",\"-\",ROUND(INDEX('EY Data'!EO:EO, MATCH('Select LAs'!$A11,'EY Data'!$B:$B, 0)),0)))","v":"-"}]
[null,{"$f":"'Select LAs'!B12","v":"No LA selected"},null,{"$f":"IF(OR('Select LAs'!$B12=0, 'Select LAs'!$B12=\"No LA selected\"),\"-\",IF(INDEX('EY Data'!EK:EK, MATCH('Select LAs'!$A12,'EY Data'!$B:$B, 0))=\"\",\"-\",ROUND(INDEX('EY Data'!EK:EK, MATCH('Select LAs'!$A12,'EY Data'!$B:$B, 0)),0)))","v":"-"},{"$f":"IF(OR('Select LAs'!$B12=0, 'Select LAs'!$B12=\"No LA selected\"),\"-\",IF(INDEX('EY Data'!EL:EL, MATCH('Select LAs'!$A12,'EY Data'!$B:$B, 0))=\"\",\"-\",ROUND(INDEX('EY Data'!EL:EL, MATCH('Select LAs'!$A12,'EY Data'!$B:$B, 0)),0)))","v":"-"},{"$f":"IF(OR('Select LAs'!$B12=0, 'Select LAs'!$B12=\"No LA selected\"),\"-\",IF(INDEX('EY Data'!EM:EM, MATCH('Select LAs'!$A12,'EY Data'!$B:$B, 0))=\"\",\"-\",ROUND(INDEX('EY Data'!EM:EM, MATCH('Select LAs'!$A12,'EY Data'!$B:$B, 0)),0)))","v":"-"},{"$f":"IF(OR('Select LAs'!$B12=0, 'Select LAs'!$B12=\"No LA selected\"),\"-\",IF(INDEX('EY Data'!EN:EN, MATCH('Select LAs'!$A12,'EY Data'!$B:$B, 0))=\"\",\"-\",ROUND(INDEX('EY Data'!EN:EN, MATCH('Select LAs'!$A12,'EY Data'!$B:$B, 0)),0)))","v":"-"},{"$f":"IF(OR('Select LAs'!$B12=0, 'Select LAs'!$B12=\"No LA selected\"),\"-\",IF(INDEX('EY Data'!EO:EO, MATCH('Select LAs'!$A12,'EY Data'!$B:$B, 0))=\"\",\"-\",ROUND(INDEX('EY Data'!EO:EO, MATCH('Select LAs'!$A12,'EY Data'!$B:$B, 0)),0)))","v":"-"}]
[null,{"$f":"'Select LAs'!B13","v":"No LA selected"},null,{"$f":"IF(OR('Select LAs'!$B13=0, 'Select LAs'!$B13=\"No LA selected\"),\"-\",IF(INDEX('EY Data'!EK:EK, MATCH('Select LAs'!$A13,'EY Data'!$B:$B, 0))=\"\",\"-\",ROUND(INDEX('EY Data'!EK:EK, MATCH('Select LAs'!$A13,'EY Data'!$B:$B, 0)),0)))","v":"-"},{"$f":"IF(OR('Select LAs'!$B13=0, 'Select LAs'!$B13=\"No LA selected\"),\"-\",IF(INDEX('EY Data'!EL:EL, MATCH('Select LAs'!$A13,'EY Data'!$B:$B, 0))=\"\",\"-\",ROUND(INDEX('EY Data'!EL:EL, MATCH('Select LAs'!$A13,'EY Data'!$B:$B, 0)),0)))","v":"-"},{"$f":"IF(OR('Select LAs'!$B13=0, 'Select LAs'!$B13=\"No LA selected\"),\"-\",IF(INDEX('EY Data'!EM:EM, MATCH('Select LAs'!$A13,'EY Data'!$B:$B, 0))=\"\",\"-\",ROUND(INDEX('EY Data'!EM:EM, MATCH('Select LAs'!$A13,'EY Data'!$B:$B, 0)),0)))","v":"-"},{"$f":"IF(OR('Select LAs'!$B13=0, 'Select LAs'!$B13=\"No LA selected\"),\"-\",IF(INDEX('EY Data'!EN:EN, MATCH('Select LAs'!$A13,'EY Data'!$B:$B, 0))=\"\",\"-\",ROUND(INDEX('EY Data'!EN:EN, MATCH('Select LAs'!$A13,'EY Data'!$B:$B, 0)),0)))","v":"-"},{"$f":"IF(OR('Select LAs'!$B13=0, 'Select LAs'!$B13=\"No LA selected\"),\"-\",IF(INDEX('EY Data'!EO:EO, MATCH('Select LAs'!$A13,'EY Data'!$B:$B, 0))=\"\",\"-\",ROUND(INDEX('EY Data'!EO:EO, MATCH('Select LAs'!$A13,'EY Data'!$B:$B, 0)),0)))","v":"-"}]
[null,"Selection Median",null,{"$f":"IFERROR(MEDIAN(D12:D22), 0)","v":0},{"$f":"IFERROR(MEDIAN(E12:E22), 0)","v":0},{"$f":"IFERROR(MEDIAN(F12:F22), 0)","v":0},{"$f":"IFERROR(MEDIAN(G12:G22), 0)","v":0},{"$f":"IFERROR(MEDIAN(H12:H22), 0)","v":0}]
[null,"Selection Minimum",null,{"$f":"MIN(D12:D22)","v":0},{"$f":"MIN(E12:E22)","v":0},{"$f":"MIN(F12:F22)","v":0},{"$f":"MIN(G12:G22)","v":0},{"$f":"MIN(H12:H22)","v":0}]
[null,"Selection Maximum",null,{"$f":"MAX(D12:D22)","v":0},{"$f":"MAX(E12:E22)","v":0},{"$f":"MAX(F12:F22)","v":0},{"$f":"MAX(G12:G22)","v":0},{"$f":"MAX(H12:H22)","v":0}]

{"sheet":"EYPP","index":7,"n_rows":25,"n_cols":8,"rows_kept":25,"cut":false,"hidden":true,"merged":[[3,1,3,2],[4,1,4,2],[9,1,9,2],[6,1,7,7]]}
[]
[null,{"$f":"CONCATENATE('Select LAs'!B3,\" - Key Budget Statistics\")","v":"No LA selected - Key Budget Statistics"}]
[null,null,null,null,null,null,null,{"$f":"'3-4 year olds '!K2","v":"Financial Year 2025-2026"}]
[null,{"$f":"'Select LAs'!D3","v":"No LA selected"},null,"All establishments"]
[null,"Early Years Pupil Premium - total",null,{"$f":"IF('Select LAs'!$A$3=\"LA No\", \"-\", INDEX('EY Data'!EI:EI, MATCH('Select LAs'!$A$3,'EY Data'!$B:$B, 0)))","v":"-"}]
[]
[null,{"$f":"CONCATENATE(\"Benchmarking against \",IF(_SN=1,\"Statistical Neighbours\",\"Manual Selection\"))","v":"Benchmarking against Manual Selection"}]
[]
[]
[null,"Local Authority",null,"Early Years Pupil Premium\n3-4 year olds","Early Years Pupil Premium\n2 year olds (FRAS)","Early Years Pupil Premium\n2 year olds (WP)","Early Years Pupil Premium\n9 mth - 2 year olds","Early Years Pupil Premium\nAll providers"]
[null,"England",null,{"$f":"ROUND(INDEX('EY Data'!EE:EE, MATCH($B11,'EY Data'!$C:$C, 0)), 0)","v":44196992},{"$f":"ROUND(INDEX('EY Data'!EF:EF, MATCH($B11,'EY Data'!$C:$C, 0)), 0)","v":14168649},{"$f":"ROUND(INDEX('EY Data'!EG:EG, MATCH($B11,'EY Data'!$C:$C, 0)), 0)","v":14624088},{"$f":"ROUND(INDEX('EY Data'!EH:EH, MATCH($B11,'EY Data'!$C:$C, 0)), 0)","v":1467351},{"$f":"ROUND(INDEX('EY Data'!EI:EI, MATCH($B11,'EY Data'!$C:$C, 0)), 0)","v":74457080}]
[null,{"$f":"'Select LAs'!B3","v":"No LA selected"},null,{"$f":"IF(OR('Select LAs'!$B3=0, 'Select LAs'!$B3=\"No LA selected\"),\"-\",IF(INDEX('EY Data'!EE:EE, MATCH('Select LAs'!$A3,'EY Data'!$B:$B, 0))=\"\",\"-\",ROUND(INDEX('EY Data'!EE:EE, MATCH('Select LAs'!$A3,'EY Data'!$B:$B, 0)),0)))","v":"-"},{"$f":"IF(OR('Select LAs'!$B3=0, 'Select LAs'!$B3=\"No LA selected\"),\"-\",IF(INDEX('EY Data'!EF:EF, MATCH('Select LAs'!$A3,'EY Data'!$B:$B, 0))=\"\",\"-\",ROUND(INDEX('EY Data'!EF:EF, MATCH('Select LAs'!$A3,'EY Data'!$B:$B, 0)),0)))","v":"-"},{"$f":"IF(OR('Select LAs'!$B3=0, 'Select LAs'!$B3=\"No LA selected\"),\"-\",IF(INDEX('EY Data'!EG:EG, MATCH('Select LAs'!$A3,'EY Data'!$B:$B, 0))=\"\",\"-\",ROUND(INDEX('EY Data'!EG:EG, MATCH('Select LAs'!$A3,'EY Data'!$B:$B, 0)),0)))","v":"-"},{"$f":"IF(OR('Select LAs'!$B3=0, 'Select LAs'!$B3=\"No LA selected\"),\"-\",IF(INDEX('EY Data'!EH:EH, MATCH('Select LAs'!$A3,'EY Data'!$B:$B, 0))=\"\",\"-\",ROUND(INDEX('EY Data'!EH:EH, MATCH('Select LAs'!$A3,'EY Data'!$B:$B, 0)),0)))","v":"-"},{"$f":"IF(OR('Select LAs'!$B3=0, 'Select LAs'!$B3=\"No LA selected\"),\"-\",IF(INDEX('EY Data'!EI:EI, MATCH('Select LAs'!$A3,'EY Data'!$B:$B, 0))=\"\",\"-\",ROUND(INDEX('EY Data'!EI:EI, MATCH('Select LAs'!$A3,'EY Data'!$B:$B, 0)),0)))","v":"-"}]
[null,{"$f":"'Select LAs'!B4","v":"No LA selected"},null,{"$f":"IF(OR('Select LAs'!$B4=0, 'Select LAs'!$B4=\"No LA selected\"),\"-\",IF(INDEX('EY Data'!EE:EE, MATCH('Select LAs'!$A4,'EY Data'!$B:$B, 0))=\"\",\"-\",ROUND(INDEX('EY Data'!EE:EE, MATCH('Select LAs'!$A4,'EY Data'!$B:$B, 0)),0)))","v":"-"},{"$f":"IF(OR('Select LAs'!$B4=0, 'Select LAs'!$B4=\"No LA selected\"),\"-\",IF(INDEX('EY Data'!EF:EF, MATCH('Select LAs'!$A4,'EY Data'!$B:$B, 0))=\"\",\"-\",ROUND(INDEX('EY Data'!EF:EF, MATCH('Select LAs'!$A4,'EY Data'!$B:$B, 0)),0)))","v":"-"},{"$f":"IF(OR('Select LAs'!$B4=0, 'Select LAs'!$B4=\"No LA selected\"),\"-\",IF(INDEX('EY Data'!EG:EG, MATCH('Select LAs'!$A4,'EY Data'!$B:$B, 0))=\"\",\"-\",ROUND(INDEX('EY Data'!EG:EG, MATCH('Select LAs'!$A4,'EY Data'!$B:$B, 0)),0)))","v":"-"},{"$f":"IF(OR('Select LAs'!$B4=0, 'Select LAs'!$B4=\"No LA selected\"),\"-\",IF(INDEX('EY Data'!EH:EH, MATCH('Select LAs'!$A4,'EY Data'!$B:$B, 0))=\"\",\"-\",ROUND(INDEX('EY Data'!EH:EH, MATCH('Select LAs'!$A4,'EY Data'!$B:$B, 0)),0)))","v":"-"},{"$f":"IF(OR('Select LAs'!$B4=0, 'Select LAs'!$B4=\"No LA selected\"),\"-\",IF(INDEX('EY Data'!EI:EI, MATCH('Select LAs'!$A4,'EY Data'!$B:$B, 0))=\"\",\"-\",ROUND(INDEX('EY Data'!EI:EI, MATCH('Select LAs'!$A4,'EY Data'!$B:$B, 0)),0)))","v":"-"}]
[null,{"$f":"'Select LAs'!B5","v":"No LA selected"},null,{"$f":"IF(OR('Select LAs'!$B5=0, 'Select LAs'!$B5=\"No LA selected\"),\"-\",IF(INDEX('EY Data'!EE:EE, MATCH('Select LAs'!$A5,'EY Data'!$B:$B, 0))=\"\",\"-\",ROUND(INDEX('EY Data'!EE:EE, MATCH('Select LAs'!$A5,'EY Data'!$B:$B, 0)),0)))","v":"-"},{"$f":"IF(OR('Select LAs'!$B5=0, 'Select LAs'!$B5=\"No LA selected\"),\"-\",IF(INDEX('EY Data'!EF:EF, MATCH('Select LAs'!$A5,'EY Data'!$B:$B, 0))=\"\",\"-\",ROUND(INDEX('EY Data'!EF:EF, MATCH('Select LAs'!$A5,'EY Data'!$B:$B, 0)),0)))","v":"-"},{"$f":"IF(OR('Select LAs'!$B5=0, 'Select LAs'!$B5=\"No LA selected\"),\"-\",IF(INDEX('EY Data'!EG:EG, MATCH('Select LAs'!$A5,'EY Data'!$B:$B, 0))=\"\",\"-\",ROUND(INDEX('EY Data'!EG:EG, MATCH('Select LAs'!$A5,'EY Data'!$B:$B, 0)),0)))","v":"-"},{"$f":"IF(OR('Select LAs'!$B5=0, 'Select LAs'!$B5=\"No LA selected\"),\"-\",IF(INDEX('EY Data'!EH:EH, MATCH('Select LAs'!$A5,'EY Data'!$B:$B, 0))=\"\",\"-\",ROUND(INDEX('EY Data'!EH:EH, MATCH('Select LAs'!$A5,'EY Data'!$B:$B, 0)),0)))","v":"-"},{"$f":"IF(OR('Select LAs'!$B5=0, 'Select LAs'!$B5=\"No LA selected\"),\"-\",IF(INDEX('EY Data'!EI:EI, MATCH('Select LAs'!$A5,'EY Data'!$B:$B, 0))=\"\",\"-\",ROUND(INDEX('EY Data'!EI:EI, MATCH('Select LAs'!$A5,'EY Data'!$B:$B, 0)),0)))","v":"-"}]
[null,{"$f":"'Select LAs'!B6","v":"No LA selected"},null,{"$f":"IF(OR('Select LAs'!$B6=0, 'Select LAs'!$B6=\"No LA selected\"),\"-\",IF(INDEX('EY Data'!EE:EE, MATCH('Select LAs'!$A6,'EY Data'!$B:$B, 0))=\"\",\"-\",ROUND(INDEX('EY Data'!EE:EE, MATCH('Select LAs'!$A6,'EY Data'!$B:$B, 0)),0)))","v":"-"},{"$f":"IF(OR('Select LAs'!$B6=0, 'Select LAs'!$B6=\"No LA selected\"),\"-\",IF(INDEX('EY Data'!EF:EF, MATCH('Select LAs'!$A6,'EY Data'!$B:$B, 0))=\"\",\"-\",ROUND(INDEX('EY Data'!EF:EF, MATCH('Select LAs'!$A6,'EY Data'!$B:$B, 0)),0)))","v":"-"},{"$f":"IF(OR('Select LAs'!$B6=0, 'Select LAs'!$B6=\"No LA selected\"),\"-\",IF(INDEX('EY Data'!EG:EG, MATCH('Select LAs'!$A6,'EY Data'!$B:$B, 0))=\"\",\"-\",ROUND(INDEX('EY Data'!EG:EG, MATCH('Select LAs'!$A6,'EY Data'!$B:$B, 0)),0)))","v":"-"},{"$f":"IF(OR('Select LAs'!$B6=0, 'Select LAs'!$B6=\"No LA selected\"),\"-\",IF(INDEX('EY Data'!EH:EH, MATCH('Select LAs'!$A6,'EY Data'!$B:$B, 0))=\"\",\"-\",ROUND(INDEX('EY Data'!EH:EH, MATCH('Select LAs'!$A6,'EY Data'!$B:$B, 0)),0)))","v":"-"},{"$f":"IF(OR('Select LAs'!$B6=0, 'Select LAs'!$B6=\"No LA selected\"),\"-\",IF(INDEX('EY Data'!EI:EI, MATCH('Select LAs'!$A6,'EY Data'!$B:$B, 0))=\"\",\"-\",ROUND(INDEX('EY Data'!EI:EI, MATCH('Select LAs'!$A6,'EY Data'!$B:$B, 0)),0)))","v":"-"}]
[null,{"$f":"'Select LAs'!B7","v":"No LA selected"},null,{"$f":"IF(OR('Select LAs'!$B7=0, 'Select LAs'!$B7=\"No LA selected\"),\"-\",IF(INDEX('EY Data'!EE:EE, MATCH('Select LAs'!$A7,'EY Data'!$B:$B, 0))=\"\",\"-\",ROUND(INDEX('EY Data'!EE:EE, MATCH('Select LAs'!$A7,'EY Data'!$B:$B, 0)),0)))","v":"-"},{"$f":"IF(OR('Select LAs'!$B7=0, 'Select LAs'!$B7=\"No LA selected\"),\"-\",IF(INDEX('EY Data'!EF:EF, MATCH('Select LAs'!$A7,'EY Data'!$B:$B, 0))=\"\",\"-\",ROUND(INDEX('EY Data'!EF:EF, MATCH('Select LAs'!$A7,'EY Data'!$B:$B, 0)),0)))","v":"-"},{"$f":"IF(OR('Select LAs'!$B7=0, 'Select LAs'!$B7=\"No LA selected\"),\"-\",IF(INDEX('EY Data'!EG:EG, MATCH('Select LAs'!$A7,'EY Data'!$B:$B, 0))=\"\",\"-\",ROUND(INDEX('EY Data'!EG:EG, MATCH('Select LAs'!$A7,'EY Data'!$B:$B, 0)),0)))","v":"-"},{"$f":"IF(OR('Select LAs'!$B7=0, 'Select LAs'!$B7=\"No LA selected\"),\"-\",IF(INDEX('EY Data'!EH:EH, MATCH('Select LAs'!$A7,'EY Data'!$B:$B, 0))=\"\",\"-\",ROUND(INDEX('EY Data'!EH:EH, MATCH('Select LAs'!$A7,'EY Data'!$B:$B, 0)),0)))","v":"-"},{"$f":"IF(OR('Select LAs'!$B7=0, 'Select LAs'!$B7=\"No LA selected\"),\"-\",IF(INDEX('EY Data'!EI:EI, MATCH('Select LAs'!$A7,'EY Data'!$B:$B, 0))=\"\",\"-\",ROUND(INDEX('EY Data'!EI:EI, MATCH('Select LAs'!$A7,'EY Data'!$B:$B, 0)),0)))","v":"-"}]
[null,{"$f":"'Select LAs'!B8","v":"No LA selected"},null,{"$f":"IF(OR('Select LAs'!$B8=0, 'Select LAs'!$B8=\"No LA selected\"),\"-\",IF(INDEX('EY Data'!EE:EE, MATCH('Select LAs'!$A8,'EY Data'!$B:$B, 0))=\"\",\"-\",ROUND(INDEX('EY Data'!EE:EE, MATCH('Select LAs'!$A8,'EY Data'!$B:$B, 0)),0)))","v":"-"},{"$f":"IF(OR('Select LAs'!$B8=0, 'Select LAs'!$B8=\"No LA selected\"),\"-\",IF(INDEX('EY Data'!EF:EF, MATCH('Select LAs'!$A8,'EY Data'!$B:$B, 0))=\"\",\"-\",ROUND(INDEX('EY Data'!EF:EF, MATCH('Select LAs'!$A8,'EY Data'!$B:$B, 0)),0)))","v":"-"},{"$f":"IF(OR('Select LAs'!$B8=0, 'Select LAs'!$B8=\"No LA selected\"),\"-\",IF(INDEX('EY Data'!EG:EG, MATCH('Select LAs'!$A8,'EY Data'!$B:$B, 0))=\"\",\"-\",ROUND(INDEX('EY Data'!EG:EG, MATCH('Select LAs'!$A8,'EY Data'!$B:$B, 0)),0)))","v":"-"},{"$f":"IF(OR('Select LAs'!$B8=0, 'Select LAs'!$B8=\"No LA selected\"),\"-\",IF(INDEX('EY Data'!EH:EH, MATCH('Select LAs'!$A8,'EY Data'!$B:$B, 0))=\"\",\"-\",ROUND(INDEX('EY Data'!EH:EH, MATCH('Select LAs'!$A8,'EY Data'!$B:$B, 0)),0)))","v":"-"},{"$f":"IF(OR('Select LAs'!$B8=0, 'Select LAs'!$B8=\"No LA selected\"),\"-\",IF(INDEX('EY Data'!EI:EI, MATCH('Select LAs'!$A8,'EY Data'!$B:$B, 0))=\"\",\"-\",ROUND(INDEX('EY Data'!EI:EI, MATCH('Select LAs'!$A8,'EY Data'!$B:$B, 0)),0)))","v":"-"}]
[null,{"$f":"'Select LAs'!B9","v":"No LA selected"},null,{"$f":"IF(OR('Select LAs'!$B9=0, 'Select LAs'!$B9=\"No LA selected\"),\"-\",IF(INDEX('EY Data'!EE:EE, MATCH('Select LAs'!$A9,'EY Data'!$B:$B, 0))=\"\",\"-\",ROUND(INDEX('EY Data'!EE:EE, MATCH('Select LAs'!$A9,'EY Data'!$B:$B, 0)),0)))","v":"-"},{"$f":"IF(OR('Select LAs'!$B9=0, 'Select LAs'!$B9=\"No LA selected\"),\"-\",IF(INDEX('EY Data'!EF:EF, MATCH('Select LAs'!$A9,'EY Data'!$B:$B, 0))=\"\",\"-\",ROUND(INDEX('EY Data'!EF:EF, MATCH('Select LAs'!$A9,'EY Data'!$B:$B, 0)),0)))","v":"-"},{"$f":"IF(OR('Select LAs'!$B9=0, 'Select LAs'!$B9=\"No LA selected\"),\"-\",IF(INDEX('EY Data'!EG:EG, MATCH('Select LAs'!$A9,'EY Data'!$B:$B, 0))=\"\",\"-\",ROUND(INDEX('EY Data'!EG:EG, MATCH('Select LAs'!$A9,'EY Data'!$B:$B, 0)),0)))","v":"-"},{"$f":"IF(OR('Select LAs'!$B9=0, 'Select LAs'!$B9=\"No LA selected\"),\"-\",IF(INDEX('EY Data'!EH:EH, MATCH('Select LAs'!$A9,'EY Data'!$B:$B, 0))=\"\",\"-\",ROUND(INDEX('EY Data'!EH:EH, MATCH('Select LAs'!$A9,'EY Data'!$B:$B, 0)),0)))","v":"-"},{"$f":"IF(OR('Select LAs'!$B9=0, 'Select LAs'!$B9=\"No LA selected\"),\"-\",IF(INDEX('EY Data'!EI:EI, MATCH('Select LAs'!$A9,'EY Data'!$B:$B, 0))=\"\",\"-\",ROUND(INDEX('EY Data'!EI:EI, MATCH('Select LAs'!$A9,'EY Data'!$B:$B, 0)),0)))","v":"-"}]
[null,{"$f":"'Select LAs'!B10","v":"No LA selected"},null,{"$f":"IF(OR('Select LAs'!$B10=0, 'Select LAs'!$B10=\"No LA selected\"),\"-\",IF(INDEX('EY Data'!EE:EE, MATCH('Select LAs'!$A10,'EY Data'!$B:$B, 0))=\"\",\"-\",ROUND(INDEX('EY Data'!EE:EE, MATCH('Select LAs'!$A10,'EY Data'!$B:$B, 0)),0)))","v":"-"},{"$f":"IF(OR('Select LAs'!$B10=0, 'Select LAs'!$B10=\"No LA selected\"),\"-\",IF(INDEX('EY Data'!EF:EF, MATCH('Select LAs'!$A10,'EY Data'!$B:$B, 0))=\"\",\"-\",ROUND(INDEX('EY Data'!EF:EF, MATCH('Select LAs'!$A10,'EY Data'!$B:$B, 0)),0)))","v":"-"},{"$f":"IF(OR('Select LAs'!$B10=0, 'Select LAs'!$B10=\"No LA selected\"),\"-\",IF(INDEX('EY Data'!EG:EG, MATCH('Select LAs'!$A10,'EY Data'!$B:$B, 0))=\"\",\"-\",ROUND(INDEX('EY Data'!EG:EG, MATCH('Select LAs'!$A10,'EY Data'!$B:$B, 0)),0)))","v":"-"},{"$f":"IF(OR('Select LAs'!$B10=0, 'Select LAs'!$B10=\"No LA selected\"),\"-\",IF(INDEX('EY Data'!EH:EH, MATCH('Select LAs'!$A10,'EY Data'!$B:$B, 0))=\"\",\"-\",ROUND(INDEX('EY Data'!EH:EH, MATCH('Select LAs'!$A10,'EY Data'!$B:$B, 0)),0)))","v":"-"},{"$f":"IF(OR('Select LAs'!$B10=0, 'Select LAs'!$B10=\"No LA selected\"),\"-\",IF(INDEX('EY Data'!EI:EI, MATCH('Select LAs'!$A10,'EY Data'!$B:$B, 0))=\"\",\"-\",ROUND(INDEX('EY Data'!EI:EI, MATCH('Select LAs'!$A10,'EY Data'!$B:$B, 0)),0)))","v":"-"}]
[null,{"$f":"'Select LAs'!B11","v":"No LA selected"},null,{"$f":"IF(OR('Select LAs'!$B11=0, 'Select LAs'!$B11=\"No LA selected\"),\"-\",IF(INDEX('EY Data'!EE:EE, MATCH('Select LAs'!$A11,'EY Data'!$B:$B, 0))=\"\",\"-\",ROUND(INDEX('EY Data'!EE:EE, MATCH('Select LAs'!$A11,'EY Data'!$B:$B, 0)),0)))","v":"-"},{"$f":"IF(OR('Select LAs'!$B11=0, 'Select LAs'!$B11=\"No LA selected\"),\"-\",IF(INDEX('EY Data'!EF:EF, MATCH('Select LAs'!$A11,'EY Data'!$B:$B, 0))=\"\",\"-\",ROUND(INDEX('EY Data'!EF:EF, MATCH('Select LAs'!$A11,'EY Data'!$B:$B, 0)),0)))","v":"-"},{"$f":"IF(OR('Select LAs'!$B11=0, 'Select LAs'!$B11=\"No LA selected\"),\"-\",IF(INDEX('EY Data'!EG:EG, MATCH('Select LAs'!$A11,'EY Data'!$B:$B, 0))=\"\",\"-\",ROUND(INDEX('EY Data'!EG:EG, MATCH('Select LAs'!$A11,'EY Data'!$B:$B, 0)),0)))","v":"-"},{"$f":"IF(OR('Select LAs'!$B11=0, 'Select LAs'!$B11=\"No LA selected\"),\"-\",IF(INDEX('EY Data'!EH:EH, MATCH('Select LAs'!$A11,'EY Data'!$B:$B, 0))=\"\",\"-\",ROUND(INDEX('EY Data'!EH:EH, MATCH('Select LAs'!$A11,'EY Data'!$B:$B, 0)),0)))","v":"-"},{"$f":"IF(OR('Select LAs'!$B11=0, 'Select LAs'!$B11=\"No LA selected\"),\"-\",IF(INDEX('EY Data'!EI:EI, MATCH('Select LAs'!$A11,'EY Data'!$B:$B, 0))=\"\",\"-\",ROUND(INDEX('EY Data'!EI:EI, MATCH('Select LAs'!$A11,'EY Data'!$B:$B, 0)),0)))","v":"-"}]
[null,{"$f":"'Select LAs'!B12","v":"No LA selected"},null,{"$f":"IF(OR('Select LAs'!$B12=0, 'Select LAs'!$B12=\"No LA selected\"),\"-\",IF(INDEX('EY Data'!EE:EE, MATCH('Select LAs'!$A12,'EY Data'!$B:$B, 0))=\"\",\"-\",ROUND(INDEX('EY Data'!EE:EE, MATCH('Select LAs'!$A12,'EY Data'!$B:$B, 0)),0)))","v":"-"},{"$f":"IF(OR('Select LAs'!$B12=0, 'Select LAs'!$B12=\"No LA selected\"),\"-\",IF(INDEX('EY Data'!EF:EF, MATCH('Select LAs'!$A12,'EY Data'!$B:$B, 0))=\"\",\"-\",ROUND(INDEX('EY Data'!EF:EF, MATCH('Select LAs'!$A12,'EY Data'!$B:$B, 0)),0)))","v":"-"},{"$f":"IF(OR('Select LAs'!$B12=0, 'Select LAs'!$B12=\"No LA selected\"),\"-\",IF(INDEX('EY Data'!EG:EG, MATCH('Select LAs'!$A12,'EY Data'!$B:$B, 0))=\"\",\"-\",ROUND(INDEX('EY Data'!EG:EG, MATCH('Select LAs'!$A12,'EY Data'!$B:$B, 0)),0)))","v":"-"},{"$f":"IF(OR('Select LAs'!$B12=0, 'Select LAs'!$B12=\"No LA selected\"),\"-\",IF(INDEX('EY Data'!EH:EH, MATCH('Select LAs'!$A12,'EY Data'!$B:$B, 0))=\"\",\"-\",ROUND(INDEX('EY Data'!EH:EH, MATCH('Select LAs'!$A12,'EY Data'!$B:$B, 0)),0)))","v":"-"},{"$f":"IF(OR('Select LAs'!$B12=0, 'Select LAs'!$B12=\"No LA selected\"),\"-\",IF(INDEX('EY Data'!EI:EI, MATCH('Select LAs'!$A12,'EY Data'!$B:$B, 0))=\"\",\"-\",ROUND(INDEX('EY Data'!EI:EI, MATCH('Select LAs'!$A12,'EY Data'!$B:$B, 0)),0)))","v":"-"}]
[null,{"$f":"'Select LAs'!B13","v":"No LA selected"},null,{"$f":"IF(OR('Select LAs'!$B13=0, 'Select LAs'!$B13=\"No LA selected\"),\"-\",IF(INDEX('EY Data'!EE:EE, MATCH('Select LAs'!$A13,'EY Data'!$B:$B, 0))=\"\",\"-\",ROUND(INDEX('EY Data'!EE:EE, MATCH('Select LAs'!$A13,'EY Data'!$B:$B, 0)),0)))","v":"-"},{"$f":"IF(OR('Select LAs'!$B13=0, 'Select LAs'!$B13=\"No LA selected\"),\"-\",IF(INDEX('EY Data'!EF:EF, MATCH('Select LAs'!$A13,'EY Data'!$B:$B, 0))=\"\",\"-\",ROUND(INDEX('EY Data'!EF:EF, MATCH('Select LAs'!$A13,'EY Data'!$B:$B, 0)),0)))","v":"-"},{"$f":"IF(OR('Select LAs'!$B13=0, 'Select LAs'!$B13=\"No LA selected\"),\"-\",IF(INDEX('EY Data'!EG:EG, MATCH('Select LAs'!$A13,'EY Data'!$B:$B, 0))=\"\",\"-\",ROUND(INDEX('EY Data'!EG:EG, MATCH('Select LAs'!$A13,'EY Data'!$B:$B, 0)),0)))","v":"-"},{"$f":"IF(OR('Select LAs'!$B13=0, 'Select LAs'!$B13=\"No LA selected\"),\"-\",IF(INDEX('EY Data'!EH:EH, MATCH('Select LAs'!$A13,'EY Data'!$B:$B, 0))=\"\",\"-\",ROUND(INDEX('EY Data'!EH:EH, MATCH('Select LAs'!$A13,'EY Data'!$B:$B, 0)),0)))","v":"-"},{"$f":"IF(OR('Select LAs'!$B13=0, 'Select LAs'!$B13=\"No LA selected\"),\"-\",IF(INDEX('EY Data'!EI:EI, MATCH('Select LAs'!$A13,'EY Data'!$B:$B, 0))=\"\",\"-\",ROUND(INDEX('EY Data'!EI:EI, MATCH('Select LAs'!$A13,'EY Data'!$B:$B, 0)),0)))","v":"-"}]
[null,"Selection Median",null,{"$f":"IFERROR(MEDIAN(D12:D22), 0)","v":0},{"$f":"IFERROR(MEDIAN(E12:E22), 0)","v":0},{"$f":"IFERROR(MEDIAN(F12:F22), 0)","v":0},{"$f":"IFERROR(MEDIAN(G12:G22), 0)","v":0},{"$f":"IFERROR(MEDIAN(H12:H22), 0)","v":0}]
[null,"Selection Minimum",null,{"$f":"MIN(D12:D22)","v":0},{"$f":"MIN(E12:E22)","v":0},{"$f":"MIN(F12:F22)","v":0},{"$f":"MIN(G12:G22)","v":0},{"$f":"MIN(H12:H22)","v":0}]
[null,"Selection Maximum",null,{"$f":"MAX(D12:D22)","v":0},{"$f":"MAX(E12:E22)","v":0},{"$f":"MAX(F12:F22)","v":0},{"$f":"MAX(G12:G22)","v":0},{"$f":"MAX(H12:H22)","v":0}]

{"sheet":"EY Data","index":8,"n_rows":177,"n_cols":156,"rows_kept":177,"cut":false,"hidden":true,"merged":[[2,4,2,7],[8,149,8,153],[2,30,2,31],[2,9,2,16],[2,18,2,21],[2,25,2,28],[15,149,15,153],[19,149,19,153],[23,149,23,153],[0,25,0,28],[2,42,2,49],[2,63,2,64],[2,75,2,81],[2,107,2,113],[2,127,2,128]]}
[]
[null,2,3,4,5,6,7,8,9,10,11,12,13,14,15,16,17,18,19,20,21,22,23,24,25,26,27,28,29,30,31,32,33,34,35,36,37,38,39,40,41,42,43,44,45,46,47,48,49,50,51,52,53,54,55,56,57,58,59,60,61,62,63,64,65,66,67,68,69,70,71,72,73,74,75,76,77,78,79,80,81,82,83,84,85,86,87,88,89,90,91,92,93,94,95,96,97,98,99,100,101,102,103,104,105,106,107,108,109,110,111,112,113,114,115,116,117,118,119,120,121,122,123,124,125,126,127,128,129,130,131,132,133,134,135,136,137,138,139,140,141,142,143,144,145]
[null,null,null,null,"3 and 4 year olds hourly average funding rate",null,null,null,null,"3 and 4 year olds components of hourly average funding rate for all providers",null,null,null,null,null,null,null,null,"3 and 4 year olds hourly average base rate",null,null,null,null,"3 and 4 year olds EYSFF total budget ",null,"3 and 4 year olds SEN Inclusion Fund (top-up grant element)",null,null,null,null,"3 and 4 year olds contingency funding & central spend",null,null,"3 and 4 year olds",null,"3 and 4 year olds",null,"2 year olds (FRAS) hourly average funding rate",null,null,null,null,"2 year olds (FRAS) components of hourly average funding rate for all providers",null,null,null,null,null,null,null,null,"2 year olds (FRAS) hourly average base rate",null,null,null,null,"2 year olds (FRAS) EYSFF total budget ",null,"2 year olds (FRAS) SEN Inclusion Fund (top-up grant element)",null,null,null,null,"2 year olds (FRAS) contingency funding & central spend",null,null,"2 year olds (FRAS)",null,"2 year olds (FRAS)",null,"2 year olds (working parents) hourly average funding rate",null,null,null,null,"2 year olds (working parents) components of hourly average funding rate for all providers",null,null,null,null,null,null,null,"2 year olds (working parents) hourly average base rate",null,null,null,null,"2 year olds (working parents) EYSFF total budget ",null,"2 year olds (working parents) SEN Inclusion Fund (top-up grant element)",null,null,null,null,"2 year olds (working parents) contingency funding & central spend",null,null,"2 year olds (working parents)",null,"2 year olds (working parents)",null,"9mth - 2 year olds hourly average funding rate",null,null,null,null,"9mth - 2 year olds components of hourly average funding rate for all providers",null,null,null,null,null,null,null,"9mth - 2 year olds hourly average base rate",null,null,null,null,"9mth - 2yr olds EYSFF total budget ",null,"9mth - 2yr olds SEN Inclusion Fund (top-up grant element)",null,null,null,null,"9mth - 2yr olds contingency funding & central spend",null,null,"9mth - 2yr olds",null,"9mth - 2yr olds",null,"EYPP",null,null,null,null,null,"DAF"]
[null,"LA Number","LA name",null,"All Providers","Primary Nursery Class","Maintained Nursery School","Private, Voluntary and Independent (PVI)",null,"Base rate","Supplements - Deprivation","Supplements - Quality","Supplements - Flexibility","Supplements - Rurality/Sparsity","Supplements - EAL","Maintained nursery school (MNS) lump sums","SEN Inclusion Fund (top-up grant element)",null,"All Providers","Primary Nursery Class","Maintained Nursery School","Private, Voluntary and Independent (PVI)",null,"All Providers",null,"All Providers","Primary Nursery Class","Maintained Nursery School","Private, Voluntary and Independent (PVI)",null,"Contingency Funding","Central Spend",null,"Pass Through Rate (%)",null,"Funding Paid Through Supplements (%)",null,"All Providers","Primary Nursery Class","Maintained Nursery School","Private, Voluntary and Independent (PVI)",null,"Base rate","Supplements - Deprivation","Supplements - Quality","Supplements - Flexibility","Supplements - Rurality/Sparsity","Supplements - EAL","6. Total 'top-up' amount paid to individual providers to ensure the disadvantaged 2 year old rate is at least equal to the 2 year old working parent rate","SEN Inclusion Fund (top-up grant element)",null,"All Providers","Primary Nursery Class","Maintained Nursery School","Private, Voluntary and Independent (PVI)",null,"All Providers",null,"All Providers","Primary Nursery Class","Maintained Nursery School","Private, Voluntary and Independent (PVI)",null,"Contingency Funding","Central Spend",null,"Pass Through Rate (%)",null,"Funding Paid Through Supplements (%)",null,"All Providers","Primary Nursery Class","Maintained Nursery School","Private, Voluntary and Independent (PVI)",null,"Base rate","Supplements - Deprivation","Supplements - Quality","Supplements - Flexibility","Supplements - Rurality/Sparsity","Supplements - EAL","SEN Inclusion Fund (top-up grant element)",null,"All Providers","Primary Nursery Class","Maintained Nursery School","Private, Voluntary and Independent (PVI)",null,"All Providers",null,"All Providers","Primary Nursery Class","Maintained Nursery School","Private, Voluntary and Independent (PVI)",null,"Contingency Funding","Central Spend",null,"Pass Through Rate (%)",null,"Funding Paid Through Supplements (%)",null,"All Providers","Primary Nursery Class","Maintained Nursery School","Private, Voluntary and Independent (PVI)",null,"Base rate","Supplements - Deprivation","Supplements - Quality","Supplements - Flexibility","Supplements - Rurality/Sparsity","Supplements - EAL","SEN Inclusion Fund (top-up grant element)",null,"All Providers","Primary Nursery Class","Maintained Nursery School","Private, Voluntary and Independent (PVI)",null,"All Providers",null,"All Providers","Primary Nursery Class","Maintained Nursery School","Private, Voluntary and Independent (PVI)",null,"Contingency Funding","Central Spend",null,"Pass Through Rate (%)",null,"Funding Paid Through Supplements (%)",null,"Early Years Pupil Premium: 3yr & 4yr olds","Early Years Pupil Premium: 2yr olds - FRAS","Early Years Pupil Premium: 2yr olds - working parents ","Early Years Pupil Premium: 9mth to 2yr olds","Early Years Pupil Premium: Total",null,"Disability Access Fund: 3yr & 4 yr olds","Disability Access Fund: 2yr olds - FRAS","Disability Access Fund: 2yr olds working parents","Disability Access Fund: 9mth to 2yr olds","Disability Access Fund: Total"]
[null,201,"City of London",null,8.5433341321191794,8.5243902439024382,0,8.541585220957419,null,8.5,2.336448598130841E-2,0,0,0,0,0,1.9969646137870438E-2,null,8.5,8.5,0,8.5,null,426816,null,1000,0,500,500,null,0,0,null,"-",null,"N/A",null,11.341880341880342,11,0,11.284900284900285,null,11,0,0,0,0,0,0,0.34188034188034189,null,11,11,0,11,null,32175,null,1000,0,500,500,null,0,0,null,"-",null,"N/A",null,11.341880341880342,11,0,11.284900284900285,null,11,0,0,0,0,0,0.34188034188034189,null,11,11,0,11,null,32175,null,1000,0,500,500,null,0,0,null,"-",null,"N/A",null,15.183688464364439,15,0,15.166666666666666,null,15,0,0,0,0,0,0.18368846436443792,null,15,15,0,15,null,81660,null,1000,0,500,500,null,0,0,null,"-",null,"N/A",null,0,0,0,0,0,null,0,0,0,0,0]
[null,202,"Camden",null,9.0191792193228331,8.8835901227266021,10.903997790145688,8.6979616643170665,null,7.43,0.83000000000000007,0.18,0,0,0,0.14889848131068892,0.43028073801214334,null,7.43,7.4300000000000006,7.4300000000000006,7.43,null,12775136.190000001,null,640000,240000,200000,200000,null,0,511005.44,null,0.96031120249588042,null,0.11966824644549763,null,11.859744561669508,12.803352080989876,11.80811424146763,11.61196557279742,null,9.7799999999999994,1.0900000000000001,0,0,0,0,0,0.98974456166950953,null,9.7799999999999994,9.7799999999999994,9.7800000000000011,9.7799999999999994,null,2064734.76,null,188000,55000,63000,70000,null,0,61942.049999999996,null,0.96972563873013151,null,0.10027598896044158,null,11.864887807267275,17.762230576441098,14.383703443429376,11.312417843006553,null,9.7800000000000011,1.0899999999999999,0,0,0,0,0.99488780726727277,null,9.7800000000000011,9.7799999999999994,9.7799999999999994,9.7799999999999994,null,2130541.7400000002,null,195000,55000,65000,75000,null,0,63916.25,null,0.97014618211506742,null,0.10027598896044157,null,16.318949878194164,0,0,16.318949878194164,null,13.95,1.55,0,0,0,0,0.81894987819416365,null,13.95,0,0,13.95,null,4485622.5,null,237000,0,0,237000,null,0,134568.68,null,0.9696345738677461,null,"No Base Rate",null,85000,60000,20000,10000,175000,null,31850,9100,9100,9100,59150]
[null,203,"Greenwich",null,7.7960181602024763,7.4442438549955785,11.436799231224128,7.4442869285331765,null,6.8,0.37999999942111129,0,0,0,0,0.35213222374257697,0.26388593703878854,null,6.8,6.8,6.8,6.8000000000000007,null,26022728.969999999,null,911698.31,283916.81,79104.549999999988,548676.94999999995,null,656432.66,1071017.57,null,0.96999830621498306,null,5.292479100999288E-2,null,11.041666049867796,10.93,11.037241177656783,11.044293931952838,null,10.090000010498704,0.55999998950129581,0,0,0,0,0,0.39166604986779502,null,10.090000010498704,10.09,10.09,10.090000012280885,null,4057643.6100000003,null,149224.53,1596,19203.29,128425.24,null,106679.83,179069.72,null,0.96932072299815453,null,5.2582158638619321E-2,null,11.046416131137367,10.93,11.111164537557487,11.041939017597535,null,10.089999995135422,0.56000000486457868,0,0,0,0,0.39641613113736518,null,10.089999995135422,10.090000000000002,10.09,10.089999994737816,null,8757181.8900000006,null,325961.32999999996,957.6,27074.97,297928.76,null,230235.77,386467.18,null,0.96972740869603202,null,5.2582160081181099E-2,null,15.164380352208076,0,0,15.164380352208076,null,13.859999997766977,0.75999999776697669,0,0,0,0,0.54438035667412166,null,13.859999997766977,0,0,13.859999997766977,null,13094354.75,null,487572.47000000003,0,0,487572.47000000003,null,349302.21,573213.89,null,0.96972446065202889,null,"No Base Rate",null,436073,128233.61,148519.39000000001,24909,737735,null,167902,13959.24,30126.76,10318,222306,null,null,"3 and 4 year olds components of hourly average funding rate for all providers"]
[null,204,"Hackney",null,7.845898557573995,8.0489100236797526,16.642429231658003,7.5270031556886874,null,6.72,0.17361370081579938,0.35411215238624127,0.1456370299484831,0,0,0.17946561369455266,0.27307006072891926,null,6.72,6.72,6.72,6.72,null,29018677.439999998,null,1046390,243090.24,22688.85,780610.91,null,0,1221565.1399999999,null,0.95950358619541531,null,9.1076671575950632E-2,null,11.19318158289423,11.193182857142856,11.19318125,11.193181577198999,null,11.16,0,0,0,0,0,0,3.3181582894230385E-2,null,11.16,11.16,11.16,11.16,null,6726623.04,null,20000,116.14,106.18,19777.68,null,0,188039.8,null,0.97247450763633625,null,0,null,11.08675970548124,11.08676,11.086759375,11.086759705256727,null,11.05,0,0,0,0,0,3.6759705481239684E-2,null,11.05,11.05,11.05,11.05,null,6012017.7000000002,null,20000,147.04,117.63,19735.330000000002,null,0,230500.72,null,0.96322847137108958,null,0,null,15.193750204610616,15.19375,15.19375,15.193750207766083,null,15.16,0,0,0,0,0,3.3750204610615453E-2,null,15.16,15.16,15.16,15.16,null,8983649.2400000002,null,20000,168.75,135,19696.25,null,0,354318.92,null,0.96223877166628358,null,0,null,376468,24225,24225,4361,429279,null,191352,27202,27202,15008,260764]
[null,205,"Hammersmith and Fulham",null,9.2466229865202205,8.44,18.056402598190981,7.8799997901609071,null,6.72,0.72000000000000008,0.19803711209123057,0,0,0,1.168586125384188,0.43999974904480177,null,6.72,6.72,6.7200000000000006,6.72,null,12633268.359999999,null,631188,223212,72481,335495,null,57380.75,502081.65,null,0.96031985715943236,null,0.12019280590270395,null,11.4,10.92,10.92,11.629090909090909,null,10.050000000000001,0.87,0,0,0,0,0,0.48,null,10.050000000000001,10.050000000000001,10.050000000000001,10.050000000000001,null,1213758,null,53352,0,0,53352,null,11115,53352,null,0.95993322203672782,null,7.9670329670329665E-2,null,11.400000050152538,0,10.92,11.436944729361349,null,10.050000025076269,0.87000000501525387,0,0,0,0,0.48000002006101555,null,10.050000025076269,0,10.050000000000001,10.050000027006341,null,2177357.37,null,95708.02,0,0,95708.02,null,19939.169999999998,95708.02,null,0.9599332262230833,null,7.9670329910059734E-2,null,15.820000009208892,0,15.159999999999998,15.827002290352693,null,14.390000018417783,0.77000000920889178,0,0,0,0,0.65999998158221651,null,14.390000018417783,0,14.389999999999999,14.390000018613188,null,3292470.03,null,143339.72,0,0,143339.72,null,21718.14,143339.72,null,0.96019300417423981,null,"No Base Rate",null,119700,16933.330000000002,30376.67,4258,171268,null,75978,5035.9799999999996,9034.02,5628,95676,null,null,"3 and 4 year olds",null,"Supplements"]
[null,206,"Islington",null,8.9252021827076877,7.618940024960386,17.288143622722401,9.04428605373983,null,6.59,0.62237237745789808,0.12148581496591658,1.9734003883030132E-2,0,0,0.36950881664514179,1.2021011697556998,null,6.589999999999999,6.59,6.59,6.59,null,13544658.710000001,null,2108227,193808,258411,1656008,null,131211.89000000001,596340,null,1.012034940243199,null,0.10383934489736045,null,11.389660694108152,11.14,11.14,11.525313403089188,null,9.7200000000000006,0,1.1635060532687651,2.6215980629539951E-2,0,0,0,0.47993866020984666,null,9.7200000000000006,9.7200000000000006,9.7200000000000006,9.7200000000000006,null,3379286.4,null,148661,0,0,148661,null,0,145655,null,0.96115280119056135,null,0.1090515441366556,null,10.881318080373639,10.58,10.58,10.920855026667335,null,9.16,0,0.81089818058203633,0.18744734625105308,0,0,0.7229725535405489,null,9.1599999999999984,9.16,9.16,9.16,null,3436517.5,null,244578,0,0,244578,null,183433,159655,null,0.96401232215435284,null,9.8278358832742732E-2,null,15.084633790250628,0,14.15,15.136186828704695,null,14.15,0,0,0,0,0,0.93463379025062865,null,14.15,0,14.15,14.15,null,5233660.5,null,345693,0,0,345693,null,235747,240503,null,0.96041611410662708,null,0,null,263112,74795.399999999994,8310.6,7478,353696,null,121940,21105,2345,8442,153832,null,null,null,{"$f":"\"Base rate, \"&TEXT($ES$11, \"£#,##0.00\")","v":"Base rate, "},{"$f":"\"Deprivation, \"&TEXT($ET$11, \"£#,##0.00\")","v":"Deprivation, "},{"$f":"\"Quality, \"&TEXT($EU$11, \"£#,##0.00\")","v":"Quality, "},{"$f":"\"Flexibility, \"&TEXT($EV$11, \"£#,##0.00\")","v":"Flexibility, "},{"$f":"\"Rurality/ Sparsity, \"&TEXT($EW$11, \"£#,##0.00\")","v":"Rurality/ Sparsity, "},{"$f":"\"EAL, \"&TEXT($EX$11, \"£#,##0.00\")","v":"EAL, "},{"$f":"\"Maintained nursery school (MNS) lump sums, \"&TEXT($EY$11, \"£#,##0.00\")","v":"Maintained nursery school (MNS) lump sums, "},{"$f":"\"SEN Inclusion Fund (top-up grant element), \"&TEXT($EZ$11, \"£#,##0.00\")","v":"SEN Inclusion Fund (top-up grant element), "}]
[null,207,"Kensington and Chelsea",null,8.7692900760347765,8.122068003955512,13.515585131610267,8.1220679982053348,null,7.6499999910477818,0.34650000271291159,0,0,0,0,0.647222078575868,0.12556800369821616,null,7.6499999910477818,7.6499999879205456,7.6499999708079836,7.6499999967014665,null,11103705.58,null,161304.37,46778.27,19356.52,95169.58,null,322608.73,129939.63,null,0.96022981617784431,null,4.333145788573374E-2,null,11.132414661654137,11.132414657332989,11.132415413533835,11.132414510853405,null,10.42,0.54134260651629074,0,0,0,0,0,0.1710720551378446,null,10.42,10.42,10.42,10.42,null,874715.14,null,13651.55,3958.95,1638.19,8054.41,null,27303.09,10997.08,null,0.96587193995088727,null,4.938652370873562E-2,null,11.100640573626885,11.100640458829758,11.100641156494145,11.100640511503352,null,10.420000002226882,0.48099685018731969,0,0,0,0,0.19964372121268401,null,10.420000002226882,10.419999854100862,10.420000185573516,10.420000037743753,null,979036.95,null,17930.34,5199.8,2151.64,10578.9,null,35860.69,14443.89,null,0.96800741813100433,null,4.4124116050982549E-2,null,15.168075996418528,15.168075894739513,15.168075562871126,15.168076134575518,null,14.290000085840383,0.64349998221877769,0,0,0,0,0.23457592835936777,null,14.290000085840383,14.290000048326748,14.290000255477249,14.290000069776863,null,1704888.71,null,26780.449999999997,7766.33,3213.65,15800.47,null,53560.92,21573.15,null,0.95992805575946716,null,"No Base Rate",null,122550,7772,8188,1437,139947,null,44086,2284,2406,3752,52528,null,null,"Hourly rate (£ per hour)",{"$f":"IF($ES$13=\"\", \"\", INDEX(J:J, MATCH($ES$13, $B:$B,0)))","v":""},"","","","","","",""]
[null,208,"Lambeth",null,8.037321874152795,7.4977799985195057,15.694423029404497,7.4126744981906345,null,6.7800000017725131,0.35000000088625666,0.26000000177251331,0,0,0,0.5182828989774636,0.12903897074404705,null,6.7800000017725131,6.78,6.78,6.780000003114627,null,22308105.530000001,null,364000,109200,218400,36400,null,0,911000,null,0.9600584350247543,null,8.2543978659403813E-2,null,11.438369649827203,12.172240215924427,12.087894736842106,11.222318928941831,null,10.549999994978213,0.15851859063384072,0.37999999531299999,0,0,0,0,0.3498510689021469,null,10.549999994978213,10.55,10.55,10.549999993371882,null,3312124.2000000007,null,104500,16500,33000,55000,null,0,0,null,0.98521702410225687,null,4.8565422154157135E-2,null,10.936453476443372,61.276332767402373,13.100061436411735,10.769600080044214,null,9.8699999932335434,0.50000002255485287,0.38000001052559801,0,0,0,0.18645345012937839,null,9.8699999932335452,9.8700033955857389,9.869999921032889,9.8699999928870668,null,7149237.5299999993,null,124000,37200,74400,12400,null,141550.51,309000,null,0.96031842129702671,null,8.1860467993151137E-2,null,15.011199038912538,0,0,14.785079651658529,null,13.559999999447816,0.6899742791267689,0.50998099672238706,0,0,0,0.25124376361556561,null,13.559999999447816,0,0,13.559999999447816,null,10692053.890000001,null,182000,54600,109200,18200,null,220578.85,462000,null,0.96023193548867525,null,"No Base Rate",null,334000,26343.96,58656.04,8000,427000,null,90000,8987.94,20017.060000000001,10000,129005]
[null,209,"Lewisham",null,7.1950705145257015,7.0362048280852756,12.002857640283914,7.0100459376112747,null,6.42,0.27323868818491698,0.13067898845891132,0,0,0,0.17115283788187263,0.19999999999999998,null,6.42,6.42,6.42,6.42,null,22207253.859999999,null,634940.1,215435.3,22401,397103.8,null,634940.1,952410.15,null,0.96062735061753057,null,5.9191463875115945E-2,null,10.329999996486688,10.330000000000002,10.33,10.329999996218174,null,9.5699999939315497,0,0,0,0,0,0,0.76000000255513778,null,9.5699999939315497,9.57,9.57,9.5699999934677535,null,2996315.99,null,237951.94999999998,6064.8,10830,221057.15,null,84535.56,137761.65,null,0.9601449269576231,null,0,null,10.329999985913448,10.329999723657666,10.329999809139533,10.330000001769033,null,9.5699999906089648,0,0,0,0,0,0.75999999530448314,null,9.5699999906089648,9.5699998157717783,9.569999881357008,9.5700000007581565,null,8152457.1399999997,null,647426.05999999994,16501.27,29466.55,601458.24,null,230006.63,374825.62,null,0.96014492647293559,null,0,null,14.08,14.080000236787171,14.079999981057021,14.07999999443169,null,13.05,0,0,0,0,0,1.03,null,13.05,13.050000147991982,13.049999988160637,13.049999996519805,null,12109134.15,null,955740.09,24359.43,43498.97,887881.69,null,352603.14,511125.84,null,0.96015936254980083,null,0,null,177168,200531,102709,27292,507700,null,145390,30394,15568,7504,198856,null,null,"LA Number",{"$f":"IF($ES$14=\"Choice\", \"\", INDEX('Stat Neighbours'!$A:$A, MATCH($ES$14,$C:$C,0)))","v":""}]
[null,210,"Southwark",null,8.3347801785320712,8.1150896323205313,16.062470818766787,6.9649944874543586,null,6.7,0.33484322329722854,0.37946710457327076,0,0,0,0.62504925992680094,0.29542059073477012,null,6.7,6.6999999980147127,6.6999999880882788,6.7000000039705743,null,20247351.420000002,null,744025,372012.5,223207.5,148805,null,41587,525000,null,0.97676906983446365,null,9.6342113599615128E-2,null,11.137457549496231,12.484887236345703,11.242857394490242,10.914853352805158,null,10.200000000000001,0.60078271619172063,0,0,0,0,0,0.33667483330450987,null,10.200000000000001,10.199999999999999,10.199999999999999,10.199999999999999,null,3372501.2,null,105125.37,52562.69,31537.61,21025.07,null,0,80000,null,0.97016180744740688,null,5.562399799887395E-2,null,11.133023576845282,14.926101440200375,13.424358749578538,10.79500056526939,null,10.199999996146621,0.50367910087398315,0,0,0,0,0.42934447982467744,null,10.199999996146621,10.199999999999999,10.199999999999999,10.199999995718468,null,5555476.0800000001,null,222840.48,111420.24,66852.14,44568.1,null,0,210000,null,0.96977557289593053,null,4.7056633173371526E-2,null,15.33098711207407,0,0,15.33098711207407,null,14.380000003537676,0.56151211538621415,0,0,0,0,0.38947499315017731,null,14.380000003537676,0,0,14.380000003537676,null,8447080.7800000012,null,220187,0,0,220187,null,0,300000,null,0.97031564000468795,null,"No Base Rate",null,417736,120684.2,6351.8,11435,556207,null,134134,28768,5000,4690,172592,null,null,"LA Name",{"$f":"LAchoice","v":"Choice"}]
[null,211,"Tower Hamlets",null,8.7805859140052114,8.3438598832023185,12.595291405597326,8.8141479335294211,null,8.1,0.21405104210667217,0,0,0,0,0.26327065076001099,0.20326422113852841,null,8.1,8.1,8.1,8.1,null,25445329,null,603000,208045.1,38929.160000000003,356025.74,null,107694.78,1057289.8799999999,null,0.96000201002362695,null,2.5745697376959385E-2,null,11.258463223656975,11.1,11.1,11.294472602456676,null,11.100000000000001,0,0,0,0,0,0,0.15846322365697466,null,11.100000000000001,11.1,11.1,11.100000000000001,null,5603823.9000000004,null,80000,0,0,80000,null,30260.35,283629.15999999997,null,0.96000022317912048,null,0,null,11.295067932407459,0,0,11.295067932407459,null,11.099999999999998,0,0,0,0,0,0.1950679324074609,null,11.099999999999998,0,0,11.099999999999998,null,4438453.7699999996,null,78000,0,0,78000,null,9329.91,238089.48,null,0.96000007066073978,null,0,null,15.572959560866254,0,0,15.572959560866254,null,15.549999999999999,0,0,0,0,0,2.2959560866255047E-2,null,15.549999999999999,0,0,15.549999999999999,null,6772777.6200000001,null,10000,0,0,10000,null,24322.22,188574.32,null,0.96000014188670124,null,0,null,495273,54709,43331,8824,602137,null,224182,37687,29849,22512,314230]
[null,212,"Wandsworth",null,7.6066263229139501,7.6911459798979589,14.403810117738111,7.2014018914285973,null,6.6800000012762162,0.29302571349509821,0,0,0,0,0.23310060570187321,0.40050000244076384,null,6.6800000012762162,6.6799999975435735,6.6800000254763647,6.6800000017583878,null,22585907.349999998,null,1255273.02,391300.19,44017.27,819955.56,null,791686.81,1004218.41,null,0.96163416015784442,null,4.2022749589803891E-2,null,11.087500015612491,11.087499861900469,11.087500306692709,11.087500005772867,null,10.510000029143317,0,0,0,0,0,0,0.57749998646917489,null,10.510000029143317,10.509999984217195,10.510000185267433,10.510000018986322,null,2524421.08,null,138711.04999999999,14636.18,11533.33,112541.54,null,0,110968.84,null,0.95995671130844074,null,0,null,10.047500019451974,10.047499627242756,10.047501361370585,10.04750000865319,null,9.4700000064117855,0,0,0,0,0,0.57750001304018661,null,9.4700000064117873,9.4699992544855114,9.4700004188832576,9.4700000084765943,null,5464779.8900000006,null,333253.48,2788.68,3446.67,327018.13,null,599856.26,266602.78000000003,null,0.9599134230296662,null,0,null,14.710999992999765,0,14.710998840419009,14.710999997715614,null,13.920000003181924,0,0,0,0,0,0.79099998981784114,null,13.920000003181924,0,13.920000624690093,13.920000000638987,null,8749421.5700000003,null,497183.36000000004,0,2025.96,495157.4,null,298310.02,397746.69,null,0.95989886177334494,null,0,null,275082,43272,1000,3985,323339,null,130382,9286.2000000000007,21667.8,8442,169778,null,null,"2 year olds (FRAS)",null,"Supplements"]
[null,213,"Westminster",null,9.0009084049300405,8.1680455947745898,15.108568860713103,8.1680455989569225,null,7.6699999957788618,0.34649999874989401,0,0,0,0,0.83286281184421185,0.15154559855707248,null,7.6699999957788618,7.6700000120363976,7.6699999668532506,7.6699999936710457,null,10901490.75,null,186688.35,54139.62,22402.6,110146.13,null,311147.25,432148.96,null,0.96016209699896815,null,4.3223351710394743E-2,null,11.602811709858159,11.594979706474506,11.594979949634729,11.608354647024155,null,10.870000037810673,0.537744560799296,0,0,0,0,0,0.19506711124818976,null,10.870000037810673,10.870000003685377,10.870000155860696,10.870000030440442,null,2111948.84,null,36113.339999999997,10472.870000000001,4333.6000000000004,21306.87,null,60188.89,83595.679999999993,null,0.95960768366236726,null,4.7138551897876475E-2,null,11.538105107079652,11.544207659866215,11.549015750956022,11.532988723612437,null,10.869999995088396,0.42813118840277492,0,0,0,0,0.23997392358848021,null,10.869999995088397,10.869999919426887,10.870000089139536,10.870000012981578,null,1610205.25,null,34200.990000000005,9918.2900000000009,4104.12,20178.580000000002,null,57001.65,79168.960000000006,null,0.96042330220384431,null,3.7893982770208952E-2,null,16.2353631533453,16.235363341048096,16.235362825497436,16.235363127765517,null,15.250000000000002,0.68399993588549057,0,0,0,0,0.30136321745981082,null,15.250000000000002,15.25000004970425,15.250000000000002,15.249999975569095,null,2763587.85,null,52268.34,15157.82,6272.2,30838.32,null,87113.89,120991.52,null,0.95972678467821393,null,"No Base Rate",null,190266,31289.42,19440.580000000002,4566,245562,null,84420,8678.14,5391.86,4690,103180,null,null,null,{"$f":"\"Base rate, \"&TEXT($ES$11, \"£#,##0.00\")","v":"Base rate, "},{"$f":"\"Deprivation, \"&TEXT($ET$11, \"£#,##0.00\")","v":"Deprivation, "},{"$f":"\"Quality, \"&TEXT($EU$11, \"£#,##0.00\")","v":"Quality, "},{"$f":"\"Flexibility, \"&TEXT($EV$11, \"£#,##0.00\")","v":"Flexibility, "},{"$f":"\"Rurality/ Sparsity, \"&TEXT($EW$11, \"£#,##0.00\")","v":"Rurality/ Sparsity, "},{"$f":"\"EAL, \"&TEXT($EX$11, \"£#,##0.00\")","v":"EAL, "},{"$f":"\"Maintained nursery school (MNS) lump sums, \"&TEXT($EY$11, \"£#,##0.00\")","v":"Maintained nursery school (MNS) lump sums, "},{"$f":"\"SEN Inclusion Fund (top-up grant element), \"&TEXT($EZ$11, \"£#,##0.00\")","v":"SEN Inclusion Fund (top-up grant element), "}]
[null,301,"Barking and Dagenham",null,6.2000440392578531,5.950767816921922,0,6.3575759524225592,null,5.6999999999999993,0.23294241342758878,0,9.5084761272906132E-2,0,0,0,0.17201686455735779,null,5.6999999999999993,5.7,0,5.7,null,18971358.899999999,null,541370.1,0,0,541370.1,null,68459,1263585,null,0.96015377250734557,null,5.4417003307021941E-2,null,9.0309375554687765,0,0,9.0309375554687765,null,8.92,0,0,0,0,0,0,0.11093755546877773,null,8.92,0,0,8.92,null,3015209.76,null,37500,0,0,37500,null,0,0,null,0.95971706221772335,null,0,null,9.0200725325716089,0,0,9.0200725325716089,null,8.92,0,0,0,0,0,0.10007253257160791,null,8.92,0,0,8.92,null,5570959.2400000002,null,62500,0,0,62500,null,6171,0,null,0.9596124648403398,null,0,null,12.17963901731186,0,0,12.17963901731186,null,12,0,0,0,0,0,0.17963901731186002,null,12,0,0,12,null,5110716,null,76507,0,0,76507,null,58417,0,null,0.96000020087086047,null,0,null,253781,200000,75310,24778,553869,null,197918,25326,16884,7504,247632,null,null,"Hourly rate (£ per hour)",{"$f":"IF($ES$13=\"\", \"\", INDEX(AQ:AQ, MATCH($ES$13, $B:$B,0)))","v":""},{"$f":"IF($ES$13=\"\", \"\", INDEX(AR:AR, MATCH($ES$13, $B:$B,0)))","v":""},"","","","","",""]
[null,302,"Barnet",null,6.9012093794942491,6.6868853018074335,10.424795080091533,6.6605682223995251,null,6.47,0.1055573109345411,0,0,0,0,0.23182334772900481,9.3828720830703191E-2,null,6.47,6.47,6.47,6.47,null,29020455.989999998,null,400000,155354.64000000001,21399.48,223245.88,null,556876.55000000005,1160532.48,null,0.97143047950263017,null,1.6052983183495198E-2,null,10.246556701337738,10.493146198830409,10.309609507640067,10.183869419762534,null,9.9900000102622677,0,0,0,0,0,0,0.25655669107547024,null,9.9900000102622677,9.99,9.99,9.9900000133205715,null,3893876.23,null,100000,36135.96,5647.5,58216.54,null,0,0,null,1.025681351485259,null,0,null,9.6372971881977278,9.6867544690108538,9.6499423938940936,9.624723880031544,null,9.3800000059692952,0.20583774578274738,0,0,0,0,5.1459436445686846E-2,null,9.3800000059692952,9.379999999999999,9.3800000681057405,9.3800000037405589,null,9313974.6699999981,null,50000,18067.98,2823.75,29108.27,null,0,262246.84000000003,null,0.96469441323300598,null,2.1473109718044787E-2,null,13.157242189921162,0,0,13.137502768392329,null,13.11,0,0,0,0,0,4.7242189921162234E-2,null,13.11,0,0,13.11,null,13875309.359999999,null,50000,18067.98,2823.75,29108.27,null,0,180944.68,null,0.96319488945250087,null,0,null,283137,1,135660,12210,431008,null,193228,46900,1,9380,249509]
[null,303,"Bexley",null,6.5570697329597074,6.6818185079121255,0,6.503575051360281,null,6.2600000013648751,0.12293092968737764,5.5473108351567789E-2,0,0,8.9662087861748743E-2,0,2.9003605694138006E-2,null,6.2600000013648751,6.2600000038655823,0,6.260000000292524,null,19131608.210000001,null,85000,0,0,85000,null,0,470152,null,0.96998072972776728,null,4.1063635183024694E-2,null,9.4840335118666097,9.7669074122746959,0,9.4808277968009875,null,9.2000000082964153,0.11834833020586222,7.524846512212901E-4,0,0,8.196855958176788E-2,0,8.2964129131344003E-2,null,9.2000000082964153,9.2000014807520749,0,9.1999999916095661,null,2266297.37,null,20000,0,0,20000,null,0,38715,null,0.97073014451040018,null,2.1387925804282251E-2,null,9.4746934227758981,9.5470347982355825,0,9.4745963063197518,null,9.2000000000000011,0.1454079042862057,2.681349475311248E-4,0,0,9.0687359185073022E-2,3.8330024357087766E-2,null,9.2000000000000011,9.1999999999999993,0,9.1999999999999993,null,8616553.8499999996,null,35000,0,0,35000,null,0,171881,null,0.96977414767409398,null,2.5048144972714355E-2,null,12.860300670908543,0,0,12.860300670908543,null,12.710000004524435,0.12923690204610591,0,9.551587647303704E-4,0,0,2.0108605573270957E-2,null,12.710000004524435,0,0,12.710000004524435,null,12770842.83,null,20000,0,0,20000,null,0,187336,null,0.96985676251195652,null,"No Base Rate",null,131824,70000,3530,6618,211972,null,133196,25000,5016,8442,171654,null,null,"2 year olds (working)",null,"Supplements"]
[null,304,"Brent",null,6.8219553022066899,5.8761208219165848,16.771514620317642,6.5596304909662759,null,5.7600000012833616,0.64000000046667671,0,0,0,0,0.29191466249296022,0.1300406379636922,null,5.7600000012833616,5.76000000189351,5.7600000231336423,5.759999998994016,null,22943219.789999999,null,445844.14,0,0,445844.14,null,0,932845.12,null,0.96030009407554862,null,0.1000000000455739,null,9.888919477549166,0,9.769999901245443,9.897179496683604,null,9.7699999833714237,0,0,0,0,0,0,0.11891949417774188,null,9.7699999833714237,0,9.769999901245443,9.7699999890758029,null,4112799.71,null,50060.6,0,0,50060.6,null,0,0,null,1.0121719014891675,null,0,null,9.5588615670468631,0,9.4399999172390228,9.567113262915651,null,9.4399999969299895,0,0,0,0,0,0.11886157011687178,null,9.4399999969299913,0,9.4399999172390228,9.4400000024623534,null,4919855.5600000005,null,61947.22,0,0,61947.22,null,0,101787.24,null,0.97838910614604524,null,0,null,13.03888635555038,0,0,13.03888635555038,null,12.920000000704764,0,0,0,0,0,0.11888635484561468,null,12.920000000704764,0,0,12.920000000704764,null,7332935.0199999996,null,67475.69,0,0,67475.69,null,0,151156.64000000001,null,0.97889537203831678,null,0,null,156180,15675,15675,2822,190352,null,122878,15477,15477,15946,169778,null,null,null,{"$f":"\"Base rate, \"&TEXT($ES$11, \"£#,##0.00\")","v":"Base rate, "},{"$f":"\"Deprivation, \"&TEXT($ET$11, \"£#,##0.00\")","v":"Deprivation, "},{"$f":"\"Quality, \"&TEXT($EU$11, \"£#,##0.00\")","v":"Quality, "},{"$f":"\"Flexibility, \"&TEXT($EV$11, \"£#,##0.00\")","v":"Flexibility, "},{"$f":"\"Rurality/ Sparsity, \"&TEXT($EW$11, \"£#,##0.00\")","v":"Rurality/ Sparsity, "},{"$f":"\"EAL, \"&TEXT($EX$11, \"£#,##0.00\")","v":"EAL, "},{"$f":"\"Maintained nursery school (MNS) lump sums, \"&TEXT($EY$11, \"£#,##0.00\")","v":"Maintained nursery school (MNS) lump sums, "},{"$f":"\"SEN Inclusion Fund (top-up grant element), \"&TEXT($EZ$11, \"£#,##0.00\")","v":"SEN Inclusion Fund (top-up grant element), "}]
[null,305,"Bromley",null,6.5069900090361958,0,0,6.5069900090361958,null,6.21,0.15124491335866549,0,0,0,0,0,0.14574509567753044,null,6.21,0,0,6.21,null,23132578.07,null,530000,0,0,530000,null,145000,586591,null,0.98006941127059821,null,2.3775992815659393E-2,null,9.6111352035470059,0,0,9.6111352035470059,null,9.3299999897769013,0.2555774670637318,0,0,0,0,0,2.5557746706373181E-2,null,9.3299999897769013,0,0,9.3299999897769013,null,1875278.28,null,5000,0,0,5000,null,0,183020,null,0.99391263738852187,null,2.666270949397441E-2,null,9.1798773482672775,0,0,9.1798773482672775,null,9.1299999966748437,4.1564459660361833E-2,0,0,0,0,8.3128919320723665E-3,null,9.1299999966748437,0,0,9.1299999966748437,null,11032940.800000001,null,10000,0,0,10000,null,120000,595030,null,0.95963102910570286,null,4.5318832853702973E-3,null,12.571974974368555,0,0,12.571974974368555,null,12.530000001526362,3.8159066220175064E-2,0,0,0,0,3.8159066220175061E-3,null,12.530000001526362,0,0,12.530000001526362,null,16468116.640000001,null,5000,0,0,5000,null,130000,175600,null,0.96652849325255619,null,"No Base Rate",null,243419,45008,100000,13053,401480,null,148208,4388,20000,7504,180100,null,null,"Hourly rate (£ per hour)",{"$f":"IF($ES$13=\"\", \"\", INDEX(BX:BX, MATCH($ES$13, $B:$B,0)))","v":""},{"$f":"IF($ES$13=\"\", \"\", INDEX(BY:BY, MATCH($ES$13, $B:$B,0)))","v":""},"","","","","",""]
[null,306,"Croydon",null,7.0785339735014725,6.8392589084631004,11.085499196472552,6.8412989855614796,null,6.66,7.2124642817161966E-2,0,0,0,0,0.23777097555156268,0.10863835513274707,null,6.66,6.66,6.66,6.66,null,30819170.800000001,null,480372.19,114796.94,26215.88,339359.37,null,184758.54,1824214.76,null,0.97211115563715089,null,1.0713503781323378E-2,null,10.69377776205469,10.693777799184343,10.69377785551019,10.693777742169596,null,9.86,0.68,0,0,0,0,0,0.15377776205469276,null,9.86,9.8600000393181819,9.8599998104554487,9.8600000013375357,null,4469012.6999999993,null,65202.540000000008,15644.44,3569.73,45988.37,null,25077.9,0,null,1.0250641615970117,null,6.4516129032258063E-2,null,10.01377776631106,10.013777747674789,10.013777882612803,10.013777763879606,null,9.8600000028196835,0,0,0,0,0,0.15377776349137803,null,9.8600000028196835,9.8600000149365972,9.8600000470190317,9.8599999951705186,null,6993691.0999999996,null,109074.45999999999,26767.95,5886.98,76419.53,null,41951.71,0,null,0.96024051976836355,null,0,null,13.71141816169755,13.633777740711727,13.633777755484143,13.741700773340421,null,13.479999997411985,0,0,0,0,0,0.23141816428556453,null,13.479999997411985,13.479999983738431,13.480000107487177,13.47999999280513,null,10417255.029999999,null,178838.43,26478.240000000002,6867.17,145493.01999999999,null,45707.09,0,null,0.96029033835544331,null,0,null,289925,82650,1,7438.5,380014.5,null,60970,58156,1,10318,129445]
[null,307,"Ealing",null,6.8053280191251355,6.8656048521618054,12.449188976818123,6.3207364855810377,null,5.5199999991103592,0.310106736397875,0.27385767602504707,0,0,0,0.23966074271369975,0.46170286487815415,null,5.5199999991103592,5.5199999978471395,5.5200000126093549,5.5199999990195554,null,28522196,null,2075907.59,1018855.8,104372.76,952679.03,null,779350.97,1086410.28,null,0.96409193769683232,null,9.5669694816623865E-2,null,9.4481289488567501,0,9.634445263157895,9.4060569278003356,null,8.5,0.59103708491556917,0,0,0,0,0,0.3570918639411812,null,8.5,0,8.5,8.5,null,5625988.2999999998,null,220986.30000000002,0,44197.26,176789.04,null,82964.14,165121.88,null,0.96013935279462514,null,6.5013163998225876E-2,null,9.2849548881921589,0,8.8554980343836185,9.6245944779582366,null,8.5,0,0,0,0,0,0.78495488819215919,null,8.5,0,8.5,8.5,null,3280405,null,302937.64,0,60587.53,242350.11,null,113730.86,290985.59999999998,null,0.95988455547116314,null,0,null,12.847661960249143,0,12.806336094866795,12.852650235294117,null,12.27,0,0,0,0,0,0.57766196024914263,null,12.27,0,12.27,12.27,null,7013041.2000000002,null,330168.46999999997,0,33016.85,297151.62,null,123954.03,432234.28,null,0.95992150130231257,null,0,null,324336,359100,0,32319,715755,null,149142,14070,14070,9380,186662,null,null,"9mth - 2yr olds",null,"Supplements"]
[null,308,"Enfield",null,6.6499999325502035,6.6559686934477345,0,6.6460940409575198,null,6.2799999999999994,0.12,0.13,0,0,0,0,0.11999993255020373,null,6.2799999999999994,6.2799999999999994,0,6.2799999999999994,null,23235059.059999999,null,426984,177293,0,249691,null,0,996297,null,0.95959594986294428,null,3.8284839203675348E-2,null,9.8000011093300206,9.6,0,9.8601280753350373,null,9.4,0.19999999999999998,0,0,0,0,0,0.20000110933002013,null,9.4,9.4,0,9.4,null,5192323.2,null,108174,0,0,108174,null,0,162260,null,0.97029713953762586,null,2.0833333333333332E-2,null,9.799999660830693,9.6,0,9.816172769581291,null,9.4,0.19999999999999998,0,0,0,0,0.19999966083069345,null,9.3999999999999986,9.4,0,9.3999999999999986,null,5660889.5999999996,null,117935,0,0,117935,null,0,446671,null,0.97029699612185105,null,2.0833333333333332E-2,null,13.490000934135653,0,0,13.490000934135653,null,13.21,0,0,0,0,0,0.28000093413565208,null,13.21,0,0,13.21,null,8484849.0500000007,null,179846,0,0,179846,null,0,0,null,0.96980596219523019,null,0,null,407932,50844,0,4577,463353,null,188538,47838,0,11256,247632,null,null,null,{"$f":"\"Base rate, \"&TEXT($ES$11, \"£#,##0.00\")","v":"Base rate, "},{"$f":"\"Deprivation, \"&TEXT($ET$11, \"£#,##0.00\")","v":"Deprivation, "},{"$f":"\"Quality, \"&TEXT($EU$11, \"£#,##0.00\")","v":"Quality, "},{"$f":"\"Flexibility, \"&TEXT($EV$11, \"£#,##0.00\")","v":"Flexibility, "},{"$f":"\"Rurality/ Sparsity, \"&TEXT($EW$11, \"£#,##0.00\")","v":"Rurality/ Sparsity, "},{"$f":"\"EAL, \"&TEXT($EX$11, \"£#,##0.00\")","v":"EAL, "},{"$f":"\"Maintained nursery school (MNS) lump sums, \"&TEXT($EY$11, \"£#,##0.00\")","v":"Maintained nursery school (MNS) lump sums, "},{"$f":"\"SEN Inclusion Fund (top-up grant element), \"&TEXT($EZ$11, \"£#,##0.00\")","v":"SEN Inclusion Fund (top-up grant element), "}]
[null,309,"Haringey",null,7.0006946168074986,6.4494789114941016,14.066589304150193,6.4291918840852835,null,6.1800000021001722,4.0381802524764983E-2,2.8502327241577634E-2,0,0,0.14000007455609739,0.54296940539539673,6.8841004989490556E-2,null,6.1800000021001722,6.180000001032921,6.1800000010181062,6.1800000032103934,null,18483431.219999999,null,183561,61187,61187,61187,null,107676,614398,null,0.95983855449584454,null,3.2694942899802924E-2,null,9.8183573800415811,10.395590283449538,10.25438341480913,9.7568330769886753,null,9.72000000730125,0,0,0,0,0,0,9.835737274033178E-2,null,9.72000000730125,9.7200000859719555,9.7199999489979376,9.7200000070307659,null,3727581.22,null,37719.659999999996,12573.22,12573.22,12573.22,null,0,156927,null,0.95976122972058464,null,0,null,9.8183574158860587,12.391713455692534,10.74834713359602,9.7543002771623364,null,9.7200000079404933,0,0,0,0,0,9.8357407945565786E-2,null,9.7200000079404916,9.7200005392252677,9.7200001245292533,9.7199999972309019,null,5875705.1099999994,null,59456.700000000004,19818.900000000001,19818.900000000001,19818.900000000001,null,0,247360,null,0.95976123322444384,null,0,null,13.617669935541832,19.312634412813217,15.675783928306869,13.475908270205421,null,13.39999998901517,0,0,0,0,0,0.21766994652666644,null,13.399999989015166,13.399999104847028,13.399999827726996,13.400000005746126,null,4879456.0299999993,null,79262.009999999995,26420.67,26420.67,26420.67,null,0,371361,null,0.96579219401005922,null,0,null,328794,69255,69255,12466,479770,null,106932,19698,19698,5628,151956,null,null,"Hourly rate (£ per hour)",{"$f":"IF($ES$13=\"\", \"\", INDEX(DD:DD, MATCH($ES$13, $B:$B,0)))","v":""},{"$f":"IF($ES$13=\"\", \"\", INDEX(DE:DE, MATCH($ES$13, $B:$B,0)))","v":""},"","","","","",""]
[null,310,"Harrow",null,6.6631763757555538,6.640247215407368,12.237812233285917,6.564177909284278,null,5.919999998559546,6.9999998559546472E-2,0.13000000144045351,0.13000000144045351,0,0,8.4376365729997349E-2,0.32880001002555653,null,5.919999998559546,5.92,5.92,5.919999998235391,null,17589950,null,913045.8,182609.16,18260.919999999998,712175.72,null,0,760872,null,0.96040876058767266,null,5.2800000230472557E-2,null,9.305583825253315,9.3055837798523022,9.305580463044727,9.3055839231051181,null,8.6499999545989876,6.9999963679189176E-2,0.12999994551878377,0.12999994551878377,0,0,0,0.3255840159375718,null,8.6499999545989859,8.6499999545989876,8.649999205482624,8.6499999738071072,null,1977929.3699999999,null,71712.94,14342.59,1434.26,55936.09,null,0,85373,null,0.96032856813759704,null,3.6748314223171687E-2,null,9.305584066703414,9.305584066703414,9.3055835989232456,9.3055840786977786,null,8.65,7.000000333463717E-2,0.12999999666536283,0.12999999666536283,0,0,0.32558407003805151,null,8.65,8.6499999833268149,8.649999874951126,8.6500000074815571,null,5385893.29,null,195274.06,39054.81,3905.48,152313.76999999999,null,0,232469,null,0.96032859305504792,null,3.6748329263686548E-2,null,12.623988005308524,12.623987815518376,12.623985917648859,12.623988107503459,null,12.5,0,0,0,0,0,0.12398800530852348,null,12.5,12.5,12.5,12.5,null,8166112.5,null,81000,16200,1620,63180,null,0,343629,null,0.9599990878561615,null,0,null,151392,20805,20805,3745,196747,null,83482,10787,10787,10318,115374]
[null,311,"Havering",null,6.2567806883027082,6.3223644116312006,0,6.1996243613239912,null,5.780000000460686,0.12013380232008242,7.6060057531959407E-2,0,0,0,0,0.28058682798998186,null,5.780000000460686,5.7799999985160539,0,5.7800000021554361,null,20755810.009999998,null,974501,469750.5,0,504750.5,null,0,890166,null,0.97762198254729837,null,3.2829232859219064E-2,null,9.0736033965801486,8.7799999999999994,0,9.1316848137490467,null,8.7800000088081003,0,0,0,0,0,0,0.29360338777205008,null,8.7800000088080985,8.7799999999999994,0,8.7800000105505429,null,2392342.9699999997,null,80000,0,0,80000,null,0,100476,null,0.98948782950710479,null,0,null,8.8142172746255856,8.5841176470588234,0,8.8614099207386179,null,8.2899999979977519,0,0,0,0,0,0.52421727662783169,null,8.2899999979977519,8.2899999999999991,0,8.289999997587099,null,8280696.96,null,523629,50000,0,473629,null,0,363930,null,0.96120144761456772,null,0,null,11.974230837577126,0,0,11.974230837577126,null,11.359999995936796,0,0,0,0,0,0.61423084164033059,null,11.359999995936796,0,0,11.359999995936796,null,12301622.33,null,665144,0,0,665144,null,0,538198,null,0.96178560944394598,null,0,null,202060,44631,44631,8032,299354,null,145390,22043,22043,11256,200732]
[null,312,"Hillingdon",null,6.6181546726566918,6.5120224720005258,10.418812275559755,6.5425533263591804,null,5.8500000000000005,0.51056033758378594,0,0,0,0,0.10500171285912152,0.15259262221378475,null,5.8500000000000005,5.8500000002499011,5.850000022984152,5.8499999984033044,null,23622192.16,null,557503.31000000006,304785.37,3206.23,249511.71,null,89319.09,995224.44,null,0.96000003379981425,null,8.0269710605046271E-2,null,9.4407857891563047,9.4296889839701112,9.6507858633265737,9.650786165735278,null,8.4399999874639455,0.93000002890257039,0,0,0,0,0,7.0785772789789966E-2,null,8.4399999874639455,8.4400000058659934,8.4399997241547791,8.4399994369448628,null,2690798.7399999998,null,20327.670000000002,16280.68,2850.15,1196.8399999999999,null,5117.59,113145.68,null,0.96026461446370681,null,9.9252937809834102E-2,null,9.4412826918773103,9.3700000114540529,9.3699999823113096,14.172473434615835,null,8.4400000120046084,0.93000000462677601,0,0,0,0,7.1282675245926588E-2,null,8.4400000120046084,8.4400000057928555,8.4400001415095165,8.4400001010971568,null,7493122.5800000001,null,57004.25,0,0,57004.25,null,14251.06,315079.03999999998,null,0.9603150616814814,null,9.9252935216228647E-2,null,12.846173034161144,0,0,12.846173034161144,null,12.540000004592121,0,0,0,0,0,0.30617302956902126,null,12.540000004592121,0,0,12.540000004592121,null,10923053.529999999,null,266694.13,0,0,266694.13,null,15522.82,466886.52,null,0.95999953036979913,null,0,null,259641,27603,10000,3386,300630,null,180096,32210,10000,12194,234500]
[null,313,"Hounslow",null,6.7776865570454143,6.6254635997377536,0,6.8793498155352264,null,6.3999999979668409,4.2532316416315441E-2,0,0,0,0,0,0.33515424266225974,null,6.3999999979668409,6.3999999966150263,0,6.3999999988696592,null,19012372.469999999,null,989064.08,238815.23,0,750248.85,null,0,619818.56999999995,null,0.96824093672077349,null,6.601801021837439E-3,null,10.478618676383265,0,0,10.449727968408599,null,9.7400000006601779,4.2508445418750866E-2,0,0,0,0,0,0.6961102303043355,null,9.7400000006601779,0,0,9.7400000006601779,null,2963594.01,null,210885.39,8752.39,0,202133,null,0,92209.88,null,1.0323762242742132,null,4.3453522839317664E-3,null,9.9050352947463463,0,0,9.9050352947463463,null,9.739999994503874,4.2508453834307743E-2,0,0,0,0,0.1225268464081623,null,9.739999994503874,0,0,9.739999994503874,null,4627718.24,null,57962.61,0,0,57962.61,null,0,143987.79,null,0.97586554628042821,null,4.3453531431939555E-3,null,13.362120594576188,0,0,13.362120594576188,null,13.309999993396689,4.253997246885053E-2,0,0,0,0,9.5806287106485824E-3,null,13.309999993396689,0,0,13.309999993396689,null,6875131.2300000004,null,4933,0,0,4933,null,0,214163.36,null,0.964077964976637,null,"No Base Rate",null,194370,28762.2,1,2587.8000000000002,225721,null,140700,34706,0.01,7504,182910.01]
[null,314,"Kingston upon Thames",null,7.0966745990475211,6.7255871778210965,13.170022742040286,6.8599297250689668,null,6.5600000011179453,4.1308089904937201E-2,2.0178912611501766E-2,0,0,0,0.1717213445326857,0.30346625088045176,null,6.5600000011179453,6.56,6.56,6.5600000015995565,null,12153024.6,null,542900,54290,162870,325740,null,0,293200,null,0.97534551699562511,null,9.2859810013506249E-3,null,9.8939320135801179,10.342859649122808,19.73701754385965,9.7523218405508718,null,9.5999999843651516,7.699850304140804E-2,0,0,0,0,0,0.21693352617355763,null,9.5999999843651516,9.6,9.6,9.599999982665878,null,1237875.55,null,27750,4775,10325,12650,null,0,75450,null,0.98056808856096311,null,7.9568580217938712E-3,null,9.7557051815271354,9.7317149122807027,23.245789473684212,9.7271980014875492,null,9.6000000000000014,3.203603946971402E-2,0,0,0,0,0.12366914205742009,null,9.6000000000000014,9.6,9.6,9.6,null,5276744.3100000005,null,67750,4775,14325,48650,null,0,75450,null,0.96686869985402712,null,3.3259883308615346E-3,null,13.406809868441737,0,0,13.406809868441737,null,13.349999993296771,1.8098721285121827E-2,0,0,0,0,3.8711153859843903E-2,null,13.349999993296771,0,0,13.349999993296771,null,7977108.6500000004,null,23100,0,0,23100,null,0,51300,null,0.97575035432618173,null,"No Base Rate",null,119284,10944,10944,1973,143145,null,77854,10787,10787,4690,104118]
[null,315,"Merton",null,6.7838215953978667,6.9113271902802946,0,6.627981423874898,null,6.2299999999999995,0.19638316641585801,0.17599999817924764,0,0,0,0,0.18143843080276062,null,6.23,6.2299999991723851,0,6.2300000010115291,null,14504735.960000001,null,398601,199300.5,0,199300.5,null,29863.7,622160.38,null,0.96008689211603349,null,5.6401325901833249E-2,null,9.9219108250000687,9.8800000000000008,0,9.926543698297742,null,9.8800000279405307,0,0,0,0,0,0,4.1910797059538478E-2,null,9.8800000279405307,9.8800000000000008,0,9.8800000310291107,null,1414432.66,null,6000,0,0,6000,null,0,58925.15,null,0.96422845724004558,null,0,null,9.8488548575841701,0,0,9.8488548575841701,null,9.7900000018112046,0,0,0,0,0,5.8854855772966376E-2,null,9.7900000018112046,0,0,9.7900000018112046,null,5405245.9900000002,null,32494.89,0,0,32494.89,null,13736.51,227252.22,null,0.95954659586211,null,0,null,13.406628145900022,0,0,13.406628145900022,null,13.389999998337185,0,0,0,0,0,1.6628147562837352E-2,null,13.389999998337185,0,0,13.389999998337185,null,8052610.7599999998,null,10000,0,0,10000,null,16153.81,336537.79,null,0.96022079625005186,null,0,null,148770,10488,10488,1887,171633,null,78792,7504,7504,5628,99428]
[null,316,"Newham",null,7.138140155254086,6.4778755351139603,9.5607459136971009,6.433259659857824,null,5.91,6.4770218992584505E-2,0.17747524118945462,0,0,0,0.66774038342303021,0.31815431164901664,null,5.91,5.91,5.91,5.91,null,27498864.920000002,null,1282830,641415,282223,359192,null,0,693273,null,0.95999992935034628,null,3.9375129251567817E-2,null,9.2352016084147479,10.496046747721833,9.3295237849817045,9.1167027434457832,null,8.85,0.19724520090698247,0,0,0,0,0,0.18795640750776532,null,8.85,8.85,8.85,8.85,null,5933192.4500000002,null,123262,61631,27118,34513,null,0,163864,null,0.96000016719488013,null,2.1801686206891876E-2,null,9.2352023332177477,11.916960466623461,9.4226811665951562,8.9866600176984957,null,8.8500000000000014,0,0,0,0,0,0.38520233321774688,null,8.8500000000000014,8.85,8.85,8.85,null,5436192.1500000004,null,236614,118308,52055,66251,null,0,151260,null,0.96000024253822747,null,0,null,12.691197977219813,0,0,12.691197977219813,null,12.16,0,0,0,0,0,0.53119797721981299,null,12.16,0,0,12.16,null,8137204.4800000004,null,355466,0,0,355466,null,0,252099,null,0.95999984699090868,null,0,null,114895,27480,25174,37685,205234,null,156478,37426,34291,51329,279524]
[null,317,"Redbridge",null,6.1660078930701756,6.1673149842936974,0,6.1651938629381506,null,5.8,0.15,0,0,0,0,0,0.21600789307017587,null,5.8,5.7999999987178317,0,5.8000000007985077,null,24183938.030000001,null,877970,338980.48,0,538989.52,null,260000,1325836.75,null,0.95993466404529093,null,2.5210084033613443E-2,null,9.0071193969718237,0,0,9.0071193969718237,null,8.6199999954213578,0.12999999640249502,0,0,0,0,0,0.25711940514797083,null,8.6199999954213578,0,0,8.6199999954213578,null,2675465.36,null,78618.75,0,0,78618.75,null,4000,104551.69,null,0.96991411110857451,null,1.4857142459882193E-2,null,8.8992446564712626,0,0,8.8992446564712626,null,8.6200000038707891,0.12999999612921007,0,0,0,0,0.14924465647126403,null,8.6200000038707891,0,0,8.6200000038707891,null,7233665.5999999996,null,123381.25,0,0,123381.25,null,100000,164080.60999999999,null,0.9699147141881963,null,1.4857142414766867E-2,null,12.110999657284978,0,0,12.110999657284978,null,11.810000005139496,0.11999999910617457,0,0,0,0,0.18099965303930707,null,11.810000005139496,0,0,11.810000005139496,null,10677700.029999999,null,162000,0,0,162000,null,118048,115471.96,null,0.97011826784946031,null,"No Base Rate",null,161667.72,35772.51,56140.42,5513.35,259094.00000000003,null,132053.63,16723.86,26245.97,12576.54,187600]
[null,318,"Richmond upon Thames",null,7.0416642851811746,6.8482746339533049,14.936018893387315,6.8871331124333315,null,6.6700000013627969,5.033286512215579E-2,0,0,0,0,9.2790579047806479E-2,0.2285408396484151,null,6.6700000013627969,6.6700000000000008,6.67,6.6700000017625944,null,14998117.670000002,null,503100,50310,150930,301860,null,0,368300,null,0.97323156060520721,null,7.4896387012571043E-3,null,9.8680894544052453,10.452982456140353,10.797649122807018,9.7703911953797551,null,9.64,0.11868131868131868,0,0,0,0,0,0.1094081357239252,null,9.64,9.64,9.64,9.64,null,1012365.6000000001,null,11350,2635,2905,5810,null,0,48850,null,0.9789771284132186,null,1.216161434169632E-2,null,9.7355813391477071,10.092187134502923,12.183552631578948,9.7093503081540522,null,9.6400000036042499,2.1063498388089977E-2,0,0,0,0,7.4517837155368527E-2,null,9.6400000036042499,9.64,9.64,9.6400000036914619,null,5360930.8999999994,null,41350,2635,7905,30810,null,0,48850,null,0.96583148205830449,null,2.1802463449025239E-3,null,13.408072528120506,0,0,13.408072528120506,null,13.350000000000001,1.6875777402539906E-2,0,0,0,0,4.119675071796506E-2,null,13.350000000000001,0,0,13.350000000000001,null,8079161.6100000003,null,24900,0,0,24900,null,0,49800,null,0.98227637568648396,null,"No Base Rate",null,91297,10881.5,10881.5,1961,115021,null,63784,4221,4221,3752,75978]
[null,319,"Sutton",null,6.9716430060288008,6.7358251205703503,13.106310471692934,6.8172544440931659,null,6.5500000020290114,2.469615049906574E-2,0.12475790548419409,0,0,0,0.18765959441283359,8.4529353603696372E-2,null,6.5500000020290106,6.55,6.55,6.5500000034779928,null,16971600.809999999,null,208301.84,0,0,208301.84,null,202280,711000,null,0.97253103244320716,null,2.2308393294304174E-2,null,9.8717612468224107,0,0,9.8717612468224107,null,9.6100000058291073,0.13384122331945422,0,0,0,0,0,0.1279200176738487,null,9.6100000058291073,0,0,9.6100000058291073,null,1671584.2200000002,null,21945.05,0,0,21945.05,null,0,604500,null,0.9630986582265767,null,1.3735981546894475E-2,null,9.7421748399470456,0,0,9.7421748399470456,null,9.6099999986492559,4.2548415031017795E-3,0,0,0,0,0.12791999979468702,null,9.6099999986492559,0,0,9.6099999986492559,null,7117751.0899999999,null,94703.41,0,0,94703.41,null,69200,0,null,0.95957524670066863,null,4.4255551510161058E-4,null,13.25677827897186,0,0,13.25677827897186,null,13.059999999999999,2.2807079547251235E-2,0,0,0,0,0.17397119942460851,null,13.059999999999999,0,0,13.059999999999999,null,10550073.75,null,140291.68,0,0,140291.68,null,103820,0,null,0.96022396852654468,null,"No Base Rate",null,276296.09999999998,87469.4,21868,87580.5,473214,null,100159.64,17138.919999999998,4285,17174.78,138758.34]
[null,320,"Waltham Forest",null,6.5210810939802633,6.5089744517755665,9.7622015271040841,6.196852328021774,null,5.6900000015008478,0.17000000150084821,0.14021922589551486,0,0,0,0.1947629702926609,0.32609889479039078,null,5.6900000015008478,5.69,5.69,5.6900000029722779,null,20638270.350000001,null,1086382,490392.84,29332.31,566656.85,null,0,651829,null,0.97029419074963241,null,5.1701315495663758E-2,null,9.0041301785939307,9.1594710280622067,8.5399999999999991,8.999011467055638,null,8.5399999936675552,0,0,0,0,0,0,0.46413018492637587,null,8.5399999936675552,8.5400000000000009,8.5399999999999991,8.5399999908145983,null,2697220.65,null,146588,46644.31,0,99943.69,null,0,87953,null,0.97027264855538053,null,0,null,9.0041299107060677,10.56754382849169,8.5400000000000009,8.8621354580917018,null,8.5399999977413668,0,0,0,0,0,0.46412991296470102,null,8.5399999977413668,8.5399999999999991,8.5400000000000009,8.5399999974347338,null,7562095.7000000002,null,410983,159831.28,0,251151.72,null,0,246590,null,0.97027261968815393,null,0,null,12.27300000697567,21.59183889989767,0,12.071161731813232,null,11.640000006633622,0,0,0,0,0,0.63300000034204618,null,11.640000006633624,11.640000156453436,0,11.640000003388652,null,11230062.370000001,null,610707,203548.64,0,407158.36,null,6947.63,366424,null,0.97000009877093274,null,0,null,266208,117337.73,12907.27,11725,408178,null,122878,10083.5,30250.5,8442,171654]
[null,330,"Birmingham",null,6.5013008367394818,6.1349143802557897,10.937630049109769,5.8278824482856635,null,5.6600000006622224,0.1310449455728821,4.1193248703165944E-2,0,0,0,0.50601548908894689,0.16304715271226478,null,5.6600000006622215,5.6600000001053914,5.6600000026259449,5.6600000005520723,null,84226424.859999999,null,2166666,972222,972222,222222,null,0,2426547.2000000002,null,0.96698149554806123,null,2.953209188635874E-2,null,8.9465775922669675,10.171338134584772,10.447523313264924,8.6406626319782429,null,8.51,0,0,0,0,0,0,0.43657759226696791,null,8.51,8.5100000154797364,8.509999968612231,8.5099999995296134,null,17868174.68,null,916668,472223,222223,222222,null,0,1819910.4,null,0.99406417691855198,null,0,null,8.8092232344734995,9.7439769469770017,8.51,8.6710067479003818,null,8.51,5.0976562122975119E-2,0,0,0,0,0.24824667235052611,null,8.51,8.51,8.51,8.51,null,23948433.029999997,null,694444,472222,0,222222,null,0,1213273.6000000001,null,0.97880258160816658,null,5.9545265371376997E-3,null,12.074977187711886,11.92,14.435873988396192,11.92,null,11.92,0,0,0,0,0,0.15497718771188582,null,11.92,11.92,11.920000000000002,11.92,null,36320740.640000001,null,472222,0,472222,0,null,0,606636.80000000005,null,0.97693990191843738,null,0,null,2241867,240852.46,319269.53999999998,50410,2852399,null,840448,116968.6,155051.4,86296,1198764]
[null,331,"Coventry",null,5.9040338295372159,5.9455858224805711,11.108580358422941,5.6994946605352359,null,5.2099999995657704,0.33812731505565735,0.12293462577320693,0,0,0,9.4427076548361466E-2,0.13854481259422002,null,5.2099999995657704,5.21,5.21,5.2099999991997707,null,22571767.099999998,null,542400,177880.85,2853.15,361666,null,0,962112.37,null,0.97969759746860963,null,8.1300812030414921E-2,null,8.3428023396187196,8.3784202831640506,8.5969245364381202,8.3250745997369187,null,7.7400000046518178,0.57513455328082408,0,0,0,0,0,2.7667781686079442E-2,null,7.7400000046518169,7.74,7.74,7.7400000053559852,null,3932505.4399999995,null,13085.02,1078.71,641.62,11364.69,null,0,140826.01,null,0.97122262393698733,null,6.9167197388543225E-2,null,8.2474731014768281,8.2474731160282921,8.24747309139069,8.2474731006650668,null,7.7399999938356805,0.4755470885198379,0,0,0,0,3.1926019121309088E-2,null,7.7399999938356805,7.7400000149549264,7.7399999036190819,7.7399999969244417,null,7996548.5300000003,null,31074.98,2561.7800000000002,1523.74,26989.46,null,0,245132.28,null,0.96012492450254117,null,5.7883800525124804E-2,null,11.252245300614209,13.77,13.77,11.25224055105533,null,10.589999997170365,0.65183224947338148,0,0,0,0,1.041305397046258E-2,null,10.589999997170365,10.59,10.59,10.589999997170361,null,11918677.109999999,null,11040,0,0,11040,null,0,497024.43,null,0.96008918947220212,null,"No Base Rate",null,641165,66516.710000000006,157967.29,20201,885850,null,241066,18899.8,44884.2,20636,325486]
[null,332,"Dudley",null,5.5577027132688661,5.4860084932097912,11.044809369693626,5.4383756338458076,null,5.2099999991563433,2.6487939337202056E-2,0.19801952892202096,0,0,0,0.10760212615561709,1.5593119697682924E-2,null,5.2099999991563433,5.2100000000869526,5.2100000063100671,5.2099999984712007,null,19050522.280000001,null,53600,26800,0,26800,null,361079.4,532300,null,0.97287994933553879,null,4.1311465593769768E-2,null,7.9267964175014427,8.0827000704931677,7.8900002422180338,7.9110693611282139,null,7.8900000066902551,0,0,0,0,0,0,3.6796410811186911E-2,null,7.8900000066902551,7.8900000607297001,7.8900002422180338,7.889999992338411,null,3537980.94,null,16500,8250,0,8250,null,67421.009999999995,26600,null,0.99841174716289427,null,0,null,7.9074465817388218,7.9813664541243634,7.889999918933051,7.8999897910388777,null,7.8900000000000006,0,0,0,0,0,1.74465817388215E-2,null,7.8900000000000006,7.8900000276867956,7.889999918933051,7.8899999998789125,null,7461920.1600000001,null,16500,8250,0,8250,null,125210.45,26600,null,0.99379977487485616,null,0,null,10.842422655708587,10.842422655708587,0,10.842422655708587,null,10.810000000970739,0,0,0,0,0,3.2422654737847792E-2,null,10.810000000970739,10.810000000970739,0,10.810000000970739,null,11135855.560000001,null,33400,16700,0,16700,null,172628.78,0,null,1.0000000000881688,null,0,null,294126,18705,18705,3369,334905,null,189476,26264,26264,22512,264516]
[null,333,"Sandwell",null,5.580684057924163,5.4052974419720581,0,5.7332275399102244,null,5.2999999990155988,8.6367225826473715E-2,0,0.16478479320846168,0,0,0,2.9532039873628662E-2,null,5.2999999990155988,5.3,0,5.2999999981594108,null,22556458.850000001,null,120000,0,0,120000,null,770000,1001937.8,null,0.96009672442261995,null,4.5243224869048991E-2,null,9.0625287952422315,0,0,9.0625287952422315,null,8.8199999959578523,0,0,0,0,0,0,0.24252879928437837,null,8.8199999959578523,0,0,8.8199999959578523,null,4364017.8099999996,null,120000,0,0,120000,null,0,221408.92,null,1.0251729406382615,null,0,null,8.9939811230481492,0,0,8.9939811230481492,null,8.82,0,0,0,0,0,0.17398112304814928,null,8.82,0,0,8.82,null,6083418.5999999996,null,120000,0,0,120000,null,0,253475.88,null,1.017418679077845,null,0,null,12.128762877141726,0,0,12.128762877141726,null,11.969999993517183,0,0,0,0,0,0.15876288362454391,null,11.969999993517183,0,0,11.969999993517183,null,9047454.7100000009,null,120000,0,0,120000,null,0,376977.28,null,1.0048685068054455,null,0,null,521607,77603,77603,13971,690784,null,207298,25795,25795,12194,271082]
[null,334,"Solihull",null,5.5806769385697619,5.7085890581498724,0,5.4449515615134212,null,5.1899999975996867,0.1315082581254996,0.12724057553628243,0,0,0,0,0.13192810730829388,null,5.1899999975996867,5.1899999980018068,0,5.1899999971730013,null,15890106.119999999,null,384740,193234,0,191506,null,56351,495769,null,0.97053722841852552,null,4.7487752083055314E-2,null,8.2100990376350005,8.182584170247285,0,8.215980053088634,null,7.76,0.26,0,0,0,0,0,0.19009903763500158,null,7.76,7.7599999204674912,0,7.7600000169992427,null,2290499.9699999997,null,54292,8177,0,46115,null,0,14252,null,0.9939587212633173,null,3.2418952618453872E-2,null,7.9500995993123267,7.9501076522785734,0,7.9500989123542887,null,7.760000002279031,0,0,0,0,0,0.1900995970332954,null,7.760000002279031,7.7600000057990588,0,7.7600000019787538,null,6809914.4900000002,null,166825,13113,0,153712,null,70119,201840,null,0.97215511556974132,null,0,null,10.903138620322707,10.903221006869778,0,10.903138247907698,null,10.8,0,0,0,0,0,0.10313862032270625,null,10.8,10.8,0,10.8,null,10323488.880000001,null,98588,444,0,98144,null,0,312440,null,0.9708939109815411,null,0,null,289577,202591,20000,20036,532204,null,133196,9380,30016,13132,185724]
[null,335,"Walsall",null,6.2984557967180006,5.6271788570837016,9.8248531613497647,5.6438928130144124,null,5.58,3.611800864748476E-2,0,0,0,0,0.66253624824185176,1.980153982866489E-2,null,5.58,5.5799999999999992,5.58,5.58,null,20610140.939999998,null,65000,15000,15000,35000,null,0,578469.02,null,0.97003776706033062,null,6.4311342090518087E-3,null,8.0667954276282288,8.0649486058719031,8.0578291256596781,8.0713115467590981,null,8.0399999999999991,0,0,0,0,0,0,2.6795427628229521E-2,null,8.0399999999999991,8.0399999999999991,8.0400000000000009,8.0399999999999991,null,4500767.88,null,15000,2500,2500,10000,null,0,172644,null,0.96262475270026582,null,0,null,8.0640843723732978,0,0,8.0560562482488649,null,8.0399999999999991,0,0,0,0,0,2.4084372373298139E-2,null,8.0399999999999991,0,0,8.0399999999999991,null,5007396.42,null,15000,2500,2500,10000,null,0,193767,null,0.96230123775337673,null,0,null,10.997370447923783,0,0,10.997370447923783,null,10.99000000737044,0,0,0,0,0,7.3704405533431949E-3,null,10.99000000737044,0,0,10.99000000737044,null,7455456.6500000004,null,5000,0,0,5000,null,0,305702,null,0.96046903475316892,null,0,null,486113.1,85918.95,85918.95,15464.1,673415.09999999986,null,196042,21105,21105,15946,254198]
[null,336,"Wolverhampton",null,6.4001834997320559,5.9782730390570213,10.064194244604316,5.6700000076359167,null,5.2300000013444183,0.35000000336104714,0.14510548176040358,0,0,0,0.58507766640611825,9.0000346860069372E-2,null,5.2300000013444183,5.230000002142134,5.23,5.2300000008484346,null,18774455.719999999,null,267774.71999999997,126043.59,35653.5,106077.63,null,14567.49,535547.38,null,0.97000028602511501,null,8.6479714005598396E-2,null,8.3000000222175423,8.2999999999999989,8.3000000000000007,8.3000000349583747,null,8.2100000044435095,0,0,0,0,0,0,9.0000017774033381E-2,null,8.2100000044435095,8.2099999594486643,8.2099999999999991,8.210000017479187,null,3695278.31,null,40508.54,6658.23,8105.4,25744.91,null,0,117024.65,null,0.96962617081980629,null,0,null,8.2999999999999989,8.3000000000000007,8.2999999999999989,8.3000000000000007,null,8.2099999919993341,0,0,0,0,0,9.0000008000665654E-2,null,8.2099999919993341,8.2099998728398678,8.2099998178207727,8.2100000066019714,null,4104658.46,null,44996.26,2123.31,1976.08,40896.870000000003,null,0,129989.18,null,0.96962616822429892,null,0,null,11.349999990818675,0,0,11.349999990818675,null,11.259999996327471,0,0,0,0,0,8.9999994491204938E-2,null,11.259999996327471,0,0,11.259999996327471,null,6132012.46,null,49012.53,0,0,49012.53,null,0,190604.3,null,0.97008546930074158,null,0,null,535241,48129.5,53461.5,9143,645975,null,181972,25774.3,28629.7,18760,255136]
[null,340,"Knowsley",null,5.6911113751612232,5.864066356889432,0,5.5046070154616222,null,5.1199999969975352,5.5923471772238206E-2,0.35261643928123892,0.14380606118107814,0,0,0,1.8765405929132669E-2,null,5.1199999969975352,5.1199999980710649,0,5.1199999958399047,null,11335378.23,null,37500,18750,0,18750,null,67229.850000000006,476120.2,null,0.97692046413811406,null,9.7375226269798679E-2,null,8.0598351068929137,8.6057506648629261,0,8.0058434583024756,null,7.94,0,0,0,0,0,0,0.11983510689291535,null,7.9399999999999995,7.9400000710133964,0,7.9399999929766967,null,2484664.1999999997,null,37500,18750,0,18750,null,107585.33,80172.67,null,0.98403221242511785,null,0,null,7.8514372550291727,8.1313180941014949,0,7.8237567335909999,null,7.7899999967233464,0,0,0,0,0,6.1437258305825831E-2,null,7.7899999967233464,7.7899999799760042,0,7.7899999983796775,null,4754850.8499999996,null,37500,18750,0,18750,null,249800.97,207984.18,null,0.96729425068705643,null,0,null,11.226403387692661,0,0,11.198201694598376,null,11.170000001504091,0,0,0,0,0,5.6403386188570513E-2,null,11.170000001504091,0,0,11.170000001504091,null,7426415.8300000001,null,37500,18750,0,18750,null,86763.41,232366.37,null,0.97484149278338683,null,0,null,255930,68970,68970,12415,406285,null,125692,22043,22043,12194,181972]
[null,341,"Liverpool",null,6.142781844361882,5.7389250081340224,13.649096916555612,5.7389250010412738,null,5.3399999998876648,0.19500000279902657,0,0,0,2.0800000772868341E-2,0.4038568403020299,0.18312500060029291,null,5.3399999998876648,5.3400000023483285,5.3399999860649707,5.3399999997622656,null,31831376.990000002,null,978096.74,311924.03000000003,49937.1,616235.61,null,646678,1304128.98,null,0.99997610642140899,null,3.8842291557924631E-2,null,8.2074000042530564,8.2074000171364077,8.207400040701188,8.2073999983445169,null,7.9500000085061133,0,0,0,0,0,0,0.25739999574694311,null,7.9500000085061133,7.9500000239931028,7.950000049514828,7.9500000016532812,null,9346218.7599999998,null,302605.87,48276.37,20793.77,233535.73,null,34563.5,403474.5,null,0.96000001288805115,null,0,null,8.2074000042530564,8.2074000171364077,8.207400040701188,8.2073999983445169,null,7.9500000085061133,0,0,0,0,0,0.25739999574694311,null,7.9500000085061133,7.9500000239931028,7.950000049514828,7.9500000016532812,null,9346218.7599999998,null,302605.87,48276.37,20793.77,233535.73,null,34563.5,403474.5,null,0.96000001288805115,null,0,null,10.522499995672092,10.522499968415032,10.522500033515866,10.522499997937086,null,10.16999999752691,0,0,0,0,0,0.35249999814518179,null,10.16999999752691,10.169999985273266,10.170000033290927,10.169999996875585,null,16449051.560000001,null,570136.74,90957.03,39177.339999999997,440002.37,null,1225187,760182.32,null,0.95999997495337708,null,0,null,827715,388481,388481,69928,1674605,null,390208,61908,61908,31892,545916]
[null,342,"St Helens",null,5.5481782894185683,5.748443307946558,7.5130764012683589,5.3732418284151287,null,5.16,2.5811469035629576E-2,0.16108140178259125,0,0,0,5.356577417197448E-2,0.14771964442837285,null,5.16,5.16,5.16,5.16,null,11409910.810000001,null,312097.19,92111,9363.7800000000007,210622.41,null,150000,486781,null,0.96000045990242522,null,3.4953546916607861E-2,null,8.0736073648416991,8.0735794038104149,8.0733341722771037,8.0736112462268501,null,7.9800000199248844,0,0,0,0,0,0,9.3607344916813454E-2,null,7.9800000199248844,7.9799998489129287,7.9800016778875396,7.9800000093645558,null,2322924.46,null,27248.47,991,267,25990.47,null,0,97922,null,0.9600008757243399,null,0,null,8.0735930050082771,8.0736022731058643,8.0736677208034919,8.0735918816181673,null,7.9799999916311561,0,0,0,0,0,9.3593013377121448E-2,null,7.9799999916311561,7.9800000634591246,7.9799992952845722,7.9799999960666987,null,5530512.7400000002,null,64864.33,2360,638,61866.33,null,0,233140,null,0.95999916825306508,null,0,null,11.020810813674997,0,0,11.020810813674997,null,10.96,0,0,0,0,0,6.0810813674996286E-2,null,10.96,0,0,10.96,null,8273660.1600000001,null,45905.84,0,0,45905.84,null,0,346648,null,0.96000094195775232,null,0,null,278485,102087,11343,10209,402124,null,121940,14070,14070,11256,161336]
[null,343,"Sefton",null,5.8443627878643136,5.7382371554507801,11.41908126752012,5.5497758544895888,null,5.3300000003591927,0.10000010677842748,0.10000013943238083,0,0,0,0.21436242145430304,0.10000011984000882,null,5.3300000003591927,5.3299999969588985,5.3300000251184523,5.3300000014061846,null,17591630.039999999,null,306242,131530,11147,163565,null,39757,205506,null,0.98826315098343653,null,3.6166408190462386E-2,null,7.7500001439161599,7.7500049378346372,7.7499956975738611,7.7499995932230155,null,7.65,0,0,0,0,0,0,0.1000001439161602,null,7.65,7.6499999604973237,7.6500001434142035,7.6499999953949773,null,3189356.91,null,41691,6329,2789,32573,null,0,83382,null,0.97484278539825908,null,0,null,7.7499996927774255,7.7500283127218692,7.7499770477460883,7.7499990313529068,null,7.6499999935058636,0,0,0,0,0,9.9999699271560785E-2,null,7.6499999935058645,7.6499999110595125,7.6499997299734828,7.6500000005250124,null,7656908.0200000005,null,100090,3374,1481,95235,null,0,200181,null,0.97484272865124832,null,0,null,10.679999629433288,10.680179135079721,0,10.679999323758576,null,10.480000005503465,0,0,0,0,0,0.19999962392982237,null,10.480000005503465,10.480001079126987,0,10.480000003675226,null,11425527.09,null,218044,371,0,217673,null,0,152361,null,0.98706096390326137,null,0,null,316032,115425,0,10391,441848,null,205422,53466,0,20636,279524]
[null,344,"Wirral",null,5.7924327759647296,5.6239011175136442,10.564225835968726,5.6238110414367357,null,5.0300000010956074,0.11400001731060472,0.15600004459124128,0.25500008052718021,0,0,0.16858338063620415,6.884925180389101E-2,null,5.0300000010956083,5.0300000029649743,5.0299999999999994,5.03,null,20896466.900000002,null,251364.56999999998,92952.87,8591.4,149820.29999999999,null,0,653547.85,null,0.97467060625087443,null,9.4509474143040229E-2,null,8.1588492521860037,8.1588492361072067,8.1588493426447624,8.1588492453068362,null,8.090000005755293,0,0,0,0,0,0,6.8849246430711164E-2,null,8.090000005755293,8.0900000254096263,8.0900000471876847,8.0899999927866837,null,4216987.74,null,35888.31,8670.6299999999992,3355.82,23861.86,null,0,93309.61,null,0.9853682671722227,null,0,null,8.1188492562212495,8.1188492995377626,8.1188497928757144,8.1188492485996626,null,8.0500000092803141,0,0,0,0,0,6.8849246940936595E-2,null,8.0500000092803123,8.0500000408408976,8.0500004943300336,8.0500000028299219,null,9107988.8899999987,null,77897.909999999989,4214.4799999999996,696.39,72987.039999999994,null,0,202534.57,null,0.98053734978517515,null,0,null,10.938849243742634,10.93884086057321,10.938837664151999,10.938849256108101,null,10.86999999918857,0,0,0,0,0,6.8849244554063327E-2,null,10.86999999918857,10.869998031764295,10.869991617770328,10.870000003737673,null,13396093.43,null,84849.21,90.94,24.64,84733.63,null,78802,220607.97,null,0.97197805628241385,null,0,null,463251,120653.65,154827.35,24795,763527,null,242942,26703.3,34266.699999999997,14070,317982]
[null,350,"Bolton",null,5.8272784532848592,5.8673272226838442,10.134258298279956,5.5724908959706063,null,5.2299999985006869,0.21200001539294538,0.13232872124705247,0,0,0,0.12610600561762544,0.12684371252654908,null,5.2299999985006869,5.2299999972512596,5.23,5.2299999992985668,null,22812189,null,507607.38,203042.97,15228.22,289336.19,null,0,731600,null,0.97455935859125653,null,6.177043963506177E-2,null,15.978506494775852,15.978506370279655,15.978506577959564,15.978506551410137,null,7.8099999916816287,0,0,0,0,0,3755543.16,0.35850649061666989,null,7.8099999916816287,7.8099999681562373,7.8100000956612634,7.8099999953786829,null,7511086.3099999987,null,172392.65,55165.65,8619.6299999999992,108607.37,null,0,123300,null,1.9067430184696725,null,0,null,8.0485652247764836,8.100815419871104,8.1321652864052254,8.0420629837776829,null,7.5899999943755265,8.3600289622920265E-2,0,0,0,0,0.37496494077803727,null,7.5899999943755274,7.5899999660188024,7.5899997797081173,7.5900000016665112,null,8185938.9500000002,null,400000,32000,8000,360000,null,0,273500,null,0.96044931083251583,null,1.0894532752409545E-2,null,11.00056518777887,10.985695555440808,11.130851295984954,10.999026242758116,null,10.639999998278782,0.11400069778181461,0,0,0,0,0.24656449171827308,null,10.639999998278782,10.640000134704023,10.639999877055859,10.639999996782771,null,12495802.530000001,null,286500,6589.5,4011,275899.5,null,0,405900,null,0.96327190786154726,null,"No Base Rate",null,308267,186162,4560,17163,516152,null,191352,52000,5218,20636,269206]
[null,351,"Bury",null,5.6453028496671793,5.5308773579880581,12.574331983805669,5.5398421147898524,null,5.3000000037755219,0.18000000058730342,0,0,0,0,0.10917341668142372,5.6129428622930286E-2,null,5.3000000037755219,5.3000000038837678,5.3,5.3000000037970887,null,13323338.969999999,null,133800,52400,2600,78800,null,0,551630,null,0.96954981313235666,null,3.2846715409488858E-2,null,7.9382496608802375,7.9764915135940102,7.9384795321637425,7.9377374084558854,null,7.7000000038833107,0.18000000543663414,0,0,0,0,0,5.8249651560292645E-2,null,7.7000000038833107,7.699999035087437,7.7,7.700000016735479,null,2029196.6900000002,null,15000,300,900,13800,null,0,53313,null,0.9752149460540831,null,2.2842640256820052E-2,null,7.9359512907590064,8.4501754385964922,8.7571929824561394,7.9305026465783639,null,7.6999999986419594,0.17999999809874245,0,0,0,0,5.5951294018305557E-2,null,7.6999999986419594,7.7,7.7,7.6999999986313643,null,5802475.2699999996,null,41200,1300,3000,36900,null,0,155257,null,0.97493259100233487,null,2.2842639362080384E-2,null,10.56135344371603,0,0,10.56135344371603,null,10.320000002944964,0.17999999705503469,0,0,0,0,6.1353443716031818E-2,null,10.320000002944964,0,0,10.320000002944964,null,8556976.8899999987,null,50000,0,0,50000,null,94327.18,419124,null,0.96537969170854143,null,"No Base Rate",null,170983,16895,48085,5849,241812,null,129444,7804,22212,9380,168840]
[null,352,"Manchester",null,5.9570138025557346,5.8601481426680531,8.292286967418546,5.9457274361668402,null,5.4200000008595408,0.25431341029980498,0.11022760264458482,0,0,0,6.4813017339052093E-2,0.10765977141275096,null,5.4200000008595408,5.42,5.42,5.4200000024408865,null,34026024.350000001,null,626263,0,0,626263,null,769297,1230562.07,null,0.98438713727578264,null,6.3019868313573688E-2,null,8.7669903013901429,8.7199999999999989,0,8.7693890886073795,null,8.7200000018796118,0,0,0,0,0,0,4.6990299510530249E-2,null,8.7200000018796118,8.7199999999999989,0,8.7200000019755635,null,9278510.7699999996,null,50000,0,0,50000,null,0,73895.23,null,0.99286413379276817,null,0,null,8.7656512280592196,0,0,8.7656512280592196,null,8.7199999963479033,0,0,0,0,0,4.5651231711317679E-2,null,8.7199999963479033,0,0,8.7199999963479033,null,9550673.3000000007,null,50000,0,0,50000,null,0,120479.7,null,0.99271248335891504,null,0,null,12.111910996464974,0,0,12.111910996464974,null,12.06999999916178,0,0,0,0,0,4.1910997303194968E-2,null,12.06999999916178,0,0,12.06999999916178,null,14399561.9,null,50000,0,0,50000,null,0,0,null,1.0034723277932871,null,0,null,1433322,143982,143982,25918,1747204,null,384580,54404,54404,27202,520590]
[null,353,"Oldham",null,5.7128000146620348,5.7128000327606916,0,5.7127999990415272,null,5.56,0.12423605490932207,0,0,0,0,0,2.8563959752713201E-2,null,5.56,5.56,0,5.5600000000000005,null,17678389.079999998,null,88836,41753,0,47083,null,0,644407,null,0.96500000247669504,null,2.1856244833819444E-2,null,8.22316609503061,0,0,8.22316609503061,null,8.14,0,0,0,0,0,0,8.3166095030609927E-2,null,8.14,0,0,8.14,null,4976820.42,null,50848,0,0,50848,null,0,76563,null,0.97546454270825744,null,0,null,8.1455503859892318,0,0,8.1455503859892318,null,8.14,0,0,0,0,0,5.5503859892321421E-3,null,8.14,0,0,8.14,null,5965985.0800000001,null,4068,0,0,4068,null,0,248752,null,0.9662574597851995,null,0,null,11.155778335349552,0,0,11.155778335349552,null,11.1,0,0,0,0,0,5.5778335349552698E-2,null,11.1,0,0,11.1,null,8918672.4000000004,null,44817,0,0,44817,null,0,277221,null,0.97006768133474364,null,0,null,376987,112285,136805,22419,648496,null,164150,17336,21122,15009,217617]
[null,354,"Rochdale",null,5.6824756323001635,5.7455522253778897,10.474359693872778,5.4724123479340072,null,5.2699999984948791,0.1389207681775268,9.0859487482873508E-2,0,0,0,0.12424069776630908,5.8454680378575888E-2,null,5.2699999984948791,5.2699999998790359,5.2699999706027221,5.2699999989771831,null,16067344.699999999,null,167000,50100,8350,108550,null,165032,668518,null,0.96000012987296268,null,4.1779897567142461E-2,null,8.0853468895895855,8.300674690933791,8.1004709523192808,8.077581526066524,null,7.7599999923959286,0.29999999366327412,0,0,0,0,0,2.5346903530382204E-2,null,7.7599999923959286,7.7600000267416149,7.7599998111334152,7.7599999972951492,null,3815850.71,null,12000,3600,600,7800,null,15321,158883,null,0.96754571497878428,null,3.7220842950640487E-2,null,7.8669856228190786,9.6003531276174883,8.2419754093397071,7.8315835579049589,null,7.7599999978054228,0,0,0,0,0,0.10698562501365609,null,7.7599999978054228,7.7599998427048469,7.7599994562322587,7.7600000067771413,null,5657582.5,null,78000,23400,3900,50700,null,136667,214676,null,0.96000471103210394,null,0,null,10.861459003086878,0,0,10.861459003086878,null,10.85,0,0,0,0,0,1.1459003086879138E-2,null,10.85,0,0,10.85,null,8616369.0899999999,null,9100,0,0,9100,null,88420,363079,null,0.96000001904600818,null,0,null,441226,108252,108252,19483,677213,null,180096,28609,28609,15946,253260]
[null,355,"Salford",null,5.6656353030660673,5.8745266739519177,0,5.4763213388361081,null,5,0.19903739461456849,0.35314383406449928,0,0,0,0,0.11345407438699817,null,5,5,0,5,null,21146909.120000005,null,432119,0,159884,272235,null,366509,0,null,0.97001065404983022,null,9.9453026826078289E-2,null,8.247065166752277,0,0,8.247065166752277,null,8.23,0,0,0,0,0,0,1.7065166752276921E-2,null,8.23,0,0,8.23,null,4822689.47,null,10000,0,0,10000,null,0,0,null,0.97024296079438554,null,0,null,7.9265879438303575,0,0,7.9265879438303575,null,7.6999999999999993,0,0,0,0,0,0.22658794383035799,null,7.6999999999999993,0,0,7.6999999999999993,null,5028816.0999999996,null,147983,0,0,147983,null,206431,0,null,0.96972588626014067,null,0,null,10.721599446018432,0,0,10.721599446018432,null,10.49,0,0,0,0,0,0.23159944601843324,null,10.49,0,0,10.49,null,7460645.3499999996,null,164717,0,0,164717,null,280843,0,null,0.95997212656241993,null,0,null,0,0,0,0,0,null,0,0,0,0,0]
[null,356,"Stockport",null,5.7180411289545985,5.4258016984773105,18.754307087183143,5.5342971824960232,null,5.1099999997944971,3.8531675789117363E-2,0.41127271534612353,0,0,0,4.5210496578531267E-2,0.11302624144632817,null,5.1099999997944971,5.1100000012646607,5.1099999348738461,5.1100000007022333,null,21819769.630000003,null,440000,66000,22000,352000,null,562000,1475000,null,0.98875007050301977,null,8.0902916633011676E-2,null,7.8924304264000806,7.8200000619404824,7.8199999779259741,7.9648608261457747,null,7.5100000017383302,0.31000002491605749,0,0,0,0,0,7.2430399745693971E-2,null,7.5100000017383302,7.5100000409606409,7.5099999475741885,7.5100000017383302,null,2699142.92,null,25000,0,0,25000,null,163400,0,null,1.0643556640124601,null,3.9641946785092801E-2,null,7.5585270350989369,7.5410000108304986,7.5410000050744941,7.5760540617848973,null,7.51,3.1000001402162698E-2,0,0,0,0,1.7527033696773903E-2,null,7.51,7.5100000067690624,7.5099999906522488,7.51,null,10756241.09,null,25000,0,0,25000,null,144520,0,null,0.97453528136046397,null,4.1108608137380457E-3,null,10.194182061922927,0,0,10.194181662865322,null,10.1,6.1999996910521764E-2,0,0,0,0,3.2182065012405545E-2,null,10.1,0,0,10.1,null,15788296.979999999,null,50000,0,0,50000,null,100000,0,null,0.9623401681001631,null,"No Base Rate",null,347000,86000,7000,1000,441000,null,160000,64000,5500,5500,235000]
[null,357,"Tameside",null,5.7908670355256424,5.7376766615744659,0,5.8373273069951797,null,5.33,9.9131273850521215E-2,0.10723324864459233,0,0,0,0,0.25450251303052868,null,5.33,5.33,0,5.33,null,15227571.310000001,null,700000,100000,0,600000,null,0,679730,null,0.97984213799080222,null,3.7274374123420211E-2,null,8.0434971658316119,7.8500000000000005,0,8.04388801349962,null,7.75,0.10798669488288316,0,0,0,0,0,0.18551047094872847,null,7.75,7.75,0,7.75,null,2818337.65,null,66535,0,0,66535,null,0,141910,null,0.96444810141865855,null,1.3742285279409296E-2,null,7.878945364804995,7.8082393755420645,0,7.8795115849959947,null,7.75,8.9900539048270875E-2,0,0,0,0,3.9044825756723175E-2,null,7.75,7.75,0,7.75,null,6826938.3500000006,null,34000,0,0,34000,null,110000,265940,null,0.95986413188252717,null,1.1467050965825697E-2,null,10.78311234320152,0,0,10.78311234320152,null,10.639999999999999,9.1184856378173598E-2,0,0,0,0,5.1927486823347573E-2,null,10.639999999999999,0,0,10.639999999999999,null,10192329.139999999,null,49320,0,0,49320,null,111000,394570,null,0.95950534987822156,null,"No Base Rate",null,375972,67476,2520,6299,452267,null,196042,31254,14708,8442,250446]
[null,358,"Trafford",null,5.5293265696453879,5.6127174102260806,0,5.4653286056760439,null,5.15,9.8522292034846526E-2,9.0042887871651003E-2,0,0,0,0,0.19076138973889017,null,5.15,5.15,0,5.15,null,16526847.140000001,null,590549,268660,0,321889,null,0,713235,null,0.96835841850181925,null,3.532132203166248E-2,null,7.9707493609821078,8.0602132063754919,0,7.9622285748082726,null,7.94,0,0,0,0,0,0,3.0749360982107499E-2,null,7.94,7.9399999999999995,0,7.9399999999999995,null,1764395.04,null,6833,2323,0,4510,null,0,73801,null,0.99262134009739833,null,0,null,7.705405628502433,9.8325587703435797,0,7.697333702739841,null,7.51,0,0,0,0,0,0.19540562850243279,null,7.51,7.51,0,7.51,null,8788637.5800000001,null,228675,10275,0,218400,null,0,375721,null,0.95957728873006642,null,0,null,10.445071677765961,0,0,10.445071677765961,null,10.41,0,0,0,0,0,3.5071677765961207E-2,null,10.41,0,0,10.41,null,13263433.050000001,null,44685,0,0,44685,null,0,554505,null,0.9600249703829008,null,0,null,165870,10260,10260,1848,188238,null,95919,15946,15946,7505,135316]
[null,359,"Wigan",null,5.7174601875512518,5.670009492168961,8.9063611162200225,5.6024428126664487,null,5.5000000012614478,7.9690697118883019E-2,0,0,0,0,9.4125425292281475E-2,4.3644063878639873E-2,null,5.5000000012614478,5.5,5.5000000417054009,5.5,null,22489308.09,null,172992,34598.400000000001,25948.799999999999,112444.8,null,0,692151,null,0.96455141719707893,null,1.4282278611252695E-2,null,8.2154023613246245,8.1076904510738856,8.3252363315696645,8.2441586686462305,null,7.9199999917082495,0.16407555691540257,0,0,0,0,0,0.1313268127009713,null,7.9199999917082495,7.92,7.92,7.9199999880797067,null,3899816.2500000005,null,63353,12670.6,9502.9500000000007,41179.449999999997,null,0,205606.5,null,1.0018783367469053,null,2.0296143440091566E-2,null,7.9823073735146872,8.0838824147594597,8.28953634669152,7.9702697791967125,null,7.9200000031942963,2.8730960233493769E-2,0,0,0,0,3.3576410086896623E-2,null,7.9200000031942963,7.9200000000000008,7.9200000000000008,7.9200000034635982,null,10949020.640000001,null,46250,9250,6937.5,30062.5,null,0,205606.5,null,0.97345211872130333,null,3.6145342402057984E-3,null,10.861533902317092,0,0,10.857497036506109,null,10.85,0,0,0,0,0,1.1533902317091725E-2,null,10.85,0,0,10.85,null,16372971.16,null,17405,3481,2610.75,11313.25,null,0,452708,null,0.97412860110467192,null,0,null,317508,138168,46056,16582,518314,null,215740,42075,7639,18760,284214]
[null,370,"Barnsley",null,5.6102859494960011,5.6381409391128594,0,5.5906401915757336,null,5.4099999999999993,0.15166501907511712,0,0,0,0,0,4.862093042088407E-2,null,5.4099999999999993,5.41,0,5.41,null,14903421.34,null,130288,65144,0,65144,null,0,553241,null,0.98253694386970247,null,2.7269714834486456E-2,null,7.6880599179893441,0,0,7.6640299589946723,null,7.6400000000000006,0,0,0,0,0,0,4.8059917989344191E-2,null,7.6400000000000006,0,0,7.6400000000000006,null,2738863.6,null,17229,8614.5,0,8614.5,null,0,114860,null,0.95980773008606046,null,0,null,7.6880604733943692,0,0,7.6640302366971849,null,7.6400000000000006,0,0,0,0,0,4.8060473394368766E-2,null,7.6400000000000006,0,0,7.6400000000000006,null,6198576.4800000004,null,38993,19496.5,0,19496.5,null,0,259951,null,0.95980779942501493,null,0,null,10.455339106844599,0,0,10.422669550932847,null,10.389999995021093,0,0,0,0,0,6.5339111823507323E-2,null,10.389999995021093,0,0,10.389999995021093,null,9181933.5,null,57742,28871,0,28871,null,0,384952,null,0.9600862357065747,null,0,null,214281,43682,43682,7861,309506,null,167902,24857,24857,17822,235438]
[null,371,"Doncaster",null,5.6828141338135953,5.6172366034151722,0,5.7541747741437064,null,5.2699999994248081,0.10382251015543804,0,0.16056603564128363,0,0,0,0.14842558859206512,null,5.269999999424809,5.2700000000000005,0,5.2699999987988919,null,19243636.800000001,null,516091,250334,0,265757,null,0,610620.19999999995,null,0.99523890259432479,null,4.7771952336992773E-2,null,8.2631174579524558,8.2878107677954009,0,8.2612933725949667,null,8.2000000000000011,0,0,0,0,0,0,6.3117457952455741E-2,null,8.2000000000000011,8.1999999999999993,0,8.2000000000000011,null,3909707.52,null,30094,2880,0,27214,null,0,0,null,1.0076972509698117,null,0,null,7.9826781790610593,8.4552631578947377,0,7.979734916339833,null,7.9500000054293505,0,0,0,0,0,3.2678173631708711E-2,null,7.9500000054293505,7.95,0,7.9500000054631652,null,7321317.9800000004,null,30094,2880,0,27214,null,0,230231.02,null,0.97349733890988532,null,0,null,10.823766295341043,0,0,10.823766295341043,null,10.820000003987603,0,0,0,0,0,3.7662913534404242E-3,null,10.820000003987603,0,0,10.820000003987603,null,10853637.220000001,null,3778,0,0,3778,null,0,351088.78,null,0.96900324935909066,null,0,null,453783,86065,5130,8208,553186,null,218554,62846,3752,17822,302974]
[null,372,"Rotherham",null,5.9411392043485058,5.5495462995607729,9.6342517668354866,5.5105664496091853,null,5.37,5.3702239214105434E-2,0,0,0,0,0.41051551864471186,0.10692144648968975,null,5.37,5.37,5.3699999999999992,5.37,null,18177882.299999997,null,333139,166570,33314,133255,null,0,711529,null,0.96858558306213072,null,9.9013988684391509E-3,null,8.0091213344619305,8.4282566835440242,8.0026235320186139,7.8902975856971471,null,7.78,0,0,0,0,0,0,0.22912133446192981,null,7.78,7.78,7.78,7.78,null,3511098.44,null,103402,58511,10047,34844,null,0,110295,null,0.98271427416710799,null,0,null,8.0071808092935424,8.0071790514747896,8.0071777494456882,8.007181748675956,null,7.7799999956373247,0,0,0,0,0,0.22718081365621776,null,7.7799999956373247,7.7800000218132004,7.7799999563748834,7.7799999937675599,null,7133239.2599999998,null,208295,41659,20830,145806,null,0,224081,null,0.98247617291945299,null,0,null,10.887714287031427,0,10.887798716920608,10.887713434404725,null,10.680000004008692,0,0,0,0,0,0.2077142830227367,null,10.680000004008692,0,10.68,10.680000004049173,null,10656847.9,null,207264,0,2073,205191,null,0,333027,null,0.97911099703520033,null,0,null,467890,110583,1280,10066,589819,null,218554,36019,24013,19698,298284]
[null,373,"Sheffield",null,5.6902268151969349,5.7086675209037425,11.834233259500031,5.506986923085333,null,5.3199999990091911,0.19187086003463155,0,0,0,0,7.486864703850854E-2,0.10348730911460412,null,5.3199999990091911,5.3199999987190925,5.3200000075687655,5.3199999989373037,null,33831389.649999999,null,626683.86,208894.62,208894.62,208894.62,null,178035.05,1424280.4,null,0.9732341291686436,null,3.4810478137348187E-2,null,8.1432315760943634,8.2309292484308489,10.823860570543413,8.0560363916320092,null,7.8799999926796618,0.15722746958227438,0,0,0,0,0,0.10600411383242613,null,7.8799999926796618,7.8799999883848235,7.8799998712721209,7.8799999967637646,null,5709242.8399999999,null,75300,25100,25100,25100,null,65127.5,58701.37,null,0.99696310899023255,null,1.9562401377903205E-2,null,8.0159292433699409,8.3374385030819465,9.700031844375431,7.9862750995517402,null,7.8800000014589315,9.6694408490180364E-2,0,0,0,0,3.9234833420829271E-2,null,7.8800000014589315,7.8800000229546407,7.8800001041942753,7.8799999995596481,null,15308975.129999999,null,75300,25100,25100,25100,null,65127.5,156440.78,null,0.9745597732385578,null,1.2122115192174853E-2,null,10.94924796091211,16.170486794711387,46.481604735687888,10.81724336156071,null,10.730000001092167,2.0170933448300028E-2,0,0,0,0,0.19907702637164451,null,10.730000001092165,10.729999907206498,10.730000869027354,10.730000000626164,null,22638876.239999998,null,419238,139746,139746,139746,null,0,232910.25,null,0.96981824277343787,null,"No Base Rate",null,1111683,269587.5,269587.5,48525,1699383,null,385518,54404,54404,33768,528094]
[null,380,"Bradford",null,5.9001685010065339,5.5591714189497585,9.879762337934288,5.5742611850915864,null,5.2200000006268645,0.24497456862545169,0,0,0,0,0.32369639338884965,0.11149753836536737,null,5.2200000006268645,5.2200000041408963,5.2200000011752108,5.2199999999234228,null,38784172.960000001,null,747035,112055.25,59762.8,575216.94999999995,null,0,474714.65,null,0.96877335595106995,null,4.4826296174140766E-2,null,8.0964297275178385,8.1161524047470337,8.0978769427683304,8.0952634058621555,null,7.9599999963811632,0,0,0,0,0,799.52,0.13570639794146061,null,7.9599999963811632,7.96,7.9600000000000009,7.9599999957802225,null,8799205.620000001,null,150000,7500,15000,127500,null,50580,62325.53,null,0.97511256585673045,null,0,null,7.9634026586866682,9.272607701671566,8.1717932917903422,7.9407619863332481,null,7.6999999993324293,0.12988880906466652,0,0,0,0,0.13351385028957116,null,7.6999999993324293,7.7,7.7,7.6999999992934685,null,11728953.65,null,200000,10000,20000,170000,null,195930,83972.01,null,0.96936520983507124,null,1.6588844649411676E-2,null,10.945286978239819,0,10.905475763782215,10.945865351211916,null,10.66999999810584,0.153083076480586,0,0,0,0,0.12220390365339141,null,10.66999999810584,0,10.67,10.669999998078321,null,17713154.410000004,null,200000,0,0,200000,null,199389.53,91465.86,null,0.96825178239789089,null,"No Base Rate",null,887451,146415,197267,30934,1262067,null,438046,50350,67838,37520,593754]
[null,381,"Calderdale",null,5.8123255889054644,5.8170036143409281,0,5.8111009401037732,null,5.46,0.14262755826354934,0,0,0,0,0,0.20969803064191503,null,5.46,5.46,0,5.46,null,13358798.699999999,null,500000,75000,0,425000,null,0,415669,null,1.0179204183722355,null,2.5457262111450187E-2,null,8.427639917274286,9.1170071684587821,0,8.3934414752142956,null,7.3999999999999995,0.49825181933042995,0,0,0,0,0,0.52938809794385666,null,7.4,7.4,0,7.4,null,2237938.06,null,150000,15450,0,134550,null,25740.04,86745.77,null,1.0728568080669538,null,6.3083810282041491E-2,null,7.6844964275537446,7.7656020316701513,0,7.6825404139570912,null,7.4,2.0652538705898494E-2,0,0,0,0,0.26384388884784649,null,7.4,7.3999999999999995,0,7.4,null,4218774.54,null,150000,4500,0,145500,null,67982.05,190727.52,null,0.98288086698313215,null,2.783116255366422E-3,null,10.361410193118173,0,0,10.361410193118173,null,10.15,2.9016753445412075E-2,0,0,0,0,0.18239343967276184,null,10.15,0,0,10.15,null,8371203.0200000005,null,150000,0,0,150000,null,100627.53,374208.68,null,0.97161898689539694,null,"No Base Rate",null,363638,150262,30776,16291,560967,null,196042,40484,8292,7504,252322]
[null,382,"Kirklees",null,5.8044820110353577,5.7620105635655836,10.776181554589048,5.7589131058820282,null,5.3800000018027667,6.2713781739351368E-2,0,0,0,0,4.4666554674780395E-2,0.31710167281845852,null,5.3800000018027667,5.380000006083951,5.38,5.3800000009695426,null,27394791.260000002,null,1583074.9100000001,260605.02,14217.25,1308252.6400000001,null,214869.71,626341.9,null,1.0162619013280769,null,1.1522520608926314E-2,null,7.8371016591778941,7.8371015034781957,7.83710180995475,7.8371016662639867,null,7.5200000000000005,0,0,0,0,0,0,0.31710165917789407,null,7.5200000000000005,7.5200000000000005,7.52,7.5200000000000005,null,4906625.16,null,206901.46000000002,12717.99,4204.7699999999995,189978.7,null,39253,81860.34,null,0.99587158350770988,null,0,null,7.8371016784746512,7.8371019043760128,7.8371016260162607,7.8371016752760889,null,7.5200000008122947,0,0,0,0,0,0.31710167766235781,null,7.5200000008122938,7.5200000000000005,7.5200000000000005,7.5200000008288974,null,14812374.639999999,null,624604.89999999991,9391.2899999999991,3120.2799999999997,612093.32999999996,null,118499,247124.26,null,0.99587158637367967,null,0,null,10.547101668355879,10.547099590684445,10.547104166666665,10.54710167089201,null,10.229999997779167,0,0,0,0,0,0.31710167057671285,null,10.229999997779167,10.229998549530013,10.229999999999999,10.229999999999999,null,18886162.27,null,585418.73,896.33999999999992,152.21,584370.17999999993,null,151089.29999999999,231620.3,null,0.98690266196237508,null,0,null,820099,83133.2,250966.8,30068,1184267,null,236376,20072.400000000001,60595.6,26264,343308]
[null,383,"Leeds",null,5.5900326197379737,5.6273046860969265,0,5.5647440851296031,null,5.3099999991132982,0.19002213542388668,0,0,0,0,0,9.0010485200788429E-2,null,5.3099999991132991,5.3099999990307412,0,5.309999999169313,null,53344000.010000005,null,873000,400000,0,473000,null,0,2230651,null,0.96048670442233219,null,3.4549340125496902E-2,null,8.1502985251430395,8.1490029950017462,0,8.1504986428176789,null,7.9599999992111972,0.10057227795361602,0,0,0,0,0,8.9726247978226051E-2,null,7.9599999992111972,7.9599999764184677,0,7.96000000273194,null,8175000,null,91000,12000,0,79000,null,0,294119,null,0.9656751807041517,null,1.2477064220183486E-2,null,8.1501533405604878,8.1492973746765767,0,8.1502855597203592,null,7.9599999985512131,9.996632837059069E-2,0,0,0,0,9.0187013638685073E-2,null,7.9599999985512131,7.9599999880891925,0,7.9600000001672591,null,22253000.009999998,null,249000,33000,0,216000,null,0,800616,null,0.96565797873939452,null,1.2402822085829854E-2,null,11.099901025346375,11.1009362735932,0,11.099741112837332,null,10.910000001083214,9.9858827375460049E-2,0,0,0,0,9.0042196887702958E-2,null,10.910000001083212,10.910000002276936,0,10.910000000898822,null,32524999.939999998,null,266000,36000,0,230000,null,0,1181614,null,0.96520878481272843,null,"No Base Rate",null,978000,103000,279000,34000,1394000,null,378000,32000,87000,30000,527000]
[null,384,"Wakefield",null,5.6972452121271395,5.5458573847856885,9.4044011382517407,5.5972961530048595,null,5.4100000003118502,5.1752544127951126E-2,0,0,0,0,0.12754454505068208,0.10794812263665726,null,5.4100000003118502,5.4100000010954936,5.4099999922937725,5.4099999998078507,null,23299929.899999999,null,450000,198000,27000,225000,null,0,595361.16,null,0.97542918862985273,null,9.4754465177366003E-3,null,8.0981244278705891,8.1644020337340883,8.0907701203263542,8.0889205269201803,null,7.9499999908347654,0.12331409450414318,0,0,0,0,0,2.4810342531680348E-2,null,7.9499999908347654,7.9499999582863694,7.9499999902296024,7.9499999958071257,null,4844744.84,null,14888.53,6550.95,893.31,7444.27,null,0,68877.48,null,0.98878198142498042,null,1.5274284290274408E-2,null,7.9748103438341245,8.0410880428264502,7.9674560192600552,7.96560643111179,null,7.9499999940719475,0,0,0,0,0,2.481034976217841E-2,null,7.9499999940719466,7.9499999752680814,7.9499999710357665,7.9499999993785124,null,8046488.1899999995,null,25111.47,11049.05,1506.69,12555.73,null,0,193954.48,null,0.97372531670746343,null,0,null,10.983860291416011,0,0,10.983860291416011,null,10.97999999814706,0,0,0,0,0,3.86029326895023E-3,null,10.97999999814706,0,0,10.97999999814706,null,14221717.41,null,5000,0,0,5000,null,0,224466.58,null,0.98421687199068197,null,0,null,538331,52403.91,88386.09,12672,691793,null,210112,30025.7,50642.3,9380,300160]
[null,390,"Gateshead",null,5.7250071220080763,5.8789101413952363,10.820368742122346,5.3440554042382482,null,4.8200000018282072,0.27386363579232176,0.27386346668319367,0.1095454927092713,0,0,0.1412797072748416,0.10645481772024168,null,4.8200000018282063,4.8199999999999994,4.8200000640622171,4.82,null,12293034.539999999,null,232916.36,109080.64,7258.6,116577.12,null,227549.32,359536.78,null,0.99609968786528413,null,0.11999997873818208,null,8.0329758073168112,7.8822921528867109,8.0822946191793328,8.0422932854141891,null,7.27,0.61068246432786188,0,0,0,0,0,0.15229334298894967,null,7.27,7.27,7.2700000000000005,7.2700000000000005,null,2350586.92,null,45424.84,3980.46,5340.82,36103.56,null,1351.76,37200.480000000003,null,1.0122805765913592,null,7.7491063380885322E-2,null,7.9273981877386577,8.0302372640672157,8.0502373151095306,7.9202361505361152,null,7.2700000000000005,0.50716196969884209,0,0,0,0,0.1502362180398166,null,7.2699999999999987,7.2700000000000005,7.27,7.27,null,5034685.7899999991,null,97258.12,2539.16,3209.67,91509.29,null,997.97,79649.119999999995,null,0.99860702372998855,null,6.52117021189519E-2,null,10.570772021521906,0,10.570771989338503,10.570772022524496,null,10.36,0,0,0,0,0,0.21077202152190622,null,10.36,0,10.36,10.360000000000001,null,7076139,null,143962.56,0,4349.28,139613.28,null,377736.91,117897.53,null,1.0309367269485068,null,0,null,235450,57000,8208,5871,306529,null,173530,17822,17822,15946,225120]
[null,391,"Newcastle upon Tyne",null,5.8109489885004431,5.6143770359087908,9.5308125383986066,5.6158773796274062,null,5.2600000010823234,0.25655828250877649,0,0,0,0,0.1950716108335625,9.9319094075781253E-2,null,5.2600000010823234,5.2600000002829601,5.26,5.2600000019099822,null,17942456.52,null,312000,140400,15600,156000,null,280000,924686.45,null,0.9768852559602732,null,4.6506946780913078E-2,null,7.7412205421395894,7.7442132947076123,7.7367314132875551,7.7412205421395894,null,7.46,0.20649816451185213,0,0,0,0,0,7.4722377627736952E-2,null,7.46,7.4600000255461119,7.4599999616808326,7.46,null,4001390.72,null,39000,5850,3900,29250,null,150000,140085,null,0.97316536996924485,null,2.6935135192196376E-2,null,7.707083609344541,7.7083743177345827,7.7083742810102081,7.7066533781237503,null,7.4600000074917725,0.20521781655342744,0,0,0,0,4.1865785299340701E-2,null,7.4600000074917725,7.46000003231745,7.4599999955930754,7.4600000041131311,null,6957430.1600000001,null,38000,5700,3800,28500,null,270000,40000,null,0.97024860984342765,null,2.6772600761543253E-2,null,10.381011460615039,10.381011472978782,10.381011426417299,10.381011462701991,null,10.379999995751849,0,0,0,0,0,1.0114648631924488E-3,null,10.379999995751847,10.380000008091718,10.379999961564335,10.379999997842209,null,10262343.629999999,null,1000,150,100,750,null,440000,86640,null,0.96146145652040138,null,0,null,627097,214169,214169,38550,1093985,null,183848,25326,25326,23450,257950]
[null,392,"North Tyneside",null,5.592881773008969,5.5238200288994186,8.755782756493792,5.5238202822611706,null,5.1700000013873666,9.212125214464631E-2,0.18242078843310161,0,0,0,6.9061620081097938E-2,7.9278110962757539E-2,null,5.1700000013873666,5.170000003173004,5.169999953624048,5.1700000015717906,null,13909523.309999999,null,200000,104937.76,4273.67,90788.57,null,413893,530637.38,null,0.99612663953046787,null,5.0425185160046383E-2,null,7.6503159491464343,7.7862298534970762,7.8391803278688528,7.6091570678918252,null,7.55,0,0,0,0,0,0,0.10031594914643446,null,7.55,7.5500000000000007,7.5500000000000007,7.55,null,1801777.3,null,23940,12561.05,511.56,10867.39,null,0,75730.490000000005,null,0.98586545736423126,null,0,null,7.1568460780548087,7.1913123945534183,7.1550628311884941,7.1396207382842887,null,7.1,0,0,0,0,0,5.6846078054808701E-2,null,7.1,7.1,7.1,7.1,null,6377326.5,null,51060,26790.6,1091.07,23178.33,null,284000,220023.95,null,0.96301916613425331,null,0,null,9.426579372988515,9.4730104562291935,9.4241786623466801,9.4033743921137027,null,9.35,0,0,0,0,0,7.6579372988515138E-2,null,9.35,9.35,9.35,9.35,null,9157165.5999999996,null,75000,39351.660000000003,1602.63,34045.71,null,701250,0,null,0.963209545150155,null,0,null,111843.33,18167.79,38748.879999999997,3414.2,172174.2,null,125934.67,16263.45,34687.22,16342.67,193228.01]
[null,393,"South Tyneside",null,5.7839911018897112,5.3479091066643551,9.1206990477959451,5.3374582473418783,null,4.68,0.25950232647306426,0.19375744154003094,0.1812870906872473,0,0,0.43026896298352779,3.9175280205840129E-2,null,4.68,4.68,4.68,4.68,null,8959942.2100000009,null,61100,20366,20367,20367,null,288502,267169,null,0.9699999982146148,null,0.11939811155518143,null,7.669999999999999,7.669999999999999,7.67,7.67,null,7.67,0,0,0,0,0,0,0,null,7.669999999999999,7.669999999999999,7.67,7.67,null,3007537.3899999997,null,0,0,0,0,null,61982.5,92974,null,0.97002124448106286,null,0,null,7.669999999999999,7.669999999999999,7.67,7.67,null,7.67,0,0,0,0,0,0,null,7.669999999999999,7.669999999999999,7.67,7.67,null,3007537.3899999997,null,0,0,0,0,null,61982.5,92974,null,0.97002124448106286,null,0,null,10.430000000000001,0,0,10.430000000000001,null,10.430000000000001,0,0,0,0,0,0,null,10.430000000000001,0,0,10.430000000000001,null,6260200.7300000004,null,0,0,0,0,null,129089,193633,null,0.96949660286284456,null,0,null,238164,47025,47025,8465,340679,null,132258,18291,18291,10318,179158]
[null,394,"Sunderland",null,6.2621190198604397,5.8737832011620599,9.4687742678331936,5.5093092881112806,null,4.8999999965072005,0.22004693204559875,0.34014311605408964,9.4305581028734875E-2,8.3824284113236409E-3,0,0.5246010009454658,0.17463996486802755,null,4.8999999965072005,4.8999999976340103,4.8999999922823996,4.8999999961719398,null,17428654.029999997,null,500000,166666,166667,166667,null,0,680000,null,1.0048192695960376,null,0.11916099024631836,null,8.1237190802853174,8.1162255806214691,8.1480685873636123,8.1179880566591578,null,8.0800000052462888,0,0,0,0,0,0,4.3719075039026931E-2,null,8.0800000052462888,8.0800000021735343,8.0800000081682253,8.0800000068378566,null,3696327.06,null,20000,6666.67,6666.67,6666.66,null,0,0,null,1.0016916251893118,null,0,null,8.0242650790025483,8.0479427707431785,8.05297608925407,8.0119189676256681,null,8,0,0,0,0,0,2.426507900254753E-2,null,8,8,8,8,null,6593838,null,20000,6666.67,6666.67,6666.66,null,0,60000,null,0.98942849309525882,null,0,null,10.97231109382299,11.181948906077071,11.050653289851136,10.958318362345732,null,10.949999998326668,0,0,0,0,0,2.2311095496319076E-2,null,10.949999998326669,10.949999947811511,10.950000000000001,10.950000000000001,null,9815743.9200000018,null,20000,6666.67,6666.67,6666.66,null,0,60000,null,0.99386875849845913,null,0,null,538080,108870,108870,19597,775417,null,259826,36114.99,36113,21574,353627.99]
[null,420,"Isles of Scilly",null,5.92,5.92,0,5.92,null,5.92,0,0,0,0,0,0,0,null,5.92,5.92,0,5.92,null,69382.399999999994,null,0,0,0,0,null,0,85027,null,"-",null,"N/A",null,7.8400000000000007,0,0,7.8400000000000007,null,7.8400000000000007,0,0,0,0,0,0,0,null,7.8400000000000007,0,0,7.8400000000000007,null,2971.36,null,0,0,0,0,null,0,0,null,"-",null,"N/A",null,7.8400000000000007,0,0,7.8400000000000007,null,7.8400000000000007,0,0,0,0,0,0,null,7.8400000000000007,0,0,7.8400000000000007,null,35617.120000000003,null,0,0,0,0,null,0,0,null,"-",null,"N/A",null,10.73,0,0,10.73,null,10.73,0,0,0,0,0,0,null,10.73,0,0,10.73,null,27425.88,null,0,0,0,0,null,0,0,null,"-",null,"N/A",null,0,0,0,0,0,null,936,0,0,0,936]
[null,800,"Bath and North East Somerset",null,5.9839966972130298,5.9002127832435729,0,6.0234243960684895,null,5.6499999999999995,6.862381376401222E-2,0,0,0,0,0,0.26537288344901755,null,5.6499999999999995,5.6499999999999995,0,5.65,null,11437985.33,null,530780,132695,0,398085,null,0,474407,null,1.0074068513826648,null,1.2000057356254715E-2,null,8.6133997596355414,10.884409066378844,0,8.4893597830572425,null,8.02,0,0,0,0,0,0,0.59339975963554037,null,8.02,8.02,0,8.0200000000000014,null,1147790.32,null,84925,21231,0,63694,null,0,47734,null,1.031544881393478,null,0,null,8.0942865840137603,8.3914278216600628,0,8.0786476363053765,null,8.02,0,0,0,0,0,7.4286584013761203E-2,null,8.02,8.02,0,8.02,null,6112386.8599999994,null,56617,14154,0,42463,null,0,254682,null,0.96937563880404343,null,0,null,10.922615535250399,0,0,10.922615535250399,null,10.879999999999999,0,0,0,0,0,4.2615535250400141E-2,null,10.879999999999999,0,0,10.879999999999999,null,9034001.2799999993,null,35385,0,0,35385,null,0,376418,null,0.96404373656225939,null,0,null,130006,32152,10000,3797,175955,null,97552,11574,10000,7504,126630]
[null,801,"Bristol, City of",null,6.5592901351755817,6.2506881694291776,10.478513558981261,5.6000932144818618,null,5.2799999999999994,0.11000000289176554,0.16,0,0,0,0.67929012939204969,0.33000000289176556,null,5.2799999999999994,5.2800000037426704,5.2799999954409031,5.28,null,32312215.590000004,null,1711757.04,570585.68000000005,570585.68000000005,570585.68000000005,null,0,1244914.2,null,0.96078430522029756,null,4.8648649144339653E-2,null,8.3999999800267986,0,0,8.2799999960053601,null,8.1100000019973191,0.11000000199731999,0,0,0,0,0,0.17999997603216003,null,8.1100000019973191,0,0,8.1100000019973191,null,4115514.8,null,90120.75,30040.25,30040.25,30040.25,null,0,175234.82,null,0.95999999771734845,null,1.3381995370299727E-2,null,8.4000000113451527,0,0,8.1800000056725768,null,7.9600000000000009,0.11000000283628804,0,0,0,0,0.33000000850886413,null,7.9600000000000009,0,0,7.9600000000000009,null,14226340.73,null,581746.29,193915.43,193915.43,193915.43,null,0,617003.63,null,0.96000000129658891,null,1.3630731449520117E-2,null,11.510000002603912,0,0,11.216666669270579,null,10.96,0.11000000260391238,0,0,0,0,0.44,null,10.96,0,0,10.96,null,21256475.629999999,null,844882.5,281627.5,281627.5,281627.5,null,0,921690,null,0.95996663908289503,null,"No Base Rate",null,593370,29951.27,105458.73,12187,740967,null,231686,14315.83,50406.17,18760,315168]
[null,802,"North Somerset",null,5.7869504076934417,0,0,5.7869504076934417,null,5.4,0.14091939686391308,0,0,0,0,0,0.24603101082952866,null,5.4,0,0,5.4,null,12410255.380000001,null,551047.12,0,0,551047.12,null,42190,160000,null,0.99414167124182351,null,2.5432493557598326E-2,null,8.1597790753829695,0,0,8.1597790753829695,null,7.910000010475823,0,0,0,0,0,0,0.24977906490714757,null,7.910000010475823,0,0,7.910000010475823,null,1510143.98,null,47686.770000000004,0,0,47686.770000000004,null,7333,20000,null,0.99251678909694274,null,0,null,8.1621477435977106,0,0,8.1621477435977106,null,7.9100000011330538,0,0,0,0,0,0.25214774246465638,null,7.9100000011330538,0,0,7.9100000011330538,null,6981135.8200000003,null,222538.26,0,0,222538.26,null,36625,88000,null,0.99317746078386304,null,0,null,11.058024078012469,0,0,11.058024078012469,null,10.810000005201109,0,0,0,0,0,0.24802407281136046,null,10.810000005201109,0,0,10.810000005201109,null,10392015.140000001,null,238433.85,0,0,238433.85,null,35869,132000,null,0.99154028519904291,null,0,null,134417.4,25336.5,0,2280,162033.9,null,101304,33768,0,4690,139762]
[null,803,"South Gloucestershire",null,5.8757745728498856,0,0,5.8757745728498856,null,5.53,4.1008187921244117E-2,0,1.727773108104444E-2,0,0,0,0.28748865384759609,null,5.53,0,0,5.53,null,19373547.860000003,null,996669.69,0,0,996669.69,null,0,673845.64999999991,null,0.99758481712222169,null,1.0430017333954648E-2,null,8.1647447361208325,0,0,8.1647447361208325,null,7.950000017227131,6.0610431338081243E-2,0,7.9768508700648801E-3,0,0,0,0.14615743668555506,null,7.950000017227131,0,0,7.950000017227131,null,1861850.8599999999,null,33936.57,0,0,33936.57,null,0,64033.850000000006,null,0.9766441071914872,null,8.5535368821109559E-3,null,8.1456894253466547,0,0,8.1456894253466547,null,7.9499999981493978,4.4664231939196289E-2,0,9.5914020091405726E-3,0,0,0.14143379324891844,null,7.9499999981493978,0,0,7.9499999981493978,null,10813036.580000002,null,191064.46,0,0,191064.46,null,0,370884.49000000005,null,0.97436476379744685,null,6.7783484738752255E-3,null,10.967215935696395,0,0,10.967215935696395,null,10.83,6.4465452466514212E-3,0,0,0,1.6962280845039746E-2,0.11380710960470435,null,10.83,0,0,10.83,null,15946696.52,null,167214.51,0,0,167214.51,null,0,546534.01,null,0.96969194833743533,null,"No Base Rate",null,154596,2084.37,12051.63,1272,170004,null,146328,7883.62,45582.38,7504,207298]
[null,805,"Hartlepool",null,5.6401370480212698,5.6115546024292406,0,5.6615677040286787,null,5.36,1.0034014447475653E-2,0.24000000000000002,0,0,0,0,3.0103033573794517E-2,null,5.36,5.36,0,5.3599999999999994,null,5665377,null,30400,0,0,30400,null,21267,243199,null,0.95952479635849963,null,4.4569072808393867E-2,null,7.9178041261560352,7.8900000000000006,0,7.9299301860286917,null,7.82,7.0000000000000007E-2,0,0,0,0,0,2.7804126156035096E-2,null,7.82,7.82,0,7.8199999999999994,null,1597062.24,null,5628,0,0,5628,null,20165,66544,null,0.96828812772624595,null,8.8719898605830166E-3,null,7.8513517245914581,0,0,7.8513517245914581,null,7.82,0,0,0,0,0,3.1351724591457603E-2,null,7.82,0,0,7.82,null,1902637.28,null,7628,0,0,7628,null,23023,79277,null,0.95965920291205253,null,0,null,10.719720888673502,0,0,10.719720888673502,null,10.69,0,0,0,0,0,2.9720888673501838E-2,null,10.69,0,0,10.69,null,2823485.56,null,7850,0,0,7850,null,26168,117754,null,0.95996411408333027,null,0,null,219388,74670,74670,13441,382169,null,77854,11725,11725,7504,108808]
[null,806,"Middlesbrough",null,5.7225481158757967,5.7225481153461706,0,5.7225481174646742,null,5.0199999987401291,0.13171366678931118,0,0.39903401540377587,0,0,0,0.17180043494257979,null,5.0199999987401291,5.0199999987783075,0,5.0199999986255959,null,9692782.8200000003,null,300000,225000,0,75000,null,0,508516,null,0.96828225310927174,null,9.5617331700412547E-2,null,8.19,8.1900000000000013,0,8.19,null,8.19,0,0,0,0,0,0,0,null,8.19,8.1900000000000013,0,8.19,null,3294894.33,null,0,0,0,0,null,0,112646,null,0.96694214876033047,null,0,null,8.1900000258682688,8.1900000172455112,0,8.1900000517365363,null,8.1900000258682688,0,0,0,0,0,0,null,8.1900000258682688,8.1900000172455112,0,8.1900000517365363,null,3166041.07,null,0,0,0,0,null,0,64700,null,0.96694215181443544,null,0,null,11.160000014249398,11.160000006333066,0,11.160000037998396,null,11.160000014249398,0,0,0,0,0,0,null,11.160000014249398,11.160000006333066,0,11.160000037998396,null,4699145.67,null,0,0,0,0,null,0,39197,null,0.96373057117870453,null,0,null,364230,107160,107160,19288.8,597838.80000000005,null,126630,17822,17822,9380,171654]
[null,807,"Redcar and Cleveland",null,5.6185220385270123,5.5841928408106805,0,5.7198512669969732,null,5.44,8.4325807431253702E-2,0,0,0,0,0,9.4196231095758379E-2,null,5.44,5.4400000020177419,0,5.4399999940442481,null,7330874.2600000007,null,125000,50000,0,75000,null,0,299474.74,null,0.97713426756991517,null,1.5264452237378845E-2,null,8.0438682981774186,7.7346504499520501,0,8.2123163439692721,null,7.6399999818440438,9.4391785981216586E-2,0,0,0,0,0,0.30947653035215833,null,7.6399999818440438,7.6399999812783257,0,7.6399999821522222,null,1874388.9300000002,null,75000,0,0,75000,null,0,199772.64,null,0.99799854816097,null,1.2204164052548046E-2,null,7.7343945096664299,7.7346505099842497,0,7.7342550521555324,null,7.6399999956894957,9.4391819911187974E-2,0,0,0,0,2.6940657463576434E-6,null,7.6399999956894957,7.6399999816651354,0,7.6400000033293383,null,2870899.43,null,1,0,0,1,null,0,175787.93,null,0.95960229648466866,null,1.2204168364058646E-2,null,10.515217952114076,0,0,10.515217952114076,null,10.510000007420109,5.2154713241210201E-3,0,0,0,0,2.4733698452189882E-6,null,10.510000007420109,0,0,10.510000007420109,null,4251372.07,null,1,0,0,1,null,0,0,null,0.96029387690539514,null,"No Base Rate",null,212610,53714,53714,9668,329706,null,119126,17822,17822,10318,165088]
[null,808,"Stockton-on-Tees",null,5.6026020041204312,5.6130096438623021,0,5.5824519191821977,null,5.4,0.14513835351608975,0,0,7.6749311100457246E-3,0,0,4.9788719494295974E-2,null,5.4,5.4,0,5.4,null,13383304.51,null,120000,75644,0,44356,null,12855.49,418026,null,0.98212536322245125,null,2.7519975333804906E-2,null,7.6913372848197366,7.7229319838017947,0,7.6808630871772481,null,7.6599999918523052,0,0,0,0,0,0,3.1337292967431998E-2,null,7.6599999918523052,7.6599999395852372,0,7.6600000091797549,null,2444371.9500000002,null,10000,5000,0,5000,null,257.05,102276,null,0.96392767041797789,null,0,null,7.6129274669333622,7.5299998790640945,0,7.6163827828458484,null,7.5299999944715026,0,0,0,0,0,8.2927472461859594E-2,null,7.5299999944715026,7.5299998790640945,0,7.5299999992801441,null,5448134.21,null,60000,0,0,60000,null,34637.79,230949,null,0.96000015119541848,null,0,null,10.276133658728591,0,0,10.276133658728591,null,10.200000000000001,0,0,0,0,0,7.613365872859075E-2,null,10.200000000000001,0,0,10.200000000000001,null,8038494.54,null,60000,0,0,60000,null,102662.46,341715,null,0.9600001356359058,null,0,null,221160,61560,61560,11081,355361,null,147266,28609,28609,11256,215740]
[null,810,"Kingston upon Hull, City of",null,5.5783997467569248,5.4693483879024427,11.285133653313641,5.4693483879024427,null,5.08,0.18000012461387008,0,0,0,0,0.10839952868265139,0.21000009346040258,null,5.08,5.08,5.0799999999999992,5.08,null,15508898.600000001,null,606674.30999999994,296725.40999999997,13223.49,296725.40999999997,null,150000,573210,null,0.96706176251137144,null,3.4220555199527429E-2,null,7.8899996295761241,7.8899996295761241,0,7.8899996295761241,null,7.5,0.18000000000000002,0,0,0,0,0,0.20999962957612395,null,7.5,7.5,0,7.5,null,4146600.96,null,113383.42,56691.71,0,56691.71,null,50000,140446,null,0.96993992692423603,null,2.3437500000000003E-2,null,7.8899997002667632,7.8899997002667632,0,7.8899997002667632,null,7.5,0.18,0,0,0,0,0.20999970026676257,null,7.5,7.5,0,7.5,null,5124556.7999999998,null,140124.4,70062.2,0,70062.2,null,50000,173569,null,0.96779258926141398,null,2.34375E-2,null,10.769999353335892,0,0,10.769999353335892,null,10.56,0,0,0,0,0,0.20999935333589248,null,10.56,0,0,10.56,null,7675081.9199999999,null,152629,0,0,152629,null,50000,259955,null,0.9660243678545648,null,0,null,603761.1,75716.320000000007,93573.68,15236.1,788287.19999999984,null,204484,24332.63,30071.37,17822,276710]
[null,811,"East Riding of Yorkshire",null,5.7864793820944778,5.5399999969374045,16.696889675757657,5.58036754856548,null,5.4099999984062572,0.1300000001648699,0,0,0,0,0.21485733899264245,3.1622044530708278E-2,null,5.4099999984062572,5.4099999981902851,5.4099999586209,5.4099999994387558,null,20943268.919999998,null,115080,0,0,115080,null,0,623400,null,0.97576568180417433,null,2.34657040069313E-2,null,7.4404309904177524,7.3900000633904206,7.3899995264927316,7.4505243984858698,null,7.3900000036022142,0,0,0,0,0,0,5.0430986815538946E-2,null,7.3900000036022133,7.3900000633904206,7.3899995264927316,7.3900000038908535,null,2051516.4699999997,null,14000,0,0,14000,null,0,63461,null,0.97643451317818286,null,0,null,7.4177266081810194,7.3900000160435679,7.3899999266856797,7.4232758923491566,null,7.3899999983267826,0,0,0,0,0,2.7726609854236535E-2,null,7.3899999983267826,7.3900000160435679,7.3899999266856797,7.3899999968205075,null,10599936.359999999,null,39770,0,0,39770,null,0,319070,null,0.97345493545682671,null,0,null,10.013253779086538,10.000000000000002,10,10.015906428959415,null,10.000000000000002,0,0,0,0,0,1.3253779086536391E-2,null,10.000000000000002,10.000000000000002,10,10.000000000000002,null,15203211,null,20150,0,0,20150,null,0,470235,null,0.97121763133720052,null,0,null,215956,12526,35651,4338,268471,null,144452,11706,33318,9380,198856]
[null,812,"North East Lincolnshire",null,5.7452426696315078,5.7012895501095429,8.2147056381091392,5.6197563748705699,null,5.48,3.7902988800407898E-2,0,0,0,0,0.1244442398641272,0.10289544096697248,null,5.48,5.48,5.48,5.4799999999999995,null,9561104.0800000001,null,174359,10267,5469,158623,null,0,289182,null,0.98437800871582848,null,6.8690930009713729E-3,null,7.9930476620261208,7.9842105263157892,7.986004784688995,7.9931621343555275,null,7.7999999999999989,8.9464951598291265E-2,0,0,0,0,0,0.10358271042782835,null,7.8000000000000007,7.8,7.8,7.8000000000000007,null,2325191.0000000005,null,30528,24,0,30504,null,0,71913,null,0.9855792431598176,null,1.1339799612160894E-2,null,7.9069336275557092,7.8832338308457715,7.8132293080054271,7.9073519923389872,null,7.8,4.4667241966842366E-3,0,0,0,0,0.10246690335902378,null,7.8,7.8,7.8,7.8,null,3467444.9600000004,null,45525,35,0,45490,null,0,17397,null,0.97496098983424273,null,5.7232919999976003E-4,null,10.779835366677137,0,0,10.779835366677137,null,10.669999996890621,7.0434480773621773E-3,0,0,0,0,0.10279192170915512,null,10.669999996890621,0,0,10.669999996890621,null,5150728.01,null,49588,0,0,49588,null,0,49147,null,0.9746686588315675,null,"No Base Rate",null,244548,106375,8007,10295,369225,null,99428,13507,20261,10318,143514]
[null,813,"North Lincolnshire",null,5.7461688513725022,5.8828296371924091,0,5.710451125104191,null,5.450000000624045,2.2527457090921951E-2,0,0,4.7112928408854955E-2,0,0,0.22652846524868003,null,5.450000000624045,5.450000015058631,0,5.4499999968514157,null,8844934.5999999996,null,363000,78000,0,285000,null,204028,227040,null,1.0286325004974002,null,1.2616833820342777E-2,null,8.0154811602201317,7.7890379008746358,0,8.0204401147107482,null,7.580000000000001,0.12309017165884822,0,0,0,0,0,0.31239098856128328,null,7.580000000000001,7.58,0,7.58,null,1479509.42,null,60000,0,0,60000,null,0,23756,null,1.0223828010484861,null,1.5979323740973543E-2,null,7.6348173776521131,7.58,0,7.63485852782817,null,7.5799999999999992,5.3912297661707093E-3,0,0,0,0,4.9426147885941893E-2,null,7.580000000000001,7.58,0,7.58,null,5217952.7,null,34000,0,0,34000,null,0,102532,null,0.97382874714950396,null,7.1073852394254173E-4,null,10.275853040143696,0,0,10.275853040143696,null,10.180000007399418,2.6203561710227662E-3,0,0,0,0,9.3232676573255166E-2,null,10.180000007399418,0,0,10.180000007399418,null,6880689.3300000001,null,63000,0,0,63000,null,0,181513,null,0.96577566166764051,null,"No Base Rate",null,319981,112168,18260,11737,462146,null,102242,23394,3808,6566,136010]
[null,815,"North Yorkshire",null,5.6101746091810671,5.5417581909316649,9.3271565729120898,5.5385256406092118,null,5.360000000310527,3.8804121452502352E-2,1.0392944795525343E-2,2.0802956109857208E-2,0,0,7.0178450700429065E-2,0.10999613581222656,null,5.360000000310527,5.3600000033037274,5.3600000263837275,5.3599999994399736,null,35424893.890000001,null,708450,66593.81,13342.03,628514.16,null,0,1094919,null,0.9702269979825987,null,1.2891348446714272E-2,null,7.5100066280361304,7.7465557826724654,7.7906154015721309,7.4908408438108616,null,7.3000000210681391,4.4186036712494083E-2,7.1430678242344267E-3,8.6723618056573862E-3,0,0,0,0.15000514062560572,null,7.3000000210681391,7.3000002122587935,7.3000000975388026,7.300000009073548,null,3493427.6500000004,null,71200,3533.54,1537.91,66128.55,null,0,109169,null,0.97028509406151542,null,8.1523714968020008E-3,null,7.5099898904102673,7.5865544034473107,7.6205433953486796,7.5086400547128456,null,7.3,3.1313599894769138E-2,1.1985492840158866E-2,1.6700936131781363E-2,0,0,0.14998986154355912,null,7.3,7.2999999722331523,7.2999996579407362,7.3000000011896979,null,18867408.649999999,null,384500,5401.76,876.98,378221.26,null,0,589606,null,0.97028293157755408,null,8.1521778031770128E-3,null,10.224564060818311,9.9191397569745767,9.9102081803285689,10.473237780763055,null,9.9099999990034959,3.5329816953369307E-2,1.2239637027351128E-2,0,0,2.5017809990572518E-2,0.24197679784352355,null,9.9099999990034959,9.9100000483361583,9.9099999956906082,9.90999999976707,null,23040535.439999998,null,558500,351.52,202.9,557945.57999999996,null,0,865606,null,0.97562634168113671,null,"No Base Rate",null,408531,129519.39,12809.61,12808,563668,null,236376,69412,13132,19698,338618]
[null,816,"York",null,5.5642445960661773,5.7461149524632678,6.9673492822966505,5.4755722855292239,null,5.3400000000000007,7.1501437422382616E-2,0,0,0,0,8.1367026422499267E-2,7.1376132221295421E-2,null,5.3400000000000007,5.34,5.34,5.34,null,11207967.4,null,145640,0,0,145640,null,0,466040,null,0.96022374249451459,null,1.3212864904354591E-2,null,7.5971798292237249,8.1247058823529414,8.0830352941176464,7.5925891655450872,null,7.3999999999999995,9.8313011095594427E-2,0,0,0,0,0,9.8866818128130834E-2,null,7.3999999999999995,7.4,7.4,7.3999999999999995,null,1079239.69,null,14230,0,0,14230,null,0,45540,null,0.96045257006621043,null,1.311135063981941E-2,null,7.5971898293661742,9.1841463414634141,8.06,7.5871383654411089,null,7.4,9.8314113286156302E-2,0,0,0,0,9.8875716080017162E-2,null,7.4,7.4,7.4,7.4,null,6119186.6900000004,null,80690,0,0,80690,null,0,258210,null,0.96045383430672238,null,1.3111495704341714E-2,null,10.288061016369504,11.07,11.175000000000001,10.287641331789086,null,10.02,0.13406529802263226,0,0,0,0,0.13399571834687241,null,10.02,10.02,10.02,10.02,null,9026040.0299999993,null,119110,0,0,119110,null,0,381160,null,0.95970718436282676,null,"No Base Rate",null,156780,5192,29424,3118,194514,null,84420,5066,28702,8442,126630]
[null,821,"Luton",null,7.0355895985229289,6.3138117538936847,13.050816539321145,5.9905858732793629,null,5.6799999986678902,0.15631598629298443,3.836477729796274E-2,0,0,0,0.67245761666214254,0.48845121960195015,null,5.6799999986678893,5.68,5.68,5.6799999980679283,null,19659447.919999998,null,1466699,85156,1036807,344736,null,772870,231868,null,1.0853309849451265,null,3.3138951965126298E-2,null,8.9471195965382222,8.5484137729152181,10.844415958068053,8.5484048653751632,null,8.4,0,0,0,0,0,0,0.54711959653822273,null,8.4,8.4,8.4,8.4,null,3396128.4,null,221201,2028,171620,47553,null,345,57967,null,1.0368450661836814,null,0,null,8.931301648998776,8.3843159101726457,10.68034775788902,8.3843250108021223,null,8.2200000168432226,0,0,0,0,0,0.7113016321555532,null,8.2200000168432226,8.220000216347195,8.2200000103466522,8.2200000138267164,null,4001846.92,null,346292,1519,285350,59423,null,88,144918,null,1.0349342300739779,null,0,null,11.483910089086464,0,13.861996336996336,11.433910066314475,null,11.4,0,0,0,0,0,8.3910089086464898E-2,null,11.4,0,11.4,11.4,null,6045349.3200000003,null,44497,0,26885,17612,null,62793,0,null,0.98659199041410339,null,0,null,349599,38543,16519,4954,409615,null,135072,15502,18266,15008,183848]
[null,822,"Bedford Borough",null,6.2874503543799811,5.9904225109070657,10.940885922252582,5.9904224991287007,null,5.36000000510988,0.17675856619926764,0.11049801879690313,0,0,0,0.29702785249088831,0.34316591178304229,null,5.36000000510988,5.3600000040554603,5.3600000334575419,5.3600000028318302,null,13028874.82,null,752162.14,270778.37,45129.729999999996,436254.04000000004,null,6213,551814,null,0.9922610553550657,null,5.086657218647405E-2,null,9.1881889280112077,9.1881887693531379,9.1881888163745717,9.1881889950674278,null,8.1499999825824858,0,0,0,0,0,0,1.0381889454287212,null,8.1499999825824858,8.1499999032360364,8.1500001319508399,8.1499999829240046,null,1403759.42,null,178818.1,37551.800000000003,19669.990000000002,121596.31,null,1000,48439.56,null,1.0841974960086123,null,0,null,8.1974225962860388,8.1974226627057067,8.1974224584888038,8.1974225979823814,null,8.1499999923664603,0,0,0,0,0,4.7422603919578518E-2,null,8.1499999923664603,8.1500000636128256,8.1499998473291768,8.149999994062803,null,5338283.41,null,31062,1863.72,1242.48,27955.8,null,34357,150733.29,null,0.97286270083350457,null,0,null,10.75500046206068,10.755000255167838,10.755000255167838,10.755000466282985,null,10.55,0,0,0,0,0,0.20500046206068029,null,10.55,10.549999793107157,10.549999793107157,10.550000004222303,null,7648887.1500000004,null,148628,1486.28,1486.28,145655.44,null,221128.82,200453.28,null,0.96006946719307884,null,0,null,204367.8,21008.91,71502.09,8327.7000000000007,305206.5,null,100366,5538.43,18849.57,10318,135072]
[null,823,"Central Bedfordshire",null,5.9096437116966909,6.2032788185799133,9.3221820292961759,5.4724693166684277,null,5.1799999994215877,4.1192816400630002E-2,0.42668177713452998,0,0,0,0.13031186584774723,0.13145725289219692,null,5.1799999994215877,5.179999996937906,5.18,5.180000001237147,null,21977434.989999995,null,500000,215869.8,23240.94,260889.26,null,5448.52,816863,null,1.0001322161478801,null,8.2840825488340153E-2,null,7.9556521669197675,8.172840911154168,7.9739065198187049,7.9111608876608548,null,7.8799999936087941,0,0,0,0,0,0,7.5652173310973347E-2,null,7.8799999936087941,7.8799998962475328,7.8800001775670649,7.8800000078734973,null,1479532.96,null,14204.3,9031.99,423.08,4749.2299999999996,null,0,22064,null,0.98096820800490359,null,0,null,7.9284685867494149,8.0074078515302443,7.9739035677218624,7.9111541483262435,null,7.8799999942159005,0,0,0,0,0,4.8468592533514439E-2,null,7.8799999942159005,7.8799999806307666,7.8799999879456637,7.8799999971498673,null,10898842.57,null,67037,28942.53,3116.01,34978.46,null,0,162504,null,0.97761634855109936,null,0,null,10.925616416147774,12.026895717785518,0,10.895089107197228,null,10.859999996814123,0,0,0,0,0,6.5616419333650491E-2,null,10.859999996814123,10.859999994532167,0,10.859999996870901,null,16362220.949999999,null,98860.989999999991,42682.21,4595.24,51583.54,null,0,177007,null,0.99504703243604498,null,0,null,316790,9602.7999999999993,70727.199999999997,7228,404348,null,154770,6279.3,46248.7,7504,214802]
[null,825,"Buckinghamshire",null,6.2418242688125964,6.1884354571085147,8.7098577786378453,6.188435455602348,null,5.9700000017195771,8.0000000327538706E-2,5.0000002047116979E-2,0,0,0,5.338881096788288E-2,8.8435453750480855E-2,null,5.9700000017195771,5.9700000052598217,5.970000025523599,5.9700000004918072,null,37573504.959999993,null,540000,79022.95,11434.01,449543.04,null,150000,1974056,null,0.95971193887709716,null,2.1311475784819928E-2,null,8.7948790817529279,8.7948739275185552,8.7948627661006409,8.7948805466845386,null,8.64,0.08,2.0000009563479752E-2,0,0,0,0,5.4879072189448708E-2,null,8.64,8.6399999766120974,8.6400000454351069,8.6400000018314866,null,4569466.47,null,28692,3754,966,23972,null,2000,242174,null,0.96055725694894922,null,1.1441648678953977E-2,null,8.784817230647759,8.7848010596034172,8.7847981116871683,8.7848177141136023,null,8.6400000010510638,8.0000002102129097E-2,1.0000006831919591E-2,0,0,0,5.4817220662646798E-2,null,8.6400000010510638,8.6399999564785013,8.6399999489461194,8.640000002376123,null,16611729.489999998,null,104308,1511,1288,101509,null,22000,880394,null,0.96030337780824016,null,1.0309279362097294E-2,null,11.956359887136367,0,0,11.956359887136367,null,11.860000001635397,8.0000000363422058E-2,9.9999989097337896E-3,0,0,0,6.3598862278135592E-3,null,11.860000001635397,0,0,11.860000001635397,null,26305502.02,null,14000,0,0,14000,null,15000,1394148,null,0.96012632832679623,null,"No Base Rate",null,276780,21141,76857,29540,404318,null,240484,5639,20501,25094,291718]
[null,826,"Milton Keynes",null,6.071658762397445,6.164151361361049,11.668225305449786,5.9162546699834877,null,5.7300000004104517,9.3817717147586716E-2,7.622689041823355E-2,0,0,0,7.9261600197922527E-2,9.2352554223250879E-2,null,5.7300000004104517,5.7300000015268111,5.7300000936375017,5.7299999980137697,null,20394635.09,null,315002.53999999998,96713.76,4308.32,213980.46,null,652378,654280.5,null,0.97227383193586248,null,2.8820902020967248E-2,null,8.3386589740293164,8.6842186279362377,8.3115363651894238,8.3115179759742777,null,8.0300000154703888,0.1899877216679435,2.7141033304192007E-2,0,0,0,0,9.1530203586790676E-2,null,8.0300000154703888,8.0300001043598552,8.0300000271169516,8.0300000074262723,null,3038620.0400000005,null,33723.919999999998,2455.7800000000002,1687.69,29580.45,null,97187.34,70046.75,null,0.97202660533309582,null,2.6327799773215473E-2,null,8.2412450644365158,10.15127218627064,8.2123274916720117,8.2123569728070454,null,8.030000010399478,9.1896684187990046E-2,2.888743955255128E-2,0,0,0,9.046093029649567E-2,null,8.030000010399478,8.0300000581659496,8.0300014483457822,8.0300000049036075,null,8464700.5,null,93944.91,1399.7,306.04000000000002,92239.17,null,270735.28999999998,195129.61,null,0.96067119117782618,null,1.4818712132815567E-2,null,11.425179930644573,0,0,11.425088498685435,null,11.239999996409152,9.3318303241880105E-2,0,0,0,0,9.1861630993539972E-2,null,11.239999996409152,0,0,11.239999996409152,null,12624671.720000001,null,102328.63,0,50.97,102277.66,null,400192.09,212543.14,null,0.98121874608332749,null,"No Base Rate",null,181540,31294.18,88206.82,10756,311797,null,156646,14001.34,39464.660000000003,7504,217616]
[null,830,"Derbyshire",null,5.7218475027265736,5.9570596123029622,9.6414496622342707,5.3656041489277939,null,5.22,0.14413306120812605,0.1621221311591034,0,0,0,0.16589512513280211,2.9697185226541266E-2,null,5.22,5.2200000000000006,5.22,5.22,null,46001534.010000005,null,240000,0,0,240000,null,39511,1384759,null,0.97241114307787135,null,5.5418213909162926E-2,null,7.9208956212269452,7.75,7.75,7.9316291224134874,null,7.4200000000000008,0.33,0,0,0,0,0,0.1708956212269451,null,7.4200000000000008,7.42,7.42,7.42,null,5441918.25,null,120000,0,0,120000,null,0,170451,null,1.0220510479002509,null,4.2580645161290329E-2,null,7.5413809332965736,7.461025523178173,7.4547759380184342,7.5524808488200224,null,7.4200000020706387,7.9968172224069128E-2,0,0,0,0,4.1412759001865543E-2,null,7.4200000020706387,7.4199999924531186,7.4200000493012777,7.420000001567697,null,21732340.530000001,null,120000,0,0,120000,null,0,703389,null,0.97308141074794496,null,1.0662468208618669E-2,null,10.21745337551385,10.141414067929192,10.141404821393007,10.227769280764038,null,10.140000001267328,1.4136233261314182E-3,0,0,0,0,7.6039750920389892E-2,null,10.140000001267328,10.14000001385716,10.139999977368602,10.140000000719628,null,32008774.890000001,null,240000,0,0,240000,null,0,766160,null,0.9721649263095955,null,"No Base Rate",null,861561,150212,570,13520,1025863,null,422100,116312,938,45024,584374]
[null,831,"Derby",null,6.3000001176370635,5.8260307627231391,12.308840693270524,5.827488258704431,null,5.5200000016607582,0.16623598169284964,0,0,0,1.86887815857418E-2,0.46083679339689049,0.13423855930082287,null,5.5200000016607582,5.5200000000000005,5.520000018196912,5.5200000007546492,null,22275706.210000001,null,484978,236109,35410,213459,null,13703,540287.34,null,0.98335462007564667,null,3.2414934621939298E-2,null,8.3626009952540556,8.3626236995686369,8.3625999739901697,8.362598095474425,null,8.0999999927555013,0,0,0,0,0,0,0.26260100249855511,null,8.0999999927555013,8.1,8.0999999379733794,8.1,null,3354269.37,null,108745,11385,12701,84659,null,0,110687.88,null,0.992004863019461,null,0,null,8.3308028764354791,8.3307294361096744,8.3308072590872104,8.3308031794673809,null,8.1000000124410541,0,0,0,0,0,0.23080286399442443,null,8.1000000124410541,8.1,8.1000000712038212,8.1000000094215387,null,4557491.9800000004,null,129862,892,6483,122487,null,6798,202255.31,null,0.98966606362583898,null,0,null,11.229017779726751,0,11.873118123510269,11.190593834460714,null,11.16000001025407,0,0,0,0,0,6.9017769472683344E-2,null,11.160000010254068,0,11.160000669855926,11.160000005560709,null,5659412.1099999994,null,35000,17040,2555,15405,null,4094,300797.59999999998,null,0.97628939068799181,null,0,null,512772,146108.1,16530,14637.6,690047.7,null,215740,48776,9380,15946,289842]
[null,838,"Dorset",null,5.5326218124600306,5.4945177756100021,0,5.5394166515838421,null,5.450000000154537,1.8123556246342532E-2,0,2.5146632484633349E-2,0,0,0,3.9351623574517179E-2,null,5.4500000001545361,5.4499999948942808,0,5.4500000010925627,null,17773395,null,127321.60000000001,0,0,127321.60000000001,null,86108,482289,null,0.97359639924797792,null,7.8769452881680743E-3,null,7.4832039361809386,7.429999935115073,0,7.4922634235354613,null,7.429999973565443,0,0,0,0,0,0,5.3203962615495405E-2,null,7.4299999735654438,7.429999935115073,0,7.4299999801127088,null,1967500.4000000001,null,14088.67,0,0,14088.67,null,9528,53367,null,0.97398771288566444,null,0,null,7.4832039483927471,7.4300002383506127,0,7.4840894780355374,null,7.4300000039021912,0,0,0,0,0,5.3203944490555335E-2,null,7.4300000039021912,7.4300002383506127,0,7.4300000000000006,null,9520293.0500000007,null,68171.89,0,0,68171.89,null,46105,258232,null,0.97398783028807689,null,0,null,10.121949378806375,10.049999989507807,0,10.130160481662916,null,10.050000002507749,0,0,0,0,0,7.1949376298624787E-2,null,10.050000002507749,10.049999989507807,0,10.050000003991345,null,14026518.98,null,100417.84,0,0,100417.84,null,67913,380379,null,0.97419626812327986,null,0,null,199951,44190,85782,11697,341620,null,167902,7715.2,47626.8,9380,232624]
[null,839,"Bournemouth, Christchurch & Poole",null,5.6399999740734037,0,0,5.6399999740734037,null,5.34,6.9999945554146015E-2,0,0,0,0,0,0.23000002851925685,null,5.34,0,0,5.34,null,20866602.420000002,null,887120,0,0,887120,null,192852,578556,null,0.97431505739443625,null,1.2938991914717276E-2,null,8.1500010275937456,0,0,8.1500010275937456,null,7.72,0.13000074215103916,0,0,0,0,0,0.30000028544270735,null,7.72,0,0,7.72,null,2750114.3099999996,null,105100,0,0,105100,null,0,73570,null,0.97488050569303186,null,1.656060253000902E-2,null,8.1500003240711774,0,0,8.1500003240711774,null,7.72,0.13000009797500733,0,0,0,0,0.30000022609617077,null,7.72,0,0,7.72,null,10415921.779999999,null,398061,0,0,398061,null,0,278642,null,0.97488042153961463,null,1.6560521828342688E-2,null,10.949999176631273,0,0,10.949999176631273,null,10.280000000000001,7.0000006919064925E-2,0,0,0,0,0.59999916971220846,null,10.280000000000001,0,0,10.280000000000001,null,14958668.710000001,null,867168,0,0,867168,null,158981,404679,null,0.97530856814754352,null,"No Base Rate",null,303172,74568,0,6709,384449,null,167902,48776,0,12194,228872]
[null,840,"Durham",null,5.8002533424214526,5.4661952050274945,9.0626611495705003,5.4618651290616675,null,5.1600000002880018,3.5823311902364631E-2,6.8347920608908139E-2,5.556495072162048E-2,0,0,0.33561613998557316,0.1449010189149848,null,5.1600000002880018,5.1599999990651639,5.1600000084778808,5.1599999998380062,null,31418403.09,null,805000,375000,75000,355000,null,79233,1255055,null,0.95952701273619867,null,3.0027087382211316E-2,null,7.639142671617341,7.6391426655069994,7.6391426182597417,7.6391426841511496,null,7.5599999915581142,0,0,0,0,0,0,7.9142680059226173E-2,null,7.5599999915581142,7.5599999949613714,7.5599999687588646,7.5599999936814921,null,5731420.7599999998,null,60000,18848.62,6079.88,35071.5,null,15366,229509,null,0.9598259538822691,null,0,null,7.6405817973975152,7.6405817823249338,7.6405817980035158,7.6405817994347762,null,7.3699999974496873,0,0,0,0,0,0.27058179994782805,null,7.3699999974496873,7.3699999792797817,7.370000033352567,7.3699999973650652,null,11848357.869999999,null,435000,49623.55,25960.87,359415.58,null,31765,500886,null,0.95994241717606144,null,0,null,10.391313456863672,10.391313305067287,10.391311758833124,10.391313460711391,null,10.119999993771341,0,0,0,0,0,0.27131346309233229,null,10.119999993771341,10.119999596610956,10.119999025981931,10.119999997215283,null,17547276.359999999,null,470436,1883.24,891.36,467661.4,null,47044,752698,null,0.96022534874322385,null,0,null,879231,290016,72504,32627,1274378,null,392084,53466,53466,31892,530908]
[null,841,"Darlington",null,5.9527735639329142,5.6040954585989731,8.2857289980601241,5.6041986379711917,null,5.3599999999999994,6.7464352318123338E-2,0,0,0,0,0.34861686030542077,0.17669235130937064,null,5.3599999999999994,5.36,5.36,5.3599999999999994,null,7191810.2699999996,null,220000,63800,28600,127600,null,18032,113754,null,0.98399977055031129,null,1.2430178797822716E-2,null,8.0651221733191676,8.0646809752593054,8.0646809752593054,8.0652771905468086,null,7.8100000000000005,0.15760533289748649,0,0,0,0,0,9.7516840421681822E-2,null,7.8099999999999987,7.8100000000000005,7.8100000000000005,7.81,null,1364962.3399999999,null,16706,2172,2172,12362,null,4258.66,0,null,0.99999764778929068,null,1.9780765526468663E-2,null,7.9570929991857922,7.956769707649519,7.9570350947962885,7.9571599661336831,null,7.81,4.9680526613582104E-2,0,0,0,0,9.7412472572209266E-2,null,7.81,7.81,7.81,7.8100000000000005,null,2847680.1500000004,null,35294,4588,4588,26118,null,18153.849999999999,30000,null,0.98976491425221957,null,6.3209346035579175E-3,null,10.535515708816144,0,10.53551056605686,10.535515979494184,null,10.31,0.1140247965924323,0,0,0,0,0.11149091222371159,null,10.31,0,10.31,10.31,null,4113851.81,null,44000,0,2200,41800,null,156202.19,35000,null,0.99195226827741267,null,"No Base Rate",null,145350,57825,6425,5780,215380,null,66598,15008,15008,3752,100366]
[null,845,"East Sussex",null,5.7877872831236994,5.7142166696355572,0,5.8043554691743529,null,5.6900000001469211,3.3583071624213777E-2,0,0,0,0,0,6.4204211352565141E-2,null,5.6900000001469211,5.69,0,5.6900000001800075,null,27269925.52,null,305900,9000,0,296900,null,0,714600,null,0.96947860688839194,null,5.8674909061504476E-3,null,8.3075680988595373,8.2424585364467706,0,8.3201888495518528,null,8.1999999911285499,7.7626963371135102E-2,0,0,0,0,0,2.9941144359852456E-2,null,8.1999999911285499,8.1999999453613643,0,8.2000000000000011,null,3732254.27,null,13500,900,0,12600,null,0,316500,null,0.9705102919228431,null,9.3779248325436305E-3,null,8.2175009813910478,8.2205511827205662,0,8.2172216338531268,null,8.2000000034484692,0,0,0,0,0,1.7500977942577791E-2,null,8.2000000034484692,8.1999999999999993,0,8.2000000037642913,null,9511468.4800000004,null,20300,2000,0,18300,null,0,142100,null,0.95998843240549614,null,0,null,11.161373812928854,11.149999989315685,0,11.16321234601577,null,11.149999999256623,3.7170526786791777E-3,0,0,0,0,7.6567609935514159E-3,null,11.149999999256625,11.149999989315685,0,11.150000000863539,null,15004162.43,null,10300,0,0,10300,null,0,595400,null,0.95970540093971224,null,"No Base Rate",null,353035.45,69952.679999999993,69952.679999999993,14044.17,506984.98,null,254198,43617,43617,20636,362068]
[null,846,"Brighton and Hove",null,6.189686610617037,6.620062008199163,9.74655331401922,5.9718085667381082,null,5.33,0.2034649344649464,0.13440772321944186,0,0,0,0.15552657047158952,0.3662873824610593,null,5.33,5.33,5.33,5.33,null,14621798.42,null,919700,49700,70000,800000,null,0,534812,null,0.98920656395827022,null,5.9611899929739483E-2,null,9.3139738666763723,9.3140334910811795,9.3139767054908482,9.3139730026981482,null,8.9499999999999993,0,0,0,0,0,0,0.36397386667637266,null,8.9499999999999993,8.9500000000000011,8.9499999999999993,8.9500000000000011,null,2458967.75,null,100000,1000,7000,92000,null,0,84080,null,0.96818855162956063,null,0,null,9.239749116642022,12.405858281283653,9.6366744103755444,9.1751325687074647,null,8.8000000000000007,0,0,0,0,0,0.43974911664202276,null,8.8000000000000007,8.8000000000000007,8.7999999999999989,8.8000000000000007,null,8171319.2000000002,null,408333,33484,54383,320466,null,0,353085,null,0.96047288114781937,null,0,null,12.647740811231678,0,0,12.598305608423759,null,12.45,0,0,0,0,0,0.19774081123167808,null,12.45,0,0,12.45,null,12592241.25,null,200000,0,50000,150000,null,0,457428,null,0.9654763978039449,null,0,null,289760,74918,74918,13487,453083,null,108808,20636,20636,5628,155708]
[null,850,"Hampshire",null,6.1380759642411453,6.1419129093250113,10.202561320243175,6.0946826556772491,null,5.83,4.1097606185591572E-2,0,0,0,0,4.2988029430696739E-2,0.22399032862485752,null,5.8299999999999992,5.83,5.83,5.8299999999999992,null,88873561.129999995,null,3366001,45442,33324,3287235,null,151439,2789642.1,null,0.98153332473757093,null,6.999986875076393E-3,null,8.131095911164806,8.1310983024082102,8.1310881560941155,8.1310960573793896,null,7.88,9.5708131248288308E-2,0,0,0,0,0,0.15538777991651792,null,7.88,7.88,7.8800000000000008,7.88,null,8212443.1000000006,null,160000,1968,3520,154512,null,94557,260297.7,null,0.9696848084404005,null,1.1999954069696993E-2,null,7.9392029443041947,8.4783918520503896,8.0017722183344997,7.9383610690195425,null,7.88,3.1646513348313775E-2,0,0,0,0,2.7556430955881672E-2,null,7.88,7.88,7.88,7.879999999999999,null,42778668.279999994,null,148999,128,1108,147763,null,1598334,1377058.8,null,0.9710854713962711,null,3.9999908103731177E-3,null,10.836211642492113,0,10.836208674391411,10.836211661490085,null,10.77,3.240698776017964E-2,0,0,0,0,3.3804654731933316E-2,null,10.770000000000001,0,10.77,10.770000000000001,null,63910766.57,null,200000,0,1272,198728,null,1796230,2032001.4,null,0.96952274302330865,null,"No Base Rate",null,948000,72000,328000,36000,1384000,null,690000,34000,156000,54000,934000]
[null,851,"Portsmouth",null,6.1,6.1000000117297732,0,6.0999999980905022,null,5.7799999999999994,0.19999999999999998,0.03,0,0,0,0,0.09,null,5.7799999999999994,5.7800000093838193,0,5.7799999984724018,null,14639182.039999999,null,219222.36000000002,30691.13,0,188531.23,null,121800,620650,null,0.96093812864253425,null,3.8269550748752081E-2,null,8.9800445524153147,0,0,8.9800445524153147,null,8.8899999820585922,0,0,0,0,0,0,9.0044570356722767E-2,null,8.8899999820585922,0,0,8.8899999820585922,null,2279308.34,null,23086.54,0,0,23086.54,null,2570,96050,null,0.96047738662622373,null,0,null,8.9800445648830713,0,0,8.9800445648830713,null,8.8900000042831984,0,0,0,0,0,9.0044560599872162E-2,null,8.8900000042831984,0,0,8.8900000042831984,null,6434210.4900000002,null,65170.49,0,0,65170.49,null,7250,271120,null,0.96047667974451389,null,0,null,12.230003294384336,0,0,12.230003294384336,null,12.12999999657667,0,0,0,0,0,0.10000329780766538,null,12.12999999657667,0,0,12.12999999657667,null,9567001.2300000004,null,78873.179999999993,0,0,78873.179999999993,null,15780,402580,null,0.96003219082766333,null,0,null,168794,8201,23149,2822,202966,null,169778,10551,29783,12194,222306]
[null,852,"Southampton",null,6.6277274627935885,6.5772908166111774,6.6511087308549453,6.3741270809291741,null,6.189999999958518,8.9999999543694531E-2,0.18470680666190564,7.4907712528662046E-2,0,0,6.7371786115569335E-2,2.0741157985238592E-2,null,6.189999999958518,6.1900000094185135,6.1899999991762709,6.1899999822906588,null,15927235.860000001,null,50000,8643.7800000000007,39624.980000000003,1731.24,null,192939.51999999999,700000,null,1.0040207674811341,null,5.3461028587377273E-2,null,8.9246342917219774,8.9246344992068316,8.9246342903398919,8.9246335549004456,null,8.8700000018211433,0,0,0,0,0,0,5.4634289900833306E-2,null,8.8700000018211451,8.8700000697948731,8.8699999843509136,8.8700002615463376,null,2435283.7800000003,null,15000,1643.85,12917.49,438.66,null,14000,124000,null,0.96098782608452049,null,0,null,8.8954096586756037,8.8954089651610317,8.8954096898350752,8.8954096881645643,null,8.8699999994918066,0,0,0,0,0,2.5409659183798717E-2,null,8.8699999994918048,8.8699998929727073,8.8699999977893764,8.8700000518503543,null,5236197.7399999993,null,15000,641,12643.8,1715.2,null,48000,188000,null,0.96110498587406445,null,0,null,12.148363315497054,12.148363003763942,12.148363326531165,12.148363333960505,null,12.119999988654669,0,0,0,0,0,2.8363326842385985E-2,null,12.119999988654669,12.119999833453953,12.119999995849277,12.119999988060179,null,8546247.0999999996,null,20000.000000000004,749.33,16400.04,2850.63,null,65000,154900,null,0.96079624236536965,null,0,null,436563,98000,104000,18360,656923,null,192290,23000,24838,14070,254198]
[null,855,"Leicestershire",null,5.3757556841999925,0,10.84,5.3370040588588559,null,5.28,2.8337320825385169E-2,0,0,0,0,3.9153043033508396E-2,2.8265320341099142E-2,null,5.28,0,5.28,5.28,null,41120438.899999999,null,217351,0,0,217351,null,1153451,1727367,null,0.9608761289729304,null,5.3382667891533012E-3,null,7.308264859814579,0,0,7.308264859814579,null,7.2799999917989657,0,0,0,0,0,0,2.8264868015613953E-2,null,7.2799999917989657,0,0,7.2799999917989657,null,3550771.22,null,13786,0,0,13786,null,0,107898,null,0.97055310223301183,null,0,null,7.3082652590936128,0,0,7.3082652590936128,null,7.2800000006188004,0,0,0,0,0,2.8265258474812777E-2,null,7.2800000006188004,0,0,7.2800000006188004,null,23529393.890000001,null,91355,0,0,91355,null,0,714992,null,0.97055315525811592,null,0,null,9.8666743672970618,0,0,9.8666743672970618,null,9.81,2.8337126838273413E-2,0,0,0,0,2.8337240458788278E-2,null,9.81,0,0,9.81,null,34635777.310000002,null,99761,0,0,99761,null,0,1093574,null,0.9692214506185719,null,"No Base Rate",null,553784,12512.07,82911.929999999993,8590,657798,null,355502,11561.18,76610.820000000007,31892,475566]
[null,856,"Leicester",null,5.5696292580738049,5.6126510625269397,0,5.5440767553083461,null,5.0500000011922994,9.0039225458454025E-2,0.10884741965541356,0,0,0,0,0.32074261176763752,null,5.0500000011923003,5.0500000028797576,0,5.050000000190046,null,22011612.940000001,null,1345059,497580,0,847479,null,420757,289464,null,0.98779841865245488,null,3.7891205986288805E-2,null,8.0259652317218109,0,0,8.0259652317218109,null,7.5699999961513118,0.11250000000000002,8.9599998152629728E-2,0,0,0,0,0.25386523741786898,null,7.5699999961513118,0,0,7.5699999961513118,null,4038830.8299999996,null,131923,0,0,131923,null,91558,35257,null,0.99179616957491989,null,2.6003267881363579E-2,null,8.0259654555656574,0,0,8.0259654555656574,null,7.5700000028296088,0.11249999646298857,8.9599997962681421E-2,0,0,0,0.2538654583103781,null,7.5700000028296088,0,0,7.5700000028296088,null,5493408.8799999999,null,179435,0,0,179435,null,124533,50827,null,0.99179628939352127,null,2.6003267391958636E-2,null,10.930365640386984,0,0,10.930365640386984,null,10.480000002597782,0.11250000649445452,8.4000002078225444E-2,0,0,0,0.25386562921652461,null,10.480000002597782,0,0,10.480000002597782,null,8219704.9699999997,null,195448,0,0,195448,null,204936,55363,null,0.99348315408087962,null,"No Base Rate",null,773120,126254,171725,26818,1097917,null,182910,19077,25947,22512,250446]
[null,857,"Rutland",null,5.6372721335818596,0,0,5.6372721335818596,null,5.4800000064787699,1.7816615840720751E-3,0,0,0,0,0,0.15549046551901746,null,5.4800000064787699,0,0,5.4800000064787699,null,1692229.29,null,48000,0,0,48000,null,0,58168.45,null,0.98726307067983532,null,3.2501505750441183E-4,null,6.9399998642116127,0,0,6.9399998642116127,null,6.9399998642116127,0,0,0,0,0,0,0,null,6.9399998642116127,0,0,6.9399998642116127,null,102217.87,null,0,0,0,0,null,0,3514.14,null,0.95988933114960062,null,0,null,6.9399999644375212,0,0,6.9399999644375212,null,6.9399999644375212,0,0,0,0,0,0,null,6.9399999644375212,0,0,6.9399999644375212,null,780598.01,null,0,0,0,0,null,0,26836.15,null,0.95988934501210521,null,0,null,9.6,0,0,9.6,null,9.6,0,0,0,0,0,0,null,9.6,0,0,9.6,null,1176151.68,null,0,0,0,0,null,0,39459.9,null,0.98360655737704916,null,0,null,7862.3,0,0,0,7862.3,null,22512,0,0,0,22512]
[null,860,"Staffordshire",null,5.5685938412576457,0,18.872315477808996,5.5182322343877441,null,5.43,3.6082886637311538E-2,0,0,0,0,2.8432905357412646E-2,7.4078049262920234E-2,null,5.4300000000000006,0,5.4300000000000006,5.4300000000000006,null,48223507.960000008,null,650158,0,0,650158,null,203269,1253000,null,0.97431192779836351,null,6.6012329826760892E-3,null,7.8443157373972419,0,0,7.8443157373972419,null,7.8400000023989644,0,0,0,0,0,0,4.3157349982778448E-3,null,7.8400000023989644,0,0,7.8400000023989644,null,6536156.6500000004,null,3598,0,0,3598,null,33348,50000,null,0.99298690826970226,null,0,null,7.8425977010574313,0,0,7.8425977010574313,null,7.84,0,0,0,0,0,2.5977010574312603E-3,null,7.84,0,0,7.84,null,27428067.52,null,9088,0,0,9088,null,139939,210000,null,0.99277048699707826,null,0,null,10.148412568452278,0,0,10.148412568452278,null,9.85,0,0,0,0,0,0.29841256845227787,null,9.85,0,0,9.85,null,37535237.399999999,null,1137156,0,0,1137156,null,838024,1534000,null,0.96270444694007162,null,0,null,922306,87220,366005,40790,1416321,null,440860,21661,90899,42210,595630]
[null,861,"Stoke-on-Trent",null,5.8213534300774681,5.7467520432882946,11.99863916548127,5.7925166790942271,null,5.66,5.0837212932791982E-2,0,0,0,0,5.7597554452201438E-2,5.2918662692475096E-2,null,5.66,5.66,5.66,5.6599999999999993,null,13080681.5,null,120000,51400,2000,66600,null,325000,735985,null,1.0011995345340206,null,8.9018844413330071E-3,null,8.2754358305107747,8.1999999999999993,8.2000000000000011,8.2835421888053471,null,8.1999999999999993,0,0,0,0,0,0,7.5435830510776014E-2,null,8.1999999999999993,8.1999999999999993,8.2000000000000011,8.1999999999999993,null,3261049.8,null,30000,0,0,30000,null,82000,99319,null,1.0157637246195885,null,0,null,8.235866419108671,8.1999999999999993,8.2000000000000011,8.2369163070403086,null,8.2000000000000011,0,0,0,0,0,3.5866419108671665E-2,null,8.1999999999999993,8.1999999999999993,8.2000000000000011,8.1999999999999993,null,6858783.3999999994,null,30000,0,0,30000,null,173000,108295,null,1.0111013296569276,null,0,null,11.406045936594188,0,0,11.406045936594188,null,11.379999999479081,0,0,0,0,0,2.6045937115106166E-2,null,11.379999999479081,0,0,11.379999999479081,null,8738407.0299999993,null,20000,0,0,20000,null,220000,70390,null,1.0274649600053034,null,0,null,823300,189200,63100,22710,1098310,null,59900,13800,4600,1700,80000]
[null,865,"Wiltshire",null,5.7302680812041418,5.7363720789059505,0,5.7298086414601199,null,5.52,4.4105688340500604E-2,0,0,4.4833432540804423E-3,0,0,0.1616790496095612,null,5.52,5.5200000000000005,0,5.52,null,32499700.009999998,null,943600,66052,0,877548,null,0,619024,null,1.0035495763930196,null,8.7255553101334617E-3,null,7.893107566397636,7.8930873561731021,0,7.8931090876143877,null,7.7599999989467268,0,0,0,0,0,0,0.13310756745091029,null,7.759999998946725,7.7599999849533772,0,7.76,null,2946999.9899999998,null,50550,3538,0,47012,null,0,33162,null,1.0171530369069119,null,0,null,7.6037793502888498,7.6037822852908068,0,7.6037791293739581,null,7.45,0,0,0,0,0,0.15377935028884965,null,7.45,7.4499999999999993,0,7.45,null,15509998.550000001,null,320150,22411,0,297739,null,0,210026,null,0.97986847297536728,null,0,null,10.143474258979928,10.143473407012822,0,10.143474323106833,null,9.9799999979714542,0,0,0,0,0,0.16347426100847337,null,9.9799999979714542,9.9799999710209342,0,9.98,null,22630999.989999998,null,370700,25949,0,344751,null,0,243188,null,0.96788876516984046,null,0,null,207424,11112,70376,81488,370400,null,207984,11142,70566,81708,371400]
[null,866,"Swindon",null,5.6347782591866906,5.5073396612836145,0,5.6821434918963094,null,5.46,4.7335778529728874E-2,0,0,0,0,0,0.12744248065696234,null,5.46,5.4599999959685732,0,5.460000001498365,null,15125000.02,null,350000,0,0,350000,null,0,644700,null,0.95992815318342262,null,8.5950413109487055E-3,null,7.9971914577530168,7.9285957001336245,0,8.0116141559416363,null,7.86,6.8595728876508819E-2,0,0,0,0,0,6.8595728876508819E-2,null,7.86,7.8600000540082435,0,7.8599999886444198,null,2028035.68,null,17545.93,0,0,17545.93,null,0,85231,null,0.96004699372785318,null,8.651687035407583E-3,null,7.9972004143946931,7.9285957419143696,0,8.0116261273599676,null,7.8600000038208044,6.8600205286944785E-2,0,0,0,0,6.8600205286944785E-2,null,7.8600000038208044,7.8600000013744671,0,7.8600000043352019,null,6640364.2599999998,null,57454.07,0,0,57454.07,null,0,279069,null,0.96004806895494521,null,8.6522467368378968E-3,null,10.865757427753545,10.810960972621674,0,10.868655989407662,null,10.799999999999999,1.0959571292257846E-2,0,0,0,0,5.4797856461289228E-2,null,10.799999999999999,10.799999956370591,0,10.80000000230786,null,9864400.0599999987,null,50000,0,0,50000,null,0,413000,null,0.95987256428918255,null,"No Base Rate",null,275200,23817,77983,9200,386200,null,110700,6785,22215,9400,149100]
[null,867,"Bracknell Forest",null,6.5024455866082214,6.5279192540575632,0,6.4893723766217395,null,6.2999999965683156,0.11874680231338097,0,0,0,0,0,8.3698787726525087E-2,null,6.2999999965683156,6.2999999959526169,0,6.2999999968842957,null,9352180.5199999996,null,121950,41359.46,0,80590.539999999994,null,121950.19,399836.7,null,0.9786247406744073,null,1.8499997902093532E-2,null,9.6964276793540218,0,0,9.6964276793540218,null,9.0200000165144374,0.55701785169456719,0,0,0,0,0,0.11940981114501617,null,9.0200000165144374,0,0,9.0200000165144374,null,927868.61,null,11569.01,0,0,11569.01,null,11569.01,37931.18,null,1.0016160704590853,null,5.8161930922525772E-2,null,9.2748947924738658,0,0,9.2748947924738658,null,9.019999997891686,0.12415610761300751,0,0,0,0,0.13073868696917254,null,9.019999997891686,0,0,9.019999997891686,null,4337188,null,62011,0,0,62011,null,62011,203314.82,null,0.95975851831051406,null,1.3577645239265626E-2,null,12.549096086337849,0,0,12.549096086337849,null,12.310000001767856,7.7770005103800555E-2,0,0,0,0,0.16132607946619232,null,12.310000001767856,0,0,12.310000001767856,null,7007227.5800000001,null,91255.21,0,0,91255.21,null,91255.21,290197.40999999997,null,0.96000167415438364,null,"No Base Rate",null,75194.399999999994,10793.19,12856.11,2126.1,100969.8,null,56280,10274.14,12237.86,2814,81606]
[null,868,"Windsor and Maidenhead",null,7.0694921439825249,6.57,10.674228818990514,6.7113954768219681,null,5.9099999999413253,0.66000000434191508,0,0,0,0,0.39480504892660501,0.10468709077267904,null,5.9099999999413253,5.91,5.9100000262281043,5.9099999965130596,null,11870236.42,null,178420,0,0,178420,null,50000,488500,null,0.99614023354032355,null,0.10045662159994447,null,9.4324269782262355,9.2200000000000006,9.2199999999999989,9.4485714285714284,null,8.3000000000000007,0.92,0,0,0,0,0,0.21242697822623474,null,8.3000000000000007,8.3000000000000007,8.3000000000000007,8.3000000000000007,null,520837.8,null,12000,0,0,12000,null,0,250000,null,0.99814042097632127,null,9.9783080260303678E-2,null,9.3584518499975093,9.2200000000000006,9.2199999999999989,9.3647501162891214,null,8.3000000000000007,0.91999998877417333,0,0,0,0,0.13845186122333819,null,8.2999999999999989,8.3000000000000007,8.3000000000000007,8.2999999999999989,null,4927922.1899999995,null,74000,0,0,74000,null,0,61140,null,0.99031236507910181,null,9.9783079164243046E-2,null,12.696744652155456,0,12.500000000000002,12.696947281007272,null,11.239999992780014,1.2600000072199873,0,0,0,0,0.196744652155455,null,11.239999992780012,0,11.24,11.239999992772576,null,6925220,null,109000,0,0,109000,null,0,100000,null,0.99193317594964503,null,"No Base Rate",null,64809,15276,0,1374,81459,null,45962,16884,0,2814,65660]
[null,869,"West Berkshire",null,6.5804985596370233,6.497319804540802,11.330664582918599,6.1770010445208321,null,5.8300000008519577,5.4973715814435456E-2,0.35969374832288492,0,0,0,0.28453185711333473,5.1299237534411644E-2,null,5.8300000008519577,5.8300000013532571,5.8300000356885668,5.8299999975710826,null,11495634.459999999,null,90320,10320,30000,50000,null,0,268563,null,0.97010272766158545,null,6.6403450057533578E-2,null,8.989282677747175,9.037234387574923,8.9393644232540073,8.9918908030090048,null,8.6800000959628427,0.24583194986901072,0,0,0,0,0,6.3450631915322381E-2,null,8.6800000959628427,8.6800002402373533,8.6800001023143523,8.6800000588155726,null,930134.17999999993,null,6612,0,0,6612,null,0,21730,null,0.99219455604273465,null,2.754162845622983E-2,null,8.714114316942597,8.9652371258604937,8.8621774141388006,8.7036717727167954,null,8.6799999968245469,2.7115621736229726E-2,0,0,0,0,6.9986983818209128E-3,null,8.6799999968245487,8.6799998561347742,8.6800002155962304,8.6799999933040528,null,5484014.8200000003,null,4408,0,0,4408,null,0,128119,null,0.96182277228946977,null,3.114191073612015E-3,null,11.803902306540719,11.797058823529412,11.793636363636363,11.80390632800661,null,11.790000000000001,4.0985148580437456E-3,0,0,0,0,9.8037916826751101E-3,null,11.790000000000001,11.79,11.790000000000001,11.790000000000001,null,8012073.1500000004,null,6660,0,0,6660,null,0,187180,null,0.95966685419030229,null,"No Base Rate",null,135748.34,35928.71,23952.47,3904.93,199534.44999999998,null,78792,14070,9380,5628,107870]
[null,870,"Reading",null,7.225182517772776,6.6367456383544763,11.04907195272181,6.7185594422074084,null,6.55,7.5230298105119733E-2,0,0,0,0,0.52003529331260157,7.9916926355053916E-2,null,6.5500000000000007,6.55,6.55,6.5500000000000007,null,14305386.190000001,null,160000,0,40000,120000,null,0,642720.81999999995,null,0.97742669017422279,null,1.1355121968610861E-2,null,9.7469632188633462,9.6476902887139104,9.7307163662389122,9.7600816211652131,null,9.57,7.7500978045368041E-2,0,0,0,0,0,9.9462240817977471E-2,null,9.57,9.5699999999999985,9.57,9.57,null,1454949.27,null,15000,0,5000,10000,null,0,48414.22,null,0.97275082024584292,null,8.0332697785401135E-3,null,9.6642843420753834,0,12.749439252336447,9.6543016926463832,null,9.5699999999999985,6.4141646554790377E-2,0,0,0,0,3.0142695520594495E-2,null,9.5699999999999985,0,9.57,9.57,null,4794266.8099999996,null,15000,0,5000,10000,null,0,159753.43,null,0.96449943533686466,null,6.657743772921141E-3,null,13.212722476095246,0,0,13.212722476095246,null,13.14,5.4273891378422902E-2,0,0,0,0,1.8448584716823448E-2,null,13.14,0,0,13.14,null,7151916.5800000001,null,10000,0,0,10000,null,0,174011.53,null,0.96022692413482891,null,"No Base Rate",null,168036,11688.43,38568.57,4526,222819,null,81606,6980.92,23035.08,8442,120064]
[null,871,"Slough",null,7.3918638490343485,6.6408482877194341,11.462731284756098,6.672021427899435,null,6.51,0.12771754613402472,0,0,0,0,0.72989650671986095,2.4249796180463103E-2,null,6.51,6.510000000506829,6.5099999892045792,6.5100000031324896,null,15191084.489999998,null,50000,19000,7500,23500,null,20684.72,573201,null,0.95999989909293448,null,1.924118422429871E-2,null,9.6653499667677263,9.539838728992855,9.6480377919481359,9.6743151742463134,null,9.4600000199593222,0.12551265520868468,0,0,0,0,0,7.9837291599719765E-2,null,9.4600000199593222,9.4600015967426447,9.4599999655873734,9.4600000199593222,null,1921009.5899999999,null,16000,160,4640,11200,null,2294.62,80804.399999999994,null,0.95999997342717125,null,1.309399501748453E-2,null,9.6653498836038807,9.7793501257434841,9.8536186585072958,9.6436773919223082,null,9.4599999866937843,0.12551260531037742,0,0,0,0,7.9837291599719765E-2,null,9.4599999866937843,9.4600015967426465,9.4599998536316328,9.4599999925663596,null,2881514.36,null,24000,480,2400,21120,null,3441.94,121206.6,null,0.95999996847694224,null,1.3093989925491815E-2,null,13.168837330359862,13.729999999999999,13.729999999999999,13.168834137863355,null,12.95,0.10505647797060472,0,0,0,0,0.11378085238925567,null,12.950000000000001,12.95,12.95,12.950000000000001,null,4589544.2700000005,null,40000,0,0,40000,null,14330.01,193495,null,0.95999995270156413,null,"No Base Rate",null,211795,40078,60117,9018,321008,null,87234,10505.6,15758.4,6566,120064]
[null,872,"Wokingham",null,6.4839393890058359,6.5875436298326902,7.4883311235060273,6.3684255279449946,null,6,2.9209927108447779E-2,0.18906252067035709,0,0,0,9.876094469406356E-2,0.16690599653296742,null,6,6,6.0000000000000009,6,null,12792573.85,null,338000,32000,46000,260000,null,78382,520131,null,0.97231200048026145,null,3.5101782627226762E-2,null,8.8969963894205009,8.8399987958517094,21.230021063065298,8.8694008732628173,null,8.8399999886007219,0,0,0,0,0,0,5.699640081977924E-2,null,8.8399999886007219,8.8399987958517094,8.8399826539462278,8.8400000646817798,null,620390.05000000005,null,4000,0,2000,2000,null,5000,287123,null,0.96744788462192277,null,0,null,8.8934095271052094,8.8877295392314331,10.122590484187649,8.8906592868785612,null,8.8399999948876822,4.7729180841214303E-2,0,0,0,0,5.6803513763115055E-3,null,8.839999994887684,8.8400000800049607,8.8399995060569765,8.8399999935537128,null,6258577.04,null,4000,0,2000,2000,null,18033,0,null,0.96213786097060028,null,5.3702334868118845E-3,null,11.772606550792938,0,11.835828677055302,11.771329596367808,null,11.769999997263119,0,0,0,0,0,2.6065535298189007E-3,null,11.769999997263119,0,11.770000052662901,11.769999996144159,null,9031082.5099999998,null,2000,0,1000,1000,null,202344,384723,null,0.95983387436298062,null,0,null,70435,9690,9690,1744,91559,null,58156,12194,12194,4690,87234]
[null,873,"Cambridgeshire",null,6.1902987861690679,5.9938884688488345,10.846769485141072,5.9475687650522442,null,5.6599999997137767,0.12793952097626371,0,0,0,0,0.2337495288217725,0.16860973665725609,null,5.6599999997137767,5.6599999925620059,5.6600000130292907,5.6599999995998385,null,37869094.099999994,null,1060350,81607.360000000001,51763.29,926979.35,null,0,2500000,null,0.98181548624234216,null,2.210450204583525E-2,null,8.5184051051628895,8.5184052623916298,8.5184052064159879,8.518405088416328,null,8.150000001205159,0,0,0,0,0,0,0.36840510395773002,null,8.150000001205159,8.1500000259057561,8.15,8.15,null,3381300.7700000005,null,152845.21,7110.49,11208.36,134526.35999999999,null,0,0,null,1.0140958458527247,null,0,null,8.1966270297596928,8.1948234811165843,8.1946739510053384,8.1966603240207725,null,8.15,0,0,0,0,0,4.662702975969242E-2,null,8.15,8.15,8.15,8.15,null,19603472.100000001,null,112153.58,982.71,895.4,110275.47,null,0,0,null,0.97578893211424911,null,0,null,11.041833406648298,11.041833826472891,11.041833413354084,11.0418333989529,null,11,0,0,0,0,0,4.183340664829855E-2,null,11,11,11,11,null,29332347,null,111552,1922.85,2526.7800000000002,107102.37,null,0,0,null,0.97028413063693297,null,0,null,706219,244647.99,65033.01,27872,1043772,null,294532,70396.899999999994,18713.099999999999,24388,408030]
[null,874,"Peterborough",null,6.1004347569158224,6.1884320564933546,10.312609496624992,6.0775971640380524,null,5.6800000011650518,4.5212674579506694E-2,0,0.22049999937924589,0,0,1.8193707270565053E-2,0.13652837452145181,null,5.6800000011650527,5.6800001165051652,5.6799997087371574,5.6800000008916216,null,16380817.200000001,null,374996.89,10000,10000,354996.89,null,353299.33,237983.75,null,0.97888735698799179,null,4.4689793886351858E-2,null,8.2472582533089671,8.4687150917486687,8.4687186492774646,8.2427387090737056,null,8.1000000266814585,0.10189974655282222,0,0,0,0,0,4.5358480074686736E-2,null,8.1000000266814585,8.100000355752881,8.100002134517279,8.1000000108903905,null,3074007.24,null,17000,1500,500,15000,null,200000,237983.75,null,0.99669550858776657,null,1.2423919990507244E-2,null,8.2129043249060363,8.2828671709201718,8.282870360923166,8.2114764960624118,null,8.1000000014575662,3.7110837435084885E-2,0,0,0,0,7.5793486013383468E-2,null,8.1000000014575679,8.0999998056576938,8.1000008745412302,8.1,null,5582666.6100000003,null,52000,1500,500,50000,null,175000,237983.75,null,0.96117804275616836,null,4.5606896808763585E-3,null,11.144719593439994,11.196907817969663,11.196907817969661,11.143654527924125,null,11.07000000802886,6.0000010705145247E-2,0,0,0,0,1.4719574705989877E-2,null,11.07000000802886,11.070000071367655,11.070000963463329,11.070000002184724,null,8317495.7599999998,null,11000,750,250,10000,null,345000,237983.75,null,0.9663929210612856,null,"No Base Rate",null,447239,27966.9,2000,2696,479901.9,null,174916.07,57780,0.01,1126,233822.08000000002]
[null,876,"Halton",null,6.1905529195189102,5.8149252890495751,9.2137595371146404,5.8069198115821656,null,5.44,0.17000000356140957,0.14000000000000001,0,0,0,0.38085300745011264,5.9699908507388322E-2,null,5.4399999999999995,5.4400000108056608,5.4399999745443601,5.4399999995235877,null,8607340.5800000001,null,83815,27323.69,9554.91,46936.4,null,14247,209538,null,0.97484878101382899,null,5.3913044064244027E-2,null,8.2896417820763162,8.289641793640099,8.2896414479251597,8.289641796995376,null,8.229999960176869,0,0,0,0,0,0,5.9641821899448368E-2,null,8.229999960176869,8.2299999378976487,8.2299996570785083,8.2299999875450283,null,1859974.23,null,13479.01,3841.52,539.16,9098.33,null,4910,48138,null,0.9755126189067157,null,0,null,8.2896391347819272,8.2896391760114376,8.2896391938197986,8.2896391138753724,null,8.2299999984146357,0,0,0,0,0,5.9639136367291956E-2,null,8.2299999984146357,8.2300000222507173,8.2300000679441681,8.2299999842302451,null,3633866.71,null,26333.01,7504.91,1053.32,17774.78,null,9592,94048,null,0.97551210629964946,null,0,null,11.208000632922973,11.208000638511416,11.208000632091208,11.208000630612698,null,11.15,0,0,0,0,0,5.8000632922973028E-2,null,11.15,11.149999989056591,11.150000025990593,11.150000003080367,null,5362516.68,null,27895.010000000002,7950.08,1115.8,18829.13,null,47414,139474,null,0.9747056964817008,null,0,null,231505.5,58932.3,58932.3,10607.7,359977.8,null,101304,16415,16415,9380,143514]
[null,877,"Warrington",null,5.7758615185163755,5.6383716428969679,14.126822833554034,5.6776431773952432,null,5.5299999972238219,2.9999779095528256E-2,0,0,0,0,8.6967750604324434E-2,0.12889399159270101,null,5.5299999972238219,5.5299999917981015,5.530000019034941,5.5299999981632526,null,14238557,null,325000,50000,25000,250000,null,75288.94,775000,null,0.99283908470662396,null,5.3956439392858629E-3,null,7.9403519464008445,8.410513143656706,7.9402983869339634,7.8954474071506748,null,7.7299999853595054,0,0,0,0,0,0,0.21035196104133908,null,7.7299999853595054,7.7300000356341512,7.7300002018856118,7.7299999744738281,null,1531164.04,null,41666.67,11458.33,1041.67,29166.67,null,0,0,null,0.98637912377650239,null,0,null,7.7754556039286769,8.6230427741051514,0,7.7622706312327825,null,7.7300000007636536,0,0,0,0,0,4.5455603165023208E-2,null,7.7300000007636536,7.729999859711036,0,7.7300000027660527,null,7085669.0199999996,null,41666.67,11458.33,1041.67,29166.67,null,0,0,null,0.96589510607809637,null,0,null,10.541731507834189,0,0,10.541731507834189,null,10.500000005007781,0,0,0,0,0,4.1731502826406704E-2,null,10.500000005007781,0,0,10.500000005007781,null,10483685,null,41666.660000000003,0,0,41666.660000000003,null,0,0,null,0.96359520181299729,null,0,null,162291,58980,911,5393,227575,null,107870,14539,14539,11256,148204]
[null,878,"Devon",null,5.6892126332391522,5.6627353821853861,9.5753937590936733,5.6266569809833831,null,5.3599999990254998,0.11136162097355523,0,0,0,0,5.37485259661383E-2,0.16410248727395885,null,5.3599999990254998,5.3599999964868141,5.3599999855602265,5.359999999514744,null,40821763.969999999,null,1212456.01,112152.18,18186.849999999999,1082116.98,null,39500,1181075,null,0.98788271811013639,null,2.0353547929733526E-2,null,7.5647864001069838,7.5647892076291168,7.5647749962118302,7.5647866189899462,null,7.2799999951082341,9.4927782548269057E-2,0,0,0,0,0,0.18985862245048021,null,7.2799999951082341,7.2800000088618955,7.279999946362218,7.2799999959089829,null,4824386,null,124198,8569.66,4247.58,111380.76,null,20000,586107,null,0.98897915879270648,null,1.2871689786016292E-2,null,7.5835596114533042,7.5835536508875849,7.5835838117828267,7.5835594793215328,null,7.2800000007153347,0.10118653929710396,0,0,0,0,0.20237307144086497,null,7.2800000007153347,7.2800000650303938,7.2799999197755847,7.2800000001479033,null,20637026.969999999,null,565813.98,12447.9,6054.2,547311.88,null,4500,137133,null,0.98765222833472399,null,1.3708709128076505E-2,null,10.099999811519119,10.03998380070489,10.039994746174557,10.100029832328687,null,9.7799999976357803,9.9999939581041933E-2,0,0,0,0,0.21999987430229812,null,9.7799999976357803,9.7799960596309194,9.7799960596309177,9.7799999996057672,null,30088569,null,669988,200.99,134,669653.01,null,29000,863685,null,0.97300503991254716,null,"No Base Rate",null,839006,83717.990000000005,356903.01,39655,1319282,null,352688,19604.2,83575.8,22512,478380]
[null,879,"Plymouth",null,5.9308232456470522,5.8851159640908728,12.959802186521468,5.6640089912626648,null,5.3400000046602836,0.14000000170137339,7.0000000850686694E-2,0,0,0,0.21142375248396353,0.16939948595074472,null,5.3400000046602845,5.3400000064007997,5.3400000475368827,5.3400000024013945,null,15577150.529999999,null,458005.07,22700,22344.5,412960.57,null,0,445786,null,0.97434403631398436,null,3.7837838248497402E-2,null,8.1290812618486132,8.0395487878417295,8.1056450032185872,8.1555665591203113,null,8.010000003058968,0,0,0,0,0,0,0.11908125878964604,null,8.010000003058968,8.0100000421693593,8.0099997324668895,8.0100000152342847,null,2356677.4500000002,null,35035.72,1751.79,1751.79,31532.14,null,0,69170,null,0.97121639926506742,null,0,null,8.1290812550441256,8.6861124698908689,8.2434927110264233,8.0941495816735749,null,7.9099999998939712,0.10000000954260077,0,0,0,0,0.11908124560755411,null,7.9099999998939703,7.9099999897018787,7.9099998792216475,7.9100000043857843,null,7554544.2799999993,null,112310.18000000001,5615.51,5615.51,101079.16,null,0,221733,null,0.97121639845210594,null,1.2484395683494491E-2,null,11.073428698806888,0,11.580288546226823,11.03126006107248,null,10.85,0.08,0,0,0,0,0.14342869880688516,null,10.850000000000001,0,10.850000239895433,10.849999996543966,null,11228509.230000002,null,147345.87999999998,7367.29,7367.29,132611.29999999999,null,0,328666,null,0.97220620709454653,null,"No Base Rate",null,241470,60554,60554,10899,373477,null,145390,23919,23919,8442,201670]
[null,880,"Torbay",null,5.7722009815799673,5.7927390175356104,0,5.7587889944620603,null,5.41,0.17541710394227708,0,0,0,0,0,0.18678387763769011,null,5.41,5.4099999999999993,0,5.41,null,6615462.9699999997,null,221230,88492,0,132738,null,0,193275.53,null,0.97338971021584608,null,3.1406267549555944E-2,null,8.2621146812522088,8.2635879123807499,0,8.2616235998472156,null,7.8999999999999995,0.17560275277642684,0,0,0,0,0,0.18651192847577996,null,7.9000000000000012,7.9,0,7.9,null,1212172.2000000002,null,27996,6999,0,20997,null,0,35084,null,0.97201349191202435,null,2.1744847802977169E-2,null,8.2615724558630355,8.2619578713019646,0,8.2615148645968599,null,7.8999999999999995,0.17506178061758354,0,0,0,0,0.18651067524545273,null,7.8999999999999995,7.8999999999999995,0,7.8999999999999995,null,2901660.4,null,67020,8713,0,58307,null,0,83931,null,0.97194970068976883,null,2.167931161069021E-2,null,11.26158787860196,11.256490061992714,0,11.261800287061718,null,10.9,0.17496855635315051,0,0,0,0,0.18661932224880873,null,10.9,10.899999999999999,0,10.9,null,4332261.9000000004,null,73001,2920,0,70081,null,0,124563,null,0.97250327103643863,null,"No Base Rate",null,137980,8239,29210,3369,178798,null,83482,5572,19754,4690,113498]
[null,881,"Essex",null,5.8011509336721057,6.0276856695881671,8.1849138119505067,5.7299357101726178,null,5.5400000002493917,8.9068528789858381E-2,4.0458666654562846E-2,0,0,0,3.0679405349786106E-2,0.10094433262850616,null,5.5400000002493917,5.540000001006546,5.5400000098459961,5.5399999999861409,null,95996981.400000006,null,1700000,221170,22610,1456220,null,0,1626118,null,0.98304455135375046,null,2.2846207624297361E-2,null,8.2646183702425198,8.2949077442695067,0,8.2630651601731948,null,8.1600000028770054,0,0,0,0,0,0,0.10461836736551387,null,8.1600000028770054,8.1600000589818968,0,8.16,null,12479644.189999999,null,160000,10064,0,149936,null,0,206914,null,1.007880289053966,null,0,null,7.9745063779383045,7.9745081760545702,0,7.9745062572611101,null,7.9600000004351923,0,0,0,0,0,1.4506377503113746E-2,null,7.9600000004351905,7.9600000057663634,0,7.9600000000773994,null,43897933.849999994,null,80000,5032,0,74968,null,0,745838,null,0.97250077779735455,null,0,null,10.92999430870691,10.930034289778023,0,10.929993230607806,null,10.920000000399705,0,0,0,0,0,9.9943083072039449E-3,null,10.920000000399705,10.919999989851529,0,10.920000000684141,null,65568239.43,null,60010,1582,0,58428,null,0,1100687,null,0.9837978675703789,null,0,null,1072967,353740,155083,45794,1627584,null,853580,155083,77541,57218,1143422]
[null,882,"Southend-on-Sea",null,5.7536881514898637,5.7536881353295435,0,5.7536881555299439,null,5.5699999967679368,0.10399999719887776,0,0,0,0,0,7.9688157523049474E-2,null,5.5699999967679368,5.5699999913811631,0,5.5699999981146302,null,10533206.779999999,null,147933,29586.6,0,118346.4,null,0,460257,null,0.97851839311052125,null,1.8329220533919867E-2,null,8.3456435583086588,8.3456435583086606,0,8.3456435583086606,null,8.2299999640691013,0,0,0,0,0,0,0.11564359423955847,null,8.2299999640691013,8.2299999640691013,0,8.2299999640691013,null,1374304.65,null,19311,3862.2,0,15448.8,null,0,9809,null,0.99352899503674508,null,0,null,8.1456437269819144,8.1456437269819144,0,8.1456437269819144,null,8.0300000061052561,0,0,0,0,0,0.11564372087665777,null,8.0300000061052561,8.0300000061052561,0,8.0300000061052561,null,3945780.6,null,56825,11365,0,45460,null,0,122845,null,0.96971949130737067,null,0,null,11.087438858061022,11.08743885806102,0,11.08743885806102,null,10.930000000000001,0,0,0,0,0,0.15743885806102051,null,10.930000000000001,10.93,0,10.93,null,5850063.9000000004,null,84266,16853.2,0,67412.800000000003,null,0,182781,null,0.97002964637454259,null,0,null,278668,90010.4,22502.6,10129,401310,null,120064,29265.599999999999,7316.4,7504,164150]
[null,883,"Thurrock",null,5.9939371108680932,5.5,0,7.3371547788810325,null,5.5,0.23975758610653364,0,0,0,0,0,0.25417952476155931,null,5.5,5.5,0,5.5,null,13548906.25,null,600000,0,0,600000,null,0,343784,null,0.97780377012530073,null,4.177137840923506E-2,null,8.4875011094117419,8.3000000000000007,0,8.5016140998836285,null,8.2999999879575395,0,0,0,0,0,0,0.18750112145420267,null,8.2999999879575395,8.3000000000000007,0,8.2999999870511161,null,2067683.63,null,46710,0,0,46710,null,0,65394,null,0.97000012678991332,null,0,null,8.4874996321899818,8.3000000328952463,0,8.4973680336905542,null,8.2999999950657131,0,0,0,0,0,0.18749963712427023,null,8.2999999950657113,8.3000000328952463,0,8.2999999930746835,null,5046321.2299999995,null,113998,0,0,113998,null,0,159598,null,0.9699999579645695,null,0,null,11.566795282960035,0,0,11.566795282960035,null,11.5,0,0,0,0,0,6.6795282960035229E-2,null,11.5,0,0,11.5,null,7593807.1900000004,null,44107,0,0,44107,null,0,236224,null,0.9728170969688843,null,0,null,122704,47936,5000,4766,180406,null,116312,13000.68,7635.32,8442,145390]
[null,884,"Herefordshire",null,5.5494354248594879,5.5978306091683878,0,5.5381498328101735,null,5.4700000000000006,4.9999999999999996E-2,0,0,0,0,0,2.9435424859487511E-2,null,5.4700000000000006,5.47,0,5.47,null,9836904.9600000009,null,52455.34,26227.67,0,26227.67,null,0,274743.61,null,0.97188010943248471,null,9.0579710144927522E-3,null,7.5523158017894874,7.5979005268947946,0,7.5468907539863022,null,7.47,7.0000000000000007E-2,0,0,0,0,0,1.2315801789486E-2,null,7.47,7.47,0,7.4700000000000006,null,1224443.2200000002,null,2000,1000,0,1000,null,0,34213.08,null,1.0150962099179415,null,9.2838196286472146E-3,null,7.1279463323933596,0,0,7.0839731617220423,null,6.9799999970169075,5.9999994033816922E-2,0,0,0,0,8.7946341342635806E-2,null,6.9799999970169075,0,0,6.9799999970169075,null,4719935.6099999994,null,58963.22,29481.61,0,29481.61,null,9706,131869.35999999999,null,0.96000312844507951,null,8.5227264360922088E-3,null,9.8500924647493981,0,0,9.8250462323746977,null,9.7099999958919767,9.0000004108022932E-2,0,0,0,0,5.0092464749397596E-2,null,9.7099999958919767,0,0,9.7099999958919767,null,7156727.3399999999,null,36581.440000000002,18290.72,0,18290.72,null,0,198555.37,null,0.9781621116930882,null,"No Base Rate",null,152703,18117.38,48196.42,6184.5,225201.3,null,87234,4637.49,17874.509999999998,6566,116312]
[null,885,"Worcestershire",null,5.6643707389253013,5.7012649236390223,10.602699889968825,5.5929710164610613,null,5.370000000756761,5.7038461817108754E-2,0,0,0,0,2.8206796750134322E-2,0.2091254796012981,null,5.370000000756761,5.3700000001777015,5.37,5.370000001076459,null,35322517.919999994,null,1354080,620098,41940,692042,null,369321,1358275,null,0.99705818731195606,null,1.0510052989389953E-2,null,7.864238286555449,7.9383376971420816,10.315908921239268,7.7855739608852819,null,7.3300000036074238,7.7040914097030261E-2,0,0,0,0,0,0.4571973688509956,null,7.3300000036074238,7.3300000137011265,7.33,7.3299999982293924,null,3901226.01,null,240802,101263,15592,123947,null,40576,110518,null,1.0299971052836523,null,1.0401038005998531E-2,null,7.5916214823773762,7.6161322986365088,9.368334807607253,7.5660631696768217,null,7.3299999963665119,7.7038804471764477E-2,0,0,0,0,0.18458268153910029,null,7.329999996366511,7.3299999937144253,7.33,7.3299999977692814,null,14881398.77,null,370843,163151,16886,190806,null,154778,421575,null,0.99463818241203084,null,1.0400756164939459E-2,null,10.28495500183136,0,0,10.28495500183136,null,9.9300000006408311,0.10459567983488799,0,0,0,0,0.25035932135564049,null,9.9300000006408311,0,0,9.9300000006408311,null,21922180,null,546950,0,0,546950,null,228506,677864,null,0.99421537623600476,null,"No Base Rate",null,415810,100000,46143,13156,575109,null,302974,48172,40000,26264,417410]
[null,886,"Kent",null,5.9671368585245119,6.7235520808242093,8.9495679861277218,5.8808497916456526,null,5.34,9.1899276441287522E-2,0.39425817911270694,0,0,0,8.6281835690155718E-3,0.1323512194015028,null,5.34,5.34,5.34,5.34,null,96681044.36999999,null,2193029,77475,3297,2112257,null,0,4298056,null,0.99342898915611366,null,8.3443926681134817E-2,null,7.9098686385292414,7.9076248762030517,7.8400000000000007,7.9099834309823551,null,7.8400000000000007,0,0,0,0,0,0,6.9868638529240856E-2,null,7.8400000000000007,7.84,7.8400000000000007,7.84,null,11792096.960000001,null,105089,2663,0,102426,null,125234,500934,null,0.95955951043014098,null,0,null,7.9099406159191386,9.5231683168316827,7.8400000000000007,7.9082705063121939,null,7.839999999999999,0,0,0,0,0,6.9940615919139068E-2,null,7.839999999999999,7.84,7.8400000000000007,7.84,null,41163112.479999997,null,367216,9180,0,358036,null,437161,1748645,null,0.95956819707029328,null,0,null,10.745008543402003,0,0,10.745008543402003,null,10.65,0,0,0,0,0,9.5008543402004195E-2,null,10.65,0,0,10.65,null,60876539.549999997,null,543079,0,0,543079,null,646572,2586091,null,0.96004620611203728,null,0,null,1209084,601008,33636,57120,1900848,null,1154678,163310,85260,77854,1481102]
[null,887,"Medway",null,5.5700000057224877,5.51,0,5.595714297392834,null,5.0299999999999994,0.36,6.0000000000000005E-2,6.0000000000000005E-2,0,0,0,6.0000005722488495E-2,null,5.03,5.0299999999999994,0,5.03,null,19257356.329999998,null,209699,0,0,209699,null,0,803847,null,0.96200345521977337,null,8.7114337568058073E-2,null,7.8800011589238741,7.7999999999999989,0,7.9142874224509407,null,7.58,0.14000000000000001,0.04,0.04,0,0,0,8.0001158923874799E-2,null,7.5799999999999992,7.5799999999999992,0,7.58,null,2422937.4,null,24851,0,0,24851,null,0,102509,null,0.96097575108827737,null,2.8205128205128209E-2,null,7.8799993357889599,7.8000000000000007,0,7.9142847175708848,null,7.58,0.14000000000000001,3.9999999999999994E-2,3.9999999999999994E-2,0,0,7.9999335788960624E-2,null,7.58,7.58,0,7.58,null,7985413.7999999989,null,81901,0,0,81901,null,0,337845,null,0.96097552875475145,null,2.8205128205128206E-2,null,10.709999937227444,10.6,0,10.757142747336648,null,9.5299999999999994,0.85,0.11,0,0,0.11,0.10999993722744381,null,9.5299999999999994,9.5299999999999994,0,9.5299999999999994,null,11820452.199999999,null,122665,0,0,122665,null,0,501812,null,0.96053811096210251,null,"No Base Rate",null,246126,41926,41927,7547,337526,null,141638,19698,19698,18760,199794]
[null,888,"Lancashire",null,6.2532239836062278,6.5157573725061404,10.659471777916924,5.7800000001072132,null,5.7000000004245024,9.5577239346051432E-2,5.6160326765173057E-3,0,0,0,0.36359259422944451,8.8438116929711402E-2,null,5.7000000004245033,5.7000000027030291,5.7000000027476343,5.6999999998213093,null,87134174.730000004,null,1250000,1250000,0,0,null,0,0,null,1.0287967759980816,null,1.7443527093501436E-2,null,7.9392625232738094,9.2873628713373222,8.0400000443991075,7.8199999963221858,null,7.4600000003683293,0.40252750061957393,0,0,0,0,0,7.6735022285906979E-2,null,7.4600000003683293,7.4600000000000009,7.4600000221995542,7.4599999966286701,null,12807918.84,null,125000,125000,0,0,null,0,0,null,1.0139543452456972,null,5.1195687464240677E-2,null,7.7851743772408124,8.1709667762961598,7.7600000054813512,7.7600000018978958,null,7.4600000008458585,0.3000000022153449,0,0,0,0,2.5174374179608681E-2,null,7.4600000008458585,7.4599999967122663,7.460000000913559,7.4600000011487264,null,38531245.840000004,null,125000,125000,0,0,null,0,0,null,0.9942751439643438,null,3.865979408466487E-2,null,10.62773417041716,0,0,10.600000000000001,null,10.210000000739578,0.38999999926042217,0,0,0,0,2.7734170417158532E-2,null,10.210000000739578,0,0,10.210000000739578,null,57330000.359999999,null,150000,150000,0,0,null,0,0,null,0.99978684575890486,null,"No Base Rate",null,1598514,716875,716875,129037,3161301,null,712880,93331,93331,71288,970830]
[null,889,"Blackburn with Darwen",null,5.8853555880897064,5.4934933733692271,10.770585904761905,5.4835006130251518,null,5.1800000000000006,0.15766491628276078,0,0,0,0,0.39627207513468354,0.15141859667226265,null,5.1800000000000006,5.1800000000000006,5.18,5.18,null,10946687.779999999,null,289074,60176.6,27823.040000000001,201074.36000000002,null,0,492117,null,0.96237077669705684,null,2.9538181724708422E-2,null,7.8151803820192445,7.7586698014629052,7.7590386847195356,7.8258213401621859,null,7.61,0.18478328306764324,0,0,0,0,0,2.0397098951601321E-2,null,7.61,7.61,7.61,7.61,null,2171003.04,null,5681,852.15000000000009,852.15000000000009,3976.7000000000003,null,0,87553,null,0.96009587002693419,null,2.3706019315385202E-2,null,7.8140686838548694,7.9249689234141263,8.2275757889904177,7.8076043402074049,null,7.6100000075902328,0.17181817749647044,0,0,0,0,3.2250498768165173E-2,null,7.6100000075902328,7.6100001419906311,7.6099995557069438,7.6100000064345625,null,3895916.0700000003,null,16146,0,0,16146,null,0,161363,null,0.95995929777086841,null,2.207943868770253E-2,null,10.638098633098641,0,0,10.638098633098641,null,10.529999995739265,9.7020725199032376E-2,0,0,0,0,1.1077912160344591E-2,null,10.529999995739265,0,0,10.529999995739265,null,5736602.9800000004,null,5980,0,0,5980,null,0,239245,null,0.96011720515330701,null,"No Base Rate",null,143013,7581,7581,1362,159537,null,129444,18291,18291,8442,174468]
[null,890,"Blackpool",null,5.6842111497980667,5.8820054626354121,0,5.5523482351985649,null,5.3900000035832312,0.1,0.12971297957522224,0,0,0,0,6.4498166639613275E-2,null,5.3900000035832312,5.3900000089580766,0,5.3900000000000006,null,7841682.8699999992,null,90000,37800,0,52200,null,0,244915.33,null,0.9700019026959158,null,4.087628323077034E-2,null,8.1652720006003143,8.6777117606876519,0,8.1326100956959504,null,7.95,0.1300000085271992,0,0,0,0,0,8.5271992073115616E-2,null,7.95,7.9499999999999993,0,7.95,null,1895112.29,null,20000,8400,0,11600,null,0,77011,null,0.97205619054765646,null,1.608910994925794E-2,null,8.1330988488169584,8.2584727829006077,0,8.1151952425741083,null,7.95,0.13,0,0,0,0,5.3098848816957651E-2,null,7.95,7.95,0,7.95,null,3043380.4800000004,null,20000,8400,0,11600,null,0,77011,null,0.96822605343059021,null,1.608910891089109E-2,null,11.120935635140757,11.31592962566746,0,11.099269636193346,null,11.059999990250297,0,0,0,0,0,6.0935644890460862E-2,null,11.059999990250297,11.059999917127524,0,11.05999999837505,null,4537574.03,null,25000,10500,0,14500,null,0,141050,null,0.97041323168767502,null,0,null,159999,63666.5,63666.5,11463,298795,null,111622,18291,18291,9380,157584]
[null,891,"Nottinghamshire",null,5.7343188047253042,5.7176842137521877,0,5.7466106919502788,null,5.5800000007752724,2.4986669578088205E-2,9.0986906767545062E-2,0,0,0,0,3.834522760439852E-2,null,5.5800000007752724,5.5800000007396404,0,5.5800000008016015,null,54368227.109999999,null,366006.27,155636.51,0,210369.76,null,0,1115589.8999999999,null,1.0042589850657275,null,2.0360624004905133E-2,null,7.9256991196292486,7.9256991528502745,0,7.9256991169208648,null,7.7799999990676536,0,0,0,0,0,0,0.14569912056159534,null,7.7799999990676536,7.78000003710551,0,7.7799999959665707,null,6675627.9100000001,null,125017.11,9423.8799999999992,0,115593.23,null,0,99984.47,null,1.0083586666194972,null,0,null,7.7900307944536529,7.7900308016539244,0,7.7900307938666424,null,7.7800000004892667,0,0,0,0,0,1.0030793964385181E-2,null,7.7800000004892667,7.7799999910753952,0,7.7800000012567452,null,25442099.829999998,null,32802.629999999997,2472.69,0,30329.94,null,0,381053.12,null,0.99109806545211865,null,0,null,10.417607915467286,0,0,10.417607915467286,null,10.380000000110471,0,0,0,0,0,3.760791535681475E-2,null,10.380000000110471,0,0,10.380000000110471,null,37584801.039999999,null,136173.99,0,0,136173.99,null,0,415059.32,null,0.97726153053164033,null,0,null,827315.1,71605.960000000006,269641.64,30711.599999999999,1199274.3,null,410844,27555.64,103764.36,37520,579684]
[null,892,"Nottingham",null,5.7429224464223978,5.5756079619213974,11.552830567868526,5.5199999972752272,null,5.5200000013339858,0.13778471291636266,0,0,0,0,5.8821821267317394E-2,2.6315910904730771E-2,null,5.5200000013339858,5.5200000025516323,5.5200000377409051,5.5199999972752272,null,18855567.990000002,null,86800,86800,0,0,null,60500,960000,null,0.96000722833790497,null,2.4353120501266548E-2,null,8.9763421316052892,0,0,8.9499999999999993,null,8.9499999999999993,0,0,0,0,0,0,2.63421316052895E-2,null,8.9499999999999993,0,0,8.9499999999999993,null,4756638.5999999996,null,14000,14000,0,0,null,105289.85,65000,null,1.0643217511424861,null,0,null,8.1808487550332369,0,0,8.1000000000000014,null,8.1000000000000014,0,0,0,0,0,8.0848755033235242E-2,null,8.1000000000000014,0,0,8.1000000000000014,null,5059447.1100000003,null,50500,50500,0,0,null,59000,0,null,0.96001226407879281,null,0,null,11.216315354412069,0,0,11.190000005879211,null,11.190000005879211,0,0,0,0,0,2.6315348532857587E-2,null,11.190000005879211,0,0,11.190000005879211,null,7613266.4500000002,null,17904,17904,0,0,null,62700,0,null,0.95997215510834177,null,0,null,454467,99148.5,99148.5,17847,670611,null,183848,25326,25326,22512,257012]
[null,893,"Shropshire",null,5.598285562621176,5.6720427092187142,0,5.5491523113872558,null,5.42,1.5503092401841395E-2,0,0,2.3254638602762091E-2,0,0,0.13952783161657256,null,5.42,5.42,0,5.42,null,17605383.460000001,null,450000,250000,0,200000,null,0,508500,null,0.98043529993365608,null,7.1001009596867934E-3,null,7.5182888563157855,8.0709968870305211,0,7.3801633699599982,null,7.1499999999999995,0,0,0,0,0,0,0.36828885631578562,null,7.1499999999999995,7.1499999999999995,0,7.15,null,1941410.9,null,100000,50000,0,50000,null,0,171000,null,0.99579984851864711,null,0,null,7.4946828788258726,8.0117086821458265,0,7.3654267064487984,null,7.1499999999999995,4.3085359853234029E-2,0,0,4.3085359853234029E-2,0,0.25851215911940417,null,7.1499999999999995,7.15,0,7.15,null,8397482.0500000007,null,300000,150000,0,150000,null,0,173500,null,0.99267322898355925,null,1.1908331498011359E-2,null,9.8631062335104094,0,0,9.586219547408934,null,9.25,9.8888102179098214E-2,0,0,0.19777620435819643,0,0.3164419269731143,null,9.25,0,0,9.25,null,12067508.75,null,400000,200000,0,200000,null,0,197000,null,0.96413550669700965,null,"No Base Rate",null,223480,29338,29338,5279,287435,null,139762,21574,21574,9380,192290]
[null,894,"Telford and Wrekin",null,5.8121352875747432,5.8097717863913152,10.326995738243605,5.5699116913783175,null,5.0599999983090704,0.16919908770954425,6.9673478070162095E-2,0.2584374861555121,0,0,0.16660393317039535,8.8221304160059355E-2,null,5.0599999983090704,5.0599999938066684,5.0600000072288305,5.0600000000000005,null,13540275.699999999,null,208693,44748,7118,156827,null,0,163931,null,0.98870951916013106,null,8.9487548371240788E-2,null,7.9405288625980717,7.9405266238530592,7.9405467596071624,7.9405286890740889,null,7.8200000176764801,0,0,0,0,0,0,0.12052884492159155,null,7.8200000176764801,7.8199999999999994,7.8200005182555525,7.82,null,2211978.89,null,34093,7310,1163,25620,null,0,26780,null,0.9888578907345047,null,0,null,7.9405278175026952,8.2103687263329572,7.8572095504386921,7.9405283274521183,null,7.8199999953096642,0,0,0,0,0,0.12052782219303056,null,7.8199999953096642,7.8199999438587557,7.8199999739995185,7.8199999993693741,null,5668677.8799999999,null,87370,8344,2576,76450,null,0,68630,null,0.98885776058564079,null,0,null,10.787736387444342,0,10.76377290138339,10.788179302753608,null,10.6,2.3990265672762197E-2,0,0,0,0,0.16374612177158024,null,10.6,0,10.599999860559352,10.600000002577271,null,8396751.9800000004,null,129418,0,2349,127069,null,101664,0,null,0.99966728583342845,null,"No Base Rate",null,288526,80917,34679,10403,414525,null,150080,33487,14351,7504,205422]
[null,895,"Cheshire East",null,5.6041768793267073,5.4919219471973983,13.71903803816047,5.5639711763363566,null,5.28,0.13576203193020889,0,0,8.7386685201882499E-3,0,5.6153526676292927E-2,0.12352265220001679,null,5.28,5.2799999999999994,5.28,5.28,null,25468655,null,574011,0,0,574011,null,0,847408,null,0.97163281132231427,null,2.6638525539944946E-2,null,7.5047378827102227,7.3500000000000005,7.35,7.5426115414653143,null,7.3500000175746614,0,0,0,0,0,0,0.15473786513556215,null,7.3500000175746614,7.3500000000000005,7.35,7.3500000218762374,null,2091078.68,null,44023,0,0,44023,null,0,66034,null,0.96960437761113982,null,0,null,7.5047365958925703,7.35,7.35,7.5126362261291346,null,7.3500000010923365,0,0,0,0,0,0.15473659480023258,null,7.3500000010923374,7.35,7.35,7.3500000011481035,null,13457389.010000002,null,283313,0,0,283313,null,0,424970,null,0.96960421135562913,null,0,null,10.159473882628491,0,0,10.159473882628491,null,9.9499999999999993,0,0,0,0,0,0.20947388262849134,null,9.9499999999999993,0,0,9.9499999999999993,null,19847523.699999999,null,417843,0,0,417843,null,0,626764,null,0.96941544681569569,null,0,null,233039,48107,5599,4834,291579,null,213864,8527,48691,16884,287966]
[null,896,"Cheshire West and Chester",null,5.6777080505684818,5.593659776992113,0,5.7099923566754782,null,5.4499999999999993,0.11064993797307948,2.0313978737005606E-2,0,7.0442254081688358E-3,0,0,8.9699908450227642E-2,null,5.4499999999999993,5.45,0,5.45,null,22211700.920000002,null,356547,0,0,356547,null,0,613943,null,0.99434466734999671,null,2.469719775067096E-2,null,7.9705973283194158,0,0,7.9705973283194158,null,7.65,0.25500000269681494,0,0,0,0,0,6.5597325622600178E-2,null,7.65,0,0,7.65,null,2931235.66,null,24324,0,0,24324,null,0,75833,null,1.0000749470915202,null,3.2258064846277149E-2,null,7.7694366388687452,0,0,7.7584493182367549,null,7.6499999999999995,8.2500013734150793E-2,0,0,2.060122618498253E-2,0,1.6335398949612147E-2,null,7.6499999999999995,0,0,7.6499999999999995,null,11290252.1,null,23788,0,0,23788,null,150000,306414,null,0.98775944413973127,null,1.3298064442688575E-2,null,10.435608673794967,0,0,10.435608673794967,null,10.330000001260887,7.500000315221822E-2,0,0,1.2608872889069783E-2,0,1.799979649279157E-2,null,10.330000001260887,0,0,10.330000001260887,null,16524250.77,null,28551,0,0,28551,null,68000,229073,null,0.96933199274910298,null,"No Base Rate",null,255771,1,80712,7262,343746,null,199794,1,61908,12194,273897]
[null,908,"Cornwall",null,5.7635762812758751,5.6762419759799512,12.196169261758781,5.6821515744418098,null,5.4899999992141364,5.5491075455286559E-2,7.7181211205684538E-2,0,0,0,8.2244900222073425E-2,5.8659095178694109E-2,null,5.4899999992141364,5.49,5.49,5.4899999989353487,null,30489585.210000001,null,313499.99,84790.03,4917.3599999999997,223792.6,null,100000,330000,null,0.99824346295733191,null,2.3595948672708766E-2,null,7.7115711921583614,7.7115710924689278,7.7115714562354762,7.7115712060274433,null,7.67,0,0,0,0,0,0,4.1571192158360387E-2,null,7.6700000000000008,7.67,7.67,7.6700000000000008,null,3856107.8400000003,null,20900,3498.54,429.35,16972.11,null,25138,0,null,1.0053849725102673,null,0,null,7.7104080985893511,7.7104080533603252,7.7104072813698474,7.7104081120843171,null,7.6700000005524007,0,0,0,0,0,4.0408098036950849E-2,null,7.6700000005523998,7.67,7.67,7.6700000006106324,null,13884852.969999999,null,73150,6227.77,748.06,66174.17,null,90514,0,null,1.0052342071574267,null,0,null,10.415299632068606,10.41,10.409999999999998,10.415319657994353,null,10.41,0,0,0,0,0,5.2996320686061462E-3,null,10.41,10.41,10.409999999999998,10.41,null,20526802.350000001,null,10450,0,0,10450,null,98592,0,null,1.000506669106507,null,0,null,460577,23639,94556,10636,589408,null,255136,13319.6,53278.400000000001,29078,350812]
[null,916,"Gloucestershire",null,5.5842377256746198,0,0,5.5842377256746198,null,5.3299999999999992,0.13,0,0,0,0,0,0.12423772567461991,null,5.3299999999999992,0,0,5.3299999999999992,null,37305526.439999998,null,848856,0,0,848856,null,742857,1849726,null,0.99701603194627519,null,2.3809523809523808E-2,null,7.7302943983238741,0,0,7.7302943983238741,null,7.47,0.13,0,0,0,0,0,0.13029439832387404,null,7.47,0,0,7.47,null,3177613.2,null,54477,0,0,54477,null,45458,113191,null,0.98728183418079274,null,1.7105263157894738E-2,null,7.7163731561075535,0,0,7.7163731561075535,null,7.4700000000000006,0.13,0,0,0,0,0.11637315610755311,null,7.4700000000000006,0,0,7.4700000000000006,null,19348878,null,296275,0,0,296275,null,276800,689238,null,0.98552856083793405,null,1.7105263157894738E-2,null,10.428428174607038,0,0,10.428428174607038,null,10.18,0.13,0,0,0,0,0.11842817460703824,null,10.18,0,0,10.18,null,28590733.170000002,null,328414,0,0,328414,null,301503,750747,null,0.98020019271306658,null,"No Base Rate",null,442269,36686,223383,23405,725743,null,363523,15737,95827,48888,523975]
[null,919,"Hertfordshire",null,6.4053908806011091,6.2353822540007826,10.03865891632908,6.1024642356287035,null,6.0000000000000009,9.42231079945334E-2,0,0,0,0,0.24188113799306918,6.9286634613505732E-2,null,6.0000000000000009,6.0000000000000009,6,6.0000000000000009,null,90827422.719999999,null,993217,651173,199214,142830,null,0,1968468.71,null,0.98616155881728629,null,1.5461053250730102E-2,null,8.8050464870904683,8.6906173796563131,9.3227136032658287,8.7694981422916847,null,8.5000000086110337,0.12852030856085619,0,0,0,0,0,0.17652616991858011,null,8.5000000086110319,8.500000134679663,8.50000006256567,8.5,null,10020308.409999998,null,205000,2009,49077,153914,null,0,205402,null,0.97942675051061956,null,1.4894825976718614E-2,null,8.7601963050714478,8.7789840269177066,9.603104715281372,8.7392344950196179,null,8.5000000032994105,7.9828607754373629E-2,0,0,0,0,0.18036769401766267,null,8.5000000032994105,8.5000001141896906,8.5000000461678695,8.5000000011378685,null,39006206.180000007,null,820000,3936,105452,710612,null,0,754880,null,0.97443785373430991,null,9.3042193933252706E-3,null,11.866318210723005,0,0,11.866318210723005,null,11.65,5.9815439816203152E-2,0,0,0,0,0.15650277090680129,null,11.65,0,0,11.65,null,57986877.25,null,775000,0,0,775000,null,0,1115035,null,0.97344694099450413,null,"No Base Rate",null,1464410,723851,31000,67939,2287200,null,613452,164592,8000,37520,823564]
[null,921,"Isle of Wight",null,5.6355644045025342,5.7805817712480616,0,5.6055649932957223,null,5.3099999999107865,0.18999910348563695,2.9999954233071127E-2,0,0,0,0,0.10556534687304062,null,5.3099999999107865,5.3099999776194986,0,5.3100000045221343,null,6198557.75,null,118327.85,20282.43,0,98045.42,null,40045.870000000003,207964.46,null,0.96779710607783875,null,3.9782838193287789E-2,null,7.9055704959022632,7.9055703547604379,0,7.9055705128124396,null,7.7999999603051124,0,0,0,0,0,0,0.10557053559715035,null,7.7999999603051124,7.799999876329764,0,7.7999999703661844,null,1178993.1599999999,null,15957.3,1707.29,0,14250.01,null,7575.38,39340.14,null,0.96784523165642589,null,0,null,7.9055705729154599,7.9055703837863174,0,7.905570595574984,null,7.7999999941738603,0,0,0,0,0,0.1055705787415999,null,7.7999999941738603,7.7999999455456184,0,7.8,null,2677587.8199999998,null,36240.32,3877.39,0,32362.93,null,17204.3,89344.6,null,0.9678452430966985,null,0,null,10.715491795966821,10.715491891089902,0,10.715491784570148,null,10.609999988775913,0,0,0,0,0,0.1054918071909096,null,10.609999988775913,10.610000002497777,0,10.609999987131898,null,3970211.28,null,39474.53,4223.43,0,35251.1,null,25419.38,132006.79999999999,null,0.96712310262131707,null,0,null,138955,19793.77,44953.23,5826,209528,null,58156,4874.84,11071.16,3752,77854]
[null,925,"Lincolnshire",null,5.6641851565876955,5.4184828225871975,12.085326042738519,5.4479500149132027,null,5.2099999998272484,0.20564200255482989,0,0,0,0,0.12894583884482613,0.11959731536079096,null,5.2099999998272484,5.2100000013541985,5.21,5.2099999995015915,null,41724423.68,null,900000,0,0,900000,null,11500,1281367.5,null,0.96966155966048495,null,3.7971860485677959E-2,null,7.645025685703871,7.6000003140006607,9.5856118228770146,7.6000000000000005,null,7.41,0.19000001235780797,0,0,0,0,0,4.5025673346061876E-2,null,7.41,7.4100000837335092,7.4100000490476319,7.4099999967605976,null,6149958.0100000007,null,36435,0,36435,0,null,60309,189596.81,null,0.98841925605663727,null,2.5000001585376679E-2,null,7.4550189722878262,7.4100000117513289,9.3953163211308883,7.4099999983789395,null,7.4099999976611448,0,0,0,0,0,4.5018974626681148E-2,null,7.4099999976611448,7.4100000117513289,7.4099999527992404,7.4099999983789395,null,18692488.149999999,null,113565,0,113565,0,null,187980,591045.98,null,0.96408927503733244,null,0,null,10.181819687195771,0,0,10.181819687195771,null,10.18,0,0,0,0,0,1.8196871957710469E-3,null,10.18,0,0,10.18,null,27971840.5,null,5000,0,0,5000,null,222000,872127.88,null,0.97000130422381914,null,0,null,915609,311215,0,28010,1254834,null,326424,25290,78828,35644,466186]
[null,926,"Norfolk",null,5.5551183390318695,5.5965776469356081,10.087177401726491,5.468328323484708,null,5.2799999991958257,4.4101296357962151E-2,0,0,0,0,5.9712011324450524E-2,0.17130503215363027,null,5.2799999991958257,5.2799999966529096,5.2799999575378722,5.2800000004287329,null,42846983.340000004,null,1363328.08,358192.17,63210.38,941925.53,null,118626.22,1590549.43,null,0.96502836423000193,null,8.283331572746671E-3,null,7.6508832003203064,7.9252372948791132,7.6927698393645549,7.6223684150465036,null,7.3599999924214075,4.4099999399542351E-2,0,0,0,0,0,0.24678320849935548,null,7.3599999924214075,7.3600000532041987,7.3599997912469854,7.3599999927492794,null,5080273.75,null,169328.65000000002,31344.13,5531.32,132453.20000000001,null,14110.72,197550.07999999999,null,0.96617738872553316,null,5.956159350664912E-3,null,7.6399859694393362,9.7531988293524332,8.1085640143069444,7.5942297845709286,null,7.35999999559934,4.4100001661249062E-2,0,0,0,0,0.23588597217874607,null,7.35999999559934,7.3599999154461848,7.3599998994188924,7.359999998218572,null,18843974.400000002,null,600347,111129.17,19611.03,469606.8,null,49867.51,700404.84,null,0.96468258369238924,null,5.9561596517558428E-3,null,10.377499991658253,10.010001143921691,12.394310544886519,10.366239235535975,null,10.009999997294567,4.4099998890772971E-2,0,0,0,0,0.32339999547291082,null,10.009999997294567,10.010001143921691,10.009999698862147,10.009999998475704,null,27871983.550000001,null,896529.71,0,36524.769999999997,860004.94,null,69859.399999999994,1045951.32,null,0.96499999725524999,null,"No Base Rate",null,679640,165422.70000000001,18380.3,16542,879985,null,425852,113122.8,12569.2,31892,583436]
[null,929,"Northumberland",null,5.6098302423242306,5.5289397178215207,0,5.6594083058579248,null,5.5000000000000009,8.0890526711207514E-2,0,0,0,0,0,2.8939715613022981E-2,null,5.5000000000000009,5.5000000000000009,0,5.5000000000000009,null,18235158.530000001,null,94558.44,35932.21,0,58626.229999999996,null,0,352081.84,null,0.98245713525818401,null,1.4494196996706886E-2,null,7.5881054627990636,7.5881054843090547,0,7.588105459297438,null,7.5500000000000007,0,0,0,0,0,0,3.8105462799063253E-2,null,7.5500000000000007,7.5500000746601286,0,7.5499999878460278,null,2889283.83,null,14582.45,2041.54,0,12540.91,null,0,54296.78,null,0.98291521538847981,null,0,null,7.5881054408370021,7.5881054438811475,0,7.5881054403414412,null,7.5499999952390384,0,0,0,0,0,3.8105445597962084E-2,null,7.5499999952390393,7.5499999965993139,0,7.5499999950175978,null,7929069.6400000006,null,40018.639999999999,5602.61,0,34416.03,null,0,149006.63,null,0.98291521254365299,null,0,null,10.299312739469881,0,0,10.299312739469881,null,10.25,0,0,0,0,0,4.9312739469881545E-2,null,10.25,0,0,10.25,null,11725313.25,null,56410.47,0,0,56410.47,null,0,210040.49,null,0.98369749183093413,null,0,null,347769,73515.240000000005,130693.75999999999,18377,570355,null,189476,20260.8,36019.199999999997,19698,265454]
[null,931,"Oxfordshire",null,5.9220971420655779,5.8729298649702164,9.6192722250239449,5.7491806951069133,null,5.5299999997455469,5.2713408189061547E-2,7.1451776548740326E-2,0,0,0,0.1520290059076646,0.11590295167456433,null,5.5299999997455469,5.5300000012741384,5.530000001245825,5.5299999994543079,null,45636839.620000005,null,911000.26,78961.320000000007,88787.37,743251.57,null,262294.59999999998,1544978,null,0.9672398063870794,null,2.1959949999081518E-2,null,8.3706891428882475,8.7148117289972191,8.5562722620386449,8.3510312604740573,null,8.0500000112462082,0.15534456919488171,0,0,0,0,0,0.1653445624471569,null,8.0500000112462082,8.0499998400823891,8.0500001959255343,8.0500000072873554,null,3648049.43,null,73511.25,6371.62,7164.51,59975.12,null,0,4140,null,0.99888891919907474,null,1.8932120116585151E-2,null,8.0977082437618666,8.2573472336623439,8.2161703492694009,8.0941031695051429,null,8.0500000001846654,2.5508023609723741E-2,0,0,0,0,2.2200219967475964E-2,null,8.0500000001846654,8.0500000000000007,8.0499999039571559,8.0500000017062963,null,21865174.379999999,null,60109.119999999995,5209.9799999999996,5858.32,49040.82,null,0,764331,null,0.96631363290714389,null,3.1586896495631794E-3,null,11.085654643792411,11.760463367004414,11.675681306464119,11.081573492625351,null,11.050000001695361,1.2833013909881726E-2,0,0,0,0,2.2821628187169086E-2,null,11.050000001695361,11.049999581453362,11.050000467128189,11.050000001194476,null,32626727.279999997,null,67306,5833.77,6559.74,54912.49,null,0,779613,null,0.97670966024602746,null,"No Base Rate",null,506656,101531.25,33843.75,12187,654218,null,343308,61439,61439,30016,496202]
[null,933,"Somerset",null,5.4799999999999995,5.48,0,5.4799999999999995,null,4.8599999999999994,7.0000000000000007E-2,0,0,0,0,0,0.55000000000000004,null,4.8599999999999994,4.8600000000000003,0,4.8599999999999994,null,27447134.099999998,null,3062053.5,216535,0,2845518.5,null,961700,971233.2,null,0.98997174325366888,null,1.4198782961460448E-2,null,7.47,7.47,0,7.47,null,6.66,7.0000000000000007E-2,0,0,0,0,0,0.74,null,6.66,6.66,0,6.66,null,2640179,null,290302,20350,0,269952,null,295500,98658,null,1.0651878320889558,null,1.0401188707280832E-2,null,7.47,7.47,0,7.47,null,6.66,7.0000000000000007E-2,0,0,0,0,0.74,null,6.66,6.66,0,6.66,null,11982765,null,1317570,92130,0,1225440,null,1346200,453826.8,null,1.0655543721345084,null,1.0401188707280832E-2,null,10.15,10.15,0,10.15,null,9.08,7.0000000000000007E-2,0,0,0,0,1,null,9.08,9.08,0,9.08,null,19420875,null,2122500,148400,0,1974100,null,0,668682,null,0.97036328871892918,null,"No Base Rate",null,249400,7800,35200,3900,296300,null,247600,10000,45400,19700,322700]
[null,935,"Suffolk",null,5.5544432343056034,5.5764471071293515,5.5904126223790911,5.5480896737698213,null,5.4000000011405991,7.691737327127697E-2,0,0,0,0,0,7.7525859893728163E-2,null,5.4000000011405991,5.4000000026658936,5.4,5.4000000007318194,null,38414331.859999999,null,543755.52999999991,88931.96,2291.66,452531.91,null,0,1955256,null,0.96592012610854949,null,1.4043917045496153E-2,null,7.7444466965102299,7.7164723804687627,7.9540129799891837,7.7439695060424558,null,7.570000014057662,8.5443601332640756E-2,0,0,0,0,0,8.9003081119927885E-2,null,7.5700000140576602,7.5700001586873382,7.57,7.570000006452295,null,4792255.34,null,55715.32,909.52,1197.72,53608.08,null,0,0,null,0.97414423855474608,null,1.1161156116526962E-2,null,7.6451193979845486,7.5901864440932858,7.6077094972067041,7.6469894559553007,null,7.5700000015503717,1.8078689725238514E-2,0,0,0,0,5.7040706708938065E-2,null,7.5700000015503717,7.57,7.57,7.5700000016058802,null,24471807.98,null,183958.19,0,0,183958.19,null,0,0,null,0.96165023874019473,null,2.3825121563412987E-3,null,10.432339133441673,10.740289855072463,10.600898876404495,10.432153622456449,null,10.320000000644795,6.1337448454195156E-2,0,0,0,0,5.1001684342684282E-2,null,10.320000000644795,10.319999999999999,10.32,10.320000000645267,null,19320274.640000001,null,94917.11,0,0,94917.11,null,0,0,null,0.96774945579236304,null,"No Base Rate",null,589808,334665,0.01,30119,954592.01,null,407092,131320,0.02,0,538412.02]
[null,936,"Surrey",null,7.0409946532738061,7.3705653958727888,14.282384307162269,6.8540717009093237,null,6.25,0.17028860571161247,0.17122083785326814,0,0,0,8.8170041288179152E-2,0.3613151684207459,null,6.25,6.2499999968732771,6.25,6.2500000002139098,null,85179457.150000006,null,4607501,151531,656625,3799345,null,43000,3646141,null,0.98094431476831956,null,5.1810506605325039E-2,null,9.9348836885009533,9.414612234943208,9.4146421689857256,9.9815109574832412,null,9.0099999855745629,0.40453413931991117,0,0,0,0,0,0.5203495636064811,null,9.0099999855745612,9.0099998872771021,9.009999877502521,9.0099999947605678,null,5873708.0699999994,null,324645,0,0,324645,null,0,249902,null,0.99249587297711839,null,4.296910860944439E-2,null,9.3282551274873686,9.0601855285541131,9.0601855016182231,9.3522803968854546,null,9.0099999996300291,5.0185526076558046E-2,0,0,0,0,0.26806960178078199,null,9.0099999996300291,9.010000022602485,9.009999976960831,9.0099999993281195,null,36733400.109999999,null,1086855,0,0,1086855,null,1150000,1611786,null,0.96022969615717046,null,5.5391278615836252E-3,null,13.076200052249458,13.89,13.89,13.076199685059267,null,12.889999999999999,0.13620007480967075,0,0,0,0,4.999997743978566E-2,null,12.89,12.89,12.89,12.89,null,57739699.980000004,null,221629,0,0,221629,null,0,2388772,null,0.96007342527529049,null,"No Base Rate",null,658000,100708,81192,16400,856300,null,568400,31852,102248,41300,743800]
[null,937,"Warwickshire",null,5.8193520433513468,5.7358091730474303,10.326454058655642,5.6381227742460354,null,5.5,9.792735554183396E-2,0,0,0,0,0.17190491106534814,4.951977674416478E-2,null,5.5,5.5,5.5,5.5,null,40376657.289999999,null,346534,19960,14485,312089,null,0,1285374,null,0.96868732555625481,null,1.749350238439373E-2,null,7.8254401545924201,0,0,7.8254401545924201,null,7.66,9.6808218637851481E-2,0,0,0,0,0,6.8631935954568762E-2,null,7.66,0,0,7.66,null,3933787.7199999997,null,34806,0,0,34806,null,0,129102,null,0.96849506863767576,null,1.2480419253533081E-2,null,7.8254310930956503,0,0,7.8254310930956503,null,7.6599999999999993,9.6799602851642116E-2,0,0,0,0,6.8631490244008372E-2,null,7.6599999999999993,0,0,7.6599999999999993,null,19109364.5,null,169078,0,0,169078,null,0,627146,null,0.96849394716530324,null,1.2479322376209842E-2,null,10.605007300390771,0,0,10.605007300390771,null,10.42,9.1998309618553653E-2,0,0,0,0,9.3008990772216624E-2,null,10.42,0,0,10.42,null,28208085.48,null,249582,0,0,249582,null,0,925755,null,0.96849381738728502,null,"No Base Rate",null,333456,11477,55755,6054,406742,null,371448,17134,83232,25326,497140]
[null,938,"West Sussex",null,6.2904792383787376,6.1277830279919314,9.7678711572514008,6.1598237500122659,null,6.0599999995483547,3.709891471877632E-2,0,0,0,0,0.13179346645690879,6.1586857654697569E-2,null,6.0599999995483556,6.0600000000000005,6.0600000000000005,6.059999999525588,null,57924576.050000004,null,572717.01,0,0,572717.01,null,0,2077211.96,null,0.965311249517528,null,6.0846830993614596E-3,null,8.8188760753020983,0,8.6595971394517282,8.8268976760352622,null,8.5,7.5026403133567121E-2,0,0,0,0,0,0.24384967216853271,null,8.5,0,8.5,8.5,null,6001968.4799999995,null,170679.13,0,0,170679.13,null,0,223878.41,null,0.98755611145600208,null,8.7494078276132512E-3,null,8.5688163844468281,0,8.6144462670872759,8.5681483192028125,null,8.5,1.6191385708477335E-2,0,0,0,0,5.2624998738350054E-2,null,8.5,0,8.5,8.5,null,28063303.790000003,null,173414.53,0,0,173414.53,null,0,1024129.68,null,0.95955390643301552,null,1.9012472800516262E-3,null,11.689565888302059,0,11.582907191149353,11.690300441451399,null,11.570000000196183,2.6702299515415852E-3,0,0,0,0,0.11689565815433402,null,11.570000000196183,0,11.569999999999999,11.570000000197535,null,41292022.129999995,null,417091.13,0,0,417091.13,null,0,1512765.76,null,0.96528207170124358,null,"No Base Rate",null,689991,105027.38,106710.62,19056,920785,null,420224,71651.83,72800.17,35644,600320]
[null,940,"North Northamptonshire",null,5.8180424209625867,5.6973755163365114,11.290267327487413,5.3997837426599196,null,5.2,0.14974359653964517,6.2393164184966085E-2,0,0,0,0.3364421625850057,6.9463497652968831E-2,null,5.2,5.1999999947204349,5.2000000081223821,5.2000000006660061,null,23033688.859999999,null,278329.76,55587.95,18983.990000000002,203757.82,null,0,915164.4,null,0.96000004568709429,null,3.9196489317134146E-2,null,7.6800012019058448,8.1497504089863266,7.8921786565396852,7.6026338684423242,null,7.1,0.35000001525261221,5.0000015252612239E-2,0,0,0,0,0.18000117140061991,null,7.1,7.1000001749674118,7.0999998809337415,7.0999999962355238,null,2458595.2600000002,null,59006.670000000006,5143.8500000000004,6047.09,47815.73,null,0,104900.08,null,0.9600001502382306,null,5.3333337183770535E-2,null,7.6800010568601076,9.8491707818342711,9.0517358615768178,7.588765606727665,null,7.099999999085127,0.46138564624969131,5.0000004116923888E-2,0,0,0,6.861540740836429E-2,null,7.099999999085127,7.1000001392415371,7.0999999579485804,7.099999996155848,null,8319618.3099999996,null,75000.009999999995,6538.06,7686.11,60775.839999999997,null,0,349775.76,null,0.96000013210751345,null,6.7186932040876293E-2,null,10.425601498479915,22.292221205386323,11.510796414539978,10.399623300290701,null,10.300000008399175,8.3991744619404854E-2,2.4811396537457127E-2,0,0,0,1.6798348923880969E-2,null,10.300000008399174,10.300002614720878,10.300000678550346,10.299999999999999,null,12392650.249999998,null,20000,79.34,306.29000000000002,19614.37,null,0,517193.76,null,0.96000013798157624,null,"No Base Rate",null,298544,147086,147086,26477,619193,null,204484,25326,25326,15946,271082]
[null,941,"West Northamptonshire",null,5.6645124139132701,5.3159245251607876,12.110230487912675,5.4355503615560412,null,5.05,7.8098582769718483E-2,0,0,0,0,0.23018529052692577,0.30622854061662608,null,5.0500000000000007,5.0500000024085399,5.0500000168474646,5.0499999988929325,null,26071509.280000001,null,1489999.49,146715.49,131877,1211407,null,231326.73,1110000,null,0.95992738953303325,null,1.5229540054500463E-2,null,7.4032279833072581,7.2199997438976506,7.2200001967625411,7.4192912100980326,null,7.2199999936126344,0,0,0,0,0,0,0.18322798969462323,null,7.2199999936126344,7.2199997438976506,7.2200001967625411,7.2199999979158003,null,2260712.6800000002,null,57372,0,0,57372,null,179287.32,75915,null,0.99201677565173985,null,0,null,7.4033681970879144,7.2199999472630871,7.2200001602392714,7.408264303821821,null,7.2200000038927818,0,0,0,0,0,0.18336819319513178,null,7.2200000038927827,7.2199999472630871,7.2200001602392714,7.2200000013322416,null,11128288.530000001,null,282628,0,0,282628,null,891711.48,374085,null,0.99277461609325324,null,0,null,10.605738395176843,0,10.569999993256426,10.606056874902359,null,10.569999998808722,0,0,0,0,0,3.5738396368121213E-2,null,10.569999998808722,0,10.569999993256426,10.569999998858201,null,17745619.960000001,null,60000,0,0,60000,null,4380.04,550000,null,0.97324287357223049,null,0,null,250396,21580.1,106339.9,11514,389830,null,204484,8386.75,41327.25,13132,267330]
[null,942,"Cumberland",null,5.6927758574067591,5.6779688489156372,9.6545750822926362,5.4313626451853629,null,5.3199999960665885,5.3992504519454504E-2,9.8803190766418025E-2,0,0,0,0.14940852591350351,7.0571640140794201E-2,null,5.3199999960665885,5.3199999968551417,5.3199999764661046,5.3199999967424567,null,16008670.810000002,null,200945.77000000002,89761.279999999999,7196.94,103987.55,null,356701,317960.24,null,0.99275653472777126,null,2.7919130167293527E-2,null,7.5459664376914608,7.6853457520509476,7.5245574256748684,7.4884103810668332,null,7.3199999836288745,0.16964408558633562,0,0,0,0,0,5.6322368476251321E-2,null,7.3199999836288745,7.3199999476016879,7.3199998290393733,7.3200000060039594,null,2195957.2000000002,null,16513.669999999998,4729.51,527.11,11257.05,null,6,9655.07,null,0.99682786018476721,null,2.2650486994919571E-2,null,7.454350137164325,7.4823257165792851,7.5042235716678398,7.4493937228305462,null,7.3200000071360041,6.3836551254884147E-2,0,0,0,0,7.051357877343771E-2,null,7.3200000071360032,7.3200000282713766,7.3200001616774841,7.3200000008715618,null,7863947.0499999998,null,75098.5,8979.01,1395.64,64723.85,null,0,43907.91,null,0.98472260728722927,null,8.6454447833546888E-3,null,10.132997712453436,0,10.144182005109831,10.122525932555559,null,10.009999997583188,5.5621275564082064E-2,0,0,0,0,6.7376439306165187E-2,null,10.009999997583188,0,10.010000038362092,10.009999996835713,null,11661538.41,null,78059.06,11680.48,1638.3,64740.28,null,0,45638.87,null,0.9876216094009197,null,"No Base Rate",null,284299,25493.48,115935.52,12729,438457,null,164150,6763.22,30756.78,8442,210112]
[null,943,"Westmorland and Furness",null,5.6759537543770113,5.6038416638283461,8.9063796678399072,5.4146383416733848,null,5.319999999082353,2.9807269527683186E-2,9.7059152668285145E-2,0,0,0,0.1569844900451442,7.2102843053546486E-2,null,5.319999999082353,5.3199999996627074,5.3199999959534114,5.3199999986588029,null,12213503.959999999,null,157147,85507.68,7127.27,64512.05,null,401768,382279.89,null,0.9977663658787238,null,2.3291634562647143E-2,null,7.4165932699489439,7.435803666472478,7.4570819897709661,7.3994599212933672,null,7.3000000257419435,6.5848536203663044E-2,0,0,0,0,0,5.0744708003337698E-2,null,7.3000000257419435,7.3000000619971903,7.2999998087077502,7.30000004380378,null,1144567.57,null,7885.1399999999994,2455.5,795.82,4633.82,null,0,14848.99,null,0.99019936848450518,null,8.9397081205087794E-3,null,7.365494644184472,7.3683106399507281,7.3727037564918998,7.3643814183505993,null,7.2999999941467459,1.47499200006462E-2,0,0,0,0,5.0744730037080944E-2,null,7.2999999941467459,7.2999999931724249,7.2999999999999989,7.2999999939636018,null,6248446.9999999991,null,43347.45,7432.32,2289.29,33625.839999999997,null,1121,81630.23,null,0.98355232894650002,null,2.0164626506394309E-3,null,10.018383889406381,0,0,10.005389072081478,null,9.9400000045696757,2.706489004812597E-2,0,0,0,0,5.1318994788579472E-2,null,9.9400000045696757,0,0,9.9400000045696757,null,9160754.9600000009,null,47167.42,9103.25,2840.32,35223.85,null,94021,88823.82,null,0.99908000152637977,null,"No Base Rate",null,170020,13583.83,74675.17,7946,266225,null,79730,4186.63,23015.37,5628,112560]
[]
[null,null,"England",null,5.8298734461968014,5.8018671176311347,8.8230647347845537,5.6321393616508937,null,5.3509416349564969,0.13166282031218932,6.1898921326654102E-2,1.1934525324507924E-2,1.3788612939351905E-3,7.6970243365487355E-4,0.13234185683183267,0.13894512371752779,null,5.350941634956496,5.3496187935738417,5.488624971307134,5.341858760554107,null,3554262592.980001,null,86778013.660000011,21147782.279999997,6987351.7100000009,58642879.669999994,null,30617803.320000004,137637447.67999998,null,0.97252905440316328,null,4.0890587161230438E-2,null,8.1780878169002467,8.1698692973319211,8.5924725064292868,8.1452992485265607,null,7.8567590939782308,0.12285141524597341,1.3033479970093418E-2,2.2030619417341929E-3,2.0148638698120903E-4,4.4735734663742152E-4,null,0.12107583358704437,null,7.856759093978229,7.8246375885787334,8.1020612845133435,7.8404533126185951,null,558030145.5799998,null,10212856.6,1410175.9400000004,978520.28000000026,7824160.3800000008,null,2987134.62,15060989.680000003,null,0.98825066269064044,null,1.7952628122187644E-2,null,7.9557968514892723,7.88384512255245,8.3906756706768046,7.9386504066886259,null,875246239.53999972,7.2342589240883159E-2,9.0184350845324852E-3,2.6726612977229563E-3,1.4150170496142776E-4,4.7866798780806576E-4,0.1305907989241015,null,7.7405521972492561,7.6235543795771266,8.0262668315541337,7.7365769423983757,null,884818291.59000003,null,14766272.839999996,1771384.41,957702.64999999991,12037185.779999999,null,6509564.5900000008,25652806.180000011,null,0.97191502831967325,null,1.2354801096342963E-2,null,10.834905875058727,10.704444943537512,11.735972533426963,10.821060166321605,null,10.584257819520854,7.8658685106439447E-2,7.0725773119389356E-3,3.4239034617363751E-3,3.0597532063738632E-4,1.3699586018558018E-4,0.16104991847693756,null,10.584257819520857,10.352053180879871,11.300880823757263,10.580540500100613,null,697693914.28999972,null,10526987.48,35566995.079999998,482574.2,9103085.540000001,null,5987592.1399999987,19102937.250000004,null,0.97231395378959984,null,0,null,44196992.159999996,14168648.810000002,14624088.289999995,1467351.1899999997,74457080.450000003,null,28226195,4386632.209999999,3974926.5800000005,2457379,39045132.789999999]
[null,null,null,null,null,null,null,null,null,null,null,null,null,null,null,null,null,null,null,null,null,null,null,null,null,null,null,null,null,null,null,null,null,null,null,null,null,null,null,null,null,null,null,null,null,null,null,null,null,null,null,null,null,null,null,null,null,null,null,null,null,null,null,null,null,null,null,null,null,null,null,null,null,null,null,null,null,null,null,null,null,null,null,null,null,null,null,null," "]
[null,null,"Median",null,5.5711338990071591,5.5797174461479386,9.6710686072864931,5.4357938827851138,null,5.2000000000000011,0.1139999978769293,0,0,0,0,7.9888603606608891E-2,0.10604228966511844,null,5.2000000000000011,5.1800000071432439,5.0600000000000005,5.2,null,18317947.039999999,null,412619.56,110213.5,26756,244364.495,null,0,697000,null,0.96935240850595372,null,3.5662873860593469E-2,null,7.9143217665615149,7.9320130679037444,8.0562657923602519,7.9174396519265366,null,7.660000017702294,3.9074261278412223E-2,0,0,0,0,null,0.13401362915904019,null,7.660000017702294,7.5,7.17,7.6600000132933372,null,3139847.16,null,43111.22,6605.17,5217.7299999999996,35746.61,null,0,79469.91,null,0.97639648401368107,null,6.0000097099764211E-3,null,7.82309110381434,7.8932623604178893,7.9852050043354392,7.8230910965907832,null,4255389.33,0,0,0,0,0,0.11942335579629787,null,7.5800000009170958,7.3499987719341329,7.09000012127155,7.5800000007235102,null,4283876.79,null,68455,11500,6531.2,55615.33,null,0,129349,null,0.97007849076156205,null,0,null,10.61618222018198,10.668859286712721,10.770644677042531,10.602720053143404,null,10.410000026105639,0,0,0,0,0,0.12671036205621614,null,10.410000026105639,0,0,10.410000009061099,null,3462226.02,null,47248,0,2704.4749999999999,33670.58,null,0,99195.15,null,0.96989651928504228,null,0,null,208316,64775,51051,6785,322303,null,151060,21363.89,19110,12740,206570]
[null,null,"Min",null,5.1220508052440143,5.0910890030743046,6.0135783465518626,4.9974284757282996,null,4.54,1.7834727846917074E-3,5.2375112227328359E-3,9.6800648412500212E-4,4.8725982287257602E-3,2.0078600607316689E-2,7.8174851965374503E-3,1.0287349749485606E-3,null,4.5400000000000009,4.54,4.54,4.54,null,87228.23,null,500,783.36,162.07,500,null,343,66246.44,null,0.94950178914590189,null,0,null,6.6499999999999995,7.11,7.1099999999999994,6.6499999999999995,null,6.5700000178577511,8.738298888763223E-3,0.04,1.3254600384509749E-2,3.4879934545311402E-2,0.12184325275544729,null,4.5497561330712674E-5,null,6.5700000178577511,6.5699999999999994,6.5700003010869246,6.5700000052974916,null,12308.33,null,20,10,106.5,10,null,0,30,null,0.94959465254424857,null,0,null,6.9709925976744707,7.0329905724840049,6.9801957347034032,6.9577048484953048,null,0,9.6000000000000009E-3,1.0000000180425465E-2,0.04,1.8007092093220912E-2,0.10199795907406413,7.462296745692389E-5,null,6.57000000840842,6.5700004090344866,6.5700001565123678,6.5699999891298742,null,24263.47,null,20,10,61.9,10,null,0,6197,null,0.92394045693333648,null,0,null,9.1949612752318224,9.3131687183193659,9.1888457482221657,9.1358844865858728,null,9,4.3484576458998891E-3,9.9999965383197539E-3,9.9999999999999992E-2,3.7190619142361263E-2,2.7476458207305855E-2,1.4728504686352444E-4,null,9,9,9,9,null,32175,null,20,0,49,10,null,0,10000,null,0.94954181909102831,null,0,null,0,0,0,0,0,null,0,0,0,0,0]
[null,null,"Max",null,8.8702235744324316,8.575691302161891,38.693917120076648,8.541706100289792,null,8.4500000000000011,0.86754095904303807,0.38435027878954847,0.39748706838305126,0.17827412295713246,9.4646925642585492E-2,0.98362459551921066,1.1566475166690806,null,8.4500000000000011,8.4499999999999993,7.75,8.4500000000000011,null,94750037.179999992,null,4533243,1164954,761321,3738112.18,null,10336305,4882573,null,1.0890939376199531,null,0.12140261351870564,null,15.180361624271923,19.014957650027032,13.661419749428093,16.388338306876207,null,11,1.0563367764062199,1.0014281790716837,0.38000000263083894,3.4879934545311402E-2,0.12184325275544729,null,2.442598925256473,null,11,11,10.67999924120989,11,null,18967737,null,289621,156395,103335.13,249814.33,null,484932,736641.69,null,2.0001268130151515,null,0.10006660442732079,null,12.22100122100122,17.690573034231754,112.43,12.282051282051283,null,24981665.969999999,1.0514686248331109,0.96035970273591831,0.38100001074129564,1.8007092093220912E-2,0.10199795907406413,1.2210012210012211,null,11,11,10.459998957770507,11,null,24981665.969999999,null,624239,150000,83333,572894.35,null,467721,1378974,null,1.0187682944694296,null,0.10405312755624732,null,15.668853333333333,26.375731174964383,15.725224791927186,15.668853333333333,null,14.45,1.4088533333333333,0.51999998380859824,0.51999998380859824,3.7190619142361263E-2,2.7476458207305855E-2,1.7094017094017093,null,14.45,14.300000458057925,14.300000458057925,14.45,null,20322720,null,567648,2479667.84,100000,542104,null,659679.39,938001,null,1.1338491941137754,null,0,null,1455787,585000,4349000,72459,4761706.7300000004,null,1005550,154000,167867,90090,1315860]
[]
[null,null,"East Midlands",null,5.4320451129047145,5.5011843072203286,10.050765704166126,5.2239953717966916,null,5.0620287546967413,0.10681793576471593,5.5505566722867626E-2,5.8164909734488642E-5,0,1.1757950966194916E-3,0.1201469524963525,8.6311943217684609E-2,null,5.0620287546967404,5.120626474000856,5.0206170782737018,5.0429085098382878,null,281233884.37999994,null,4540788.379999999,1009675.82,135779.26,3395333.3,null,1767758.75,10352175.109999999,null,0.96776656561714136,null,2.9825914814067434E-2,null,8.0106866593894779,8.0079765464079813,8.5264215825622873,7.9988874652632731,null,7.3513108401494929,0.10535390358987545,8.5764911266518421E-3,0,0,0,null,7.9896314777356842E-2,null,7.3513108401494929,7.3926538136829123,7.3547323205263062,7.3491239260703907,null,42141460.690000013,null,299541.21999999997,6119.88,7744.38,285676.95999999996,null,292158.18,853066.92999999993,null,1.0776150601154966,null,1.3938382173985719E-2,null,4.2536558468142411,2.9645359312695998,4.835910293170798,4.3364710574204031,null,73458150.070000008,3.0634680342144605E-2,6.5450334232795317E-3,0,0,0,6.6187606166936447E-2,null,7.2993120171513564,7.2824756784738574,7.2996068591216243,7.3005550548882292,null,42141460.690000013,null,666092.79,27435.39,27489.5,611167.9,null,793750.72,1620750.97,null,0.97678164503685994,null,7.1371833060165455E-3,null,7.0060692703198564,4.9709750546280294,8.072206437313266,7.1310401939399979,null,10.017722895797561,4.4888477558076637E-2,5.8972684380540694E-3,0,0,0,5.1356260244756993E-2,null,10.017722895797563,10.108078182720719,10.225500991247642,10.006670160151684,null,42141460.690000013,null,311188.66000000003,4069744.56,11416.59,290621.14,null,614142.08000000007,1150169.52,null,0.98076848393062599,null,0,null,4328918.26,1528278.71,883285.29,155038,6895520.2599999998,null,2245500,472491.3,194068.7,206450,3118510]
[null,null,"East of England",null,5.7123922485270571,5.7520172720975227,9.4101718986065794,5.5375497827939251,null,5.3459589018390519,9.4382227982886951E-2,3.0573728108901171E-2,0,0,0,0.11853771496617076,0.12293967563004722,null,5.345958901839051,5.4013239122248304,5.5017220032399106,5.3232754669816442,null,381369192.04999995,null,8388192.6099999994,1755865.0699999998,315450.99,6316876.5499999989,null,11494616.189999999,14252682.699999999,null,0.99032624571565608,null,2.8005169670932032E-2,null,8.0666821059044302,7.9617633177581988,8.273800671895307,8.0665649315250718,null,7.8110314046263785,7.5184094262662579E-2,0,0,0,0,null,0.18046660701538825,null,7.8110314046263793,7.6391276604991809,8.0579182400036036,7.8151590496223182,null,48972547.010000005,null,842520.15,97914.52,46422.36,698183.27,null,573298.59,747235.47,null,0.9967093311476436,null,7.2813420704440626E-3,null,3.9106963193586237,4.2519042096455362,5.6249470541732176,3.8284956019799008,null,100827780.95999998,3.4432158257804199E-2,0,0,0,0,0.11735152160551569,null,7.8099784823424869,7.5819559730093289,8.04150267821068,7.8209142100069657,null,48972547.010000005,null,1515022.55,123652.95000000001,22665.059999999998,1368704.54,null,198063.15,1596875.4600000002,null,0.97304374077905775,null,5.2496740145991528E-3,null,6.8200551455220335,11.631787043706085,27.827124144548954,6.364110231252349,null,10.661052754840505,2.613358315284945E-2,0,0,0,0,0.16134914906367187,null,10.661052754840505,10.413371932875521,10.660720162519729,10.672951779027782,null,48972547.010000005,null,1186668.82,3474222.65,5974.16,1143852.52,null,590469.55000000005,1259197.08,null,0.98908127445534122,null,0,null,4778568,1847379.8299999998,721126.28,205546,7552620.1100000003,null,2896408,514836.26999999996,296235.73,238380,3945860]
[]
[null,null,"Inner London",null,7.6559199335285593,7.3185627275079854,12.298720383118201,7.1574642604908529,null,6.5032086304317209,0.30910076861764502,0.13228190866003778,1.9644669787128699E-2,0,0,0.40009525655738198,0.29158869947464466,null,6.5032086304317209,6.538317893207199,6.4062678826307025,6.4936136105074738,null,245677897.18000001,null,9727549.7599999998,3227637.33,1540512.43,4959400,null,2893984.86,11908726.27,null,0.9575076761208694,null,6.8265307717742918E-2,null,10.333657167280036,9.9097228773379538,10.351068519538892,10.440089539864797,null,9.613902121550705,0.23285778952579816,0.10627418620025997,9.8023125599361674E-4,0,0,null,0.37964283874727994,null,9.6139021215507032,9.0870356689002083,9.2756352450659243,9.8138989148673161,null,44106189.810000002,null,1489749.6,305674.42000000004,238513.63,945561.54999999993,null,509713.97,1797638.46,null,0.96372921770020525,null,4.2286611954109959E-2,null,11.053533814655079,14.591022363094725,13.927762551433787,10.080941826962928,null,39201053.590000011,0.18427873151936228,9.9134102065167248E-2,3.0005056310960913E-3,0,0,0.39343434378223296,null,9.4745688174967064,9.0516899586715365,9.2537054046752569,9.5744559408741807,null,44106189.810000002,null,1627835.6400000001,244613.12,240569.16999999998,1142653.3500000001,null,1280249.98,2023195.83,null,0.95856553926888877,null,3.8618285536762456E-2,null,16.798578212881043,85.533127185514445,44.110710474782032,12.848054029485292,null,13.112606015281873,0.19735160893300674,5.3157004940008502E-2,0,0,0,0.45605054472393808,null,13.11260601528187,13.353572605981062,13.0025232374491,13.109744631397314,null,44106189.810000002,null,1230816.45,1199361.94,157101.08000000002,879451.36,null,902710.40999999992,1506051.83,null,0.95970914252295425,null,0,null,2386570,790421.88,4787440.12,77528.73,8041960.7300000004,null,1518060,209153.69,161616.31,126480,2015310]
[null,null,"Outer London",null,6.4874180300837319,6.4685639063276144,9.1230369809885072,6.3069241084852905,null,5.8516307966248355,0.17250077565110017,8.3567356737139845E-2,2.8235387748060451E-2,0,4.517161634649141E-3,0.10670794095682187,0.24025861073112345,null,5.8516307966248347,5.8369179806521769,6.1220733489818091,5.8393600057104331,null,391664486.08000004,null,15062968.460000001,5090603.1000000006,1281658.6400000001,8690706.7200000007,null,2910448.67,17225729.949999999,null,0.96688605983180931,null,4.7667763970068507E-2,null,9.4335353971069438,9.4565097344409512,9.8540410231020079,9.4036050080298637,null,9.0028193588351133,0.15022043110456698,3.1296799592662038E-2,2.1096117613212922E-2,0,4.875057020280113E-3,null,0.22322763294111031,null,9.0028193588351151,9.0016644404093835,9.4335415912844862,8.9738310450073939,null,58726124.709999971,null,1145771.81,127408.17000000001,78660.710000000006,939702.92999999993,null,310025.36,1616626.78,null,0.98232603590604706,null,2.668130045576431E-2,null,6.3001950019823321,4.8577268510830152,6.4502600215059767,6.4160247431919313,null,85826957.099999979,6.4962472830660561E-2,3.8157583335167999E-2,2.756226664226295E-2,0,5.6070220579053399E-3,0.21645124110077474,null,8.8912595093076465,8.5928920114486473,9.2763121221543816,8.8905130192205721,null,58726124.709999971,null,2089394.8,83535.38,118612.18999999999,1887247.23,null,700159.57000000007,2930812.52,null,0.96677956116322261,null,1.6369002408731709E-2,null,10.75266277407777,21.472734095591477,16.037476175222647,10.180648648632628,null,12.212201965737568,3.0007780677606934E-2,2.297112449946952E-2,3.4633557801002135E-2,0,1.6012326059610495E-3,0.25156438916405743,null,12.212201965737568,12.019562619756869,13.198182280543088,12.174545350480164,null,58726124.709999971,null,1406843.47,1967933.66,61064.350000000006,1294168.74,null,778715.95000000019,2151927.9,null,0.96667782869932417,null,0,null,2833278.96,1047371.9700000001,634842.59000000008,82435.820000000007,4597929.3400000008,null,2327849,433550.00999999995,281830.99,154720,3197950]
[null,null,"London",null,6.8932448379899434,6.8023652676841051,10.695770082223005,6.5683510187870704,null,6.0779271780143223,0.21994266594002013,0.10048617479568868,2.5251786576826165E-2,0,2.9483278299444185E-3,0.20860288645869621,0.25808581837444355,null,6.0779271780143223,6.1123633575540683,6.262818534714043,6.0404551545433049,null,637342383.26000023,null,24790518.220000003,8318240.4300000006,2822171.0700000003,13650106.719999999,null,5804433.5300000012,29134456.220000003,null,0.96307609144923989,null,5.6035516117561246E-2,null,9.8025914570277042,9.7628851524535367,10.153843354054496,9.7692947362069056,null,9.253367455955285,0.18410231121433721,6.203803905766709E-2,1.2848467121011833E-2,0,2.8762504194269696E-3,null,0.28735893325997536,null,9.253367455955285,9.0593760187805099,9.3382939621132781,9.270221566567308,null,102832314.52000001,null,2635521.41,433082.59,317174.33999999997,1885264.4800000002,null,819739.33000000007,3414265.2399999998,null,0.97477107850992373,null,3.3020958251967235E-2,null,7.7263222383096961,8.9507084634822061,9.6048730103071644,7.4282848952484724,null,125028010.69,0.10076050300662431,5.645215007327533E-2,2.0193089369058531E-2,0,3.924767292024082E-3,0.26955084814558117,null,9.0662677139392773,8.7858227161079636,9.2667747874215145,9.0794199303583039,null,102832314.52000001,null,3717230.44,328148.49999999994,359181.36,3029900.58,null,1980409.5500000003,4954008.3500000006,null,0.96359993978477099,null,2.5407773679494195E-2,null,12.720653052506758,44.165641010451196,26.270519233220146,11.041459475150369,null,12.505290156284943,8.4479436871809976E-2,3.2796852274543896E-2,2.3360078085700047E-2,0,1.0800195268283054E-3,0.31812614813811585,null,12.505290156284941,12.492125508941529,13.126862125861132,12.476347870540968,null,102832314.52000001,null,2637659.92,3167295.6,218165.43000000002,2173620.1,null,1681426.36,3657979.7300000004,null,0.96384679994017408,null,0,null,5219848.96,1837793.8499999999,5422282.71,159964.54999999999,12639890.07,null,3845909,642703.69999999995,443447.3,281200,5213260]
[]
[null,null,"North East",null,5.4754385692073475,5.4078965514257478,8.2466762659703168,5.235495253687974,null,4.914367409152681,0.16387641202668068,8.8686224233934255E-2,5.0760184220308105E-2,1.6128613551887863E-3,0,0.16151210673408489,9.4623371484468907E-2,null,4.9143674091526819,4.9229070233633276,4.8448698606911984,4.9142585434703232,null,158353989.41000003,null,2784706,1349486.26,173352.66999999998,1261867.07,null,499840.69,5588196.2300000004,null,0.96970544183474472,null,6.031751273264549E-2,null,7.5612142099067485,7.6576966047957304,7.7325184396473379,7.5130221658216678,null,7.3901179843151086,5.3787107729785261E-2,2.8595714140618445E-2,0,0,0,null,8.8713403721237677E-2,null,7.3901179843151068,7.5726001689049571,7.4303862661599629,7.3244295559798669,null,34308126.5,null,356344.5,58270.01,46140.13,251934.36,null,246354.55,988369.60000000009,null,0.97722624872341279,null,1.1238166045370481E-2,null,6.2315763975822005,5.703993666270379,6.6755704104203089,6.4006220284919095,null,40675121.450000003,4.4966215031390228E-2,0,0,0,0,0.12481532113136791,null,7.2400703212625261,7.3187825652908503,7.2600098936327342,7.2072002334999175,null,34308126.5,null,701219.48,232593.58000000002,61594.64,407031.26,null,362748.52999999997,1225196.78,null,0.96737875440223764,null,7.0889329544573942E-3,null,10.910261351375558,11.385058635786649,12.739011341606505,10.614684095576036,null,9.9242062850887844,7.4218153404527415E-3,0,0,0,0,0.14600095991949261,null,9.9242062850887844,9.9739483304574748,9.9839171062707788,9.9034178159049073,null,34308126.5,null,465338,7373146.8499999996,52495.63,296712.70999999996,null,466246.41,894648.94,null,0.97152573996810832,null,0,null,2970874.33,918249.2,724917.78,92034.94,4706076.2500000009,null,1796340,308923.81,276206.19,173810,2555280]
[null,null,"North West",null,5.5807788300480778,5.4784412650763157,10.466400926124583,5.3836114765810654,null,5.1113967085125598,0.12544532593021199,7.549230801051364E-2,1.390882610827588E-2,7.4052436699781994E-4,1.5253441598021636E-3,0.14396511210576984,0.1083046808539454,null,5.1113967085125598,5.0725031957964966,5.2035122629954289,5.1276281223133582,null,486695267.51999998,null,9632092.2100000009,2788968.0100000002,1025318.04,5817806.1600000001,null,2954499.35,14176563.710000001,null,0.97853452003674368,null,4.3193228579839781E-2,null,7.7517910250055246,7.8366253628476636,7.7970315409652571,7.7385457655795014,null,7.4921069989850348,0.1347483568575315,0,0,1.1654683835495545E-3,0,null,0.12377020077940913,null,7.4921069989850348,7.4721126815967418,7.3005852491233805,7.5078115301201258,null,91630363.419999987,null,1440872.02,288477.25,152247.9,1000146.87,null,145427.57,2029247.3500000003,null,0.98135033519249737,null,1.4064595305008193E-2,null,5.2503027766673336,5.3022926741146374,5.2149169349576283,5.2465699939202723,null,131520012.04000001,9.4584008597175986E-2,0,0,8.9421647165519318E-4,0,0.12921650954761629,null,7.3504600699035825,7.3340004944278041,7.2520902547265642,7.3593461311362898,null,91630363.419999987,null,2312039.8899999997,412322.4,189806.4,1709911.0899999999,null,733223.62,3181873.7499999995,null,0.97235489404332942,null,7.0056493150922093E-3,null,9.1705563684231084,26.298132573681858,56.116115317037767,8.0766533309652999,null,9.9969095084498125,0.11648982713353931,0,0,1.9688233534053269E-3,0,0.1503563993074479,null,9.9969095084498107,9.8940089316483153,9.7380674200749411,10.003249634103048,null,91630363.419999987,null,1527373.18,3502696.8299999996,121550.98,1223111.72,null,1050277.6200000001,2169534.36,null,0.97212919591951996,null,0,null,7233544,2229126.09,1670720.4100000001,216448.5,11349839,null,4337490,682315.87000000011,623259.13,371825,6014890]
[null,null,"South East",null,6.0000911373954944,6.0975105398311866,7.5052260061825518,5.8803449583197454,null,5.5582413569648192,9.6681754326810102E-2,0.11612235334535592,3.6574192320474402E-3,0,0,8.5001392612096729E-2,0.1403868609143647,null,5.5582413569648184,5.5090804952610215,5.6476441326009761,5.5578865525996548,null,588810379.09000003,null,14106725.68,1029830.8500000001,993048.95000000007,12083845.879999999,null,2792151.8,27975129.449999999,null,0.96694438364807833,null,4.0691159732776469E-2,null,8.3164479337159225,8.1804410130011878,8.7583250313425438,8.2856448063271415,null,8.0752785813027614,0.12751179515432121,7.1838860225683001E-3,1.7525047861173012E-3,0,0,null,0.10472116645015458,null,8.0752785813027614,7.9303276707691976,8.5394249971565852,8.0430375695907479,null,66638648.440000013,null,798318.46,37337.15,41323.449999999997,719657.86,null,213190,2913020.7600000002,null,0.975383147481099,null,2.4543495167956831E-2,null,3.8076388086908972,3.6343537975396991,4.8789604671697644,3.7427923233038509,null,145031221.75,6.6390545827781464E-2,9.7606723261690672E-3,1.3209318234912763E-3,0,0,9.8725993887990665E-2,null,8.072014806534046,7.9994958330503962,8.3991729849224743,8.0532992428892776,null,66638648.440000013,null,1773826.22,70485.840000000011,78891.7,1624448.68,null,1163349.97,6312694.9500000002,null,0.9642035798720805,null,1.3619292172314876E-2,null,6.3709322882469275,15.902581185857183,11.705054994895102,5.9333935478441067,null,11.059032862759452,8.1582150903222392E-2,1.4618582772866928E-2,2.8472617540662546E-3,0,0,7.1247872441448257E-2,null,11.059032862759453,10.200152634268186,11.359928541030301,11.062407926104269,null,66638648.440000013,null,753666.63,2033023.4300000002,19866.920000000002,713024.85,null,557636.05000000005,4400217.91,null,0.96138217878436405,null,0,null,5138965.6100000003,1260126.4000000001,1572128.55,163152.84,8134373.4000000004,null,4381910,426087.43000000005,745380.36,344942,5898319.79]
[null,null,"South West",null,5.4851750415502432,5.4877094136667948,8.5973130486078908,5.3827398942556481,null,5.168102251797543,8.0157499047503869E-2,2.044110709285726E-2,1.4819050570318703E-3,5.0792796227697591E-4,0,7.4032938894706801E-2,0.1404514116983229,null,5.1681022517975439,5.1941586114340073,5.09821874466164,5.1669555710544,null,315678050.44,null,8295551.0700000003,1005012.56,643802.91,6646735.5999999996,null,2536811,10636290.34,null,0.97620467797837152,null,1.9629900472137553E-2,null,7.5917707160713963,7.603085078119574,7.7267448117257533,7.5885462089940177,null,7.3825886639820535,6.8697789715540608E-2,0,0,0,0,null,0.14048426237380157,null,7.3825886639820535,7.4072277378485083,7.5473199004483016,7.3778249077854561,null,41819662.460000001,null,639146.4,37916.550000000003,14182.289999999999,587047.56000000006,null,189099,951008.03999999992,null,0.98598649970664021,null,7.81106513286077E-3,null,3.8496707042532448,3.6998151677973943,4.1254087394055734,3.8571208868999931,null,82732441.010000005,6.7356940221309461E-2,0,0,0,0,0.13046976211779207,null,7.3577488303227607,7.3536441087730884,7.4271046503135247,7.3569156505870472,null,41819662.460000001,null,1467035.93,125551.94999999998,30944.239999999998,1310539.74,null,511563,2125073.9300000002,null,0.98324533970470174,null,9.3453468372295158E-3,null,6.4583593747773156,8.8224818908613276,8.8195155331835622,6.3000667800568344,null,10.006057684638231,6.3017001697716749E-2,0,0,0,0,0.14469251155503968,null,10.006057684638233,10.018891776224372,10.332447624750902,10.001250012031011,null,41819662.460000001,null,958395.83000000019,3382269.86,10903.51,899004.41000000015,null,399903,1887586.0399999998,null,0.97609156469147762,null,0,null,3202563,667878.12999999989,1087832.8700000001,104461,5062735,null,2612628,285329.71999999997,500712.27999999997,234997,3633666.9999999995]
[null,null,"West Midlands",null,5.6262190845658635,5.5215787947513695,7.3766047916042332,5.3743011480961256,null,5.1388697640967251,0.15243875731605494,2.6762848278634663E-2,1.9650015010678978E-2,9.546340001894256E-3,0,0.1761554731596521,0.10279588670222277,null,5.1388697640967251,5.1384595962655331,5.2675810827201834,5.1167876054087591,null,371653084.12000006,null,6916799.0499999989,1856514.08,468390.68999999994,4591894.2799999993,null,1749427.23,13821743.020000001,null,0.97217549655345381,null,4.3050558604033402E-2,null,7.9354921858334144,7.7611642166471677,8.2852637198917947,7.8746995985795563,null,7.6820308358254374,0.16002665734864907,0,0,0,0,null,9.343469265933145E-2,null,7.6820308358254366,7.4445952095096759,7.8284645689439225,7.6730739823990426,null,66955121.279999986,null,531742.5,73184,139903.08000000002,318655.42000000004,null,198566,1881900.98,null,0.98667708937183662,null,1.1093146950681768E-2,null,5.5297005320088015,4.6573577088932092,11.351624121985784,5.0238737397586517,null,92607648.479999989,0.10719669328251323,0,0,0,0,8.9552365375103957E-2,null,7.5244330749232589,7.3347298385745239,7.810615319234838,7.5155080153579306,null,66955121.279999986,null,1102173.9300000002,289343.92000000004,92478.37,720351.64000000013,null,457249,2665703.88,null,0.97818707389105863,null,9.6277501687087735E-3,null,9.6295862478388283,14.179876512721451,333.20448500095773,7.6869628467259723,null,10.121685126306399,0.15354806357702555,0,0,0,0,0.21205065081431779,null,10.121685126306399,10.490836745161502,10.608344126159128,10.09990599318574,null,66955121.279999986,null,1507600.0400000003,3671593.43,10651.98,1380519.6900000002,null,340699,2378649.2799999998,null,0.97698026745485045,null,0,null,5684377,1867301.03,1357148.97,190505.36,9099332.3599999994,null,3172260,487165.82,508374.18,337445,4505245]
[null,null,"Yorkshire and The Humber",null,5.4511163514204082,5.3722145142533275,9.2907520155450012,5.3445043865107866,null,5.0963410985746656,0.13382604841385187,0,8.2782160210623512E-3,1.2088731713191547E-3,0,9.4215289228184479E-2,0.11724682601132276,null,5.0963410985746664,5.09301854265878,5.056406265216034,5.0993035499236701,null,333126362.70999998,null,7322640.4399999995,2034189.2000000002,410037.12999999995,4878414.1099999994,null,1018264.78,11700210.899999999,null,0.97944256092004212,null,2.42613353577243E-2,null,7.7214535625649097,7.8822610887595888,7.9296895758442485,7.6913132602409027,null,7.4679300021236923,0.10473590063354947,0,0,0,0,null,0.14872465704729079,null,7.4679300021236914,7.6414325144064916,7.5333348550920283,7.4414439394407772,null,62731901.260000005,null,868778.42,110143.49,89681.790000000008,668953.14,null,309301.40000000002,1282875.3100000003,null,0.99096861544330472,null,1.5420262709814886E-2,null,5.6959958864191051,6.4352245996046813,9.629742927348337,5.5185798513227011,null,83365853.089999989,7.297575400826109E-2,0,0,0,0,0.13402512358347965,null,7.391429690352572,7.6166020265480094,7.4979989191845986,7.361745392963928,null,62731901.260000005,null,1511631.61,161849.88,94651.38,1255130.3500000001,null,309207.05,1970628.11,null,0.98129161319386204,null,8.8973647409368688E-3,null,10.647450062481115,16.530337169349806,76.509992162863583,9.828888015563825,null,10.102266769914388,6.6274154128108553E-2,0,0,0,0,0.19643520673295112,null,10.102266769914388,10.504511259713258,10.168465685176351,10.067938031430922,null,62731901.260000005,null,1179096.3999999999,4893001.8699999992,31549,982618.39999999991,null,286792.07,1304954.3899999999,null,0.97933692914611781,null,0,null,5639333,2012515.57,1184645.43,180200,9016694,null,2937750,566778.29,387242.71,268330,4160101]

{"sheet":"Options","index":9,"n_rows":50,"n_cols":7,"rows_kept":50,"cut":false,"hidden":true,"merged":[]}
["ChartOptions_3yrs",null,"ChartOptions_2yrsFRAS",null,"ChartOptions_2yrsWP",null,"ChartOptions_9mth"]
["3-4 yrs per hour",null,"2 yrs (FRAS) per hour",null,"2 yrs(WP) per hour",null,"9mth - 2 yrs per hour"]
["% Pass through rate",null,"% Pass through rate",null,"% Pass through rate",null,"% Pass through rate"]
["% Funding provided through supplements",null,"% Funding provided through supplements",null,"% Funding provided through supplements",null,"% Funding provided through supplements"]
["SEN Inclusion Fund",null,"SEN Inclusion Fund",null,"SEN Inclusion Fund",null,"SEN Inclusion Fund"]
[]
["AllAges_SortChoice"]
["Original",1]
["All provider rate",2]
["PVI rate",3]
["Nursery school rate",4]
["Primary nursery place rate",5]
["Pass-through rate",6]
["Funding paid through supplements",7]
["SEN Inclusion Fund - All providers",8]
["SEN Inclusion Fund - PVI",9]
["SEN Inclusion Fund - Nursery school",10]
["SEN Inclusion Fund - Primary nursery places",11]
[]
["SortOptions_NonEYFF"]
["Original",1]
["3-4 yr olds Total other spend",2]
["3-4 yr olds SEN Inclusion Fund ",3]
["3-4 yr olds Contingency funding",4]
["3-4 yr olds Central spend",5]
["2 yr olds (WP) Total other spend",6]
["2 yr olds (WP) SEN Inclusion Fund ",7]
["2 yr olds (WP) Contingency funding",8]
["2 yr olds (WP) Central spend",9]
["2 yr olds (FRAS) Total other spend",10]
["2 yr olds (FRAS)  SEN Inclusion Fund ",11]
["2 yr olds (FRAS)  Contingency funding",12]
["2 yr olds (FRAS)  Central spend",13]
["9mth - 2yr olds Total other spend",14]
["9mth - 2yr olds SEN Inclusion Fund ",15]
["9mth - 2yr olds Contingency funding",16]
["9mth - 2yr olds Central spend",17]
[]
["Named range - assigned via control properties"]
[1,null,"LA option - number for button 11"]
[{"$f":"INDEX(LAs,A40)","v":"Choice"},null,"LA Choice - look up based on cell above"]
[1,null,"SortChoice_3yrs - sorthing option chosen on sheet"]
[1,null,"SortChoice_2yrsFRAS - sorthing option chosen on sheet"]
[1,null,"SortChoice_2yrsWP - sorthing option chosen on sheet"]
[1,null,"SortChoice_9mth - sorthing option chosen on sheet"]
[1,null,"SortChoice_Non - sorthing option chosen on sheet"]
[1,null,"ChartChoice_3yrs - chart chosen on named sheet"]
[1,null,"ChartChoice_2yrsFRAS - chart chosen on named sheet"]
[0,null,"ChartChoice_2yrsWP - chart chosen on named sheet"]
[0,null,"ChartChoice_9mth - chart chosen on named sheet"]

{"sheet":"Stat Neighbours","index":10,"n_rows":154,"n_cols":13,"rows_kept":154,"cut":false,"hidden":true,"merged":[]}
["Statistical Neighbours"]
[]
["LA No","Region","Choice","LA No","LA No","LA No","LA No","LA No","LA No","LA No","LA No","LA No","LA No"]
[301,"London (Outer)","Barking and Dagenham",308,821,313,333,336,307,304,312,874,203]
[302,"London (Outer)","Barnet",320,870,310,317,315,306,209,312,309,307]
[370,"Yorkshire and The Humber","Barnsley",372,384,357,371,332,894,840,390,807,394]
[800,"South West","Bath and North East Somerset",816,358,919,356,938,314,825,931,873,916]
[822,"East of England","Bedford Borough",303,826,941,311,937,839,886,935,881,866]
[303,"London (Outer)","Bexley",311,822,886,881,883,887,826,866,839,351]
[330,"West Midlands","Birmingham",892,352,380,391,353,889,373,806,852,355]
[889,"North West","Blackburn with Darwen",380,353,350,831,354,335,373,861,330,382]
[890,"North West","Blackpool",805,806,394,341,393,807,354,880,355,861]
[350,"North West","Bolton",354,831,353,357,335,355,889,331,373,874]
[839,"South West","Bournemouth, Christchurch & Poole",822,882,886,878,826,303,938,926,845,881]
[867,"South East","Bracknell Forest",919,850,825,931,869,938,803,823,916,865]
[380,"Yorkshire and The Humber","Bradford",889,330,353,373,831,354,350,335,333,382]
[304,"London (Outer)","Brent",307,316,313,309,821,871,301,308,320,317]
[846,"South East","Brighton and Hove",801,882,302,314,800,383,209,826,212,816]
[801,"South West","Bristol, City of",846,383,882,373,826,851,870,302,839,382]
[305,"London (Outer)","Bromley",919,358,825,869,867,931,850,868,334,936]
[825,"South East","Buckinghamshire",931,919,869,936,873,867,823,868,358,850]
[351,"North West","Bury",888,908,392,886,332,891,808,926,887,303]
[381,"Yorkshire and The Humber","Calderdale",839,845,878,921,926,882,350,929,383,356]
[873,"East of England","Cambridgeshire",931,919,825,803,937,916,938,823,850,869]
[202,"Inner London","Camden",206,213,205,210,208,207,209,309,204,302]
[823,"East of England","Central Bedfordshire",825,803,873,850,865,931,938,867,869,919]
[895,"North West","Cheshire East",916,937,815,877,865,850,896,931,885,855]
[896,"North West","Cheshire West and Chester",334,356,895,937,885,916,877,878,938,929]
[908,"South West","Cornwall",926,351,845,830,929,935,878,891,888,886]
[331,"West Midlands","Coventry",831,852,874,350,336,312,354,335,821,861]
[306,"London (Outer)","Croydon",209,320,383,870,826,882,302,852,355,203]
[942,"North West","Cumberland",943,925,884,888,813,384,860,929,371,370]
[841,"North East","Darlington",390,808,332,384,888,894,372,357,840,371]
[831,"East Midlands","Derby",331,350,335,852,382,874,354,373,357,861]
[830,"East Midlands","Derbyshire",891,933,935,926,860,878,893,929,838,885]
[878,"South West","Devon",845,838,926,886,933,935,938,830,881,885]
[371,"Yorkshire and The Humber","Doncaster",372,370,384,894,357,812,335,861,354,813]
[838,"South West","Dorset",933,878,893,935,885,881,830,886,938,815]
[332,"West Midlands","Dudley",384,894,808,372,370,887,357,888,841,925]
[840,"North East","Durham",876,344,390,807,372,370,394,393,808,841]
[307,"London (Outer)","Ealing",313,317,312,320,304,309,310,871,821,302]
[811,"Yorkshire and The Humber","East Riding of Yorkshire",860,893,815,877,855,933,884,943,937,830]
[845,"South East","East Sussex",878,886,908,926,881,351,838,938,929,839]
[308,"London (Outer)","Enfield",301,309,821,330,352,307,320,203,306,355]
[881,"East of England","Essex",886,938,916,802,935,850,937,933,303,865]
[390,"North East","Gateshead",841,357,393,372,808,840,807,394,332,384]
[916,"South West","Gloucestershire",937,938,850,802,865,895,855,931,881,885]
[203,"London (Outer)","Greenwich",209,208,306,210,355,320,851,852,391,870]
[204,"Inner London","Hackney",210,206,309,208,211,209,202,352,320,213]
[876,"North West","Halton",342,840,344,394,807,370,390,372,808,343]
[205,"Inner London","Hammersmith and Fulham",208,207,209,210,212,202,302,309,306,206]
[850,"South East","Hampshire",865,802,916,938,869,867,803,937,931,855]
[309,"Inner London","Haringey",320,307,209,208,302,308,210,304,313,317]
[310,"London (Outer)","Harrow",317,312,302,307,320,870,313,315,871,826]
[805,"North East","Hartlepool",807,394,393,890,806,390,840,876,372,340]
[311,"London (Outer)","Havering",303,822,883,881,886,866,941,826,887,938]
[884,"West Midlands","Herefordshire",943,860,925,893,933,888,935,811,815,830]
[919,"East of England","Hertfordshire",931,825,873,867,938,305,850,358,916,869]
[312,"London (Outer)","Hillingdon",313,317,320,874,307,852,310,870,871,331]
[313,"London (Outer)","Hounslow",307,312,871,317,320,821,304,310,852,301]
[921,"South East","Isle of Wight",357,908,926,880,879,350,929,372,354,351]
[206,"Inner London","Islington",202,210,208,213,204,205,209,309,203,352]
[207,"Inner London","Kensington and Chelsea",205,202,208,213,210,209,212,206,302,203]
[886,"South East","Kent",881,845,878,303,935,926,891,938,822,933]
[810,"Yorkshire and The Humber","Kingston Upon Hull, City of",333,336,861,335,812,354,806,371,831,372]
[314,"London (Outer)","Kingston upon Thames",319,315,919,305,800,868,358,318,936,825]
[382,"Yorkshire and The Humber","Kirklees",373,357,851,831,879,354,351,384,908,390]
[340,"North West","Knowsley",342,876,394,805,807,343,344,393,840,341]
[208,"Inner London","Lambeth",210,209,205,203,309,206,306,320,202,212]
[888,"North West","Lancashire",925,351,332,884,841,808,384,891,929,359]
[383,"Yorkshire and The Humber","Leeds",851,882,373,826,382,355,801,852,306,839]
[856,"East Midlands","Leicester",821,871,304,316,333,380,307,313,330,889]
[855,"East Midlands","Leicestershire",916,803,937,802,850,865,933,938,811,891]
[209,"Inner London","Lewisham",208,210,306,205,203,320,309,302,383,355]
[925,"East Midlands","Lincolnshire",888,384,884,813,926,935,332,940,830,933]
[341,"North West","Liverpool",890,805,806,355,393,340,394,391,807,354]
[821,"East of England","Luton",871,874,331,313,312,856,307,333,852,301]
[352,"North West","Manchester",892,330,391,308,380,355,806,852,309,353]
[887,"South East","Medway",866,332,886,303,926,935,883,891,351,384]
[315,"London (Outer)","Merton",319,314,870,302,826,822,306,919,310,873]
[806,"North East","Middlesbrough",890,805,861,354,391,336,335,393,341,355]
[826,"South East","Milton Keynes",822,303,882,870,839,311,919,886,319,383]
[391,"North East","Newcastle upon Tyne",355,373,806,851,892,383,330,852,352,890]
[316,"Inner London","Newham",304,301,308,856,309,821,307,313,352,871]
[926,"East of England","Norfolk",935,908,878,830,929,886,933,925,891,887]
[812,"Yorkshire and The Humber","North East Lincolnshire",371,861,372,894,335,384,841,370,807,357]
[813,"Yorkshire and The Humber","North Lincolnshire",384,925,371,370,940,332,942,372,894,888]
[940,"East Midlands","North Northamptonshire",866,941,935,925,933,883,891,813,887,384]
[802,"South West","North Somerset",850,916,865,937,855,881,938,803,891,886]
[392,"North East","North Tyneside",351,891,808,802,841,888,334,908,390,886]
[815,"Yorkshire and The Humber","North Yorkshire",893,895,811,860,916,877,937,884,865,933]
[929,"North East","Northumberland",926,830,888,908,878,840,838,886,885,935]
[892,"East Midlands","Nottingham",330,352,391,806,380,333,852,353,373,355]
[891,"East Midlands","Nottinghamshire",830,935,933,886,926,937,855,802,860,888]
[353,"North West","Oldham",889,350,354,380,335,831,861,331,330,333]
[931,"South East","Oxfordshire",873,919,825,937,916,850,867,938,869,803]
[874,"East of England","Peterborough",331,831,312,350,852,335,821,354,336,883]
[879,"South West","Plymouth",357,880,894,332,372,384,382,390,887,908]
[851,"South East","Portsmouth",373,383,382,355,852,882,879,831,390,357]
[870,"South East","Reading",826,302,312,315,822,306,320,383,852,310]
[317,"London (Outer)","Redbridge",310,312,320,307,313,302,871,870,852,821]
[807,"North East","Redcar and Cleveland",394,393,805,372,390,840,370,357,371,880]
[318,"London (Outer)","Richmond upon Thames",868,314,936,872,305,358,825,919,800,869]
[354,"North West","Rochdale",335,357,861,350,394,371,372,831,353,355]
[372,"Yorkshire and The Humber","Rotherham",370,357,371,384,894,332,807,394,390,840]
[857,"East Midlands","Rutland",865,815,893,895,850,823,916,855,869,811]
[355,"North West","Salford",373,354,851,391,390,350,393,357,852,383]
[333,"West Midlands","Sandwell",336,810,861,335,354,380,806,331,353,821]
[343,"North West","Sefton",344,342,359,888,876,840,808,340,841,351]
[373,"Yorkshire and The Humber","Sheffield",382,851,355,383,831,354,391,852,357,350]
[893,"West Midlands","Shropshire",815,933,860,811,838,884,830,885,943,916]
[871,"South East","Slough",313,312,821,307,317,310,304,874,320,856]
[334,"West Midlands","Solihull",356,896,937,877,886,916,802,895,881,919]
[933,"South West","Somerset",935,830,838,893,885,891,878,860,855,881]
[803,"South West","South Gloucestershire",855,850,938,873,823,802,916,881,931,865]
[393,"North East","South Tyneside",394,807,390,805,840,357,372,354,890,841]
[852,"South East","Southampton",331,831,851,373,312,355,874,383,350,320]
[882,"East of England","Southend-on-Sea",839,383,826,351,845,851,886,303,392,822]
[210,"Inner London","Southwark",208,209,205,206,203,309,202,204,306,320]
[342,"North West","St. Helens",876,343,340,840,807,370,394,344,808,894]
[860,"West Midlands","Staffordshire",811,884,893,815,933,830,877,891,943,888]
[356,"North West","Stockport",334,358,896,916,919,938,937,802,803,873]
[808,"North East","Stockton-on-Tees",841,332,888,390,384,351,840,372,894,344]
[861,"West Midlands","Stoke-on-Trent",335,354,336,371,812,810,333,357,831,372]
[935,"East of England","Suffolk",933,926,830,891,878,881,886,838,925,940]
[394,"North East","Sunderland",807,393,805,372,357,880,390,840,370,354]
[936,"South East","Surrey",868,825,358,919,869,823,872,931,867,873]
[319,"London (Outer)","Sutton",315,919,826,873,931,314,822,938,839,825]
[866,"South West","Swindon",887,940,883,303,822,941,935,311,891,886]
[357,"North West","Tameside",372,390,354,370,384,332,894,879,394,880]
[894,"West Midlands","Telford and Wrekin",384,372,332,370,357,371,841,390,879,808]
[883,"East of England","Thurrock",866,303,311,887,940,822,941,332,925,935]
[880,"South West","Torbay",357,394,879,372,807,921,370,390,354,894]
[211,"Inner London","Tower Hamlets",204,206,316,352,202,309,213,210,330,304]
[358,"North West","Trafford",919,356,825,931,936,305,895,873,916,334]
[384,"Yorkshire and The Humber","Wakefield",332,370,894,372,925,357,371,813,841,888]
[335,"West Midlands","Walsall",354,861,357,336,371,831,350,372,812,333]
[320,"London (Outer)","Waltham Forest",317,302,312,306,307,309,313,310,209,852]
[212,"Inner London","Wandsworth",205,314,315,208,209,302,870,801,846,305]
[877,"North West","Warrington",895,937,860,811,815,916,334,893,885,865]
[937,"West Midlands","Warwickshire",916,895,931,802,855,938,850,877,865,881]
[869,"South East","West Berkshire",825,850,931,867,919,873,823,865,916,305]
[941,"East Midlands","West Northamptonshire",822,940,937,866,933,935,311,855,931,303]
[938,"South East","West Sussex",916,881,850,919,937,865,802,931,803,878]
[213,"Inner London","Westminster",202,206,210,207,205,208,203,352,204,309]
[943,"North West","Westmorland and Furness",884,942,860,893,811,815,925,933,935,830]
[359,"North West","Wigan",888,925,343,877,860,332,929,884,808,893]
[865,"South West","Wiltshire",850,916,802,938,855,937,895,881,815,803]
[868,"South East","Windsor and Maidenhead",936,825,872,358,919,869,305,823,931,867]
[344,"North West","Wirral",840,343,876,808,394,390,807,888,351,393]
[872,"South East","Wokingham",868,936,825,869,305,358,318,919,867,823]
[336,"West Midlands","Wolverhampton",333,861,335,810,354,331,371,831,806,812]
[885,"West Midlands","Worcestershire",933,916,838,937,893,938,878,830,881,815]
[816,"Yorkshire and The Humber","York",916,800,802,919,937,931,938,358,850,356]

{"sheet":"Select LAs","index":11,"n_rows":41,"n_cols":18,"rows_kept":41,"cut":false,"hidden":true,"merged":[]}
["LAs to benchmark",null,null,null,6,null,null,null,null,1,null,null,null,null,3]
["LA","Name","Symbol","Result","values","order","LA name","LA code",null,"value_2yrsD","order_2yrsD","LA name","LA code",null,"value_2yrsW","order_2yrsW","LA name","LA code"]
[{"$f":"INDEX('Stat Neighbours'!A3:A155,MATCH(LAchoice,LAs,0))","v":"LA No"},{"$f":"IF('Select LAs'!A3 = \"LA No\", \"No LA selected\", VLOOKUP('Select LAs'!A3,'Stat Neighbours'!$A$4:$C$155,3,0))","v":"No LA selected"},null,{"$f":"CONCATENATE(B3,C3)","v":"No LA selected"},{"$f":"IF(D3=\"No LA selected\", \"No LA selected\", VLOOKUP(D3,'3-4 year olds '!$B$21:$N$31,$E$1+2,0))","v":"No LA selected"},null,{"$f":"IFERROR(IF($A$3=\"LA No\", \"No LA selected\", INDEX($D$3:$D$13,MATCH(H3,$A$3:$A$13,0))), \"No LA selected\")","v":"No LA selected"},353,null,{"$f":"IF(D3=\"No LA selected\", \"No LA selected\", VLOOKUP(D3,'2 year olds  (FRAS)'!$B$29:$M$39,$J$1+2,0))","v":"No LA selected"},null,{"$f":"IFERROR(IF($A$3=\"LA No\", \"No LA selected\", INDEX($D$3:$D$13,MATCH(M3,$A$3:$A$13,0))), \"No LA selected\")","v":"No LA selected"},353,null,{"$f":"IF(D3=\"No LA selected\", \"No LA selected\", VLOOKUP(D3,'2 year olds (WP)'!$B$29:$N$39,$O$1+2,0))","v":"No LA selected"},null,{"$f":"IFERROR(IF($A$3=\"LA No\", \"No LA selected\", INDEX($D$3:$D$13,MATCH(R3,$A$3:$A$13,0))), \"No LA selected\")","v":"No LA selected"},353]
[{"$f":"IF(OR(ISBLANK(D16),D16=1), 0, INDEX(OFFSET(LAs,0,-2),D16))","v":0},{"$f":"IF(OR(ISBLANK(D16),D16=1),\"No LA selected\",INDEX(LAs,D16))","v":"No LA selected"},null,{"$f":"CONCATENATE(B4,C4)","v":"No LA selected"},{"$f":"IF(D4=\"No LA selected\", \"No LA selected\", VLOOKUP(D4,'3-4 year olds '!$B$21:$N$31,$E$1+2,0))","v":"No LA selected"},null,{"$f":"IFERROR(IF($A$3=\"LA No\", \"No LA selected\", INDEX($D$3:$D$13,MATCH(H4,$A$3:$A$13,0))), \"No LA selected\")","v":"No LA selected"},889,null,{"$f":"IF(D4=\"No LA selected\", \"No LA selected\", VLOOKUP(D4,'2 year olds  (FRAS)'!$B$29:$M$39,$J$1+2,0))","v":"No LA selected"},null,{"$f":"IFERROR(IF($A$3=\"LA No\", \"No LA selected\", INDEX($D$3:$D$13,MATCH(M4,$A$3:$A$13,0))), \"No LA selected\")","v":"No LA selected"},889,null,{"$f":"IF(D4=\"No LA selected\", \"No LA selected\", VLOOKUP(D4,'2 year olds (WP)'!$B$29:$N$39,$O$1+2,0))","v":"No LA selected"},null,{"$f":"IFERROR(IF($A$3=\"LA No\", \"No LA selected\", INDEX($D$3:$D$13,MATCH(R4,$A$3:$A$13,0))), \"No LA selected\")","v":"No LA selected"},889]
[0,"No LA selected",null,{"$f":"CONCATENATE(B5,C5)","v":"No LA selected"},{"$f":"IF(D5=\"No LA selected\", \"No LA selected\", VLOOKUP(D5,'3-4 year olds '!$B$21:$N$31,$E$1+2,0))","v":"No LA selected"},null,"No LA selected",350,null,{"$f":"IF(D5=\"No LA selected\", \"No LA selected\", VLOOKUP(D5,'2 year olds  (FRAS)'!$B$29:$M$39,$J$1+2,0))","v":"No LA selected"},null,"No LA selected",350,null,{"$f":"IF(D5=\"No LA selected\", \"No LA selected\", VLOOKUP(D5,'2 year olds (WP)'!$B$29:$N$39,$O$1+2,0))","v":"No LA selected"},null,"No LA selected",350]
[0,"No LA selected",null,"No LA selected",{"$f":"IF(D6=\"No LA selected\", \"No LA selected\", VLOOKUP(D6,'3-4 year olds '!$B$21:$N$31,$E$1+2,0))","v":"No LA selected"},null,"No LA selected",354,null,{"$f":"IF(D6=\"No LA selected\", \"No LA selected\", VLOOKUP(D6,'2 year olds  (FRAS)'!$B$29:$M$39,$J$1+2,0))","v":"No LA selected"},null,"No LA selected",354,null,{"$f":"IF(D6=\"No LA selected\", \"No LA selected\", VLOOKUP(D6,'2 year olds (WP)'!$B$29:$N$39,$O$1+2,0))","v":"No LA selected"},null,"No LA selected",354]
[0,"No LA selected",null,"No LA selected",{"$f":"IF(D7=\"No LA selected\", \"No LA selected\", VLOOKUP(D7,'3-4 year olds '!$B$21:$N$31,$E$1+2,0))","v":"No LA selected"},null,"No LA selected",380,null,{"$f":"IF(D7=\"No LA selected\", \"No LA selected\", VLOOKUP(D7,'2 year olds  (FRAS)'!$B$29:$M$39,$J$1+2,0))","v":"No LA selected"},null,"No LA selected",380,null,{"$f":"IF(D7=\"No LA selected\", \"No LA selected\", VLOOKUP(D7,'2 year olds (WP)'!$B$29:$N$39,$O$1+2,0))","v":"No LA selected"},null,"No LA selected",380]
[0,"No LA selected",null,"No LA selected",{"$f":"IF(D8=\"No LA selected\", \"No LA selected\", VLOOKUP(D8,'3-4 year olds '!$B$21:$N$31,$E$1+2,0))","v":"No LA selected"},null,"No LA selected",335,null,{"$f":"IF(D8=\"No LA selected\", \"No LA selected\", VLOOKUP(D8,'2 year olds  (FRAS)'!$B$29:$M$39,$J$1+2,0))","v":"No LA selected"},null,"No LA selected",335,null,{"$f":"IF(D8=\"No LA selected\", \"No LA selected\", VLOOKUP(D8,'2 year olds (WP)'!$B$29:$N$39,$O$1+2,0))","v":"No LA selected"},null,"No LA selected",335]
[0,"No LA selected",null,"No LA selected",{"$f":"IF(D9=\"No LA selected\", \"No LA selected\", VLOOKUP(D9,'3-4 year olds '!$B$21:$N$31,$E$1+2,0))","v":"No LA selected"},null,"No LA selected",831,null,{"$f":"IF(D9=\"No LA selected\", \"No LA selected\", VLOOKUP(D9,'2 year olds  (FRAS)'!$B$29:$M$39,$J$1+2,0))","v":"No LA selected"},null,"No LA selected",831,null,{"$f":"IF(D9=\"No LA selected\", \"No LA selected\", VLOOKUP(D9,'2 year olds (WP)'!$B$29:$N$39,$O$1+2,0))","v":"No LA selected"},null,"No LA selected",831]
[0,"No LA selected",null,"No LA selected",{"$f":"IF(D10=\"No LA selected\", \"No LA selected\", VLOOKUP(D10,'3-4 year olds '!$B$21:$N$31,$E$1+2,0))","v":"No LA selected"},null,"No LA selected",861,null,{"$f":"IF(D10=\"No LA selected\", \"No LA selected\", VLOOKUP(D10,'2 year olds  (FRAS)'!$B$29:$M$39,$J$1+2,0))","v":"No LA selected"},null,"No LA selected",861,null,{"$f":"IF(D10=\"No LA selected\", \"No LA selected\", VLOOKUP(D10,'2 year olds (WP)'!$B$29:$N$39,$O$1+2,0))","v":"No LA selected"},null,"No LA selected",861]
[0,"No LA selected",null,"No LA selected",{"$f":"IF(D11=\"No LA selected\", \"No LA selected\", VLOOKUP(D11,'3-4 year olds '!$B$21:$N$31,$E$1+2,0))","v":"No LA selected"},null,"No LA selected",331,null,{"$f":"IF(D11=\"No LA selected\", \"No LA selected\", VLOOKUP(D11,'2 year olds  (FRAS)'!$B$29:$M$39,$J$1+2,0))","v":"No LA selected"},null,"No LA selected",331,null,{"$f":"IF(D11=\"No LA selected\", \"No LA selected\", VLOOKUP(D11,'2 year olds (WP)'!$B$29:$N$39,$O$1+2,0))","v":"No LA selected"},null,"No LA selected",331]
[0,"No LA selected",null,"No LA selected",{"$f":"IF(D12=\"No LA selected\", \"No LA selected\", VLOOKUP(D12,'3-4 year olds '!$B$21:$N$31,$E$1+2,0))","v":"No LA selected"},null,"No LA selected",330,null,{"$f":"IF(D12=\"No LA selected\", \"No LA selected\", VLOOKUP(D12,'2 year olds  (FRAS)'!$B$29:$M$39,$J$1+2,0))","v":"No LA selected"},null,"No LA selected",330,null,{"$f":"IF(D12=\"No LA selected\", \"No LA selected\", VLOOKUP(D12,'2 year olds (WP)'!$B$29:$N$39,$O$1+2,0))","v":"No LA selected"},null,"No LA selected",330]
[0,"No LA selected",null,"No LA selected",{"$f":"IF(D13=\"No LA selected\", \"No LA selected\", VLOOKUP(D13,'3-4 year olds '!$B$21:$N$31,$E$1+2,0))","v":"No LA selected"},null,"No LA selected",333,null,{"$f":"IF(D13=\"No LA selected\", \"No LA selected\", VLOOKUP(D13,'2 year olds  (FRAS)'!$B$29:$M$39,$J$1+2,0))","v":"No LA selected"},null,"No LA selected",333,null,{"$f":"IF(D13=\"No LA selected\", \"No LA selected\", VLOOKUP(D13,'2 year olds (WP)'!$B$29:$N$39,$O$1+2,0))","v":"No LA selected"},null,"No LA selected",333]
[]
["Stat neighbours",null,null,null,null,null,null,"RangeRanking","RangeValues","Order",null,null,null,null,6]
[{"$f":"IF('Select LAs'!$A$3=\"LA No\", \"No LA selected\", VLOOKUP('Select LAs'!$A$3,'Stat Neighbours'!$A$4:$M$155,ROW(A4),0))","v":"No LA selected"},{"$f":"IF('Select LAs'!A16=\"No LA selected\", \"No LA selected\", VLOOKUP('Select LAs'!A16,'Stat Neighbours'!$A$4:$C$155,3,0))","v":"No LA selected"},{"$f":"IF(B16=\"No LA selected\", 0, MATCH(B16,LAs,0))","v":0},null,{"$f":"IF(C16=0, 0, IF(C16=D16,1,0))","v":0},null,null,null,null,null,null,null,null,null,"value_9mth",null,"LA name","LA code"]
[{"$f":"IF('Select LAs'!$A$3=\"LA No\", \"No LA selected\", VLOOKUP('Select LAs'!$A$3,'Stat Neighbours'!$A$4:$M$155,ROW(A5),0))","v":"No LA selected"},{"$f":"IF('Select LAs'!A17=\"No LA selected\", \"No LA selected\", VLOOKUP('Select LAs'!A17,'Stat Neighbours'!$A$4:$C$155,3,0))","v":"No LA selected"},0,null,{"$f":"IF(C17=0, 0, IF(C17=D17,1,0))","v":0},null,null,null,null,null,null,"Output or Input for macro, and named ranges",null,null,{"$f":"IF(D3=\"No LA selected\", \"No LA selected\", VLOOKUP(D3,'9mth - 2 year'!$B$29:$N$39,$O$15+2,0))","v":"No LA selected"},null,{"$f":"IFERROR(IF($A$3=\"LA No\", \"No LA selected\", INDEX($D$3:$D$13,MATCH(R17,$A$3:$A$13,0))), \"No LA selected\")","v":"No LA selected"},353]
[{"$f":"IF('Select LAs'!$A$3=\"LA No\", \"No LA selected\", VLOOKUP('Select LAs'!$A$3,'Stat Neighbours'!$A$4:$M$155,ROW(A6),0))","v":"No LA selected"},{"$f":"IF('Select LAs'!A18=\"No LA selected\", \"No LA selected\", VLOOKUP('Select LAs'!A18,'Stat Neighbours'!$A$4:$C$155,3,0))","v":"No LA selected"},0,null,0,null,null,null,null,null,null,null,null,null,{"$f":"IF(D4=\"No LA selected\", \"No LA selected\", VLOOKUP(D4,'9mth - 2 year'!$B$29:$N$39,$O$15+2,0))","v":"No LA selected"},null,{"$f":"IFERROR(IF($A$3=\"LA No\", \"No LA selected\", INDEX($D$3:$D$13,MATCH(R18,$A$3:$A$13,0))), \"No LA selected\")","v":"No LA selected"},889]
[{"$f":"IF('Select LAs'!$A$3=\"LA No\", \"No LA selected\", VLOOKUP('Select LAs'!$A$3,'Stat Neighbours'!$A$4:$M$155,ROW(A7),0))","v":"No LA selected"},{"$f":"IF('Select LAs'!A19=\"No LA selected\", \"No LA selected\", VLOOKUP('Select LAs'!A19,'Stat Neighbours'!$A$4:$C$155,3,0))","v":"No LA selected"},0,null,0,null,null,null,null,null,null,null,null,null,{"$f":"IF(D5=\"No LA selected\", \"No LA selected\", VLOOKUP(D5,'9mth - 2 year'!$B$29:$N$39,$O$15+2,0))","v":"No LA selected"},null,"No LA selected",350]
[{"$f":"IF('Select LAs'!$A$3=\"LA No\", \"No LA selected\", VLOOKUP('Select LAs'!$A$3,'Stat Neighbours'!$A$4:$M$155,ROW(A8),0))","v":"No LA selected"},{"$f":"IF('Select LAs'!A20=\"No LA selected\", \"No LA selected\", VLOOKUP('Select LAs'!A20,'Stat Neighbours'!$A$4:$C$155,3,0))","v":"No LA selected"},0,null,0,null,null,null,null,null,null,"Formula based cells",null,null,{"$f":"IF(D6=\"No LA selected\", \"No LA selected\", VLOOKUP(D6,'9mth - 2 year'!$B$29:$N$39,$O$15+2,0))","v":"No LA selected"},null,"No LA selected",354]
[{"$f":"IF('Select LAs'!$A$3=\"LA No\", \"No LA selected\", VLOOKUP('Select LAs'!$A$3,'Stat Neighbours'!$A$4:$M$155,ROW(A9),0))","v":"No LA selected"},{"$f":"IF('Select LAs'!A21=\"No LA selected\", \"No LA selected\", VLOOKUP('Select LAs'!A21,'Stat Neighbours'!$A$4:$C$155,3,0))","v":"No LA selected"},0,null,0,null,null,null,null,null,null,null,null,null,{"$f":"IF(D7=\"No LA selected\", \"No LA selected\", VLOOKUP(D7,'9mth - 2 year'!$B$29:$N$39,$O$15+2,0))","v":"No LA selected"},null,"No LA selected",380]
[{"$f":"IF('Select LAs'!$A$3=\"LA No\", \"No LA selected\", VLOOKUP('Select LAs'!$A$3,'Stat Neighbours'!$A$4:$M$155,ROW(A10),0))","v":"No LA selected"},{"$f":"IF('Select LAs'!A22=\"No LA selected\", \"No LA selected\", VLOOKUP('Select LAs'!A22,'Stat Neighbours'!$A$4:$C$155,3,0))","v":"No LA selected"},0,null,0,null,null,null,null,null,null,null,null,null,{"$f":"IF(D8=\"No LA selected\", \"No LA selected\", VLOOKUP(D8,'9mth - 2 year'!$B$29:$N$39,$O$15+2,0))","v":"No LA selected"},null,"No LA selected",335]
[{"$f":"IF('Select LAs'!$A$3=\"LA No\", \"No LA selected\", VLOOKUP('Select LAs'!$A$3,'Stat Neighbours'!$A$4:$M$155,ROW(A11),0))","v":"No LA selected"},{"$f":"IF('Select LAs'!A23=\"No LA selected\", \"No LA selected\", VLOOKUP('Select LAs'!A23,'Stat Neighbours'!$A$4:$C$155,3,0))","v":"No LA selected"},0,null,0,null,null,null,null,null,null,null,null,null,{"$f":"IF(D9=\"No LA selected\", \"No LA selected\", VLOOKUP(D9,'9mth - 2 year'!$B$29:$N$39,$O$15+2,0))","v":"No LA selected"},null,"No LA selected",831]
[{"$f":"IF('Select LAs'!$A$3=\"LA No\", \"No LA selected\", VLOOKUP('Select LAs'!$A$3,'Stat Neighbours'!$A$4:$M$155,ROW(A12),0))","v":"No LA selected"},{"$f":"IF('Select LAs'!A24=\"No LA selected\", \"No LA selected\", VLOOKUP('Select LAs'!A24,'Stat Neighbours'!$A$4:$C$155,3,0))","v":"No LA selected"},0,null,0,null,null,null,null,null,null,null,null,null,{"$f":"IF(D10=\"No LA selected\", \"No LA selected\", VLOOKUP(D10,'9mth - 2 year'!$B$29:$N$39,$O$15+2,0))","v":"No LA selected"},null,"No LA selected",861]
[{"$f":"IF('Select LAs'!$A$3=\"LA No\", \"No LA selected\", VLOOKUP('Select LAs'!$A$3,'Stat Neighbours'!$A$4:$M$155,ROW(A13),0))","v":"No LA selected"},{"$f":"IF('Select LAs'!A25=\"No LA selected\", \"No LA selected\", VLOOKUP('Select LAs'!A25,'Stat Neighbours'!$A$4:$C$155,3,0))","v":"No LA selected"},0,null,0,null,null,null,null,null,null,null,null,null,{"$f":"IF(D11=\"No LA selected\", \"No LA selected\", VLOOKUP(D11,'9mth - 2 year'!$B$29:$N$39,$O$15+2,0))","v":"No LA selected"},null,"No LA selected",331]
[null,null,null,null,null,null,null,null,null,null,null,null,null,null,{"$f":"IF(D12=\"No LA selected\", \"No LA selected\", VLOOKUP(D12,'9mth - 2 year'!$B$29:$N$39,$O$15+2,0))","v":"No LA selected"},null,"No LA selected",330]
[null,null,null,{"$f":"COUNT(Rightindices)","v":0},{"$f":"IF(AND(E16:E25),1,0)","v":0},null,null,null,null,null,null,null,null,null,{"$f":"IF(D13=\"No LA selected\", \"No LA selected\", VLOOKUP(D13,'9mth - 2 year'!$B$29:$N$39,$O$15+2,0))","v":"No LA selected"},null,"No LA selected",333]
[]
[null,null,null,"Check for duplicates",{"$f":"MAX(COUNTIFS(E31:E41,E31:E41))","v":1},null,null,null,null,null,null,null,null,null,9]
[null,null,null,null,null,null,null,null,null,null,null,null,null,null,"value_NonEYFF",null,"LA name","LA code"]
[null,null,null,null,{"$f":"A3","v":"LA No"},null,null,null,null,null,null,null,null,null,13,null,{"$f":"IFERROR(IF($A$3=\"LA No\", \"No LA selected\", INDEX($D$3:$D$13,MATCH(R31,$A$3:$A$13,0))), \"No LA selected\")","v":"No LA selected"},353]
[null,null,null,null,{"$f":"IF(A4=0, \"zero1\", A4)","v":"zero1"},null,null,null,null,null,null,null,null,null,{"$f":"IF(D4=\"No LA selected\", \"No LA selected\", VLOOKUP(D4,'Other EYFF funds'!$B$16:$S$26,$O$29+2,0))","v":"No LA selected"},null,{"$f":"IFERROR(IF($A$3=\"LA No\", \"No LA selected\", INDEX($D$3:$D$13,MATCH(R32,$A$3:$A$13,0))), \"No LA selected\")","v":"No LA selected"},889]
[null,null,null,null,{"$f":"IF(A5=0, \"zero2\", A5)","v":"zero2"},null,null,null,null,null,null,null,null,null,{"$f":"IF(D5=\"No LA selected\", \"No LA selected\", VLOOKUP(D5,'Other EYFF funds'!$B$16:$S$26,$O$29+2,0))","v":"No LA selected"},null,"No LA selected",350]
[null,null,null,null,{"$f":"IF(A6=0, \"zero3\", A6)","v":"zero3"},null,null,null,null,null,null,null,null,null,{"$f":"IF(D6=\"No LA selected\", \"No LA selected\", VLOOKUP(D6,'Other EYFF funds'!$B$16:$S$26,$O$29+2,0))","v":"No LA selected"},null,"No LA selected",354]
[null,null,null,null,{"$f":"IF(A7=0, \"zero4\", A7)","v":"zero4"},null,null,null,null,null,null,null,null,null,{"$f":"IF(D7=\"No LA selected\", \"No LA selected\", VLOOKUP(D7,'Other EYFF funds'!$B$16:$S$26,$O$29+2,0))","v":"No LA selected"},null,"No LA selected",380]
[null,null,null,null,{"$f":"IF(A8=0, \"zero5\", A8)","v":"zero5"},null,null,null,null,null,null,null,null,null,{"$f":"IF(D8=\"No LA selected\", \"No LA selected\", VLOOKUP(D8,'Other EYFF funds'!$B$16:$S$26,$O$29+2,0))","v":"No LA selected"},null,"No LA selected",335]
[null,null,null,null,{"$f":"IF(A9=0, \"zero6\", A9)","v":"zero6"},null,null,null,null,null,null,null,null,null,{"$f":"IF(D9=\"No LA selected\", \"No LA selected\", VLOOKUP(D9,'Other EYFF funds'!$B$16:$S$26,$O$29+2,0))","v":"No LA selected"},null,"No LA selected",831]
[null,null,null,null,{"$f":"IF(A10=0, \"zero7\", A10)","v":"zero7"},null,null,null,null,null,null,null,null,null,{"$f":"IF(D10=\"No LA selected\", \"No LA selected\", VLOOKUP(D10,'Other EYFF funds'!$B$16:$S$26,$O$29+2,0))","v":"No LA selected"},null,"No LA selected",861]
[null,null,null,null,{"$f":"IF(A11=0, \"zero8\", A11)","v":"zero8"},null,null,null,null,null,null,null,null,null,{"$f":"IF(D11=\"No LA selected\", \"No LA selected\", VLOOKUP(D11,'Other EYFF funds'!$B$16:$S$26,$O$29+2,0))","v":"No LA selected"},null,"No LA selected",331]
[null,null,null,null,{"$f":"IF(A12=0, \"zero9\", A12)","v":"zero9"},null,null,null,null,null,null,null,null,null,{"$f":"IF(D12=\"No LA selected\", \"No LA selected\", VLOOKUP(D12,'Other EYFF funds'!$B$16:$S$26,$O$29+2,0))","v":"No LA selected"},null,"No LA selected",330]
[null,null,null,null,{"$f":"IF(A13=0, \"zero10\", A13)","v":"zero10"},null,null,null,null,null,null,null,null,null,{"$f":"IF(D13=\"No LA selected\", \"No LA selected\", VLOOKUP(D13,'Other EYFF funds'!$B$16:$S$26,$O$29+2,0))","v":"No LA selected"},null,"No LA selected",333]