{"text_format":"1","workbook":"xlsx","n_sheets":12,"sheets":["STATISTICAL NEIGHBOURS","3-4 year olds ","2 year olds  (FRAS)","2 year olds (WP)","9mth - 2 year","Other EYFF funds","DAF","EYPP","EY Data","Options","Stat Neighbours","Select LAs"],"not_rendered":{"charts":29,"images":0,"macros":1,"external_links":0,"defined_names":54,"comments":0,"pivot_tables":0},"unopened":[],"bounds":{"document_bytes":16777216,"sheet_cells":100000,"rows_first":2000,"rows_last":500,"rows_between":2000,"halvings":0,"cell_chars":16384,"cell_head_chars":4096},"cells_cut":0,"cells_raw":0,"read":"whole","date_system":"1900"}

{"sheet":"STATISTICAL NEIGHBOURS","index":0,"n_rows":27,"n_cols":4,"rows_kept":27,"cut":false,"hidden":false,"merged":[]}
[null,"Early Years Funding Benchmarking Tool: 2025-2026"]
[null,"This worksheet allows you to view data for your own local authority along with your statistical "]
[null,"neighbours, or with your own choice of other local authorities."]
[]
[null,"Choose Local Authorities",null,"Other Local Authorities"]
[]
{"$rows_left_out":22}
{"sheet":"3-4 year olds ","index":1,"n_rows":34,"n_cols":13,"rows_kept":34,"cut":false,"hidden":true,"merged":[[4,1,4,2],[14,3,14,4],[6,1,6,2],[7,1,7,2],[8,1,8,2],[5,1,5,2],[17,9,17,12],[18,1,18,2],[17,3,17,6],[17,7,18,7],[17,8,18,8]]}
[]
[null,{"$f":"CONCATENATE('Select LAs'!B3,\" - Key Budget Statistics\")","v":"No LA selected - Key Budget Statistics"},null,null,null,null,null,null,null,null,"Financial Year 2025-2026"]
[]
[null,null,null,"PVIs","Nursery Schools","Primary Nursery Places","Centrally Retained"]
[null,{"$f":"'Select LAs'!D3","v":"No LA selected"},null,"All providers","Private, Voluntary, Independent","Nursery schools","Primary nursery places"]
["Total FTE","3-4 year old hourly average funding rate (£/hr)1",null,{"$f":"IFERROR(IF(INDEX('EY Data'!E:E, MATCH('Select LAs'!$A$3,'EY Data'!$B:$B, 0))=\"\",\"-\", INDEX('EY Data'!E:E, MATCH('Select LAs'!$A$3,'EY Data'!$B:$B, 0))), 0)","v":0},{"$f":"IFERROR(IF(INDEX('EY Data'!H:H, MATCH('Select LAs'!$A$3,'EY Data'!$B:$B, 0))=\"\",\"-\", INDEX('EY Data'!H:H, MATCH('Select LAs'!$A$3,'EY Data'!$B:$B, 0))), 0)","v":0},{"$f":"IFERROR(IF(INDEX('EY Data'!G:G, MATCH('Select LAs'!$A$3,'EY Data'!$B:$B, 0))=\"\",\"-\", INDEX('EY Data'!G:G, MATCH('Select LAs'!$A$3,'EY Data'!$B:$B, 0))), 0)","v":0},{"$f":"IFERROR(IF(INDEX('EY Data'!F:F, MATCH('Select LAs'!$A$3,'EY Data'!$B:$B, 0))=\"\",\"-\", INDEX('EY Data'!F:F, MATCH('Select LAs'!$A$3,'EY Data'!$B:$B, 0))), 0)","v":0}]
{"$rows_left_out":29}
{"sheet":"2 year olds  (FRAS)","index":2,"n_rows":42,"n_cols":13,"rows_kept":42,"cut":false,"hidden":true,"merged":[[26,1,26,2],[43,1,43,11],[4,1,4,2],[5,1,5,2],[6,1,6,2],[22,3,22,4],[25,3,25,6],[25,9,25,12],[7,1,7,2],[25,7,26,7],[25,8,26,8]]}
[]
[null,{"$f":"CONCATENATE('Select LAs'!B3,\" - Key Budget Statistics\")","v":"No LA selected - Key Budget Statistics"},null,null,null,null,null,null,null,null,null,null,{"$f":"'3-4 year olds '!$K$2","v":"Financial Year 2025-2026"}]
[]
[]
[null,{"$f":"'Select LAs'!D3","v":"No LA selected"},null,"All providers","Private, Voluntary, Independent","Nursery schools","Primary nursery places"]
[null,"2 year old (FRAS) hourly average funding rate (£/hr)",null,{"$f":"IFERROR(IF(INDEX('EY Data'!AL:AL, MATCH('Select LAs'!$A$3,'EY Data'!$B:$B, 0))=\"\",\"-\", INDEX('EY Data'!AL:AL, MATCH('Select LAs'!$A$3,'EY Data'!$B:$B, 0))), 0)","v":0},{"$f":"IFERROR(IF(INDEX('EY Data'!AO:AO, MATCH('Select LAs'!$A$3,'EY Data'!$B:$B, 0))=\"\",\"-\", INDEX('EY Data'!AO:AO, MATCH('Select LAs'!$A$3,'EY Data'!$B:$B, 0))), 0)","v":0},{"$f":"IFERROR(IF(INDEX('EY Data'!AN:AN, MATCH('Select LAs'!$A$3,'EY Data'!$B:$B, 0))=\"\",\"-\", INDEX('EY Data'!AN:AN, MATCH('Select LAs'!$A$3,'EY Data'!$B:$B, 0))), 0)","v":0},{"$f":"IFERROR(IF(INDEX('EY Data'!AM:AM, MATCH('Select LAs'!$A$3,'EY Data'!$B:$B, 0))=\"\",\"-\", INDEX('EY Data'!AM:AM, MATCH('Select LAs'!$A$3,'EY Data'!$B:$B, 0))), 0)","v":0}]
{"$rows_left_out":37}
{"sheet":"2 year olds (WP)","index":3,"n_rows":42,"n_cols":13,"rows_kept":42,"cut":false,"hidden":true,"merged":[[43,1,43,11],[4,1,4,2],[22,3,22,4],[26,1,26,2],[25,3,25,6],[6,1,6,2],[5,1,5,2],[25,9,25,12],[7,1,7,2],[25,7,26,7],[25,8,26,8]]}
[]
[null,{"$f":"CONCATENATE('Select LAs'!B3,\" - Key Budget Statistics\")","v":"No LA selected - Key Budget Statistics"},null,null,null,null,null,null,null,null,null,null,{"$f":"'3-4 year olds '!$K$2","v":"Financial Year 2025-2026"}]
[]
[]
[null,{"$f":"'Select LAs'!D3","v":"No LA selected"},null,"All providers","Private, Voluntary, Independent","Nursery schools","Primary nursery places"]
[null,"2 year old (WP) hourly average funding rate (£/hr)",null,{"$f":"IFERROR(IF(INDEX('EY Data'!BS:BS, MATCH('Select LAs'!$A$3,'EY Data'!$B:$B, 0))=\"\",\"-\", INDEX('EY Data'!BS:BS, MATCH('Select LAs'!$A$3,'EY Data'!$B:$B, 0))), 0)","v":0},{"$f":"IFERROR(IF(INDEX('EY Data'!BV:BV, MATCH('Select LAs'!$A$3,'EY Data'!$B:$B, 0))=\"\",\"-\", INDEX('EY Data'!BV:BV, MATCH('Select LAs'!$A$3,'EY Data'!$B:$B, 0))), 0)","v":0},{"$f":"IFERROR(IF(INDEX('EY Data'!BU:BU, MATCH('Select LAs'!$A$3,'EY Data'!$B:$B, 0))=\"\",\"-\", INDEX('EY Data'!BU:BU, MATCH('Select LAs'!$A$3,'EY Data'!$B:$B, 0))), 0)","v":0},{"$f":"IFERROR(IF(INDEX('EY Data'!BT:BT, MATCH('Select LAs'!$A$3,'EY Data'!$B:$B, 0))=\"\",\"-\", INDEX('EY Data'!BT:BT, MATCH('Select LAs'!$A$3,'EY Data'!$B:$B, 0))), 0)","v":0}]
{"$rows_left_out":37}
{"sheet":"9mth - 2 year","index":4,"n_rows":42,"n_cols":13,"rows_kept":42,"cut":false,"hidden":true,"merged":[[26,1,26,2],[43,1,43,11],[4,1,4,2],[5,1,5,2],[6,1,6,2],[22,3,22,4],[25,3,25,6],[25,9,25,12],[7,1,7,2],[25,7,26,7],[25,8,26,8]]}
[]
[null,{"$f":"CONCATENATE('Select LAs'!B3,\" - Key Budget Statistics\")","v":"No LA selected - Key Budget Statistics"},null,null,null,null,null,null,null,null,null,null,{"$f":"'3-4 year olds '!$K$2","v":"Financial Year 2025-2026"}]
[]
[]
[null,{"$f":"'Select LAs'!D3","v":"No LA selected"},null,"All providers","Private, Voluntary, Independent","Nursery schools","Primary nursery places"]
[null,"9mth - 2 year old hourly average funding rate (£/hr)",null,{"$f":"IFERROR(IF(INDEX('EY Data'!CY:CY, MATCH('Select LAs'!$A$3,'EY Data'!$B:$B, 0))=\"\",\"-\", INDEX('EY Data'!CY:CY, MATCH('Select LAs'!$A$3,'EY Data'!$B:$B, 0))), 0)","v":0},{"$f":"IFERROR(IF(INDEX('EY Data'!DB:DB, MATCH('Select LAs'!$A$3,'EY Data'!$B:$B, 0))=\"\",\"-\", INDEX('EY Data'!DB:DB, MATCH('Select LAs'!$A$3,'EY Data'!$B:$B, 0))), 0)","v":0},{"$f":"IFERROR(IF(INDEX('EY Data'!DA:DA, MATCH('Select LAs'!$A$3,'EY Data'!$B:$B, 0))=\"\",\"-\", INDEX('EY Data'!DA:DA, MATCH('Select LAs'!$A$3,'EY Data'!$B:$B, 0))), 0)","v":0},{"$f":"IFERROR(IF(INDEX('EY Data'!CZ:CZ, MATCH('Select LAs'!$A$3,'EY Data'!$B:$B, 0))=\"\",\"-\", INDEX('EY Data'!CZ:CZ, MATCH('Select LAs'!$A$3,'EY Data'!$B:$B, 0))), 0)","v":0}]
{"$rows_left_out":37}
{"sheet":"Other EYFF funds","index":5,"n_rows":29,"n_cols":19,"rows_kept":29,"cut":false,"hidden":true,"merged":[[13,1,13,2],[30,1,30,10],[31,2,31,10],[9,3,9,4],[12,3,12,6],[12,7,12,10],[12,11,12,14],[12,15,12,18]]}
[]
[null,{"$f":"'Select LAs'!B3","v":"No LA selected"},null,null,null,null,null,null,null,null,null,null,null,null,null,{"$f":"'3-4 year olds '!K2","v":"Financial Year 2025-2026"}]
[]
[null,null,null,"PVIs","Nursery Schools","Primary Nursery Places"]
[]
[null,{"$f":"CONCATENATE(\"Benchmarking against \",IF(_SN=1,\"Statistical Neighbours\",\"Manual Selection\"))","v":"Benchmarking against Manual Selection"}]
{"$rows_left_out":24}
{"sheet":"DAF","index":6,"n_rows":25,"n_cols":8,"rows_kept":25,"cut":false,"hidden":true,"merged":[[3,1,3,2],[4,1,4,2],[6,1,7,7],[9,1,9,2]]}
[]
[null,{"$f":"CONCATENATE('Select LAs'!B3,\" - Key Budget Statistics\")","v":"No LA selected - Key Budget Statistics"}]
[null,null,null,null,null,null,null,{"$f":"'3-4 year olds '!K2","v":"Financial Year 2025-2026"}]
[null,{"$f":"'Select LAs'!D3","v":"No LA selected"},null,"All establishments"]
[null,"Disability Access Fund - total",null,{"$f":"IF('Select LAs'!$A$3=\"LA No\", \"-\", INDEX('EY Data'!EO:EO, MATCH('Select LAs'!$A$3,'EY Data'!$B:$B, 0)))","v":"-"}]
[]
{"$rows_left_out":20}
{"sheet":"EYPP","index":7,"n_rows":25,"n_cols":8,"rows_kept":25,"cut":false,"hidden":true,"merged":[[3,1,3,2],[4,1,4,2],[9,1,9,2],[6,1,7,7]]}
[]
[null,{"$f":"CONCATENATE('Select LAs'!B3,\" - Key Budget Statistics\")","v":"No LA selected - Key Budget Statistics"}]
[null,null,null,null,null,null,null,{"$f":"'3-4 year olds '!K2","v":"Financial Year 2025-2026"}]
[null,{"$f":"'Select LAs'!D3","v":"No LA selected"},null,"All establishments"]
[null,"Early Years Pupil Premium - total",null,{"$f":"IF('Select LAs'!$A$3=\"LA No\", \"-\", INDEX('EY Data'!EI:EI, MATCH('Select LAs'!$A$3,'EY Data'!$B:$B, 0)))","v":"-"}]
[]
{"$rows_left_out":20}
{"sheet":"EY Data","index":8,"n_rows":177,"n_cols":156,"rows_kept":177,"cut":false,"hidden":true,"merged":[[2,4,2,7],[8,149,8,153],[2,30,2,31],[2,9,2,16],[2,18,2,21],[2,25,2,28],[15,149,15,153],[19,149,19,153],[23,149,23,153],[0,25,0,28],[2,42,2,49],[2,63,2,64],[2,75,2,81],[2,107,2,113],[2,127,2,128]]}
[]
[null,2,3,4,5,6,7,8,9,10,11,12,13,14,15,16,17,18,19,20,21,22,23,24,25,26,27,28,29,30,31,32,33,34,35,36,37,38,39,40,41,42,43,44,45,46,47,48,49,50,51,52,53,54,55,56,57,58,59,60,61,62,63,64,65,66,67,68,69,70,71,72,73,74,75,76,77,78,79,80,81,82,83,84,85,86,87,88,89,90,91,92,93,94,95,96,97,98,99,100,101,102,103,104,105,106,107,108,109,110,111,112,113,114,115,116,117,118,119,120,121,122,123,124,125,126,127,128,129,130,131,132,133,134,135,136,137,138,139,140,141,142,143,144,145]
[null,null,null,null,"3 and 4 year olds hourly average funding rate",null,null,null,null,"3 and 4 year olds components of hourly average funding rate for all providers",null,null,null,null,null,null,null,null,"3 and 4 year olds hourly average base rate",null,null,null,null,"3 and 4 year olds EYSFF total budget ",null,"3 and 4 year olds SEN Inclusion Fund (top-up grant element)",null,null,null,null,"3 and 4 year olds contingency funding & central spend",null,null,"3 and 4 year olds",null,"3 and 4 year olds",null,"2 year olds (FRAS) hourly average funding rate",null,null,null,null,"2 year olds (FRAS) components of hourly average funding rate for all providers",null,null,null,null,null,null,null,null,"2 year olds (FRAS) hourly average base rate",null,null,null,null,"2 year olds (FRAS) EYSFF total budget ",null,"2 year olds (FRAS) SEN Inclusion Fund (top-up grant element)",null,null,null,null,"2 year olds (FRAS) contingency funding & central spend",null,null,"2 year olds (FRAS)",null,"2 year olds (FRAS)",null,"2 year olds (working parents) hourly average funding rate",null,null,null,null,"2 year olds (working parents) components of hourly average funding rate for all providers",null,null,null,null,null,null,null,"2 year olds (working parents) hourly average base rate",null,null,null,null,"2 year olds (working parents) EYSFF total budget ",null,"2 year olds (working parents) SEN Inclusion Fund (top-up grant element)",null,null,null,null,"2 year olds (working parents) contingency funding & central spend",null,null,"2 year olds (working parents)",null,"2 year olds (working parents)",null,"9mth - 2 year olds hourly average funding rate",null,null,null,null,"9mth - 2 year olds components of hourly average funding rate for all providers",null,null,null,null,null,null,null,"9mth - 2 year olds hourly average base rate",null,null,null,null,"9mth - 2yr olds EYSFF total budget ",null,"9mth - 2yr olds SEN Inclusion Fund (top-up grant element)",null,null,null,null,"9mth - 2yr olds contingency funding & central spend",null,null,"9mth - 2yr olds",null,"9mth - 2yr olds",null,"EYPP",null,null,null,null,null,"DAF"]
[null,"LA Number","LA name",null,"All Providers","Primary Nursery Class","Maintained Nursery School","Private, Voluntary and Independent (PVI)",null,"Base rate","Supplements - Deprivation","Supplements - Quality","Supplements - Flexibility","Supplements - Rurality/Sparsity","Supplements - EAL","Maintained nursery school (MNS) lump sums","SEN Inclusion Fund (top-up grant element)",null,"All Providers","Primary Nursery Class","Maintained Nursery School","Private, Voluntary and Independent (PVI)",null,"All Providers",null,"All Providers","Primary Nursery Class","Maintained Nursery School","Private, Voluntary and Independent (PVI)",null,"Contingency Funding","Central Spend",null,"Pass Through Rate (%)",null,"Funding Paid Through Supplements (%)",null,"All Providers","Primary Nursery Class","Maintained Nursery School","Private, Voluntary and Independent (PVI)",null,"Base rate","Supplements - Deprivation","Supplements - Quality","Supplements - Flexibility","Supplements - Rurality/Sparsity","Supplements - EAL","6. Total 'top-up' amount paid to individual providers to ensure the disadvantaged 2 year old rate is at least equal to the 2 year old working parent rate","SEN Inclusion Fund (top-up grant element)",null,"All Providers","Primary Nursery Class","Maintained Nursery School","Private, Voluntary and Independent (PVI)",null,"All Providers",null,"All Providers","Primary Nursery Class","Maintained Nursery School","Private, Voluntary and Independent (PVI)",null,"Contingency Funding","Central Spend",null,"Pass Through Rate (%)",null,"Funding Paid Through Supplements (%)",null,"All Providers","Primary Nursery Class","Maintained Nursery School","Private, Voluntary and Independent (PVI)",null,"Base rate","Supplements - Deprivation","Supplements - Quality","Supplements - Flexibility","Supplements - Rurality/Sparsity","Supplements - EAL","SEN Inclusion Fund (top-up grant element)",null,"All Providers","Primary Nursery Class","Maintained Nursery School","Private, Voluntary and Independent (PVI)",null,"All Providers",null,"All Providers","Primary Nursery Class","Maintained Nursery School","Private, Voluntary and Independent (PVI)",null,"Contingency Funding","Central Spend",null,"Pass Through Rate (%)",null,"Funding Paid Through Supplements (%)",null,"All Providers","Primary Nursery Class","Maintained Nursery School","Private, Voluntary and Independent (PVI)",null,"Base rate","Supplements - Deprivation","Supplements - Quality","Supplements - Flexibility","Supplements - Rurality/Sparsity","Supplements - EAL","SEN Inclusion Fund (top-up grant element)",null,"All Providers","Primary Nursery Class","Maintained Nursery School","Private, Voluntary and Independent (PVI)",null,"All Providers",null,"All Providers","Primary Nursery Class","Maintained Nursery School","Private, Voluntary and Independent (PVI)",null,"Contingency Funding","Central Spend",null,"Pass Through Rate (%)",null,"Funding Paid Through Supplements (%)",null,"Early Years Pupil Premium: 3yr & 4yr olds","Early Years Pupil Premium: 2yr olds - FRAS","Early Years Pupil Premium: 2yr olds - working parents ","Early Years Pupil Premium: 9mth to 2yr olds","Early Years Pupil Premium: Total",null,"Disability Access Fund: 3yr & 4 yr olds","Disability Access Fund: 2yr olds - FRAS","Disability Access Fund: 2yr olds working parents","Disability Access Fund: 9mth to 2yr olds","Disability Access Fund: Total"]
[null,201,"City of London",null,8.5433341321191794,8.5243902439024382,0,8.541585220957419,null,8.5,2.336448598130841E-2,0,0,0,0,0,1.9969646137870438E-2,null,8.5,8.5,0,8.5,null,426816,null,1000,0,500,500,null,0,0,null,"-",null,"N/A",null,11.341880341880342,11,0,11.284900284900285,null,11,0,0,0,0,0,0,0.34188034188034189,null,11,11,0,11,null,32175,null,1000,0,500,500,null,0,0,null,"-",null,"N/A",null,11.341880341880342,11,0,11.284900284900285,null,11,0,0,0,0,0,0.34188034188034189,null,11,11,0,11,null,32175,null,1000,0,500,500,null,0,0,null,"-",null,"N/A",null,15.183688464364439,15,0,15.166666666666666,null,15,0,0,0,0,0,0.18368846436443792,null,15,15,0,15,null,81660,null,1000,0,500,500,null,0,0,null,"-",null,"N/A",null,0,0,0,0,0,null,0,0,0,0,0]
[null,202,"Camden",null,9.0191792193228331,8.8835901227266021,10.903997790145688,8.6979616643170665,null,7.43,0.83000000000000007,0.18,0,0,0,0.14889848131068892,0.43028073801214334,null,7.43,7.4300000000000006,7.4300000000000006,7.43,null,12775136.190000001,null,640000,240000,200000,200000,null,0,511005.44,null,0.96031120249588042,null,0.11966824644549763,null,11.859744561669508,12.803352080989876,11.80811424146763,11.61196557279742,null,9.7799999999999994,1.0900000000000001,0,0,0,0,0,0.98974456166950953,null,9.7799999999999994,9.7799999999999994,9.7800000000000011,9.7799999999999994,null,2064734.76,null,188000,55000,63000,70000,null,0,61942.049999999996,null,0.96972563873013151,null,0.10027598896044158,null,11.864887807267275,17.762230576441098,14.383703443429376,11.312417843006553,null,9.7800000000000011,1.0899999999999999,0,0,0,0,0.99488780726727277,null,9.7800000000000011,9.7799999999999994,9.7799999999999994,9.7799999999999994,null,2130541.7400000002,null,195000,55000,65000,75000,null,0,63916.25,null,0.97014618211506742,null,0.10027598896044157,null,16.318949878194164,0,0,16.318949878194164,null,13.95,1.55,0,0,0,0,0.81894987819416365,null,13.95,0,0,13.95,null,4485622.5,null,237000,0,0,237000,null,0,134568.68,null,0.9696345738677461,null,"No Base Rate",null,85000,60000,20000,10000,175000,null,31850,9100,9100,9100,59150]
{"$rows_left_out":172}
{"sheet":"Options","index":9,"n_rows":50,"n_cols":7,"rows_kept":50,"cut":false,"hidden":true,"merged":[]}
["ChartOptions_3yrs",null,"ChartOptions_2yrsFRAS",null,"ChartOptions_2yrsWP",null,"ChartOptions_9mth"]
["3-4 yrs per hour",null,"2 yrs (FRAS) per hour",null,"2 yrs(WP) per hour",null,"9mth - 2 yrs per hour"]
["% Pass through rate",null,"% Pass through rate",null,"% Pass through rate",null,"% Pass through rate"]
["% Funding provided through supplements",null,"% Funding provided through supplements",null,"% Funding provided through supplements",null,"% Funding provided through supplements"]
["SEN Inclusion Fund",null,"SEN Inclusion Fund",null,"SEN Inclusion Fund",null,"SEN Inclusion Fund"]
[]
{"$rows_left_out":45}
{"sheet":"Stat Neighbours","index":10,"n_rows":154,"n_cols":13,"rows_kept":154,"cut":false,"hidden":true,"merged":[]}
["Statistical Neighbours"]
[]
["LA No","Region","Choice","LA No","LA No","LA No","LA No","LA No","LA No","LA No","LA No","LA No","LA No"]
[301,"London (Outer)","Barking and Dagenham",308,821,313,333,336,307,304,312,874,203]
[302,"London (Outer)","Barnet",320,870,310,317,315,306,209,312,309,307]
[370,"Yorkshire and The Humber","Barnsley",372,384,357,371,332,894,840,390,807,394]
{"$rows_left_out":149}
{"sheet":"Select LAs","index":11,"n_rows":41,"n_cols":18,"rows_kept":41,"cut":false,"hidden":true,"merged":[]}
["LAs to benchmark",null,null,null,6,null,null,null,null,1,null,null,null,null,3]
["LA","Name","Symbol","Result","values","order","LA name","LA code",null,"value_2yrsD","order_2yrsD","LA name","LA code",null,"value_2yrsW","order_2yrsW","LA name","LA code"]
[{"$f":"INDEX('Stat Neighbours'!A3:A155,MATCH(LAchoice,LAs,0))","v":"LA No"},{"$f":"IF('Select LAs'!A3 = \"LA No\", \"No LA selected\", VLOOKUP('Select LAs'!A3,'Stat Neighbours'!$A$4:$C$155,3,0))","v":"No LA selected"},null,{"$f":"CONCATENATE(B3,C3)","v":"No LA selected"},{"$f":"IF(D3=\"No LA selected\", \"No LA selected\", VLOOKUP(D3,'3-4 year olds '!$B$21:$N$31,$E$1+2,0))","v":"No LA selected"},null,{"$f":"IFERROR(IF($A$3=\"LA No\", \"No LA selected\", INDEX($D$3:$D$13,MATCH(H3,$A$3:$A$13,0))), \"No LA selected\")","v":"No LA selected"},353,null,{"$f":"IF(D3=\"No LA selected\", \"No LA selected\", VLOOKUP(D3,'2 year olds  (FRAS)'!$B$29:$M$39,$J$1+2,0))","v":"No LA selected"},null,{"$f":"IFERROR(IF($A$3=\"LA No\", \"No LA selected\", INDEX($D$3:$D$13,MATCH(M3,$A$3:$A$13,0))), \"No LA selected\")","v":"No LA selected"},353,null,{"$f":"IF(D3=\"No LA selected\", \"No LA selected\", VLOOKUP(D3,'2 year olds (WP)'!$B$29:$N$39,$O$1+2,0))","v":"No LA selected"},null,{"$f":"IFERROR(IF($A$3=\"LA No\", \"No LA selected\", INDEX($D$3:$D$13,MATCH(R3,$A$3:$A$13,0))), \"No LA selected\")","v":"No LA selected"},353]
[{"$f":"IF(OR(ISBLANK(D16),D16=1), 0, INDEX(OFFSET(LAs,0,-2),D16))","v":0},{"$f":"IF(OR(ISBLANK(D16),D16=1),\"No LA selected\",INDEX(LAs,D16))","v":"No LA selected"},null,{"$f":"CONCATENATE(B4,C4)","v":"No LA selected"},{"$f":"IF(D4=\"No LA selected\", \"No LA selected\", VLOOKUP(D4,'3-4 year olds '!$B$21:$N$31,$E$1+2,0))","v":"No LA selected"},null,{"$f":"IFERROR(IF($A$3=\"LA No\", \"No LA selected\", INDEX($D$3:$D$13,MATCH(H4,$A$3:$A$13,0))), \"No LA selected\")","v":"No LA selected"},889,null,{"$f":"IF(D4=\"No LA selected\", \"No LA selected\", VLOOKUP(D4,'2 year olds  (FRAS)'!$B$29:$M$39,$J$1+2,0))","v":"No LA selected"},null,{"$f":"IFERROR(IF($A$3=\"LA No\", \"No LA selected\", INDEX($D$3:$D$13,MATCH(M4,$A$3:$A$13,0))), \"No LA selected\")","v":"No LA selected"},889,null,{"$f":"IF(D4=\"No LA selected\", \"No LA selected\", VLOOKUP(D4,'2 year olds (WP)'!$B$29:$N$39,$O$1+2,0))","v":"No LA selected"},null,{"$f":"IFERROR(IF($A$3=\"LA No\", \"No LA selected\", INDEX($D$3:$D$13,MATCH(R4,$A$3:$A$13,0))), \"No LA selected\")","v":"No LA selected"},889]
[0,"No LA selected",null,{"$f":"CONCATENATE(B5,C5)","v":"No LA selected"},{"$f":"IF(D5=\"No LA selected\", \"No LA selected\", VLOOKUP(D5,'3-4 year olds '!$B$21:$N$31,$E$1+2,0))","v":"No LA selected"},null,"No LA selected",350,null,{"$f":"IF(D5=\"No LA selected\", \"No LA selected\", VLOOKUP(D5,'2 year olds  (FRAS)'!$B$29:$M$39,$J$1+2,0))","v":"No LA selected"},null,"No LA selected",350,null,{"$f":"IF(D5=\"No LA selected\", \"No LA selected\", VLOOKUP(D5,'2 year olds (WP)'!$B$29:$N$39,$O$1+2,0))","v":"No LA selected"},null,"No LA selected",350]
[0,"No LA selected",null,"No LA selected",{"$f":"IF(D6=\"No LA selected\", \"No LA selected\", VLOOKUP(D6,'3-4 year olds '!$B$21:$N$31,$E$1+2,0))","v":"No LA selected"},null,"No LA selected",354,null,{"$f":"IF(D6=\"No LA selected\", \"No LA selected\", VLOOKUP(D6,'2 year olds  (FRAS)'!$B$29:$M$39,$J$1+2,0))","v":"No LA selected"},null,"No LA selected",354,null,{"$f":"IF(D6=\"No LA selected\", \"No LA selected\", VLOOKUP(D6,'2 year olds (WP)'!$B$29:$N$39,$O$1+2,0))","v":"No LA selected"},null,"No LA selected",354]
{"$rows_left_out":35}