{"text_format":"1","workbook":"xlsx","n_sheets":9,"sheets":["Guidance","Organisation user","BFR 2025","Revenue Reserves Bal Details","Summary declaration","Preparer declaration ","Approver declaration","Min Max table","Trust validations table"],"not_rendered":{"charts":0,"images":0,"macros":1,"external_links":0,"defined_names":1,"comments":1,"pivot_tables":0},"unopened":[],"bounds":{"document_bytes":16777216,"sheet_cells":100000,"rows_first":2000,"rows_last":500,"rows_between":2000,"halvings":0,"cell_chars":16384,"cell_head_chars":4096},"cells_cut":0,"cells_raw":0,"read":"whole","date_system":"1900"}

{"sheet":"Guidance","index":0,"n_rows":267,"n_cols":2,"rows_kept":267,"cut":false,"hidden":false,"merged":[[4,1,5,1]]}
[null,"Budget forecast return (BFR) 2025"]
[null,"There are 7 tabs in this workbook to work through excluding the guidance and min/max tables tabs."]
[]
[null,"Protected sheets \nThe worksheets are protected with the password 'BFR'. You can remove the protection to inspect how the workbook is structured. \nIf you remove the password protection, there's a risk that formulas and validations could be accidentally overwritten. For that reason it's safer to do this on a separate, saved version."]
[null,"This document is designed to help you prepare for the online BFR return. To actually submit your return you'll need to use the online form published on the GOV.UK website."]
[]
[null,"Use the workbook to process and validate information before completing the online form."]
[null,"Most numbers (especially income and expenditure) are positive figures. A few numbers are negative, but this will be clear when inputting the figures either on the workbook or the online form."]
[null,"Enter all figures in the online form in thousands, except for line 999 for pupil numbers and line 3900 and 3950 around % for pay awards."]
[null,"As with the online form, enter all monetary balances in round £000s, not pounds and pence. For example, for £10,471.23 enter 10, but for £10,891.25 enter 11. Enter a six-figure amount like £453,678 as 454."]
[null,"Updates to the BFR 2025 form"]
[null,"We have made some changes to the BFR 2025 form, including:\n• improved helptexts throughout the form to help trusts better understand what information is required\n"]
[null,"\n• updated the reserve balance details section for trusts whose revenue reserves are more than 20% of their total revenue income to better understand trusts’ plans for them. You can find more information in section 5.8 Academy trust reserves in the BFR guidance"]
[null,"• increased the input values limit for lines 310 and 3100 to enable large MATs with high staff costs to enter large values "]
[null,"• updated the 2024 to 2025 Chart of accounts (CoA) to include account codes for revenue information and communication technology (ICT) spend categories. Further guidance is available in Academies chart of accounts and automating the account return"]
[null,"The summary declaration page shows you a summary of the revenue, capital and reserve totals from your return, these will be presented in the rounded thousands as well as in pounds. This is to make sure any roundings in your return are accurate. "]
[null,"Once all validations are cleared in the workbook, completing the online form shouldn't result in any more validations being triggered. Note that you can copy and paste comments entered in the workbook into the online form. "]
[null,"Queries"]
[null,"If you have a query about completing your BFR return please contact the DfE using the Customer Help Portal."]
[]
{"$rows_left_out":248}
{"sheet":"Organisation user","index":1,"n_rows":128,"n_cols":24,"rows_kept":128,"cut":false,"hidden":false,"merged":[[2,2,2,10],[2,12,2,17],[4,12,4,17],[6,12,6,17],[8,12,8,17],[24,2,24,10],[25,2,25,10],[25,12,25,17],[26,2,26,10],[26,12,26,17],[27,2,27,10],[27,12,27,17],[14,12,14,17],[19,4,19,10],[19,12,19,17],[20,4,20,10],[20,12,20,17],[31,2,31,10],[31,12,31,17],[32,2,32,10],[32,12,32,17],[33,2,33,10],[33,12,33,17],[28,2,28,10],[28,12,28,17],[29,2,29,10],[29,12,29,17],[30,2,30,10],[30,12,30,17],[37,2,37,10],[37,12,37,17],[38,2,38,10],[38,12,38,17],[39,2,39,10],[39,12,39,17],[34,2,34,10],[34,12,34,17],[35,2,35,10],[35,12,35,17],[36,2,36,10],[36,12,36,17],[43,2,43,10],[43,12,43,17],[44,2,44,10],[44,12,44,17],[45,2,45,10],[45,12,45,17],[40,2,40,10],[40,12,40,17],[41,2,41,10],[41,12,41,17],[42,2,42,10],[42,12,42,17],[49,2,49,10],[49,12,49,17],[50,2,50,10],[50,12,50,17],[51,2,51,10],[51,12,51,17],[46,2,46,10],[46,12,46,17],[47,2,47,10],[47,12,47,17],[48,2,48,10],[48,12,48,17],[55,2,55,10],[55,12,55,17],[56,2,56,10],[56,12,56,17],[57,2,57,10],[57,12,57,17],[52,2,52,10],[52,12,52,17],[53,2,53,10],[53,12,53,17],[54,2,54,10],[54,12,54,17],[61,2,61,10],[61,12,61,17],[62,2,62,10],[62,12,62,17],[63,2,63,10],[63,12,63,17],[58,2,58,10],[58,12,58,17],[59,2,59,10],[59,12,59,17],[60,2,60,10],[60,12,60,17],[67,2,67,10],[67,12,67,17],[68,2,68,10],[68,12,68,17],[69,2,69,10],[69,12,69,17],[64,2,64,10],[64,12,64,17],[65,2,65,10],[65,12,65,17],[66,2,66,10],[66,12,66,17],[73,2,73,10],[73,12,73,17],[74,2,74,10],[74,12,74,17],[75,2,75,10],[75,12,75,17],[70,2,70,10],[70,12,70,17],[71,2,71,10],[71,12,71,17],[72,2,72,10],[72,12,72,17],[79,2,79,10],[79,12,79,17],[80,2,80,10],[80,12,80,17],[81,2,81,10],[81,12,81,17],[76,2,76,10],[76,12,76,17],[77,2,77,10],[77,12,77,17],[78,2,78,10],[78,12,78,17],[85,2,85,10],[85,12,85,17],[86,2,86,10],[86,12,86,17],[87,2,87,10],[87,12,87,17],[82,2,82,10],[82,12,82,17],[83,2,83,10],[83,12,83,17],[84,2,84,10],[84,12,84,17],[91,2,91,10],[91,12,91,17],[92,2,92,10],[92,12,92,17],[93,2,93,10],[93,12,93,17],[88,2,88,10],[88,12,88,17],[89,2,89,10],[89,12,89,17],[90,2,90,10],[90,12,90,17],[97,2,97,10],[97,12,97,17],[98,2,98,10],[98,12,98,17],[99,2,99,10],[99,12,99,17],[94,2,94,10],[94,12,94,17],[95,2,95,10],[95,12,95,17],[96,2,96,10],[96,12,96,17],[103,2,103,10],[103,12,103,17],[104,2,104,10],[104,12,104,17],[105,2,105,10],[105,12,105,17],[100,2,100,10],[100,12,100,17],[101,2,101,10],[101,12,101,17],[102,2,102,10],[102,12,102,17],[109,2,109,10],[109,12,109,17],[110,2,110,10],[110,12,110,17],[111,2,111,10],[111,12,111,17],[106,2,106,10],[106,12,106,17],[107,2,107,10],[107,12,107,17],[108,2,108,10],[108,12,108,17],[116,2,116,10],[116,12,116,17],[117,2,117,10],[117,12,117,17],[112,2,112,10],[112,12,112,17],[113,2,113,10],[113,12,113,17],[114,2,114,10],[114,12,114,17],[127,2,127,10],[127,12,127,17],[12,12,12,17],[16,12,16,17],[124,2,124,10],[124,12,124,17],[125,2,125,10],[125,12,125,17],[126,2,126,10],[126,12,126,17],[121,2,121,10],[121,12,121,17],[122,2,122,10],[122,12,122,17],[123,2,123,10],[123,12,123,17],[118,2,118,10],[118,12,118,17],[119,2,119,10],[119,12,119,17],[120,2,120,10],[120,12,120,17],[115,2,115,10],[115,12,115,17]]}
[null,"Budget Forecast Return 2025"]
[null,null,null,null,null,null,null,null,null,null,null,null,null,null,null,null,null,null,"Initial validation","Outstanding validation"]
[null,"Trust name:",null,null,null,null,null,null,null,null,null,null,{"$f":"IF(S3=1,V3,\"\")","v":"Please enter the name of your trust."},null,null,null,null,null,{"$f":"IF(C3=\"\",1,0)","v":1},{"$f":"S3","v":1},null,"Please enter the name of your trust."]
[]
[null,"Trust type ",null,null,null,null,null,null,null,null,null,null,{"$f":"IF(S5=1,V5,\"\")","v":"Please state whether your trust is a MAT or a SAT."},null,null,null,null,null,{"$f":"IF(C5=\"\",1,0)","v":1},{"$f":"S5","v":1},null,"Please state whether your trust is a MAT or a SAT."]
[]
[null,"Trust UPIN",null,null,null,null,null,null,null,null,null,null,{"$f":"IF(S7=1,V7,\"\")","v":"Please enter your trust UPIN."},null,null,null,null,null,{"$f":"IF(C7=\"\",1,0)","v":1},{"$f":"S7","v":1},null,"Please enter your trust UPIN."]
[]
[null,"Company House Number ",null,null,null,null,null,null,null,null,null,null,{"$f":"IF(S9=1,V9,\"\")","v":"Please enter your trust companies house number, this cell allows a leading zero."},null,null,null,null,null,{"$f":"IF(C9=\"\",1,0)","v":1},{"$f":"S9","v":1},null,"Please enter your trust companies house number, this cell allows a leading zero."]
[]
[null,"What are the contact details for this trust as we may need to contact you?"]
[]
[null,"Full name",null,null,null,null,null,null,null,null,null,null,{"$f":"IF(S13=1,V13,\"\")","v":"Please enter your full name."},null,null,null,null,null,{"$f":"IF(C13=\"\",1,0)","v":1},{"$f":"S13","v":1},null,"Please enter your full name."]
[]
[null,"UK telephone number",null,null,null,null,null,null,null,null,null,null,{"$f":"IF(S15=1,V15,\"\")","v":"Please enter a full UK telephone number."},null,null,null,null,null,{"$f":"IF(C15=\"\",1,0)","v":1},{"$f":"S15","v":1},null,"Please enter a full UK telephone number."]
[]
[null,"Email Address",null,null,null,null,null,null,null,null,null,null,{"$f":"IF(S17=1,V17,\"\")","v":"Please enter your email address."},null,null,null,null,null,{"$f":"IF(C17=\"\",1,0)","v":1},{"$f":"S17","v":1},null,"Please enter your email address."]
[]
[]
[null,"No of academies in trust",null,null,null,null,null,null,null,null,null,null,{"$f":"IF(C20-C21=0,\"\",IF(E20=\"\",\"Explain the different number of academies. Include new openers; transfers; mergers; closures or demergers. Are you including the financials of any academies that you expect to join your trust within the period of this return and/or before the next BFR.\",\"\"))","v":""},null,null,null,null,null,"MAT","Yes",null,{"$f":"IF(C20-C21=0,0,IF(E20=\"\",1,0))","v":0}]
{"$rows_left_out":109}
{"sheet":"BFR 2025","index":2,"n_rows":394,"n_cols":37,"rows_kept":394,"cut":false,"hidden":false,"merged":[[9,0,9,2],[8,0,8,2],[10,0,10,2],[1,0,1,11],[7,0,7,2],[3,0,3,2],[4,0,5,2],[393,9,394,9],[393,1,394,1],[393,2,394,2],[393,7,394,7],[393,8,394,8],[393,6,394,6],[393,3,394,3],[393,4,394,4],[155,1,156,4],[187,6,187,8],[202,6,202,8],[124,14,124,16],[227,6,227,8],[227,14,227,16],[153,14,153,16],[202,14,202,16],[26,6,26,8],[187,10,187,12],[227,10,227,12],[153,10,153,12],[61,6,61,8],[96,6,96,8],[124,6,124,8],[153,6,153,8],[61,10,61,12],[202,10,202,12],[14,10,14,16],[15,10,15,16],[16,10,16,16],[17,10,17,16],[26,10,26,12],[26,14,26,16],[61,14,61,16],[96,10,96,12],[96,14,96,16],[124,10,124,12],[187,14,187,16]]}
["Budget Forecast Return",null,null,null,null,null,null,null,null,null,null,null,null,null,null,null,null,null,null,null,null,null,null,null,null,null,"hidden from here"]
["This workbook is to be used to help prepare for the online form. It should be completed on an accruals and prepayments basis at whole trust level.\nEnter all figures in the online form in round thousands, except for line 999 pupil numbers. Lines 3900 and 3950 around pay award % increase should be entered as a percentage % up to a maximum of 3 decimal places. QU379 if triggered is a % input to the nearest whole number."]
[]
["Protected sheets"]
["The worksheets are protected with the password 'BFR'. You can remove the protection to inspect how the workbook is structured. If you remove the password protection, there's a risk that formulas and validations could be accidentally overwritten. For that reason it's safer to do this on a separate, saved version."]
[]
[]
["Queries"]
[]
["If you have a query about completing your BFR return please contact the DfE using the Customer Help Portal."]
[]
[]
[]
["Finance Questions",null,null,null,null,null,null,null,null,null,null,null,null,null,null,null,null,null,null,null,null,null,null,"Query No",null,"Query",null,"Test  No","Formula","Text for test","Formula"]
["FQ1","Have you had any provisions during this period, excluding pension liability?","No",null,{"$f":"IF(C15=\"No\",\"\",\"Link to the provisions section\")","v":""}]
["FQ2","Have you had any loans during the period?","No",null,{"$f":"IF(C16=\"No\",\"\",\"Link to the loans section\")","v":""}]
["FQ3","Have you had any investments during the period?","No",null,{"$f":"IF(C17=\"No\",\"\",\"Link to the investments section\")","v":""}]
["FQ4","Have you had any overdrafts during the period?","No",null,{"$f":"IF(C18=\"No\",\"\",\"Link to the overdrafts section\")","v":""}]
[]
[]
{"$rows_left_out":375}
{"sheet":"Revenue Reserves Bal Details","index":3,"n_rows":104,"n_cols":27,"rows_kept":104,"cut":false,"hidden":false,"merged":[[26,2,26,6],[2,0,2,7],[7,0,7,7],[14,1,14,6],[17,0,17,7],[23,1,23,6],[98,2,98,6],[35,1,35,6],[38,2,38,6],[47,1,47,6],[50,2,50,6],[59,1,59,6],[62,2,62,6],[71,1,71,6],[74,2,74,6],[83,1,83,6],[86,2,86,6],[95,1,95,6]]}
["Revenue Reserve balance details",null,null,null,null,null,null,null,null,null,null,null,null,null,null,null,null,null,null,null,null,null,null,null,null,null,"hidden from here"]
[]
["You  will trigger the Reserve balance details page within the online form if your revenue reserves in line 430 - Balance c/f 31 Aug 25 are equal to or greater than 20% of your total revenue income stated in line 298 – Total revenue income for 2024/2025. See the box below to identify if you will trigger the page. If your % is 20 or above, you will need to complete the following section. "]
[]
[null,"Your revenue reserves as a % of your total revenue income are:"]
[null,{"$f":"'BFR 2025'!L110/'BFR 2025'!M58","v":{"$error":"#DIV/0!"}}]
[]
["What is the value of actual reserves your trust is holding for contingency? \nThis may be in line with your reserve policy and the level of reserves identified by trustees as being appropriate to hold. Setting aside some funds for contingency and uncertainty will support in unforeseen circumstances and with any unexpected extra costs. "]
["Enter all financial data using the format £'000. For example, for £100,000 enter £100"]
[]
["£"]
[]
[]
[null,"Provide more details and context to explain your answer"]
[]
[]
[]
["Select the main plans for your remaining reserves balance from the options below.\n\nThis is the difference between your Total reserves from line 430 and the actual reserves held for contingency amount you have told us above. For example if your Total reserves are £100,000.00 and your Actual reserves held for contingency are £20,000.00, then your remaining balance to disclose below would be £80,000.00. We want to know your plans for the £80,000.00. Enter the £80,000.00 using the format £,000 – for example £80,000.00 would be entered as 80.\n\nYou can select more than one option. For example, 80 split across 3 options as 30, 30 and 20.  Details should relate to plans for reserves you currently hold however if you allocate more funds to plans than you currently hold, provide the details of this as narrative."]
[]
[null,"Your revenue reserve amount is:"]
{"$rows_left_out":85}
{"sheet":"Summary declaration","index":4,"n_rows":39,"n_cols":16,"rows_kept":39,"cut":false,"hidden":false,"merged":[[5,1,5,16]]}
["Summary Declaration"]
[]
[null,"To ensure that figures input into the form have been rounded to the nearest £000, please review and confirm that the information in the table below is a true picture of your trust."]
[null,"Tick the box to confirm that the reported as figures are a true reflection of your trusts figures and show the unrounded position (in the orange cells)."]
[null,"If these figures are incorrect, please go to the relevant section to amend data input."]
[null,"As with the online form, enter all monetary balances in round £000s, not pounds and pence. For example, for £10,471.23 enter 10, but for £10,891.25 enter 11. Enter a six-figure amount like £453,678 as 454."]
[]
[null,null,null,null,null,"Actuals","Actuals","TOTAL",null,"Actuals","Forecast","TOTAL",null,"Forecast","Forecast","TOTAL"]
[null,"Section of workbook",null,"line no.",null,"Sep 23 - Mar 24","Apr 24 - Aug 24","2023/24",null,"Sep 24 - Mar 25","Apr 25 - Aug 25","2024/25",null,"Sep 25 - Mar 26","Apr 26 - Aug 26","2025/26"]
[]
[null,"Revenue totals","Net revenue income/(expenditure) for the period",400,"calculated from input as (£000)",{"$f":"'BFR 2025'!G101","v":0},{"$f":"'BFR 2025'!H101","v":0},{"$f":"'BFR 2025'!I101","v":0},null,{"$f":"'BFR 2025'!K101","v":0},{"$f":"'BFR 2025'!L101","v":0},{"$f":"'BFR 2025'!M101","v":0},null,{"$f":"'BFR 2025'!O101","v":0},{"$f":"'BFR 2025'!P101","v":0},{"$f":"'BFR 2025'!Q101","v":0}]
[null,null,null,null,"reported as (£)",{"$f":"F11*1000","v":0},{"$f":"G11*1000","v":0},{"$f":"H11*1000","v":0},null,{"$f":"J11*1000","v":0},{"$f":"K11*1000","v":0},{"$f":"L11*1000","v":0},null,{"$f":"N11*1000","v":0},{"$f":"O11*1000","v":0},{"$f":"P11*1000","v":0}]
[]
[null,"Capital totals","Net capital income/(expenditure) for the period",660,"calculated from input as (£000)",{"$f":"'BFR 2025'!G174","v":0},{"$f":"'BFR 2025'!H174","v":0},{"$f":"'BFR 2025'!I174","v":0},null,{"$f":"'BFR 2025'!K174","v":0},{"$f":"'BFR 2025'!L174","v":0},{"$f":"'BFR 2025'!M174","v":0},null,{"$f":"'BFR 2025'!O174","v":0},{"$f":"'BFR 2025'!P174","v":0},{"$f":"'BFR 2025'!Q174","v":0}]
[null,null,null,null,"reported as (£)",{"$f":"F14*1000","v":0},{"$f":"G14*1000","v":0},{"$f":"H14*1000","v":0},null,{"$f":"J14*1000","v":0},{"$f":"K14*1000","v":0},{"$f":"L14*1000","v":0},null,{"$f":"N14*1000","v":0},{"$f":"O14*1000","v":0},{"$f":"P14*1000","v":0}]
[]
[null,null,null,null,null,"Balance at \n31 Aug 23","Balance at \n31 Mar 24",null,null,"Balance at \n31 Aug 24","Balance at \n31 Mar 25","Balance at \n31 Aug 25",null,"Balance at \n31 Mar 26","Balance at \n31 Aug 26"]
[]
[null,"Reserves total","Total trust reserves",1001,"calculated from input as (£000)",{"$f":"'BFR 2025'!G247","v":0},{"$f":"'BFR 2025'!H247","v":0},null,null,{"$f":"'BFR 2025'!K247","v":0},{"$f":"'BFR 2025'!L247","v":0},{"$f":"'BFR 2025'!M247","v":0},null,{"$f":"'BFR 2025'!O247","v":0},{"$f":"'BFR 2025'!P247","v":0}]
[null,null,null,null,"reported as (£)",{"$f":"F19*1000","v":0},{"$f":"G19*1000","v":0},null,null,{"$f":"J19*1000","v":0},{"$f":"K19*1000","v":0},{"$f":"L19*1000","v":0},null,{"$f":"N19*1000","v":0},{"$f":"O19*1000","v":0}]
{"$rows_left_out":20}
{"sheet":"Preparer declaration ","index":5,"n_rows":43,"n_cols":7,"rows_kept":43,"cut":false,"hidden":false,"merged":[[36,6,36,7],[26,4,26,6],[28,2,31,11],[9,2,9,7],[13,2,13,9],[17,2,17,7],[21,2,24,10],[33,2,33,3]]}
[]
[null,null,"Preparer Declaration"]
[]
[null,null,"Contact details of person completing the form\n"]
[]
[null,null,"Please enter these details so the DFE can contact you if there are any questions."]
[]
[null,null,"Contact name:"]
[]
[]
[]
[null,null,"Contact email address:"]
[]
[]
[]
[null,null,"Contact phone number:"]
[]
[]
[]
[]
{"$rows_left_out":24}
{"sheet":"Approver declaration","index":6,"n_rows":55,"n_cols":21,"rows_kept":55,"cut":false,"hidden":false,"merged":[[8,2,8,7],[12,2,12,9],[16,2,16,7],[32,2,35,10],[36,2,36,10],[22,4,22,9],[26,4,26,11],[44,2,44,11],[40,2,42,10],[48,6,48,7],[40,12,42,16],[37,4,37,6]]}
[]
[null,null,"Academy Trust Declaration (approver)"]
[]
[null,null,"Contact details of person completing the form\n"]
[null,null,"Please enter these details so the DFE can contact you if there are any questions."]
[]
[null,null,"Contact name:"]
[]
[]
[]
[null,null,"Contact email address:"]
[]
[]
[]
[null,null,"Contact phone number:"]
[]
[]
[]
[null,null,"Are you the Accounting Officer?",null,null,null,"No"]
[]
{"$rows_left_out":36}
{"sheet":"Min Max table","index":7,"n_rows":232,"n_cols":4,"rows_kept":232,"cut":false,"hidden":false,"merged":[]}
["Table of min and max values"]
["This table is for info only. The values are used in the 'BFR 2025' tab for the min/max tests."]
[]
["Line no.","Minimum value","Maximum value","Description"]
[101,{"$f":"-100000","v":-100000},{"$f":"100000","v":100000},"Rates reclaim"]
[102,0,{"$f":"800000","v":800000},"General Annual Grant (GAG) (excluding Student Service Grant)"]
[103,0,{"$f":"100000","v":100000},"Student Services Grant (Academy Post 16 Bursary Funding)"]
[105,0,100000,"Start Up Grants"]
[108,0,100000,"Pupil Premium & Service Premium"]
[132,{"$f":"-100000","v":-100000},100000,"Pupil Number Adjustment"]
[135,0,100000,"Other DfE revenue grants"]
[136,0,100000,"Universal Infant Free School Meals"]
[137,0,100000,"Insurance"]
[138,0,{"$f":"300000","v":300000},"Sponsor Capacity Grant"]
[150,{"$f":"-100000","v":-100000},{"$f":"300000","v":300000},"Other DfE family revenue Grants"]
[199,null,null,"Total DfE revenue Income"]
[200,-400000,{"$f":"100000","v":100000},"Local authority revenue income"]
[205,-400000,{"$f":"100000","v":100000},"Other government grants"]
[210,-400000,{"$f":"100000","v":100000},"Income from trading activities"]
[211,-400000,{"$f":"100000","v":100000},"Income from trading activities"]
{"$rows_left_out":213}
{"sheet":"Trust validations table","index":8,"n_rows":145,"n_cols":6,"rows_kept":145,"cut":false,"hidden":false,"merged":[]}
["Validations table"]
["Trust responses to queries",null,"Please complete your answers in this table. You can then review your answers and paste into the online form."]
[]
[]
["No of 3Y forecast validations outstanding",null,{"$f":"COUNTIF('Trust validations table'!F134:F145,\"Response outstanding\")","v":4}]
["No of validations outstanding",null,{"$f":"COUNTIF('Trust validations table'!F15:F133,\"Response outstanding\")","v":9}]
[]
["Query reference",null,"Query","Section query relates to","Trust Response","STATUS"]
[]
[]
["FQ1",{"$f":"RIGHT(A11,2)","v":"Q1"}]
["FQ2","Q2"]
["FQ3","Q3"]
["FQ4","Q4"]
["QU1",1,{"$f":"IF(VLOOKUP($A15,'BFR 2025'!$X$31:$AA$395,3,FALSE)=0,\"\",VLOOKUP($A15,'BFR 2025'!$X$31:$AA$394,3,FALSE))","v":"You have forecast zero for GAG income for next year (102).  Briefly tell us why this value is zero?"},"Revenue Income: Line 102 - General Annual Grant (GAG) (excluding Student Service Grant)",null,{"$f":"IF(C15=\"\",\"OK\",IF(E15=\"\",\"Response Outstanding\",\"Response Provided\"))","v":"Response Outstanding"}]
["QU99",99,{"$f":"IF(VLOOKUP($A16,'BFR 2025'!$X$23:$AA$395,3,FALSE)=0,\"\",VLOOKUP($A16,'BFR 2025'!$X$23:$AA$394,3,FALSE))","v":"Please explain why your GAG per pupil is greater than £30k"},"GAG line 102 divided by pupil numbers line 999",null,"Response Outstanding"]
["QU2",2,{"$f":"IF(VLOOKUP($A17,'BFR 2025'!$X$31:$AA$395,3,FALSE)=0,\"\",VLOOKUP($A17,'BFR 2025'!$X$31:$AA$394,3,FALSE))","v":""},"Revenue Income: Line 132 - Pupil Number Adjustment",null,"OK"]
["QU3",3,{"$f":"IF(VLOOKUP($A18,'BFR 2025'!$X$31:$AA$383,3,FALSE)=0,\"\",VLOOKUP($A18,'BFR 2025'!$X$31:$AA$382,3,FALSE))","v":"Income totals are zero in any year - is this correct?"},"Revenue totals",null,"Response Outstanding"]
["QU4",4,{"$f":"IF(VLOOKUP($A19,'BFR 2025'!$X$31:$AA$383,3,FALSE)=0,\"\",VLOOKUP($A19,'BFR 2025'!$X$31:$AA$382,3,FALSE))","v":"Expenditure totals are zero for any year - is this correct?"},"Revenue totals",null,"Response Outstanding"]
["QU5",5,{"$f":"IF(VLOOKUP($A20,'BFR 2025'!$X$31:$AA$395,3,FALSE)=0,\"\",VLOOKUP($A20,'BFR 2025'!$X$31:$AA$394,3,FALSE))","v":""},"Revenue expenditure: Line 380 - Total revenue expenditure",null,"OK"]
{"$rows_left_out":125}