{"text_format":"1","workbook":"xlsx","n_sheets":3,"sheets":["Instructions","Form","Sheet1"],"not_rendered":{"charts":0,"images":1,"macros":1,"external_links":0,"defined_names":3,"comments":0,"pivot_tables":0},"unopened":[],"bounds":{"document_bytes":16777216,"sheet_cells":100000,"rows_first":2000,"rows_last":500,"rows_between":2000,"halvings":0,"cell_chars":16384,"cell_head_chars":4096},"cells_cut":0,"cells_raw":0,"read":"whole","date_system":"1900"}

{"sheet":"Instructions","index":0,"n_rows":11,"n_cols":1,"rows_kept":11,"cut":false,"hidden":false,"merged":[]}
["Higher technical skills injection fund 2 contract variation form: instructions"]
[]
["Note: This form can only be used to alter the qualifications in one occupational route."]
["You must submit separate forms to request changes to multiple occupational routes."]
[]
["How to complete the form:"]
["1. Use the drop-down menu in the Learning Aim box to select a reference. The corresponding qualification title and standard will be auto-filled."]
["2. Use the text box to explain why you are requesting this variation and how you meet the eligibility criteria."]
["3. Do not modify the sheet, as it contains drop-down menus and formulas."]
["4. Once complete, submit the form as an attachment and email it to:"]
["team.highertechnicaleducation@education.gov.uk"]

{"sheet":"Form","index":1,"n_rows":86,"n_cols":6,"rows_kept":86,"cut":false,"hidden":false,"merged":[]}
[]
[]
[null,null,null,"HTE Skills Injection Fund 2 "]
[null,null,null,"Variation request form"]
[]
[null,"Provider name","Provider contact name","Provider email","Funded occupational route (drop down)","Total predicted learners in route"]
[]
[]
[null,"1) Complete the table with the details of all qualifications within the route you wish to change.\n"]
[null,"2) If you do not have a current Learning Aim reference or qualification title, provide the relevant details in the Other (specify) box."]
[]
[null,"Learning aim reference (drop down)","Qualification title ","Occupational standard","Other (specify)","Predicted learner number"]
[null,null,{"$f":"_xlfn.IFNA(VLOOKUP(B13, Sheet1!A:B, 2, FALSE), \"\")","v":""},{"$f":"_xlfn.IFNA(VLOOKUP(B13, Sheet1!A2:D263, 4, FALSE), \"\")","v":""}]
[null,null,{"$f":"_xlfn.IFNA(VLOOKUP(B14, Sheet1!A:B, 2, FALSE), \"\")","v":""},{"$f":"_xlfn.IFNA(VLOOKUP(B14, Sheet1!A3:D264, 4, FALSE), \"\")","v":""}]
[null,null,{"$f":"_xlfn.IFNA(VLOOKUP(B15, Sheet1!A:B, 2, FALSE), \"\")","v":""},{"$f":"_xlfn.IFNA(VLOOKUP(B15, Sheet1!A4:D265, 4, FALSE), \"\")","v":""}]
[null,null,{"$f":"_xlfn.IFNA(VLOOKUP(B16, Sheet1!A:B, 2, FALSE), \"\")","v":""},{"$f":"_xlfn.IFNA(VLOOKUP(B16, Sheet1!A5:D266, 4, FALSE), \"\")","v":""}]
[null,null,{"$f":"_xlfn.IFNA(VLOOKUP(B17, Sheet1!A:B, 2, FALSE), \"\")","v":""},{"$f":"_xlfn.IFNA(VLOOKUP(B17, Sheet1!A6:D267, 4, FALSE), \"\")","v":""}]
[null,null,{"$f":"_xlfn.IFNA(VLOOKUP(B18, Sheet1!A:B, 2, FALSE), \"\")","v":""},{"$f":"_xlfn.IFNA(VLOOKUP(B18, Sheet1!A7:D268, 4, FALSE), \"\")","v":""}]
[null,null,{"$f":"_xlfn.IFNA(VLOOKUP(B19, Sheet1!A:B, 2, FALSE), \"\")","v":""},{"$f":"_xlfn.IFNA(VLOOKUP(B19, Sheet1!A8:D269, 4, FALSE), \"\")","v":""}]
[null,null,{"$f":"_xlfn.IFNA(VLOOKUP(B20, Sheet1!A:B, 2, FALSE), \"\")","v":""},{"$f":"_xlfn.IFNA(VLOOKUP(B20, Sheet1!A9:D270, 4, FALSE), \"\")","v":""}]
[null,null,{"$f":"_xlfn.IFNA(VLOOKUP(B21, Sheet1!A:B, 2, FALSE), \"\")","v":""},{"$f":"_xlfn.IFNA(VLOOKUP(B21, Sheet1!A10:D271, 4, FALSE), \"\")","v":""}]
[null,null,{"$f":"_xlfn.IFNA(VLOOKUP(B22, Sheet1!A:B, 2, FALSE), \"\")","v":""},{"$f":"_xlfn.IFNA(VLOOKUP(B22, Sheet1!A11:D272, 4, FALSE), \"\")","v":""}]
[null,null,{"$f":"_xlfn.IFNA(VLOOKUP(B23, Sheet1!A:B, 2, FALSE), \"\")","v":""},{"$f":"_xlfn.IFNA(VLOOKUP(B23, Sheet1!A12:D273, 4, FALSE), \"\")","v":""}]
[null,null,{"$f":"_xlfn.IFNA(VLOOKUP(B24, Sheet1!A:B, 2, FALSE), \"\")","v":""},{"$f":"_xlfn.IFNA(VLOOKUP(B24, Sheet1!A13:D274, 4, FALSE), \"\")","v":""}]
[null,null,{"$f":"_xlfn.IFNA(VLOOKUP(B25, Sheet1!A:B, 2, FALSE), \"\")","v":""},{"$f":"_xlfn.IFNA(VLOOKUP(B25, Sheet1!A14:D275, 4, FALSE), \"\")","v":""}]
[null,null,null,null,"TOTAL",{"$f":"SUM(F13:F25)","v":0}]
[null,"3) Provide a clear explanation of how you meet the eligibility criteria for requesting a variation."]
[]
[]
[]
[]
[]
[]
[]
[]
[]
[]
[]
[]
[null,"4) Include the details of the new qualifications, ensuring that the total predicted number of learners within the route remains unchanged."]
[]
[null,"New learning aim reference","New qualification title","Is the new qualification an approved HTQ (Yes/No)?","Occupational standard","Predicted learners"]
[]
[]
[]
[]
[]
[]
[]
[]
[]
[]
[]
[]
[]
[]
[]
[]
[]
[]
[]
[]
[]
[]
[]
[]
[]
[]
[]
[]
[]
[]
[]
[]
[]
[]
[]
[]
[]
[]
[]
[]
[]
[]
[null,null,null,null,"TOTAL",{"$f":"SUM(F43:F84)","v":0}]
[null,null,null,{"$f":"IF(F7<>F85, \"Predicted learner numbers do not match\", \"\")","v":""}]

{"sheet":"Sheet1","index":2,"n_rows":263,"n_cols":4,"rows_kept":263,"cut":false,"hidden":true,"merged":[]}
["Qual ref","Qualification","Route","Aligned occupational standard"]
["HTQDZ0020","FdSc Network Engineering (Systems Administration)","Digital","Network engineer"]
["HTQDZ0001","HND Applied Computing","Digital","Network engineer and"]
["HTQDZ0009","FD Cyber Security","Digital","Cyber security technologist"]
["HTQDZ0006","FD Software Development","Digital","Software developer"]
["HTQDZ0005","Foundation Degree in Computer Science","Digital","Data analyst"]
["HTQDZ0011","NCC Education Level 4 Diploma In Computing","Digital","Software developer"]
["HTQDZ0014","FdSc Business Computing","Digital","Data analyst"]
["HTQDZ0013","FdSc Computing with Networking","Digital","Network engineer"]
["HTQDZ0012","FdSc Software Development","Digital","Software developer"]
["HTQDZ0021","FdSc Cyber Security","Digital","Cyber security technologist"]
["HTQDZ0018","FdSc Networking and Cyber Security","Digital","Cyber security technologist"]
["HTQDZ0017","Certificate of Higher Education (CertHE) Software Development","Digital","Software developer"]
["HTQDZ0022","Pearson BTEC Level 5 Higher National Diploma in Computing for England","Digital","Software tester"]
["HTQDZ0022","Pearson BTEC Level 5 Higher National Diploma in Computing for England","Digital","Cyber security technologist"]
["HTQDZ0022","Pearson BTEC Level 5 Higher National Diploma in Computing for England","Digital","Data analyst"]
["HTQDZ0022","Pearson BTEC Level 5 Higher National Diploma in Computing for England","Digital","Business analyst"]
["HTQDZ0022","Pearson BTEC Level 5 Higher National Diploma in Computing for England","Digital","Network engineer"]
["HTQDZ0022","Pearson BTEC Level 5 Higher National Diploma in Computing for England","Digital","Software developer"]
["HTQDZ0004","Foundation Degree of Science (FdSc) in Computer Science","Digital","Business analyst"]
["HTQDZ0004","Foundation Degree of Science (FdSc) in Computer Science","Digital","Cyber security technologist"]
["HTQDZ0004","Foundation Degree of Science (FdSc) in Computer Science","Digital","Data analyst"]
["HTQDZ0004","Foundation Degree of Science (FdSc) in Computer Science","Digital","Digital accessibility specialist"]
["HTQDZ0004","Foundation Degree of Science (FdSc) in Computer Science","Digital","Network engineer"]
["HTQDZ0004","Foundation Degree of Science (FdSc) in Computer Science","Digital","Software developer"]
["HTQDZ0004","Foundation Degree of Science (FdSc) in Computer Science","Digital","Software tester"]
["HTQDZ0008","Diploma of Higher Education in Software and Development","Digital","Software developer"]
["HTQDZ0008","Diploma of Higher Education in Network Engineering","Digital","Network engineer"]
["HTQDZ0019","Foundation Degree: FD Computing and Digital Technologies","Digital","Software developer"]
["HTQDZ0010","FdSc Software Development","Digital","Software developer"]
["HTQDZ0016","FdSc Computer Networks and Cybersecurity","Digital","Network engineer"]
["HTQCZ2001","Pearson BTEC Level 5 Higher National Diploma in Quantity Surveying for England","Construction and the built environment","Construction quantity surveying technician"]
["HTQCZ2002","Pearson BTEC Level 4 Higher National Certificate Quantity Surveying for England","Construction and the built environment","Construction quantity surveying technician"]
["HTQCZ2003","Pearson BTEC Level 5 Higher National Diploma in Modern Methods of Construction for England","Construction and the built environment","Construction design and build technician"]
["HTQCZ2004","Pearson BTEC Level 4 Higher National Certificate in Modern Methods of Construction for England","Construction and the built environment","Construction design and build technician"]
["HTQCZ2005","Pearson BTEC Level 5 Higher National Diploma in Architectural Technology for England","Construction and the built environment","Construction design and build technician"]
["HTQCZ2006","Pearson BTEC Level 4 Higher National Certificate in Architectural Technology for England","Construction and the built environment","Construction design and build technician"]
["HTQCZ2007","Pearson BTEC Level 5 Higher National Diploma in Construction Management for England","Construction and the built environment","Construction site supervisor"]
["HTQCZ2008","Pearson BTEC Level 4 Higher National Certificate in Construction Management for England","Construction and the built environment","Construction site supervisor"]
["HTQCZ2010","FdSc Sustainable Construction and the Built Environment","Construction and the built environment","Construction design and build technician"]
["HTQCZ2011","HNC Construction and Digital Innovation","Construction and the built environment","Construction quantity surveying technician"]
["HTQCZ2012","NOCN Level 4 Construction Site Supervisor Diploma","Construction and the built environment","Construction site supervisor"]
["HTQCZ2013","CertHE Technical Practice in Site Supervision","Construction and the built environment","Construction site supervisor"]
["HTQCZ2014","CertHE Technical Practice in Construction Quantity Surveying","Construction and the built environment","Construction quantity surveying technician"]
["HTQCZ2016","Construction Design and Build Technician (Foundation Degree)","Construction and the built environment","Construction design and build technician"]
["HTQCZ2017","FdSc Civil Engineering and Construction Management","Construction and the built environment","Construction design and build technician"]
["HTQCZ2018","Construction Site Supervisor (Foundation Degree)","Construction and the built environment","Construction site supervisor"]
["HTQCZ2019","Construction Quantity Surveying Technician (Built Environment Technician)  Foundation Degree","Construction and the built environment","Construction quantity surveying technician"]
["HTQCZ2020","FdSc Construction Management","Construction and the built environment","Construction design and build technician"]
["HTQDZ2025","NCFE Level 4 Diploma: Cyber Security Engineer ","Digital","Cyber security technologist - cyber security engineer"]
["HTQDZ2026","NCFE Level 4 Diploma: Data Analyst ","Digital","Data analyst"]
["HTQDZ2027","Certificate of Higher Education Data Analyst","Digital","Data analyst"]
["HTQDZ2028","Diploma of Higher Education (DipHE) Cyber Security Technologist","Digital","Cyber security technologist - cyber security engineer"]
["HTQDZ2029","Diploma of Higher Education (DipHE) Software Developer","Digital","Software developer"]
["HTQDZ2031","Certificate of Higher Education Software Development","Digital","Software developer"]
["HTQDZ2032","Digital Modular Programme for Data Analysts","Digital","Data analyst"]
["HTQDZ2033","Certificate of Higher Education in Data Science","Digital","Data analyst"]
["HTQDZ2034","Pearson BTEC Level 5 Higher National Diploma in Digital Technologies for England","Digital","Cyber Security Engineer, Cyber Risk Analyst, Cyber Defend & Respond"]
["HTQDZ2034","Pearson BTEC Level 5 Higher National Diploma in Digital Technologies for England","Digital","Network Engineer"]
["HTQDZ2034","Pearson BTEC Level 5 Higher National Diploma in Digital Technologies for England","Digital","Software Developer, Software Tester "]
["HTQDZ2034","Pearson BTEC Level 5 Higher National Diploma in Digital Technologies for England","Digital","Data Analyst"]
["HTQDZ2034","Pearson BTEC Level 5 Higher National Diploma in Digital Technologies for England","Digital","Digital Community Manager"]
["HTQDZ2034","Pearson BTEC Level 5 Higher National Diploma in Digital Technologies for England","Digital","Business Analyst"]
["HTQDZ2034","Pearson BTEC Level 5 Higher National Diploma in Digital Technologies for England","Digital","Software Developer, Software Tester "]
["HTQDZ2035","Foundation Degree Software Engineering","Digital","Software developer  "]
["HTQDZ2036","Level 4 Diploma in Digital Community Management","Digital","Digital accessibility specialist "]
["HTQDZ2037","Certificate of Higher Education: Cyber Security Engineer","Digital","Cyber security technologist "]
["HTQDZ2038","Digital Modular Programme in Software Development","Digital","Software developer "]
["HTQDZ2039","Certification of Higher Education Business Analyst","Digital","Business analyst "]
["HTQDZ2040","FdSc Computing ","Digital","Software developer  "]
["HTQDZ2041","Certificate of Higher Education Cyber Security","Digital","Cyber security technologist  "]
["HTQDZ2044","Foundation Degree Cyber Security","Digital","Cyber security technologist  "]
["HTQHS2002","FdSc Physical Education and Sports Coaching","Health and Science","Sports coach"]
["HTQHS2003","FdSc Healthcare Practice","Health and Science","Assistant practitioner (health) "]
["HTQHS2004","CertHE Sports Coaching (Level 4)","Health and Science","Sports coach - community coach"]
["HTQHS2005 ","FdSc Nursing Associate (Level 5)","Health and Science","Nursing associate (NMC 2018) "]
["HTQHS2006","FD in Nursing Associate Practise (Level 5)","Health and Science","Nursing associate (NMC 2018) "]
["HTQHS2007","FdSc Strength Conditioning and Sports Coaching (Level 5)","Health and Science","Sports coach - high performance coach "]
["HTQHS2008","BTEC Higher National Certificate in Community Coaching for England (Level 4)","Health and Science","Sports coach - community coach "]
["HTQHS2009","FdSc Health Care Practice (Level 5)","Health and Science","Nursing associate (NMC 2018)"]
["HTQHS2010","HND in Healthcare Professions' Support for England (Level 5)","Health and Science","Assistant practitioner (health)"]
["HTQHS2011","FdSc Nursing Associate (Level 5)","Health and Science","Nursing associate (NMC 2018) "]
["HTQHS2012","FdSc Assistant Practitioner Health and Social Care","Health and Science","Assistant practitioner (health) "]
["HTQHS2013","FdSc Assistant Practitioner (Level 5)","Health and Science","Assistant practitioner (health)"]
["HTQHS2014","DipHE Assistant Practitioner (Level 5)","Health and Science","Assistant practitioner (health)"]
["HTQHS2015","FdSc Coaching and Fitness (Level 5)","Health and Science","Sports coach - high performance coach"]
["HTQHS2016","FdSc Assistant Practitioner (Level 5)","Health and Science","Assistant practitioner (health) "]
["HTQHS2018","CertHE Sports Coach – Community and Sport (Level 4)","Health and Science","Sports coach - community coach"]
["HTQHS2019","FD in Health Play Specialism (Level 5)","Health and Science","Health play specialist "]
["HTQHS2020","FD Assistant Practitioner (Healthcare) (Level 5)","Health and Science","Assistant practitioner (health) "]
["HTQHS2021","CertHE Sports Coaching (Level 4)","Health and Science","Sports coach - community coach "]
["HTQHS2022","CertHE Mammographer Associate (Level 4)","Health and Science","Mammography associate "]
["HTQHS2023","FdSc Nursing Associate (Level 5)","Health and Science","Nursing associate (NMC 2018) "]
["HTQHS2025","FdSc Basketball/Golf/ Cricket / Football / Rugby Coaching and Performance (Level 5)","Health and Science","Sports Coach - high performance coach"]
["HTQHS2026","FD in Physical Education and Sports Coaching (Level 5)","Health and Science","Sports coach - school coach "]
["HTQHS2027","FdSc Hearing Aid Audiology (Level 5)","Health and Science","Hearing aid dispenser "]
["HTQHS2029","FdSc Nursing Associate (Level 5)","Health and Science","Nursing associate (NMC 2018) "]
["HTQHS2030","CertHE Healthcare Science Associate","Health and Science","Healthcare science associate "]
["HTQHS2031","FdSc Assistant Practitioner in Healthcare (Level 5)","Health and Science","Assistant practitioner (health) "]
["HTQHS2032","FdSc Assistant Practitioner (Health and Social Care)","Health and Science","Assistant practitioner (health)"]
["HTQHS2033","FdSc Assistant Practitioner (Mental Health)","Health and Science","Assistant practitioner (health) "]
["HTQHS2034","FdA Mental Health and Wellbeing (Level 5)","Health and Science","Assistant practitioner (health)"]
["HTQHS2035","FdA Health and Social Care (Level 5)","Health and Science","Assistant practitioner (health) "]
["HTQBA3001","CMI Level 5 Diploma in Coaching for Professionals","Business and administration","Coaching professional"]
["HTQBA3002","Pearson BTEC Level 5 Higher National Diploma in Leadership and Management for England","Business and administration","Operations or departmental manager"]
["HTQBA3003","CMI Level 5 Diploma in Operational Management","Business and administration","Operations or departmental manager"]
["HTQBA3004","Foundation Degree in Business","Business and administration","Operations or departmental manager"]
["HTQBA3005","Foundation degree in Business, Enterprise & Management","Business and administration","Operations or departmental manager"]
["HTQBA3006","HE Diploma Operations Management","Business and administration","Operations or departmental manager"]
["HTQBA3007","FDA Business and Management","Business and administration","Operations or departmental manager"]
["HTQBA3008","FdA Business Management","Business and administration","Operations or departmental manager"]
["HTQBA3010","Foundation Degree (Arts) Business and Management Practice","Business and administration","Operations or departmental manager"]
["HTQCZ3021","CertHE Technical Practice in Architectural Technology and Design Management","Construction and the built environment","Construction design and build technician"]
["HTQCZ3022","HNC Construction Quantity Surveying","Construction and the built environment","Construction quantity surveying technician"]
["HTQCZ3023","HNC Construction Management Practice","Construction and the built environment","Construction site supervisor"]
["HTQDZ3045","HNC Data Analyst","Digital","Data analyst"]
["HTQDZ3046","HNC Network Engineer","Digital","Network engineer"]
["HTQDZ3047","HNC Cyber Security Technologist – Cyber Security Engineer","Digital","Cyber security technologist"]
["HTQDZ3048","Pearson BTEC Level 5 Higher National Diploma in Computer Systems Engineering for England","Digital","Network engineer"]
["HTQDZ3049","Pearson BTEC Level 4 Higher National Certificate in Computer Systems Engineering for England","Digital","Network engineer"]
{"$rows_left_out":143}