{"text_format":"1","workbook":"xlsx","n_sheets":7,"sheets":["Cover Sheet","Instructions","LA Table","High Needs Places Table","Early Years Proforma","Admin-Lists","Admin-MissingRowCheck"],"not_rendered":{"charts":0,"images":0,"macros":1,"external_links":3,"defined_names":116,"comments":1,"pivot_tables":0},"unopened":[],"bounds":{"document_bytes":16777216,"sheet_cells":100000,"rows_first":2000,"rows_last":500,"rows_between":2000,"halvings":0,"cell_chars":16384,"cell_head_chars":4096},"cells_cut":0,"cells_raw":0,"read":"whole","date_system":"1900"}

{"sheet":"Cover Sheet","index":0,"n_rows":24,"n_cols":5,"rows_kept":24,"cut":false,"hidden":false,"merged":[]}
[]
[]
[]
[]
[null,null,null,"Section 251 Budget 2025-26"]
[null,null,null,"XML Generator"]
[null,null,null,"Version 1.0"]
[]
[]
[]
{"$rows_left_out":15}
{"sheet":"Instructions","index":1,"n_rows":36,"n_cols":2,"rows_kept":36,"cut":false,"hidden":false,"merged":[]}
[]
[null,"Completing the return"]
[]
[null,"Before you complete the return you are advised to read the guidance at https://www.gov.uk/government/publications/section-251-2025-to-2026"]
[]
[null,"LA Table"]
[]
[null,"This table is for local authorities to provide an overall picture of the funding being allocated direct to schools, the amount being spent on education centrally and the amount being spent on children’s and young people’s services."]
[]
[null,"Values should be entered in all red cells. If the value entered does not match the data validation restrictions for the cell, an error message will be displayed. You will still be able to submit your return, but you will be prompted to enter an explanation within COLLECT."]
{"$rows_left_out":27}
{"sheet":"LA Table","index":2,"n_rows":188,"n_cols":26,"rows_kept":188,"cut":false,"hidden":false,"merged":[[2,16,2,24],[73,4,73,5],[187,4,187,12],[0,4,1,12]]}
[null,"S251 Budget 2025-26",null,null,"PLEASE ENABLE MACROS BEFORE ENTERING DATA",null,null,null,null,null,null,null,null,null,null,null,"Count of headings:",{"$f":"COUNTIF(O:O,\"Error Cell Reference and Description\")","v":1}]
[null,"LA Table:  Local Authority Information",null,null,null,null,null,null,null,null,null,null,null,null,null,null,"Count of cells with errors:",{"$f":"COUNTIF(O:O,\"<>\")-R1-COUNTIF(LAErrorCell,\"<>\")","v":0}]
[null,null,null,null,null,null,null,null,null,null,null,null,null,null,null,null,"Rule Application (offset by 12 columns to data)"]
[null,null,"Description",null,"Early Years","Primary","Secondary","SEN/Special schools","AP/PRUs","\nPost school (e.g. Sixth Form & FE Colleges)\n\n","Gross","Income","Net",null,"Error Cell Reference and Description",null,"Early Years","Primary","Secondary","SEN/    Special schools","AP/    PRUs","Post school (e.g. Sixth Form & FE Colleges)\n","Gross","Income","Net","Notes"]
[null,null,null,null,{"$f":"IF(COUNTA(E9:L186)<456,\"PLEASE ENTER VALUES IN ALL CELLS\",\"\")","v":"PLEASE ENTER VALUES IN ALL CELLS"},null,null,null,null,null,null,null,null,null,null,null,"E","F","G","H","I","J","K","L","M"]
[null,null,null,null,null,null,null,null,null,null,null,null,"LA Table Errors:"]
[null,1,"SCHOOLS BUDGET"]
[]
[null,"1.0.1","Individual Schools Budget (before academy recoupment), including sixth form grant for maintained schools, but excluding high needs place funding",null,null,null,null,null,null,null,{"$f":"SUM(E9,F9,G9)","v":0},null,{"$f":"K9-L9","v":0},null,null,null,"1.1,1.3,1.7","1.1,1.3,1.7","1.1,1.3,1.7",1.6,1.6,1.6,1001,1.6," "]
[null,"1.0.2","High needs place funding within Individual Schools Budget (before academy recoupment), excluding funding for 16-19 academies and free schools and FE colleges and independent learning providers",null,null,null,null,null,null,null,{"$f":"SUM(E10,F10,G10,H10,I10)","v":0},null,{"$f":"K10-L10","v":0},null,null,null,"1.1,1.3,1.7","1.1,1.3,1.7","1.1,1.3,1.7","1.1,1.3,1.7","1.1,1.3,1.7",1.6,"1001, 1022",1.6," "]
{"$rows_left_out":179}
{"sheet":"High Needs Places Table","index":3,"n_rows":209,"n_cols":40,"rows_kept":209,"cut":false,"hidden":false,"merged":[[5,19,6,19],[5,13,5,14],[5,17,6,17],[5,33,5,34],[5,37,6,37],[5,22,6,24],[5,25,6,25],[5,26,6,26],[5,27,5,28],[5,30,5,31],[0,5,0,13],[5,2,6,4],[5,5,6,5],[5,6,6,6],[5,7,5,8],[5,10,5,11],[3,5,3,16]]}
[null,"S251 Budget 2025-26",null,null,null,"PLEASE ENABLE MACROS BEFORE ENTERING DATA"]
[null,"Nursery, Pre-16 and Post-16 high needs places in maintained schools. Full-year data should be entered for schools becoming academies on or after 1 April 2025."]
[]
[null,null,null,null,"Schools Table Notes:",null,null,null,null,null,null,null,null,null,null,null,null,"HNP Table Errors:",null,null,null,null,"Count of headings:",{"$f":"COUNTIF(T:T,\"Error Cell Reference and Description\")","v":1}]
[null,null,null,null,null,null,null,null,null,null,null,null,null,null,null,null,null,null,null,null,null,null,"Count of cells with errors:",{"$f":"COUNTIF(T:T,\"<>\")-X4","v":0}]
[null,null,"Special Schools / Pupil Referral Units / Hospital Schools / Special units and resourced provision in mainstream schools",null,null,"Is School/Unit Opening/Closing In-Year?","Date Opening / Closing","Special Educational Needs (SEN) Places",null,"SEN place funding","Alternative provision (AP) places",null,"AP place funding","Hospital education places  ",null,"Hospital education place funding","Total place funding","Comments",null,"Error Cell Reference and Description",null,"Last Row with data entered:","Special Schools / Pupil Referral Units / Hospital Schools / Special units and resourced provision in mainstream schools",null,null,"Is School/Unit Opening/Closing In-Year?","Date Opening / Closing","Special Educational Needs (SEN) Places",null,"SEN place funding","Alternative provision (AP) places",null,"AP place funding","Hospital education places  ",null,"Hospital education place funding","Total Place funding         net ","Comments"]
[null,null,null,null,null,null,null,"April 2025 to August 2025    ","September 2025 to March 2026","April 2025 to March 2026","April 2025 to August 2025","September 2025 to March 2026","April 2025 to March 2026","April 2025 to August 2025","September 2025 to March 2026","April 2025 to March 2026","April 2025 to March 2026",null,null,null,null,{"$f":"IF(MAX(IF(V9:V1002=1, ROW(V9:V1002)-ROW(INDEX(V9:V1002,1,1))+1))+6>6,MAX(IF(V9:V1002=1, ROW(V9:V1002)-ROW(INDEX(V9:V1002,1,1))+1))+8,0)","v":0},null,null,null,null,null,"April 2022 to August 2022       ","September 2022 to March 2023","April 2022 to March 2023","April 2022 to August 2022","September 2022 to March 2023","April 2022 to March 2023","April 2022 to August 2022","September 2022 to March 2023","April 2022 to March 2023","April 2022 to March 2023"]
[null,"School number - for authorities own use","School Name","DfE Number","School Type","O or C","yyyy-mm-dd",null,null,"£",null,null,"£",null,null,"£","£",null,null,null,null,"Count if values are present","School Name","DfE Number","School Type","O or C",null,null,null,"£",null,null,"£",null,null,"£","£",null,"Error1002\nCalc","Error1003\nCalc"]
[null,null,null,null,null,null,null,null,null,null,null,null,null,null,null,null,{"$f":"SUM(J9,M9,P9)","v":0},null,null,null,null,{"$f":"IF(COUNTIF(B9:R9,\"<>\")-1>0,1,0)","v":0},"2.12, 2.5","2.11, 2.5, 1.2,1.7, 2.12","1025, 2.12, 2.5","2.9.1, 2.12, 2.5","2.9.1,2.10.1, 2.12, 2.5","1002, 1012, 1.3,1.7, 2.12, 2.5","1002, 1012, 1.3,1.7, 2.12, 2.5","1003, 1024, 1034, 1035,1.7, 2.12, 2.5","1002, 1012, 1.3,1.7, 2.12, 2.5","1002, 1012, 1.3,1.7, 2.12, 2.5","1004, 1036,1.7, 2.12, 2.5","1002, 1012, 1.3,1.7, 2.12, 2.5","1002, 1012, 1.3,1.7, 2.12, 2.5","1005, 1012, 1013, 1037,1.7, 2.12, 2.5","1011, 1022,1.7, 2.12, 2.5",null,{"$f":"SUM(H9:I9,K9:L9,N9:O9)","v":0},{"$f":"ROUND(H9*5/12+I9*7/12*10000,2)","v":0}]
[null,null,null,null,null,null,null,null,null,null,null,null,null,null,null,null,{"$f":"SUM(J10,M10,P10)","v":0},null,null,null,null,{"$f":"IF(COUNTIF(B10:R10,\"<>\")-1>0,1,0)","v":0},"2.12, 2.5","2.11, 2.5, 1.2,1.7, 2.12","1025, 2.12, 2.5","2.9.1, 2.12, 2.5","2.9.1,2.10.1, 2.12, 2.5","1002, 1012, 1.3,1.7, 2.12, 2.5","1002, 1012, 1.3,1.7, 2.12, 2.5","1003, 1024, 1034, 1035,1.7, 2.12, 2.5","1002, 1012, 1.3,1.7, 2.12, 2.5","1002, 1012, 1.3,1.7, 2.12, 2.5","1004, 1036,1.7, 2.12, 2.5","1002, 1012, 1.3,1.7, 2.12, 2.5","1002, 1012, 1.3,1.7, 2.12, 2.5","1005, 1012, 1013, 1037,1.7, 2.12, 2.5","1011, 1022,1.7, 2.12, 2.5",null,{"$f":"SUM(H10:I10,K10:L10,N10:O10)","v":0},{"$f":"ROUND(H10*5/12+I10*7/12*10000,2)","v":0}]
{"$rows_left_out":200}
{"sheet":"Early Years Proforma","index":4,"n_rows":131,"n_cols":41,"rows_kept":131,"cut":false,"hidden":false,"merged":[[112,25,112,35],[81,4,81,14],[81,25,81,35],[105,25,105,35],[106,4,106,14],[106,25,106,35],[108,4,108,14],[108,25,108,35],[109,4,109,14],[109,25,109,35],[111,4,111,14],[111,25,111,35],[87,25,87,35],[89,4,89,14],[89,25,89,35],[90,4,90,14],[90,25,90,35],[102,4,102,14],[102,25,102,35],[103,4,103,14],[103,25,103,35],[93,3,93,14],[93,15,93,17],[94,25,94,35],[66,20,67,20],[67,12,67,14],[126,25,126,35],[74,15,74,17],[77,15,77,18],[117,15,117,17],[118,15,118,17],[116,25,116,35],[123,25,123,35],[124,15,124,17],[125,15,125,17],[117,25,117,35],[118,25,118,35],[119,25,119,35],[124,25,124,35],[125,25,125,35],[80,4,80,14],[80,25,80,35],[83,4,83,14],[95,25,95,35],[96,4,96,14],[96,25,96,35],[97,4,97,14],[97,25,97,35],[100,1,100,2],[100,3,100,14],[100,15,100,17],[93,1,93,2],[95,4,95,14],[105,4,105,14],[112,4,112,14],[130,4,130,18],[116,15,116,17],[122,3,122,14],[122,15,122,17],[115,1,115,2],[122,1,122,2],[115,3,115,14],[115,15,115,17],[119,15,119,17],[123,15,123,17],[126,15,126,17],[94,4,94,14],[8,14,8,17],[77,20,78,20],[28,9,28,11],[28,20,29,20],[14,20,15,20],[10,20,11,20],[28,15,28,18],[29,12,29,14],[10,15,10,18],[22,15,22,17],[32,9,32,14],[32,15,32,18],[32,20,33,20],[33,12,33,14],[40,15,40,17],[42,15,42,18],[42,20,43,20],[42,4,43,14],[44,3,44,14],[47,9,47,11],[47,15,47,18],[47,20,48,20],[48,12,48,14],[47,3,48,3],[14,15,14,18],[24,12,24,14],[15,12,15,14],[14,8,15,8],[77,1,78,2],[77,3,78,14],[28,1,29,2],[28,3,29,3],[28,4,29,4],[28,5,28,7],[28,8,29,8],[32,1,33,2],[32,3,33,3],[32,4,33,4],[32,5,32,7],[32,8,33,8],[34,1,34,3],[14,1,15,2],[14,3,15,3],[14,4,15,4],[44,1,44,2],[42,1,43,2],[42,3,43,3],[47,1,48,2],[24,1,24,2],[16,1,16,3],[0,36,0,39],[0,22,1,23],[0,24,1,24],[0,25,1,25],[0,26,0,28],[0,29,1,29],[0,30,0,32],[10,5,10,7],[10,4,11,4],[10,8,11,8],[0,33,0,35],[0,4,1,13],[10,1,11,2],[10,3,11,3],[10,9,10,11],[10,12,10,14],[12,1,12,2],[7,14,7,17],[6,14,6,17],[5,14,5,17],[14,5,14,7],[14,9,14,14],[25,1,25,2],[30,1,30,2],[49,1,49,2],[64,1,64,2],[47,4,48,4],[47,5,47,7],[47,8,48,8],[51,9,51,14],[51,15,51,18],[62,1,63,2],[62,3,63,3],[62,4,63,4],[62,5,62,7],[62,8,63,8],[62,9,62,11],[62,15,62,18],[63,12,63,14],[83,25,83,35],[84,4,84,14],[84,25,84,35],[86,4,86,14],[86,25,86,35],[87,4,87,14],[51,20,52,20],[52,12,52,14],[53,1,53,3],[51,1,52,2],[51,3,52,3],[51,4,52,4],[51,5,51,7],[51,8,52,8],[59,15,59,17],[68,1,68,3],[62,20,63,20],[66,1,67,2],[66,3,67,3],[66,4,67,4],[66,5,66,7],[66,8,67,8],[66,9,66,14],[66,15,66,18]]}
[null,"S251 Budget 2025-26",null,null,"PLEASE ENABLE MACROS BEFORE ENTERING DATA",null,null,null,null,null,null,null,null,null,null,null,null,null,null,null,null,null,"EYSFF (3 & 4 year olds): \nBase rate",null,"Row No.","Description","Unit Value (£)",null,null,"Unit\nApplied","Number of Units (Universal 15 hours)",null,null,"Number of Units (Additional 15 hours)",null,null,"Anticipated Budget (£)"]
[null,"Early Years Proforma Table",null,null,null,null,null,null,null,null,null,null,null,null,null,null,null,null,null,null,null,null,null,null,null,null,"PVI","Nursery School","Primary Nursery Class",null,"PVI","Nursery School","Primary Nursery Class","PVI","Nursery School","Primary Nursery Class","PVI","Nursery School","Primary Nursery Class","TOTAL","Is Data Present on Row?"]
[null,null,null,null,null,null,null,null,null,null,null,null,null,null,null,null,null,null,"EYP Errors:",null,null,null,null,null,"Count of headings:",{"$f":"COUNTIF(U:U,\"Error Cell Reference and Description\")","v":17}]
[null,null,null,null,null,null,null,null,null,null,null,null,null,null,null,null,null,null,null,null,null,null,null,null,"Count of cells with errors:",{"$f":"COUNTIF(U:U,\"<>\")-Z3","v":0}]
[null,null,null,null,null,null,null,null,null,null,null,null,null,null,null,null,null,null,null,null,"Error Cell Reference and Description"]
[null,null,null,null,null,null,null,null,null,null,null,null,null,null,"Pass-through rate for 3 & 4 Year Olds:     ",null,null,null,{"$f":"IF(AND(LANumber<>\"\",LANumber<> 201,LANumber<> 420,SUM(Total1a)<>0),(SUM(Total1, Total2, Total3, Total11a, Total12a)-VLOOKUP(LANumber,'Admin-Lists'!A:F,4,FALSE))/SUM(Total1a)/VLOOKUP(LANumber,'Admin-Lists'!A:F,3,FALSE),\"\")","v":""},null,null,null,null,null,null,null,null,null,null,null,null,null,null,null,null,null,null,null,null,1023]
[null,null,null,null,null,null,null,null,null,null,null,null,null,null,"Pass-through rate for 2 Year Olds - Families receiving additional support:     ",null,null,null,{"$f":"IF(AND(LANumber<>\"\",LANumber<> 201,LANumber<> 420,SUM(Total4a)<>0),(SUM(Total4, Total5, Total11b, Total12b))/SUM(Total4a)/VLOOKUP(LANumber,'Admin-Lists'!A:F,5,FALSE),\"\")","v":""},null,null,null,null,null,null,null,null,null,null,null,null,null,null,null,null,null,null,null,null,1023]
[null,null,null,null,null,null,null,null,null,null,null,null,null,null,"Pass-through rate for 2 Year Olds - Working Parents:     ",null,null,null,{"$f":"IF(AND(LANumber<>\"\",LANumber<> 201,LANumber<> 420,SUM(Total7a)<>0),(SUM(Total7, Total8, Total11c, Total12c))/SUM(Total7a)/VLOOKUP(LANumber,'Admin-Lists'!A:F,5,FALSE),\"\")","v":""},null,null,null,null,null,null,null,null,null,null,null,null,null,null,null,null,null,null,null,null,1023]
[null,null,null,null,null,null,null,null,null,null,null,null,null,null,"Pass-through rate for 9 Month to 2 Year Olds - Working Parents:     ",null,null,null,{"$f":"IF(AND(LANumber<>\"\",LANumber<> 201,LANumber<> 420,SUM(Total9a)<>0),(SUM(Total9, Total10, Total11d, Total12d))/SUM(Total9a)/VLOOKUP(LANumber,'Admin-Lists'!A:F,6,FALSE),\"\")","v":""},null,null,null,null,null,null,null,null,null,null,null,null,null,null,null,null,null,null,null,null,1023]
[]
{"$rows_left_out":122}
{"sheet":"Admin-Lists","index":5,"n_rows":1621,"n_cols":20,"rows_kept":1621,"cut":false,"hidden":true,"merged":[[0,18,0,19],[0,11,0,16]]}
["Local Authority List",null,"EYNFF_Hourly_Rate","MNS_Supp_Funding","Hourly rate for 2 year old entitlement Dec 2023 (£)","Hourly rate for under 2s entitlement Dec 2023 (£)",null,"School States",null,"SchoolTypes",null,"School List for Pre-population",null,null,null,null,null,null,"Section Names For EY Dropdowns"]
[201,"Common Council of The City Of London",0,0,0,"",null,"Open",null,"Mainstream",null,"LA Number","School Name","DFE Number","School Type\n","O/C","O/C Date",null,"Section Name","Abbreviation"]
[202,"Camden London Borough Council",9.23,231301,12.23,16.829999999999998,null,"Closed",null,"Hospital",null,202,"Thomas Coram Centre",1048,"Mainstream","Open",null,null,"1 - 3 and 4 Year Olds: Base Rate","EY1"]
[203,"Royal Borough of Greenwich",7.87,1216580,11.68,16.04,null,null,null,"Pupil Referral Unit",null,202,"Heath School",1100,"Pupil Referral Unit","Open",null,null,"2a - 3 and 4 Year Olds - Supplements: deprivation","EY2a"]
[204,"Hackney London Borough Council",7.99,687700,11.51,15.79,null,null,null,"Special",null,202,"Camden Primary Pupil Referral Unit",1101,"Pupil Referral Unit","Open",null,null,"2b - 3 and 4 Year Olds - Supplements: quality","EY2b"]
[205,"Hammersmith and Fulham London Borough Council",8.8699999999999992,1102551,11.98,16.579999999999998,null,null,null,null,null,202,"Netley Primary School & Centre for Autism",2436,"Mainstream","Open",null,null,"2c - 3 and 4 Year Olds - Supplements: flexibility","EY2c"]
[206,"Islington London Borough Council",8.6,520029,11.85,16.37,null,null,null,null,null,202,"Primrose Hill School",2475,"Mainstream","Open",null,null,"2d - 3 and 4 Year Olds - Supplements: rurality/sparsity","EY2d"]
[207,"Royal Borough of Kensington And Chelsea",8.7200000000000006,831420,11.88,16.29,null,null,null,"RED = OLD DATA",null,202,"Torriano Primary School",2603,"Mainstream","Open",null,null,"2e - 3 and 4 Year Olds - Supplements: EAL","EY2e"]
[208,"Lambeth London Borough Council",8.07,817061,11.61,15.95,null,null,null,null,null,202,"Kentish Town Church of England Primary School",3370,"Mainstream","Open",null,null,"3 - 3 and 4 Year Olds - Maintained nursery school (MNS) lump sums","EY3"]
[209,"Lewisham London Borough Council",7.52,543359,11.04,15.06,null,null,null,null,null,202,"Haverstock School",4104,"Mainstream","Open",null,null,"4 - 2 Year Olds - Families receiving additional support: Base Rate","EY4"]
{"$rows_left_out":1612}
{"sheet":"Admin-MissingRowCheck","index":6,"n_rows":128,"n_cols":14,"rows_kept":128,"cut":false,"hidden":true,"merged":[]}
["LA Table - Error 1033 information for error message",null,null,"Missing rows",null,null,null,"EY table - Error 1043",null,null,"Missing rows",null,"1011 Error","1010 Value"]
["Required Row Numbers","Are they present? If not output the number in column C to add to end of 1033 error message","Check for isna",{"$f":"_xlfn.CONCAT(C3:C148)","v":""},null,null,null,"Required Rows","Are they present? If not output the number in column C to add to end of 1043 error message","Check for isna",{"$f":"_xlfn.CONCAT(J3:J149)","v":""},null,{"$f":"IF(ISERR(ABS('LA Table'!M72 - 'LA Table'!K87)), \"\", IF(ABS('LA Table'!M72 - 'LA Table'!K87) > 10000, \"Y\", \"\"))","v":""},{"$f":"IF(ISERR(ABS('LA Table'!M72-'LA Table'!K87)),\"\",ABS('LA Table'!M72-'LA Table'!K87))","v":0}]
[1,{"$f":"VLOOKUP(A3,LARowCount,1,FALSE)","v":1},{"$f":"IF(ISNA(B3),\", \"&A3,\"\")","v":""},null,null,null,null,"EY1",{"$f":"VLOOKUP(H3,'Early Years Proforma'!A:A,1,FALSE)","v":"EY1"},{"$f":"IF(ISNA(I3),\", \"&MID(H3,3,10),\"\")","v":""}]
[2,{"$f":"VLOOKUP(A4,LARowCount,1,FALSE)","v":2},{"$f":"IF(ISNA(B4),\", \"&A4,\"\")","v":""},null,null,null,null,"EY2a",{"$f":"VLOOKUP(H4,'Early Years Proforma'!A:A,1,FALSE)","v":"EY2a"},{"$f":"IF(ISNA(I4),\", \"&MID(H4,3,10),\"\")","v":""}]
[3,3,"",null,null,null,null,"EY2b",{"$f":"VLOOKUP(H5,'Early Years Proforma'!A:A,1,FALSE)","v":"EY2b"},""]
[6,6,"",null,null,null,null,"EY2c",{"$f":"VLOOKUP(H6,'Early Years Proforma'!A:A,1,FALSE)","v":"EY2c"},""]
[7,7,"",null,null,null,null,"EY2d",{"$f":"VLOOKUP(H7,'Early Years Proforma'!A:A,1,FALSE)","v":"EY2d"},""]
[8,8,"",null,null,null,null,"EY2e",{"$f":"VLOOKUP(H8,'Early Years Proforma'!A:A,1,FALSE)","v":"EY2e"},""]
["1.0.1","1.0.1","",null,null,null,null,"EY3",{"$f":"VLOOKUP(H9,'Early Years Proforma'!A:A,1,FALSE)","v":"EY3"},""]
["1.0.2","1.0.2","",null,null,null,null,"EY4",{"$f":"VLOOKUP(H10,'Early Years Proforma'!A:A,1,FALSE)","v":"EY4"},""]
{"$rows_left_out":118}