{"text_format":"1","workbook":"xlsx","n_sheets":4,"sheets":["Guidance","allocation_businesscase","Summary","Providers"],"not_rendered":{"charts":0,"images":1,"macros":1,"external_links":0,"defined_names":11,"comments":2,"pivot_tables":0},"unopened":[],"bounds":{"document_bytes":16777216,"sheet_cells":100000,"rows_first":2000,"rows_last":500,"rows_between":2000,"halvings":0,"cell_chars":16384,"cell_head_chars":4096},"cells_cut":0,"cells_raw":0,"read":"whole","date_system":"1900"}

{"sheet":"Guidance","index":0,"n_rows":76,"n_cols":3,"rows_kept":76,"cut":false,"hidden":false,"merged":[]}
[]
[]
[]
[]
[null,null,"da"]
[]
[]
[]
[]
[]
[]
[]
[]
[]
[]
[]
[]
[]
[]
[]
[]
[]
[]
[]
[]
[]
[]
[]
[]
[]
[]
[]
[]
[]
[]
[]
[]
[]
[]
[]
[]
[]
[]
[]
[]
[]
[]
[]
[]
[]
[]
[]
[]
[]
[]
[]
[]
[]
[]
[]
[]
[]
[]
[]
[null,"Form details"]
[]
[null,"Field","Description"]
[null,"Completion status","This box stays INCOMPLETE until all the yellow boxes are complete. Once all the required yellow boxes are complete, it will change to COMPLETE."]
[null,"UK Provider Registration Number (UKPRN)","Please enter your UKPRN.  This is an eight digit number.  If you do not know what this is, you can find out by logging into Manage your Education and Skills Funding."]
[null,"Provider name","This box will be completed automatically when you enter your UKPRN."]
[null,"Declaration","Please tick to confirm that you understand and agree to the statements."]
[null,"Request completed by","Please ensure you enter your:\nName\nPosition in organisation\nDate of request"]
[null,"Reason for business case","Please select the reason from the drop down list."]
[null,"Funding stream","Please select the funding stream you wish to raise a business case for (a separate form should be completed for each different funding stream if you wish to raise more than one case)."]
[null,"2023/24 allocation table","Enter the value you have been allocated on your 2023 to 2024 funding year allocation statement, if you haven't received an allocation, enter £0.\n\nEnter the allocation amount you are requesting for the full funding year in the increase requested yellow box.  \n\nPlease note that we use nationally consistent methodologies to calculate allocations so this may not be the value the increase you receive if your business case is accepted and we re-run the calculation.  \n\nIf you do not know what the increase should be then enter £0 in this box.\n\nFor new allocations, this is limited to £25,000."]
[null,"Supporting information text box","Text to support your increase, please limit the amount of words to 250.  We will contact you if we need further information."]

{"sheet":"allocation_businesscase","index":1,"n_rows":55,"n_cols":10,"rows_kept":55,"cut":false,"hidden":false,"merged":[[39,1,39,2],[33,1,33,2],[31,1,31,2],[38,1,38,2],[1,7,1,9],[2,7,3,9],[31,3,31,7],[33,3,33,7],[8,2,8,7],[6,2,6,3],[22,2,22,7],[24,2,24,7],[26,2,26,4],[37,1,37,2],[40,1,40,2],[41,1,41,2],[42,1,42,2],[43,1,43,2],[54,1,72,7]]}
[]
[null,"Post 19 allocation business case",null,null,null,null,null,"Completion status"]
[null,null,null,null,null,null,null,{"$f":"IF(COUNTIFS(J6:J73,\"✔\")=COUNTA(J6:J73),\"Complete\",\"Incomplete\")","v":"Incomplete"},{"$error":"#REF!"},{"$error":"#REF!"}]
[null,null,null,null,null,null,null,{"$error":"#REF!"},{"$error":"#REF!"},{"$error":"#REF!"}]
[null,null,null,null,null,null,null,{"$f":"COUNTA(J6:J73)","v":9}]
[null,"Section 1. Provider details"]
[null,"UKPRN"]
[]
[null,"Provider name",{"$f":"_xlfn.XLOOKUP(C7,Providers!$A$2:$A$1265,Providers!$B$2:$B$1265,\"\",)","v":""},null,null,null,null,null,null,{"$f":"IF(C9=\"\", \"✖\", \"✔\")","v":"✖"}]
[]
[]
[]
[]
[]
[null,"Section 2. Declaration"]
[]
[]
[]
[]
[]
[null,"Please tick the box to confirm the statements above are true.",null,null,null,null,false,null,null,{"$f":"IF(G21=FALSE, \"✖\", \"✔\")","v":"✖"}]
[]
[null,"Name",null,null,null,null,null,null,null,{"$f":"IF(ISBLANK(C23), \"✖\", \"✔\")","v":"✖"}]
[]
[null,"Position",null,null,null,null,null,null,null,{"$f":"IF(ISBLANK(C25), \"✖\", \"✔\")","v":"✖"}]
[]
[null,"Date",null,null,null,null,null,null,null,{"$f":"IF(ISBLANK(C27), \"✖\", \"✔\")","v":"✖"}]
[]
[]
[null,"Section 3. Business case request"]
[]
[null,"Reason for business case",null,null,null,null,null,null,null,{"$f":"IF(ISBLANK(D32), \"✖\", \"✔\")","v":"✖"}]
[]
[null,"Funding stream",null,null,null,null,null,null,null,{"$f":"IF(ISBLANK(D34), \"✖\", \"✔\")","v":"✖"}]
[]
[]
[]
[null,null,null,"Allocation line","Current value","Increase requested","Revised allocation requested"]
[null,"2023 to 2024 allocation",null,null,null,null,{"$f":"E39+F39","v":0},null,null,{"$f":"IF(ISBLANK(D39), \"✖\", \"✔\")","v":"✖"}]
[null,"2023 to 2024 allocation",null,null,null,null,{"$f":"E40+F40","v":0}]
[null,"2023 to 2024 allocation",null,null,null,null,0]
[null,"2023 to 2024 allocation",null,null,null,null,0]
[null,"2023 to 2024 allocation",null,null,null,null,0]
[null,"2023 to 2024 allocation",null,null,null,null,0]
[]
[]
[null,"Section 4. Supporting information"]
[]
[null,"Please briefly describe the reason for your request.  For new requests only, please include evidence of:"]
[null,null,"•  Your capability and capacity to deliver the funding requested"]
[null,null,"•  Why you require an allocation this year when you have not used the funding previously"]
[]
[null,"Please limit this to a maximum of 250 words.  We will contact you if we require further information."]
[null,"Word count:",{"$f":"LEN(TRIM(B55))-LEN(SUBSTITUTE(B55,\" \",\"\"))+1","v":1}]
[null,null,null,null,null,null,null,null,null,{"$f":"IF(ISBLANK(B55), \"✖\", \"✔\")","v":"✖"}]

{"sheet":"Summary","index":2,"n_rows":3,"n_cols":33,"rows_kept":3,"cut":false,"hidden":true,"merged":[[0,8,0,31],[0,0,0,1],[0,2,0,5],[0,6,0,7]]}
["Provider Details ",null,"Declaration",null,null,null,"BC Request",null,"2023 to 24 allocation ",null,null,null,null,null,null,null,null,null,null,null,null,null,null,null,null,null,null,null,null,null,null,null,"Section 4 Supporting info "]
["UKPRN","Provider Name ",null,"Name","Position","Date","Reason for business case","Funding stream","allocation line","current value ","increase requested ","Revised allocation requested","allocation line","current value ","increase requested ","Revised allocation requested","allocation line","current value ","increase requested ","Revised allocation requested","allocation line","current value ","increase requested ","Revised allocation requested","allocation line","current value ","increase requested ","Revised allocation requested","allocation line","current value ","increase requested ","Revised allocation requested","Reason for business case"]
[{"$f":"allocation_businesscase!C7","v":0},{"$f":"allocation_businesscase!C9","v":""},{"$f":"allocation_businesscase!G21","v":false},{"$f":"allocation_businesscase!C23","v":0},{"$f":"allocation_businesscase!C25","v":0},{"$f":"allocation_businesscase!C27","v":"00:00:00"},{"$f":"allocation_businesscase!D32","v":0},{"$f":"allocation_businesscase!D34","v":0},{"$f":"allocation_businesscase!$D39","v":0},{"$f":"allocation_businesscase!$E39","v":0},{"$f":"allocation_businesscase!$F39","v":0},{"$f":"allocation_businesscase!$G39","v":0},{"$f":"allocation_businesscase!$D40","v":0},{"$f":"allocation_businesscase!$E40","v":0},{"$f":"allocation_businesscase!$F40","v":0},{"$f":"allocation_businesscase!$G40","v":0},{"$f":"allocation_businesscase!$D41","v":0},{"$f":"allocation_businesscase!$E41","v":0},{"$f":"allocation_businesscase!$F41","v":0},{"$f":"allocation_businesscase!$G41","v":0},{"$f":"allocation_businesscase!$D42","v":0},{"$f":"allocation_businesscase!$E42","v":0},{"$f":"allocation_businesscase!$F42","v":0},{"$f":"allocation_businesscase!$G42","v":0},{"$f":"allocation_businesscase!$D43","v":0},{"$f":"allocation_businesscase!$E43","v":0},{"$f":"allocation_businesscase!$F43","v":0},{"$f":"allocation_businesscase!$G43","v":0},{"$f":"allocation_businesscase!$D44","v":0},{"$f":"allocation_businesscase!$E44","v":0},{"$f":"allocation_businesscase!$F44","v":0},{"$f":"allocation_businesscase!$G44","v":0},{"$f":"allocation_businesscase!B55","v":0}]

{"sheet":"Providers","index":3,"n_rows":1265,"n_cols":14,"rows_kept":1265,"cut":false,"hidden":true,"merged":[]}
["UKPRN","Provider Name",null,null,"Reason for business case",null,"ESFA Funded Adult Education Budget (AEB)","16-18 Traineeships ","19-24 Traineeships","Advanced Learner Loans","Apprenticeships non-levy (procured)","Apprenticeships carry-in (non-procured)",null,"Filtered list for funding stream dropdowns"]
[10000020,"5 E LTD.",null,null,"Data error",null,"Adult Skills ","16-18 Traineeships ","19-24 Traineeships","Facility","16-18 Apprenticeships ","16-18 Apprenticeships ",null,{"$f":"_xlfn._xlws.SORT(_xlfn.UNIQUE(_xlfn.XLOOKUP(allocation_businesscase!D34,TBL_FS_Areas[#Headers],TBL_FS_Areas[],\" \"),,TRUE))","v":" "}]
[10000028,"WOODSPEEN TRAINING LIMITED",null,null,"No allocation calculated due to no delivery",null,"Community Learning ","Bursary","Learner support","Bursary","19+ Apprenticeships ","19+ Apprenticeships "]
[10000055,"ABINGDON AND WITNEY COLLEGE",null,null,null,null,"Funding for innovative permission"]
[10000060,"ACACIA TRAINING AND DEVELOPMENT LTD",null,null,null,null,"Learner support"]
[10000061,"ACACIA TRAINING LIMITED",null,null,null,null,"Level 3 Free Courses for Jobs"]
[10000080,"ACCESS TO MUSIC LIMITED"]
[10000082,"TRN (TRAIN) LTD."]
[10000099,"ACHIEVEMENT TRAINING LIMITED"]
[10000108,"ACORN TRAINING CONSULTANTS LIMITED"]
[10000143,"BARKING & DAGENHAM LONDON BOROUGH COUNCIL"]
[10000146,"BEXLEY LONDON BOROUGH COUNCIL"]
[10000201,"THE LEARNING FOUNDRY LIMITED"]
[10000238,"ALLIANCE LEARNING"]
[10000239,"PRE-SCHOOL LEARNING ALLIANCE"]
[10000267,"AMACSPORTS LIMITED"]
[10000285,"ANDREW COLLINGE TRAINING LIMITED"]
[10000291,"ANGLIA RUSKIN UNIVERSITY HIGHER EDUCATION CORPORATION"]
[10000330,"AQUINAS COLLEGE"]
[10000385,"ARTS UNIVERSITY BOURNEMOUTH, THE"]
[10000415,"ASKHAM BRYAN COLLEGE"]
[10000417,"ASPECT TRAINING LIMITED"]
[10000421,"ASPIRATION TRAINING LIMITED"]
[10000427,"ASSET TRAINING & CONSULTANCY LIMITED"]
[10000446,"KAPLAN FINANCIAL LIMITED"]
[10000452,"AURELIA TRAINING LIMITED"]
[10000470,"AXIA SOLUTIONS LIMITED"]
[10000473,"AYLESBURY COLLEGE"]
[10000486,"B L TRAINING LIMITED"]
[10000488,"B-SKILL LIMITED"]
[10000494,"BABINGTON BUSINESS COLLEGE LIMITED"]
[10000501,"BAE SYSTEMS PLC"]
[10000528,"BARKING AND DAGENHAM COLLEGE"]
[10000533,"BARNET & SOUTHGATE COLLEGE"]
[10000536,"BARNSLEY COLLEGE"]
[10000538,"BARNSLEY METROPOLITAN BOROUGH COUNCIL"]
[10000560,"BASINGSTOKE COLLEGE OF TECHNOLOGY"]
[10000561,"BASINGSTOKE ITEC LIMITED"]
[10000610,"BEDFORD COLLEGE"]
[10000654,"BERKSHIRE COLLEGE OF AGRICULTURE, THE (BCA)"]
[10000670,"BEXHILL COLLEGE"]
[10000673,"LONDON SKILLS FOR GROWTH LIMITED"]
[10000703,"BIRMINGHAM CITY COUNCIL"]
[10000712,"UNIVERSITY COLLEGE BIRMINGHAM"]
[10000715,"BIRMINGHAM ELECTRICAL TRAINING LTD"]
[10000720,"BISHOP AUCKLAND COLLEGE"]
[10000721,"BISHOP BURTON COLLEGE"]
[10000747,"BLACKBURN COLLEGE"]
[10000748,"BLACKBURN WITH DARWEN BOROUGH COUNCIL"]
[10000754,"BLACKPOOL AND THE FYLDE COLLEGE"]
[10000755,"BLACKPOOL BOROUGH COUNCIL"]
[10000794,"BOLTON COLLEGE"]
[10000795,"BOLTON METROPOLITAN BOROUGH COUNCIL"]
[10000812,"BOSTON COLLEGE"]
[10000820,"BOURNEMOUTH AND POOLE COLLEGE, THE"]
[10000834,"BRACKNELL FOREST BOROUGH COUNCIL"]
[10000840,"BRADFORD COLLEGE"]
[10000848,"APPRIS CHARITY LIMITED"]
[10000863,"BRENT LONDON BOROUGH COUNCIL"]
[10000878,"BRIDGWATER AND TAUNTON COLLEGE"]
[10000883,"BRIGHTON & HOVE CITY COUNCIL"]
[10000896,"BRISTOL CITY COUNCIL"]
[10000929,"BRITISH PRINTING INDUSTRIES FEDERATION LTD"]
[10000944,"BROCKENHURST COLLEGE"]
[10000948,"LONDON SOUTH EAST COLLEGES"]
[10000950,"BROOKLANDS COLLEGE"]
[10000952,"THE SMB GROUP"]
[10000975,"BUCKINGHAMSHIRE NEW UNIVERSITY"]
[10000976,"BUCKINGHAMSHIRE COUNCIL"]
[10000994,"MARTINEX LIMITED"]
[10001000,"BURNLEY COLLEGE"]
[10001004,"BURTON AND SOUTH DERBYSHIRE COLLEGE"]
[10001005,"BURY COLLEGE"]
[10001008,"BURY METROPOLITAN BOROUGH COUNCIL"]
[10001013,"THINK EMPLOYMENT LIMITED"]
[10001078,"DIGITAL TELECOMS NETWORK ACADEMY LIMITED"]
[10001093,"CALDERDALE COLLEGE"]
[10001116,"CAMBRIDGE REGIONAL COLLEGE"]
[10001123,"CAMBRIDGESHIRE COUNTY COUNCIL"]
[10001148,"CAPEL MANOR COLLEGE"]
[10001149,"CAPITA PLC"]
[10001156,"ITEC TRAINING SOLUTIONS LTD"]
[10001174,"CT SKILLS LIMITED"]
[10001201,"CARMEL COLLEGE"]
[10001259,"CENTRAL TRAINING ACADEMY LIMITED"]
[10001282,"UNIVERSITY OF NORTHUMBRIA AT NEWCASTLE"]
[10001309,"COVENTRY AND WARWICKSHIRE CHAMBERS OF COMMERCE TRAINING LIMITED"]
[10001310,"CHAMBER TRAINING (HUMBER) LIMITED"]
[10001346,"CHEADLE AND MARPLE SIXTH FORM COLLEGE"]
[10001353,"CHELMSFORD COLLEGE"]
[10001378,"CHESTERFIELD COLLEGE"]
[10001394,"CHILTERN TRAINING LIMITED"]
[10001436,"CITB"]
[10001446,"CIRENCESTER COLLEGE"]
[10001463,"THE CITY LITERARY INSTITUTE"]
[10001464,"WESTMINSTER CITY COUNCIL"]
[10001465,"BATH COLLEGE"]
[10001467,"CITY OF BRISTOL COLLEGE"]
[10001473,"STOKE-ON-TRENT CITY COUNCIL"]
[10001475,"CITY OF SUNDERLAND COLLEGE"]
[10001476,"UNITED COLLEGES GROUP"]
[10001477,"CITY OF YORK COUNCIL"]
[10001478,"CITY, UNIVERSITY OF LONDON"]
[10001503,"THE NORTHERN SCHOOL OF ART"]
[10001515,"C.M.S. VOCATIONAL TRAINING LIMITED"]
[10001535,"COLCHESTER INSTITUTE"]
[10001539,"THE COLLEGE OF ANIMAL WELFARE LIMITED"]
[10001550,"THE COLLEGE OF RICHARD COLLYER IN HORSHAM"]
[10001647,"FUTURES ADVICE, SKILLS AND EMPLOYMENT LIMITED"]
[10001695,"CORNWALL COUNCIL"]
[10001696,"CORNWALL COLLEGE"]
[10001710,"COUNCIL OF THE ISLES OF SCILLY"]
[10001723,"COVENTRY CITY COUNCIL"]
[10001726,"COVENTRY UNIVERSITY"]
[10001736,"CRACKERJACK TRAINING LIMITED"]
[10001743,"CRAVEN COLLEGE"]
[10001777,"ALT VALLEY COMMUNITY TRUST LIMITED"]
[10001778,"CROYDON COLLEGE"]
[10001786,"CSM CONSULTING LIMITED"]
[10001800,"CUMBRIA COUNTY COUNCIL"]
[10001828,"DART LIMITED"]
[10001831,"DAMAR LIMITED"]
[10001848,"DARLINGTON BOROUGH COUNCIL"]
[10001850,"DARLINGTON COLLEGE"]
[10001869,"DAVIDSON TRAINING UK LIMITED"]
[10001883,"DE MONTFORT UNIVERSITY"]
[10001918,"DERBY CITY COUNCIL"]
[10001919,"DCG"]
[10001928,"DERBYSHIRE COUNTY COUNCIL"]
[10001934,"DERWENTSIDE COLLEGE"]
[10001951,"DEVON COUNTY COUNCIL"]
[10001967,"DIDAC LIMITED"]
[10001971,"DIMENSIONS TRAINING SOLUTIONS LIMITED"]
[10002009,"DONCASTER ROTHERHAM AND DISTRICT MOTOR TRADES GROUP TRAINING ASSOCIATION LIMITED"]
[10002054,"DUDLEY METROPOLITAN BOROUGH COUNCIL"]
[10002061,"CENTRAL BEDFORDSHIRE COLLEGE"]
[10002064,"COUNTY DURHAM COUNCIL"]
[10002073,"BIG CREATIVE TRAINING LTD"]
[10002078,"E-TRAINING LIMITED"]
[10002085,"E.QUALITY TRAINING LIMITED"]
[10002094,"EALING, HAMMERSMITH & WEST LONDON COLLEGE"]
[10002098,"EASI HAIRDRESSING ACADEMY LIMITED"]
[10002107,"THE WINDSOR FOREST COLLEGES GROUP"]
[10002111,"EAST DURHAM COLLEGE"]
[10002126,"EAST RIDING COLLEGE"]
[10002130,"EAST SURREY COLLEGE"]
[10002131,"EAST SUSSEX COUNTY COUNCIL"]
[10002140,"EASTERN REGION ROOF TRAINING GROUP LIMITED"]
[10002143,"EASTLEIGH COLLEGE"]
[10002187,"EDUCATION AND TRAINING SKILLS LTD"]
[10002244,"SHEFFIELD CITY COUNCIL"]
[10002327,"ESSEX COUNTY COUNCIL"]
[10002370,"EXETER COLLEGE"]
[10002407,"FAREPORT TRAINING ORGANISATION LIMITED"]
[10002412,"FARNBOROUGH COLLEGE OF TECHNOLOGY"]
[10002424,"FNTC TRAINING AND CONSULTANCY LIMITED"]
[10002457,"FINCHALE TRAINING COLLEGE"]
[10002471,"EAST LINDSEY INFORMATION TECHNOLOGY CENTRE"]
[10002483,"FIRST RUNG LIMITED"]
[10002565,"FRANCESCO GROUP (HOLDINGS) LIMITED"]
[10002570,"FRANKLIN COLLEGE"]
[10002599,"FURNESS COLLEGE"]
[10002618,"G B TRAINING (UK) LTD"]
[10002638,"GATESHEAD COLLEGE"]
[10002639,"GATESHEAD COUNCIL"]
[10002655,"GENII ENGINEERING & TECHNOLOGY TRAINING LIMITED"]
[10002696,"GLOUCESTERSHIRE COLLEGE"]
[10002697,"GLOUCESTERSHIRE COUNTY COUNCIL"]
[10002743,"GRANTHAM COLLEGE"]
[10002767,"GREENBANK PROJECT (THE)"]
[10002834,"HAIR AND BEAUTY INDUSTRY TRAINING LIMITED"]
[10002841,"HADDON TRAINING LIMITED"]
[10002843,"HADLOW COLLEGE"]
[10002850,"HAIR ACADEMY SOUTH WEST LIMITED"]
[10002852,"HALESOWEN COLLEGE"]
[10002859,"HARINGEY LONDON BOROUGH COUNCIL"]
[10002863,"RIVERSIDE COLLEGE"]
[10002868,"HAMMERSMITH AND FULHAM LONDON BOROUGH COUNCIL"]
[10002872,"HAMPSHIRE COUNTY COUNCIL"]
[10002888,"HAPPY COMPUTERS LIMITED"]
[10002899,"HARLOW COLLEGE"]
[10002910,"HARROW LONDON BOROUGH COUNCIL"]
[10002916,"HARTLEPOOL BOROUGH COUNCIL"]
[10002917,"HARTLEPOOL COLLEGE OF FURTHER EDUCATION"]
[10002923,"EAST SUSSEX COLLEGE GROUP"]
[10002976,"HEART OF ENGLAND TRAINING LIMITED"]
[10002979,"HEATHERCROFT TRAINING SERVICES LIMITED"]
[10003010,"COVENTRY COLLEGE"]
[10003011,"THE HENLEY COLLEGE"]
[10003022,"HEREFORD COLLEGE OF ARTS"]
[10003023,"HEREFORDSHIRE, LUDLOW, AND NORTH SHROPSHIRE COLLEGE"]
[10003025,"HEREFORDSHIRE COUNCIL"]
[10003026,"HEREFORDSHIRE AND WORCESTERSHIRE GROUP TRAINING ASSOCIATION LIMITED"]
[10003029,"HEREWARD COLLEGE OF FURTHER EDUCATION"]
[10003035,"HERTFORD REGIONAL COLLEGE"]
[10003039,"HERTFORDSHIRE COUNTY COUNCIL"]
[10003088,"RICHMOND AND HILLCROFT ADULT AND COMMUNITY COLLEGE"]
[10003089,"HILLINGDON LONDON BOROUGH COUNCIL"]
[10003093,"HILLINGDON TRAINING LIMITED"]
[10003094,"HILLS ROAD SIXTH FORM COLLEGE"]
[10003146,"HOPWOOD HALL COLLEGE"]
[10003161,"BABCOCK TRAINING LIMITED"]
[10003162,"HTP APPRENTICESHIP COLLEGE LTD"]
[10003165,"HOUNSLOW LONDON BOROUGH COUNCIL"]
[10003189,"KIRKLEES COLLEGE"]
[10003193,"HUGH BAIRD COLLEGE"]
[10003197,"HULL BUSINESS TRAINING CENTRE LIMITED"]
[10003198,"KINGSTON UPON HULL CITY COUNCIL"]
[10003200,"HULL COLLEGE"]
[10003206,"HUMBERSIDE ENGINEERING TRAINING ASSOCIATION LIMITED"]
[10003207,"HUMBER LEARNING CONSORTIUM"]
[10003231,"EXG LIMITED"]
[10003240,"ICON VOCATIONAL TRAINING LIMITED"]
[10003252,"CILEX LAW SCHOOL LIMITED"]
[10003274,"LEAN EDUCATION AND DEVELOPMENT LIMITED"]
[10003280,"IN-COMM TRAINING AND BUSINESS SERVICES LIMITED"]
[10003289,"INDEPENDENT TRAINING SERVICES LIMITED"]
[10003347,"INTEC BUSINESS COLLEGES LIMITED"]
[10003354,"INTER TRAINING SERVICES LIMITED"]
[10003375,"QA LIMITED"]
[10003380,"INTROTRAIN & FORUM LIMITED"]
[10003382,"INTUITIONS LIMITED"]
[10003385,"IPS INTERNATIONAL LIMITED"]
[10003402,"ENGINEERING TRUST TRAINING LIMITED"]
[10003406,"ISLE OF WIGHT COLLEGE"]
[10003407,"ISLE OF WIGHT COUNCIL"]
[10003425,"ITALIA CONTI ACADEMY OF THEATRE ARTS LIMITED(THE)"]
[10003427,"ITCHEN COLLEGE"]
[10003429,"ITEC LEARNING TECHNOLOGIES LIMITED"]
[10003430,"ITEC NORTH EAST LIMITED"]
[10003440,"J & E TRAINING CONSULTANTS LIMITED"]
[10003456,"JARVIS TRAINING MANAGEMENT LIMITED"]
[10003491,"JOHN LEGGOTT SIXTH FORM COLLEGE"]
[10003511,"JOSEPH CHAMBERLAIN SIXTH FORM COLLEGE"]
[10003526,"JTL"]
[10003529,"JUNIPER TRAINING LIMITED"]
[10003558,"KENDAL COLLEGE"]
[10003570,"KENT COUNTY COUNCIL"]
[10003571,"KEITS TRAINING SERVICES LTD"]
[10003593,"KEY TRAINING LIMITED"]
[10003674,"SOUTH THAMES COLLEGES GROUP"]
[10003676,"KINGSTON MAURWARD COLLEGE"]
[10003709,"KNOWSLEY METROPOLITAN BOROUGH COUNCIL"]
[10003744,"LAGAT LIMITED"]
[10003748,"MARITIME + ENGINEERING COLLEGE NORTH WEST"]
[10003753,"LAKES COLLEGE WEST CUMBRIA"]
[10003755,"SOUTH BANK COLLEGES"]
[10003768,"LANCASTER AND MORECAMBE COLLEGE"]
[10003784,"GENIUS SOLUTIONS LIMITED"]
[10003808,"LEAGUE FOOTBALL EDUCATION"]
[10003841,"V LEARNING NETWORK, TRADING AS STEP INTO LEARNING LTD"]
[10003853,"LEEDS CITY COUNCIL"]
[10003854,"LEEDS ARTS UNIVERSITY"]
[10003855,"LEEDS COLLEGE OF BUILDING"]
[10003861,"LEEDS BECKETT UNIVERSITY"]
[10003866,"LEICESTER CITY COUNCIL"]
[10003867,"LEICESTER COLLEGE"]
[10003872,"LEICESTERSHIRE COUNTY COUNCIL"]
[10003889,"LESLIE FRANCES (HAIR FASHIONS) LIMITED"]
[10003909,"LIFESKILLS SOLUTIONS LIMITED"]
[10003915,"LIFETIME TRAINING GROUP LIMITED"]
[10003919,"THELIGHTBULB LTD"]
[10003928,"LINCOLN COLLEGE"]
[10003932,"LINCOLNSHIRE COUNTY COUNCIL"]
[10003954,"LIVERPOOL CITY COUNCIL"]
[10003955,"THE CITY OF LIVERPOOL COLLEGE"]
[10003957,"LIVERPOOL JOHN MOORES UNIVERSITY"]
[10003959,"LIVERPOOL THEATRE SCHOOL & COLLEGE LIMITED"]
[10003976,"LOCOMOTIVATION LTD."]
[10003981,"LOMAX TRAINING SERVICES LIMITED"]
[10003987,"BROMLEY LONDON BOROUGH COUNCIL"]
[10003988,"CAMDEN LONDON BOROUGH COUNCIL"]
[10003989,"CROYDON LONDON BOROUGH COUNCIL"]
[10003990,"ROYAL BOROUGH OF GREENWICH"]
[10003993,"HAVERING LONDON BOROUGH COUNCIL"]
[10003996,"MERTON BOROUGH COUNCIL"]
[10003997,"NEWHAM LONDON BOROUGH COUNCIL"]
[10004000,"SUTTON LONDON BOROUGH COUNCIL"]
[10004002,"WANDSWORTH LONDON BOROUGH COUNCIL"]
[10004013,"THE LONDON COLLEGE OF BEAUTY THERAPY LIMITED"]
[10004078,"LONDON SOUTH BANK UNIVERSITY"]
[10004112,"LOUGHBOROUGH COLLEGE"]
[10004113,"LOUGHBOROUGH UNIVERSITY"]
[10004116,"EAST COAST COLLEGE"]
[10004124,"LUTON BOROUGH COUNCIL"]
[10004140,"MEAT EAST ANGLIA TRADES (IPSWICH) LIMITED"]
[10004144,"MACCLESFIELD COLLEGE"]
[10004175,"MANCHESTER CITY COUNCIL"]
[10004177,"THE GROWTH COMPANY LIMITED"]
[10004180,"MANCHESTER METROPOLITAN UNIVERSITY"]
[10004181,"MANTRA LEARNING LIMITED"]
[10004204,"THE MARINE SOCIETY AND SEA CADETS"]
[10004257,"MCARTHUR DEAN TRAINING LIMITED"]
[10004285,"MEDWAY COUNCIL"]
[10004303,"MERCIA PARTNERSHIP (UK) LTD"]
[10004340,"MID-KENT COLLEGE"]
[10004343,"MIDDLESBROUGH COUNCIL"]
[10004344,"MIDDLESBROUGH COLLEGE"]
[10004355,"MIDLAND GROUP TRAINING SERVICES LIMITED"]
[10004370,"COOL BLUE COLLEGE LTD"]
[10004375,"MILTON KEYNES COLLEGE"]
[10004376,"MILTON KEYNES COUNCIL"]
[10004406,"MODE TRAINING LTD"]
[10004432,"MORLEY COLLEGE LIMITED"]
[10004440,"M I T SKILLS LIMITED"]
[10004442,"MOULTON COLLEGE"]
[10004478,"MYERSCOUGH COLLEGE"]
[10004484,"N & B TRAINING COMPANY LIMITED"]
[10004486,"NACRO"]
[10004499,"NATIONAL BUSINESS COLLEGE LIMITED"]
[10004552,"NELSON AND COLNE COLLEGE"]
[10004576,"NEW COLLEGE DURHAM"]
[10004577,"NOTTINGHAM COLLEGE"]
[10004579,"NEW COLLEGE SWINDON"]
[10004596,"NEWBURY COLLEGE"]
[10004599,"NCG"]
[10004601,"NEWCASTLE UPON TYNE CITY COUNCIL"]
[10004603,"NEWCASTLE AND STAFFORD COLLEGES GROUP"]
[10004607,"NEWHAM COLLEGE OF FURTHER EDUCATION"]
[10004609,"NEWHAM TRAINING AND EDUCATION CENTRE"]
[10004632,"NHTA LIMITED"]
[10004657,"NORFOLK COUNTY COUNCIL"]
[10004676,"PETROC"]
[10004686,"NORTH EAST SURREY COLLEGE OF TECHNOLOGY (NESCOT)"]
[10004690,"NORTH HERTFORDSHIRE COLLEGE"]
[10004692,"NORTH LANCS. TRAINING GROUP LIMITED(THE)"]
[10004694,"NORTH LINCOLNSHIRE COUNCIL"]
[10004695,"DN COLLEGES GROUP"]
[10004714,"NORTH TYNESIDE METROPOLITAN BOROUGH COUNCIL"]
[10004718,"NORTH WARWICKSHIRE AND SOUTH LEICESTERSHIRE COLLEGE"]
[10004720,"NORTH WEST COMMUNITY SERVICES TRAINING LTD"]
[10004721,"NORTH KENT COLLEGE"]
[10004723,"NORTH WEST TRAINING COUNCIL"]
[10004727,"NORTH YORKSHIRE COUNTY COUNCIL"]
[10004733,"NORTH NORTHAMPTONSHIRE COUNCIL"]
[10004736,"GREATER BRIGHTON METROPOLITAN COLLEGE"]
[10004739,"NORTHERN COLLEGE FOR RESIDENTIAL ADULT EDUCATION LIMITED(THE)"]
[10004748,"NATIONAL HORSERACING COLLEGE LIMITED"]
[10004762,"THE NORTHUMBERLAND COUNCIL"]
[10004772,"CITY COLLEGE NORWICH"]
[10004788,"THE VOLUNTARY AND COMMUNITY SECTOR LEARNING AND SKILLS CONSORTIUM"]
[10004791,"NOTTINGHAM CITY COUNCIL"]
[10004797,"NOTTINGHAM TRENT UNIVERSITY"]
[10004801,"NOTTINGHAMSHIRE COUNTY COUNCIL"]
[10004807,"NOTTINGHAMSHIRE TRAINING NETWORK LIMITED"]
[10004823,"CDB TRAINING LTD"]
[10004835,"OAKLANDS COLLEGE"]
[10004856,"OLDHAM ENGINEERING GROUP TRAINING ASSOCIATION LIMITED (THE)"]
[10004895,"ORACLE TRAINING CONSULTANTS LIMITED"]
[10004927,"ACTIVATE LEARNING"]
[10004930,"OXFORD BROOKES UNIVERSITY"]
[10004977,"PARAGON EDUCATION & SKILLS LIMITED"]
[10005032,"SALFORD CITY COLLEGE"]
[10005064,"PETA LIMITED"]
[10005072,"PETER SYMONDS COLLEGE"]
[10005074,"PETERBOROUGH CITY COUNCIL"]
[10005077,"INSPIRE EDUCATION GROUP"]
[10005089,"PHILIPS HAIR SALONS LIMITED"]
[10005094,"CHALLENGE-TRG SKILLS LIMITED"]
[10005101,"PILOT IMS LIMITED"]
[10005109,"DERBY BUSINESS COLLEGE LIMITED"]
[10005124,"PLUMPTON COLLEGE"]
[10005126,"PLYMOUTH CITY COUNCIL"]
[10005127,"ARTS UNIVERSITY PLYMOUTH"]
[10005128,"CITY COLLEGE PLYMOUTH"]
[10005143,"BOURNEMOUTH CHRISTCHURCH AND POOLE COUNCIL"]
[10005157,"PORTSMOUTH CITY COUNCIL"]
[10005158,"PORTSMOUTH COLLEGE"]
[10005172,"POULTEC TRAINING LIMITED"]
[10005200,"PRESTON COLLEGE"]
[10005204,"PREVISTA LTD"]
[10005222,"PRIORITY MANAGEMENT LIMITED"]
[10005250,"ACHIEVE TRAINING (STAFFORDSHIRE) LIMITED"]
[10005264,"MILLBROOK MANAGEMENT SERVICES LIMITED"]
[10005268,"TRANSWORLD PUBLICATIONS SERVICES LIMITED"]
[10005277,"SKILLS TO GROUP LIMITED"]
[10005319,"QUBE QUALIFICATIONS AND DEVELOPMENT LIMITED"]
[10005325,"QUEEN ELIZABETH SIXTH FORM COLLEGE"]
[10005389,"RAVENSBOURNE UNIVERSITY LONDON"]
[10005398,"READING BOROUGH COUNCIL"]
[10005404,"REASEHEATH COLLEGE"]
[10005412,"REDBRIDGE LONDON BOROUGH COUNCIL"]
[10005413,"REDCAR AND CLEVELAND BOROUGH COUNCIL"]
[10005422,"REED BUSINESS SCHOOL LIMITED"]
[10005426,"HOUSE OF CLIVE (HAIR AND BEAUTY) LIMITED"]
[10005451,"ARDEN UNIVERSITY LIMITED"]
[10005457,"REWARDS TRAINING RECRUITMENT CONSULTANCY LIMITED"]
[10005465,"RICHARD HUISH COLLEGE"]
[10005469,"RICHMOND UPON THAMES COLLEGE"]
[10005488,"RIVERSIDE TRAINING LIMITED"]
[10005509,"ROCHDALE TRAINING ASSOCIATION LIMITED"]
[10005534,"RNN GROUP"]
[10005549,"ROYAL BOROUGH OF KINGSTON UPON THAMES"]
[10005557,"ROYAL MENCAP SOCIETY"]
[10005575,"RUNSHAW COLLEGE"]
[10005583,"RUSKIN COLLEGE"]
[10005586,"RUTLAND COUNTY COUNCIL"]
[10005588,"RWP TRAINING LIMITED"]
[10005599,"S & B AUTOMOTIVE ACADEMY LIMITED"]
[10005642,"KLEEK APPRENTICESHIPS LIMITED"]
{"$rows_left_out":865}