{"text_format":"1","workbook":"xlsx","n_sheets":12,"sheets":["STATISTICAL NEIGHBOURS","3-4 year olds ","2 year olds  (D)","2 year olds (W)","9mth - 2 year","Other EYFF funds","DAF","EYPP","EY Data","Options","Stat Neighbours","Select LAs"],"not_rendered":{"charts":29,"images":0,"macros":1,"external_links":0,"defined_names":53,"comments":0,"pivot_tables":0},"unopened":[],"bounds":{"document_bytes":16777216,"sheet_cells":100000,"rows_first":2000,"rows_last":500,"rows_between":2000,"halvings":0,"cell_chars":16384,"cell_head_chars":4096},"cells_cut":0,"cells_raw":0,"read":"whole","date_system":"1900"}

{"sheet":"STATISTICAL NEIGHBOURS","index":0,"n_rows":27,"n_cols":4,"rows_kept":27,"cut":false,"hidden":false,"merged":[]}
[null,"Early Years Funding Benchmarking Tool: 2024-2025"]
[null,"This worksheet allows you to view data for your own local authority along with your statistical "]
[null,"neighbours, or with your own choice of other local authorities."]
[]
[null,"Choose Local Authorities",null,"Other Local Authorities"]
[]
[null,"1. Please select your local authority"]
[]
[null,"My Local Authority"]
[]
[]
[]
[null,"2. Then either select your statistical neighbours:"]
[]
[]
[]
[]
[null,"Or make your own selection of local authorities \nusing the drop down boxes"]
[]
[null,"3. When you have made your selection, press the \"Create Table\" button to view the benchmarking table"]
[]
[]
[]
[]
[]
[null,"Note: When statistical neighbours are selected, local authorities are shown in order of closeness to your local authority"]
[null,"Cumberland & Westmorland and Furness will not be automatically selected as a statistical neighbour. However, you can manually select them."]

{"sheet":"3-4 year olds ","index":1,"n_rows":34,"n_cols":13,"rows_kept":34,"cut":false,"hidden":true,"merged":[[4,1,4,2],[14,3,14,4],[6,1,6,2],[7,1,7,2],[8,1,8,2],[5,1,5,2],[17,9,17,12],[18,1,18,2],[17,3,17,6],[17,7,18,7],[17,8,18,8]]}
[]
[null,{"$f":"CONCATENATE('Select LAs'!B3,\" - Key Budget Statistics\")","v":"No LA selected - Key Budget Statistics"},null,null,null,null,null,null,null,null,"Financial Year 2024-2025"]
[]
[null,null,null,"PVIs","Nursery Schools","Primary Nursery Places","Centrally Retained"]
[null,{"$f":"'Select LAs'!D3","v":"No LA selected"},null,"All providers","Private, Voluntary, Independent","Nursery schools","Primary nursery places"]
["Total FTE","3-4 year old hourly average funding rate (£/hr)1",null,{"$f":"IFERROR(IF(INDEX('EY Data'!E:E, MATCH('Select LAs'!$A$3,'EY Data'!$B:$B, 0))=\"\",\"-\", INDEX('EY Data'!E:E, MATCH('Select LAs'!$A$3,'EY Data'!$B:$B, 0))), 0)","v":0},{"$f":"IFERROR(IF(INDEX('EY Data'!H:H, MATCH('Select LAs'!$A$3,'EY Data'!$B:$B, 0))=\"\",\"-\", INDEX('EY Data'!H:H, MATCH('Select LAs'!$A$3,'EY Data'!$B:$B, 0))), 0)","v":0},{"$f":"IFERROR(IF(INDEX('EY Data'!G:G, MATCH('Select LAs'!$A$3,'EY Data'!$B:$B, 0))=\"\",\"-\", INDEX('EY Data'!G:G, MATCH('Select LAs'!$A$3,'EY Data'!$B:$B, 0))), 0)","v":0},{"$f":"IFERROR(IF(INDEX('EY Data'!F:F, MATCH('Select LAs'!$A$3,'EY Data'!$B:$B, 0))=\"\",\"-\", INDEX('EY Data'!F:F, MATCH('Select LAs'!$A$3,'EY Data'!$B:$B, 0))), 0)","v":0}]
["Total budget","3-4 year old hourly average base rate for statutory hours (£/hr)",null,{"$f":"IFERROR(IF(INDEX('EY Data'!S:S, MATCH('Select LAs'!$A$3,'EY Data'!$B:$B, 0))=\"\",\"-\", INDEX('EY Data'!S:S, MATCH('Select LAs'!$A$3,'EY Data'!$B:$B, 0))), 0)","v":0},{"$f":"IFERROR(IF(INDEX('EY Data'!V:V, MATCH('Select LAs'!$A$3,'EY Data'!$B:$B, 0))=\"\",\"-\", INDEX('EY Data'!V:V, MATCH('Select LAs'!$A$3,'EY Data'!$B:$B, 0))), 0)","v":0},{"$f":"IFERROR(IF(INDEX('EY Data'!U:U, MATCH('Select LAs'!$A$3,'EY Data'!$B:$B, 0))=\"\",\"-\", INDEX('EY Data'!U:U, MATCH('Select LAs'!$A$3,'EY Data'!$B:$B, 0))), 0)","v":0},{"$f":"IFERROR(IF(INDEX('EY Data'!T:T, MATCH('Select LAs'!$A$3,'EY Data'!$B:$B, 0))=\"\",\"-\", INDEX('EY Data'!T:T, MATCH('Select LAs'!$A$3,'EY Data'!$B:$B, 0))), 0)","v":0}]
["Total Hours"]
[null,"Pass-through rate (%)",null,{"$f":"IF(OR('Select LAs'!$A$3 = \"LA No\", 'Select LAs'!$A$3 = 201, 'Select LAs'!$A$3 = 420), \"-\", INDEX('EY Data'!AH:AH, MATCH('Select LAs'!$A$3,'EY Data'!$B:$B, 0)))","v":"-"}]
[]
[null,{"$f":"CONCATENATE(\"Benchmarking against \",IF(_SN=1,\"Statistical Neighbours\",\"Manual Selection\"))","v":"Benchmarking against Manual Selection"}]
[]
[]
[]
[null,null,"Table ordering"]
[]
[]
[null,null,null,"Average funding rate to providers per hour",null,null,null,"Pass-through rate","Funding paid through supplements","SEN Inclusion Fund (top-up grant element) budget"]
[null,"Local Authority",null,"All providers","Private, Voluntary, Independent","Nursery schools","Primary nursery places",null,null,"All providers","Private, Voluntary, Independent","Nursery schools","Primary nursery places"]
[null,"England",null,{"$f":"ROUND(INDEX('EY Data'!E:E, MATCH($B20,'EY Data'!$C:$C, 0)), 5)","v":5.8298699999999997},{"$f":"ROUND(INDEX('EY Data'!H:H, MATCH($B20,'EY Data'!$C:$C, 0)),5)","v":5.6321399999999997},{"$f":"ROUND(INDEX('EY Data'!G:G, MATCH($B20,'EY Data'!$C:$C, 0)), 5)","v":8.8230599999999999},{"$f":"ROUND(INDEX('EY Data'!F:F, MATCH($B20,'EY Data'!$C:$C, 0)), 5)","v":5.8018700000000001},{"$f":"IF(INDEX('EY Data'!AH:AH, MATCH($B20,'EY Data'!$C:$C, 0))=\"-\", \"-\", ROUND(INDEX('EY Data'!AH:AH, MATCH($B20,'EY Data'!$C:$C, 0)), 3))","v":0.97299999999999998},{"$f":"IF(INDEX('EY Data'!AJ:AJ, MATCH($B20,'EY Data'!$C:$C, 0))=\"-\", \"-\", ROUND(INDEX('EY Data'!AJ:AJ, MATCH($B20,'EY Data'!$C:$C, 0)), 3))","v":4.1000000000000002E-2},{"$f":"ROUND(INDEX('EY Data'!Z:Z, MATCH($B20,'EY Data'!$C:$C, 0)), 0)","v":86778014},{"$f":"ROUND(INDEX('EY Data'!AC:AC, MATCH($B20,'EY Data'!$C:$C, 0)), 0)","v":58642880},{"$f":"ROUND(INDEX('EY Data'!AB:AB, MATCH($B20,'EY Data'!$C:$C, 0)), 0)","v":6987352},{"$f":"ROUND(INDEX('EY Data'!AA:AA, MATCH($B20,'EY Data'!$C:$C, 0)), 0)","v":21147782}]
[null,{"$f":"'Select LAs'!G3","v":"No LA selected"},null,{"$f":"IF('Select LAs'!$H3=0,\"-\",IF(INDEX('EY Data'!E:E, MATCH('Select LAs'!$H3,'EY Data'!$B:$B, 0))=\"\",\"-\", ROUND(INDEX('EY Data'!E:E, MATCH('Select LAs'!$H3,'EY Data'!$B:$B, 0)), 5)))","v":5.9508900000000002},{"$f":"IF('Select LAs'!$H3=0,\"-\",IF(INDEX('EY Data'!H:H, MATCH('Select LAs'!$H3,'EY Data'!$B:$B, 0))=\"\",\"-\", ROUND(INDEX('EY Data'!H:H, MATCH('Select LAs'!$H3,'EY Data'!$B:$B, 0)), 5)))","v":5.9508900000000002},{"$f":"IF('Select LAs'!$H3=0,\"-\",IF(INDEX('EY Data'!G:G, MATCH('Select LAs'!$H3,'EY Data'!$B:$B, 0))=\"\",\"-\", ROUND(INDEX('EY Data'!G:G, MATCH('Select LAs'!$H3,'EY Data'!$B:$B, 0)), 5)))","v":0},{"$f":"IF('Select LAs'!$H3=0,\"-\",IF(INDEX('EY Data'!F:F, MATCH('Select LAs'!$H3,'EY Data'!$B:$B, 0))=\"\",\"-\", ROUND(INDEX('EY Data'!F:F, MATCH('Select LAs'!$H3,'EY Data'!$B:$B, 0)), 5)))","v":0},{"$f":"IF(OR('Select LAs'!$H3=0,'Select LAs'!$H3=201, 'Select LAs'!$H3=420), \"-\",IF(INDEX('EY Data'!AH:AH, MATCH('Select LAs'!$H3,'EY Data'!$B:$B, 0))=\"-\", \"-\", ROUND(INDEX('EY Data'!AH:AH, MATCH('Select LAs'!$H3,'EY Data'!$B:$B, 0)),3)))","v":0.95},{"$f":"IF(OR('Select LAs'!$H3=0,'Select LAs'!$H3=201, 'Select LAs'!$H3=420), \"-\",IF(INDEX('EY Data'!AJ:AJ, MATCH('Select LAs'!$H3,'EY Data'!$B:$B, 0))=\"\", \"-\", ROUND(INDEX('EY Data'!AJ:AJ, MATCH('Select LAs'!$H3,'EY Data'!$B:$B, 0)),3)))","v":6.9000000000000006E-2},{"$f":"IF('Select LAs'!$H3=0,\"-\",IF(INDEX('EY Data'!Z:Z, MATCH('Select LAs'!$H3,'EY Data'!$B:$B, 0))=\"\",\"-\", ROUND(INDEX('EY Data'!Z:Z, MATCH('Select LAs'!$H3,'EY Data'!$B:$B, 0)), 0)))","v":300000},{"$f":"IF('Select LAs'!$H3=0,\"-\",IF(INDEX('EY Data'!AC:AC, MATCH('Select LAs'!$H3,'EY Data'!$B:$B, 0))=\"\",\"-\", ROUND(INDEX('EY Data'!AC:AC, MATCH('Select LAs'!$H3,'EY Data'!$B:$B, 0)), 0)))","v":300000},{"$f":"IF('Select LAs'!$H3=0,\"-\",IF(INDEX('EY Data'!AB:AB, MATCH('Select LAs'!$H3,'EY Data'!$B:$B, 0))=\"\",\"-\", ROUND(INDEX('EY Data'!AB:AB, MATCH('Select LAs'!$H3,'EY Data'!$B:$B, 0)), 0)))","v":0},{"$f":"IF('Select LAs'!$H3=0,\"-\",IF(INDEX('EY Data'!AA:AA, MATCH('Select LAs'!$H3,'EY Data'!$B:$B, 0))=\"\",\"-\", ROUND(INDEX('EY Data'!AA:AA, MATCH('Select LAs'!$H3,'EY Data'!$B:$B, 0)), 0)))","v":0}]
[null,{"$f":"'Select LAs'!G4","v":"No LA selected"},null,{"$f":"IF('Select LAs'!$H4=0,\"-\",IF(INDEX('EY Data'!E:E, MATCH('Select LAs'!$H4,'EY Data'!$B:$B, 0))=\"\",\"-\", ROUND(INDEX('EY Data'!E:E, MATCH('Select LAs'!$H4,'EY Data'!$B:$B, 0)), 5)))","v":7.4563499999999996},{"$f":"IF('Select LAs'!$H4=0,\"-\",IF(INDEX('EY Data'!H:H, MATCH('Select LAs'!$H4,'EY Data'!$B:$B, 0))=\"\",\"-\", ROUND(INDEX('EY Data'!H:H, MATCH('Select LAs'!$H4,'EY Data'!$B:$B, 0)), 5)))","v":7.1614699999999996},{"$f":"IF('Select LAs'!$H4=0,\"-\",IF(INDEX('EY Data'!G:G, MATCH('Select LAs'!$H4,'EY Data'!$B:$B, 0))=\"\",\"-\", ROUND(INDEX('EY Data'!G:G, MATCH('Select LAs'!$H4,'EY Data'!$B:$B, 0)), 5)))","v":9.1830700000000007},{"$f":"IF('Select LAs'!$H4=0,\"-\",IF(INDEX('EY Data'!F:F, MATCH('Select LAs'!$H4,'EY Data'!$B:$B, 0))=\"\",\"-\", ROUND(INDEX('EY Data'!F:F, MATCH('Select LAs'!$H4,'EY Data'!$B:$B, 0)), 5)))","v":7.1477700000000004},{"$f":"IF(OR('Select LAs'!$H4=0,'Select LAs'!$H4=201, 'Select LAs'!$H4=420), \"-\",IF(INDEX('EY Data'!AH:AH, MATCH('Select LAs'!$H4,'EY Data'!$B:$B, 0))=\"-\", \"-\", ROUND(INDEX('EY Data'!AH:AH, MATCH('Select LAs'!$H4,'EY Data'!$B:$B, 0)),3)))","v":0.96899999999999997},{"$f":"IF(OR('Select LAs'!$H4=0,'Select LAs'!$H4=201, 'Select LAs'!$H4=420), \"-\",IF(INDEX('EY Data'!AJ:AJ, MATCH('Select LAs'!$H4,'EY Data'!$B:$B, 0))=\"\", \"-\", ROUND(INDEX('EY Data'!AJ:AJ, MATCH('Select LAs'!$H4,'EY Data'!$B:$B, 0)),3)))","v":5.2999999999999999E-2},{"$f":"IF('Select LAs'!$H4=0,\"-\",IF(INDEX('EY Data'!Z:Z, MATCH('Select LAs'!$H4,'EY Data'!$B:$B, 0))=\"\",\"-\", ROUND(INDEX('EY Data'!Z:Z, MATCH('Select LAs'!$H4,'EY Data'!$B:$B, 0)), 0)))","v":1177665},{"$f":"IF('Select LAs'!$H4=0,\"-\",IF(INDEX('EY Data'!AC:AC, MATCH('Select LAs'!$H4,'EY Data'!$B:$B, 0))=\"\",\"-\", ROUND(INDEX('EY Data'!AC:AC, MATCH('Select LAs'!$H4,'EY Data'!$B:$B, 0)), 0)))","v":294416},{"$f":"IF('Select LAs'!$H4=0,\"-\",IF(INDEX('EY Data'!AB:AB, MATCH('Select LAs'!$H4,'EY Data'!$B:$B, 0))=\"\",\"-\", ROUND(INDEX('EY Data'!AB:AB, MATCH('Select LAs'!$H4,'EY Data'!$B:$B, 0)), 0)))","v":164873},{"$f":"IF('Select LAs'!$H4=0,\"-\",IF(INDEX('EY Data'!AA:AA, MATCH('Select LAs'!$H4,'EY Data'!$B:$B, 0))=\"\",\"-\", ROUND(INDEX('EY Data'!AA:AA, MATCH('Select LAs'!$H4,'EY Data'!$B:$B, 0)), 0)))","v":718376}]
["",{"$f":"'Select LAs'!G5","v":"No LA selected"},null,{"$f":"IF('Select LAs'!$H5=0,\"-\",IF(INDEX('EY Data'!E:E, MATCH('Select LAs'!$H5,'EY Data'!$B:$B, 0))=\"\",\"-\", ROUND(INDEX('EY Data'!E:E, MATCH('Select LAs'!$H5,'EY Data'!$B:$B, 0)), 5)))","v":6.41},{"$f":"IF('Select LAs'!$H5=0,\"-\",IF(INDEX('EY Data'!H:H, MATCH('Select LAs'!$H5,'EY Data'!$B:$B, 0))=\"\",\"-\", ROUND(INDEX('EY Data'!H:H, MATCH('Select LAs'!$H5,'EY Data'!$B:$B, 0)), 5)))","v":6.4166299999999996},{"$f":"IF('Select LAs'!$H5=0,\"-\",IF(INDEX('EY Data'!G:G, MATCH('Select LAs'!$H5,'EY Data'!$B:$B, 0))=\"\",\"-\", ROUND(INDEX('EY Data'!G:G, MATCH('Select LAs'!$H5,'EY Data'!$B:$B, 0)), 5)))","v":0},{"$f":"IF('Select LAs'!$H5=0,\"-\",IF(INDEX('EY Data'!F:F, MATCH('Select LAs'!$H5,'EY Data'!$B:$B, 0))=\"\",\"-\", ROUND(INDEX('EY Data'!F:F, MATCH('Select LAs'!$H5,'EY Data'!$B:$B, 0)), 5)))","v":6.3788999999999998},{"$f":"IF(OR('Select LAs'!$H5=0,'Select LAs'!$H5=201, 'Select LAs'!$H5=420), \"-\",IF(INDEX('EY Data'!AH:AH, MATCH('Select LAs'!$H5,'EY Data'!$B:$B, 0))=\"-\", \"-\", ROUND(INDEX('EY Data'!AH:AH, MATCH('Select LAs'!$H5,'EY Data'!$B:$B, 0)),3)))","v":0.95499999999999996},{"$f":"IF(OR('Select LAs'!$H5=0,'Select LAs'!$H5=201, 'Select LAs'!$H5=420), \"-\",IF(INDEX('EY Data'!AJ:AJ, MATCH('Select LAs'!$H5,'EY Data'!$B:$B, 0))=\"\", \"-\", ROUND(INDEX('EY Data'!AJ:AJ, MATCH('Select LAs'!$H5,'EY Data'!$B:$B, 0)),3)))","v":0.04},{"$f":"IF('Select LAs'!$H5=0,\"-\",IF(INDEX('EY Data'!Z:Z, MATCH('Select LAs'!$H5,'EY Data'!$B:$B, 0))=\"\",\"-\", ROUND(INDEX('EY Data'!Z:Z, MATCH('Select LAs'!$H5,'EY Data'!$B:$B, 0)), 0)))","v":467996},{"$f":"IF('Select LAs'!$H5=0,\"-\",IF(INDEX('EY Data'!AC:AC, MATCH('Select LAs'!$H5,'EY Data'!$B:$B, 0))=\"\",\"-\", ROUND(INDEX('EY Data'!AC:AC, MATCH('Select LAs'!$H5,'EY Data'!$B:$B, 0)), 0)))","v":389465},{"$f":"IF('Select LAs'!$H5=0,\"-\",IF(INDEX('EY Data'!AB:AB, MATCH('Select LAs'!$H5,'EY Data'!$B:$B, 0))=\"\",\"-\", ROUND(INDEX('EY Data'!AB:AB, MATCH('Select LAs'!$H5,'EY Data'!$B:$B, 0)), 0)))","v":0},{"$f":"IF('Select LAs'!$H5=0,\"-\",IF(INDEX('EY Data'!AA:AA, MATCH('Select LAs'!$H5,'EY Data'!$B:$B, 0))=\"\",\"-\", ROUND(INDEX('EY Data'!AA:AA, MATCH('Select LAs'!$H5,'EY Data'!$B:$B, 0)), 0)))","v":78531}]
["",{"$f":"'Select LAs'!G6","v":"No LA selected"},null,{"$f":"IF('Select LAs'!$H6=0,\"-\",IF(INDEX('EY Data'!E:E, MATCH('Select LAs'!$H6,'EY Data'!$B:$B, 0))=\"\",\"-\", ROUND(INDEX('EY Data'!E:E, MATCH('Select LAs'!$H6,'EY Data'!$B:$B, 0)), 5)))","v":5.6614100000000001},{"$f":"IF('Select LAs'!$H6=0,\"-\",IF(INDEX('EY Data'!H:H, MATCH('Select LAs'!$H6,'EY Data'!$B:$B, 0))=\"\",\"-\", ROUND(INDEX('EY Data'!H:H, MATCH('Select LAs'!$H6,'EY Data'!$B:$B, 0)), 5)))","v":5.6035500000000003},{"$f":"IF('Select LAs'!$H6=0,\"-\",IF(INDEX('EY Data'!G:G, MATCH('Select LAs'!$H6,'EY Data'!$B:$B, 0))=\"\",\"-\", ROUND(INDEX('EY Data'!G:G, MATCH('Select LAs'!$H6,'EY Data'!$B:$B, 0)), 5)))","v":10.612719999999999},{"$f":"IF('Select LAs'!$H6=0,\"-\",IF(INDEX('EY Data'!F:F, MATCH('Select LAs'!$H6,'EY Data'!$B:$B, 0))=\"\",\"-\", ROUND(INDEX('EY Data'!F:F, MATCH('Select LAs'!$H6,'EY Data'!$B:$B, 0)), 5)))","v":5.59},{"$f":"IF(OR('Select LAs'!$H6=0,'Select LAs'!$H6=201, 'Select LAs'!$H6=420), \"-\",IF(INDEX('EY Data'!AH:AH, MATCH('Select LAs'!$H6,'EY Data'!$B:$B, 0))=\"-\", \"-\", ROUND(INDEX('EY Data'!AH:AH, MATCH('Select LAs'!$H6,'EY Data'!$B:$B, 0)),3)))","v":0.96699999999999997},{"$f":"IF(OR('Select LAs'!$H6=0,'Select LAs'!$H6=201, 'Select LAs'!$H6=420), \"-\",IF(INDEX('EY Data'!AJ:AJ, MATCH('Select LAs'!$H6,'EY Data'!$B:$B, 0))=\"\", \"-\", ROUND(INDEX('EY Data'!AJ:AJ, MATCH('Select LAs'!$H6,'EY Data'!$B:$B, 0)),3)))","v":6.6000000000000003E-2},{"$f":"IF('Select LAs'!$H6=0,\"-\",IF(INDEX('EY Data'!Z:Z, MATCH('Select LAs'!$H6,'EY Data'!$B:$B, 0))=\"\",\"-\", ROUND(INDEX('EY Data'!Z:Z, MATCH('Select LAs'!$H6,'EY Data'!$B:$B, 0)), 0)))","v":489063},{"$f":"IF('Select LAs'!$H6=0,\"-\",IF(INDEX('EY Data'!AC:AC, MATCH('Select LAs'!$H6,'EY Data'!$B:$B, 0))=\"\",\"-\", ROUND(INDEX('EY Data'!AC:AC, MATCH('Select LAs'!$H6,'EY Data'!$B:$B, 0)), 0)))","v":489063},{"$f":"IF('Select LAs'!$H6=0,\"-\",IF(INDEX('EY Data'!AB:AB, MATCH('Select LAs'!$H6,'EY Data'!$B:$B, 0))=\"\",\"-\", ROUND(INDEX('EY Data'!AB:AB, MATCH('Select LAs'!$H6,'EY Data'!$B:$B, 0)), 0)))","v":0},{"$f":"IF('Select LAs'!$H6=0,\"-\",IF(INDEX('EY Data'!AA:AA, MATCH('Select LAs'!$H6,'EY Data'!$B:$B, 0))=\"\",\"-\", ROUND(INDEX('EY Data'!AA:AA, MATCH('Select LAs'!$H6,'EY Data'!$B:$B, 0)), 0)))","v":0}]
["",{"$f":"'Select LAs'!G7","v":"No LA selected"},null,{"$f":"IF('Select LAs'!$H7=0,\"-\",IF(INDEX('EY Data'!E:E, MATCH('Select LAs'!$H7,'EY Data'!$B:$B, 0))=\"\",\"-\", ROUND(INDEX('EY Data'!E:E, MATCH('Select LAs'!$H7,'EY Data'!$B:$B, 0)), 5)))","v":6.1477500000000003},{"$f":"IF('Select LAs'!$H7=0,\"-\",IF(INDEX('EY Data'!H:H, MATCH('Select LAs'!$H7,'EY Data'!$B:$B, 0))=\"\",\"-\", ROUND(INDEX('EY Data'!H:H, MATCH('Select LAs'!$H7,'EY Data'!$B:$B, 0)), 5)))","v":5.73062},{"$f":"IF('Select LAs'!$H7=0,\"-\",IF(INDEX('EY Data'!G:G, MATCH('Select LAs'!$H7,'EY Data'!$B:$B, 0))=\"\",\"-\", ROUND(INDEX('EY Data'!G:G, MATCH('Select LAs'!$H7,'EY Data'!$B:$B, 0)), 5)))","v":8.5608599999999999},{"$f":"IF('Select LAs'!$H7=0,\"-\",IF(INDEX('EY Data'!F:F, MATCH('Select LAs'!$H7,'EY Data'!$B:$B, 0))=\"\",\"-\", ROUND(INDEX('EY Data'!F:F, MATCH('Select LAs'!$H7,'EY Data'!$B:$B, 0)), 5)))","v":5.8602800000000004},{"$f":"IF(OR('Select LAs'!$H7=0,'Select LAs'!$H7=201, 'Select LAs'!$H7=420), \"-\",IF(INDEX('EY Data'!AH:AH, MATCH('Select LAs'!$H7,'EY Data'!$B:$B, 0))=\"-\", \"-\", ROUND(INDEX('EY Data'!AH:AH, MATCH('Select LAs'!$H7,'EY Data'!$B:$B, 0)),3)))","v":0.98099999999999998},{"$f":"IF(OR('Select LAs'!$H7=0,'Select LAs'!$H7=201, 'Select LAs'!$H7=420), \"-\",IF(INDEX('EY Data'!AJ:AJ, MATCH('Select LAs'!$H7,'EY Data'!$B:$B, 0))=\"\", \"-\", ROUND(INDEX('EY Data'!AJ:AJ, MATCH('Select LAs'!$H7,'EY Data'!$B:$B, 0)),3)))","v":3.2000000000000001E-2},{"$f":"IF('Select LAs'!$H7=0,\"-\",IF(INDEX('EY Data'!Z:Z, MATCH('Select LAs'!$H7,'EY Data'!$B:$B, 0))=\"\",\"-\", ROUND(INDEX('EY Data'!Z:Z, MATCH('Select LAs'!$H7,'EY Data'!$B:$B, 0)), 0)))","v":425000},{"$f":"IF('Select LAs'!$H7=0,\"-\",IF(INDEX('EY Data'!AC:AC, MATCH('Select LAs'!$H7,'EY Data'!$B:$B, 0))=\"\",\"-\", ROUND(INDEX('EY Data'!AC:AC, MATCH('Select LAs'!$H7,'EY Data'!$B:$B, 0)), 0)))","v":295526},{"$f":"IF('Select LAs'!$H7=0,\"-\",IF(INDEX('EY Data'!AB:AB, MATCH('Select LAs'!$H7,'EY Data'!$B:$B, 0))=\"\",\"-\", ROUND(INDEX('EY Data'!AB:AB, MATCH('Select LAs'!$H7,'EY Data'!$B:$B, 0)), 0)))","v":59428},{"$f":"IF('Select LAs'!$H7=0,\"-\",IF(INDEX('EY Data'!AA:AA, MATCH('Select LAs'!$H7,'EY Data'!$B:$B, 0))=\"\",\"-\", ROUND(INDEX('EY Data'!AA:AA, MATCH('Select LAs'!$H7,'EY Data'!$B:$B, 0)), 0)))","v":70046}]
["",{"$f":"'Select LAs'!G8","v":"No LA selected"},null,{"$f":"IF('Select LAs'!$H8=0,\"-\",IF(INDEX('EY Data'!E:E, MATCH('Select LAs'!$H8,'EY Data'!$B:$B, 0))=\"\",\"-\", ROUND(INDEX('EY Data'!E:E, MATCH('Select LAs'!$H8,'EY Data'!$B:$B, 0)), 5)))","v":6.1755599999999999},{"$f":"IF('Select LAs'!$H8=0,\"-\",IF(INDEX('EY Data'!H:H, MATCH('Select LAs'!$H8,'EY Data'!$B:$B, 0))=\"\",\"-\", ROUND(INDEX('EY Data'!H:H, MATCH('Select LAs'!$H8,'EY Data'!$B:$B, 0)), 5)))","v":5.7293000000000003},{"$f":"IF('Select LAs'!$H8=0,\"-\",IF(INDEX('EY Data'!G:G, MATCH('Select LAs'!$H8,'EY Data'!$B:$B, 0))=\"\",\"-\", ROUND(INDEX('EY Data'!G:G, MATCH('Select LAs'!$H8,'EY Data'!$B:$B, 0)), 5)))","v":7.0680800000000001},{"$f":"IF('Select LAs'!$H8=0,\"-\",IF(INDEX('EY Data'!F:F, MATCH('Select LAs'!$H8,'EY Data'!$B:$B, 0))=\"\",\"-\", ROUND(INDEX('EY Data'!F:F, MATCH('Select LAs'!$H8,'EY Data'!$B:$B, 0)), 5)))","v":5.7293000000000003},{"$f":"IF(OR('Select LAs'!$H8=0,'Select LAs'!$H8=201, 'Select LAs'!$H8=420), \"-\",IF(INDEX('EY Data'!AH:AH, MATCH('Select LAs'!$H8,'EY Data'!$B:$B, 0))=\"-\", \"-\", ROUND(INDEX('EY Data'!AH:AH, MATCH('Select LAs'!$H8,'EY Data'!$B:$B, 0)),3)))","v":0.96299999999999997},{"$f":"IF(OR('Select LAs'!$H8=0,'Select LAs'!$H8=201, 'Select LAs'!$H8=420), \"-\",IF(INDEX('EY Data'!AJ:AJ, MATCH('Select LAs'!$H8,'EY Data'!$B:$B, 0))=\"\", \"-\", ROUND(INDEX('EY Data'!AJ:AJ, MATCH('Select LAs'!$H8,'EY Data'!$B:$B, 0)),3)))","v":5.2999999999999999E-2},{"$f":"IF('Select LAs'!$H8=0,\"-\",IF(INDEX('EY Data'!Z:Z, MATCH('Select LAs'!$H8,'EY Data'!$B:$B, 0))=\"\",\"-\", ROUND(INDEX('EY Data'!Z:Z, MATCH('Select LAs'!$H8,'EY Data'!$B:$B, 0)), 0)))","v":789277},{"$f":"IF('Select LAs'!$H8=0,\"-\",IF(INDEX('EY Data'!AC:AC, MATCH('Select LAs'!$H8,'EY Data'!$B:$B, 0))=\"\",\"-\", ROUND(INDEX('EY Data'!AC:AC, MATCH('Select LAs'!$H8,'EY Data'!$B:$B, 0)), 0)))","v":263092},{"$f":"IF('Select LAs'!$H8=0,\"-\",IF(INDEX('EY Data'!AB:AB, MATCH('Select LAs'!$H8,'EY Data'!$B:$B, 0))=\"\",\"-\", ROUND(INDEX('EY Data'!AB:AB, MATCH('Select LAs'!$H8,'EY Data'!$B:$B, 0)), 0)))","v":263092},{"$f":"IF('Select LAs'!$H8=0,\"-\",IF(INDEX('EY Data'!AA:AA, MATCH('Select LAs'!$H8,'EY Data'!$B:$B, 0))=\"\",\"-\", ROUND(INDEX('EY Data'!AA:AA, MATCH('Select LAs'!$H8,'EY Data'!$B:$B, 0)), 0)))","v":263092}]
["",{"$f":"'Select LAs'!G9","v":"No LA selected"},null,{"$f":"IF('Select LAs'!$H9=0,\"-\",IF(INDEX('EY Data'!E:E, MATCH('Select LAs'!$H9,'EY Data'!$B:$B, 0))=\"\",\"-\", ROUND(INDEX('EY Data'!E:E, MATCH('Select LAs'!$H9,'EY Data'!$B:$B, 0)), 5)))","v":6.1715},{"$f":"IF('Select LAs'!$H9=0,\"-\",IF(INDEX('EY Data'!H:H, MATCH('Select LAs'!$H9,'EY Data'!$B:$B, 0))=\"\",\"-\", ROUND(INDEX('EY Data'!H:H, MATCH('Select LAs'!$H9,'EY Data'!$B:$B, 0)), 5)))","v":5.9587700000000003},{"$f":"IF('Select LAs'!$H9=0,\"-\",IF(INDEX('EY Data'!G:G, MATCH('Select LAs'!$H9,'EY Data'!$B:$B, 0))=\"\",\"-\", ROUND(INDEX('EY Data'!G:G, MATCH('Select LAs'!$H9,'EY Data'!$B:$B, 0)), 5)))","v":9.5872700000000002},{"$f":"IF('Select LAs'!$H9=0,\"-\",IF(INDEX('EY Data'!F:F, MATCH('Select LAs'!$H9,'EY Data'!$B:$B, 0))=\"\",\"-\", ROUND(INDEX('EY Data'!F:F, MATCH('Select LAs'!$H9,'EY Data'!$B:$B, 0)), 5)))","v":6.0539500000000004},{"$f":"IF(OR('Select LAs'!$H9=0,'Select LAs'!$H9=201, 'Select LAs'!$H9=420), \"-\",IF(INDEX('EY Data'!AH:AH, MATCH('Select LAs'!$H9,'EY Data'!$B:$B, 0))=\"-\", \"-\", ROUND(INDEX('EY Data'!AH:AH, MATCH('Select LAs'!$H9,'EY Data'!$B:$B, 0)),3)))","v":0.95899999999999996},{"$f":"IF(OR('Select LAs'!$H9=0,'Select LAs'!$H9=201, 'Select LAs'!$H9=420), \"-\",IF(INDEX('EY Data'!AJ:AJ, MATCH('Select LAs'!$H9,'EY Data'!$B:$B, 0))=\"\", \"-\", ROUND(INDEX('EY Data'!AJ:AJ, MATCH('Select LAs'!$H9,'EY Data'!$B:$B, 0)),3)))","v":5.2999999999999999E-2},{"$f":"IF('Select LAs'!$H9=0,\"-\",IF(INDEX('EY Data'!Z:Z, MATCH('Select LAs'!$H9,'EY Data'!$B:$B, 0))=\"\",\"-\", ROUND(INDEX('EY Data'!Z:Z, MATCH('Select LAs'!$H9,'EY Data'!$B:$B, 0)), 0)))","v":1116521},{"$f":"IF('Select LAs'!$H9=0,\"-\",IF(INDEX('EY Data'!AC:AC, MATCH('Select LAs'!$H9,'EY Data'!$B:$B, 0))=\"\",\"-\", ROUND(INDEX('EY Data'!AC:AC, MATCH('Select LAs'!$H9,'EY Data'!$B:$B, 0)), 0)))","v":702403},{"$f":"IF('Select LAs'!$H9=0,\"-\",IF(INDEX('EY Data'!AB:AB, MATCH('Select LAs'!$H9,'EY Data'!$B:$B, 0))=\"\",\"-\", ROUND(INDEX('EY Data'!AB:AB, MATCH('Select LAs'!$H9,'EY Data'!$B:$B, 0)), 0)))","v":95798},{"$f":"IF('Select LAs'!$H9=0,\"-\",IF(INDEX('EY Data'!AA:AA, MATCH('Select LAs'!$H9,'EY Data'!$B:$B, 0))=\"\",\"-\", ROUND(INDEX('EY Data'!AA:AA, MATCH('Select LAs'!$H9,'EY Data'!$B:$B, 0)), 0)))","v":318320}]
["",{"$f":"'Select LAs'!G10","v":"No LA selected"},null,{"$f":"IF('Select LAs'!$H10=0,\"-\",IF(INDEX('EY Data'!E:E, MATCH('Select LAs'!$H10,'EY Data'!$B:$B, 0))=\"\",\"-\", ROUND(INDEX('EY Data'!E:E, MATCH('Select LAs'!$H10,'EY Data'!$B:$B, 0)), 5)))","v":7.02271},{"$f":"IF('Select LAs'!$H10=0,\"-\",IF(INDEX('EY Data'!H:H, MATCH('Select LAs'!$H10,'EY Data'!$B:$B, 0))=\"\",\"-\", ROUND(INDEX('EY Data'!H:H, MATCH('Select LAs'!$H10,'EY Data'!$B:$B, 0)), 5)))","v":6.4267500000000002},{"$f":"IF('Select LAs'!$H10=0,\"-\",IF(INDEX('EY Data'!G:G, MATCH('Select LAs'!$H10,'EY Data'!$B:$B, 0))=\"\",\"-\", ROUND(INDEX('EY Data'!G:G, MATCH('Select LAs'!$H10,'EY Data'!$B:$B, 0)), 5)))","v":11.61922},{"$f":"IF('Select LAs'!$H10=0,\"-\",IF(INDEX('EY Data'!F:F, MATCH('Select LAs'!$H10,'EY Data'!$B:$B, 0))=\"\",\"-\", ROUND(INDEX('EY Data'!F:F, MATCH('Select LAs'!$H10,'EY Data'!$B:$B, 0)), 5)))","v":6.3890799999999999},{"$f":"IF(OR('Select LAs'!$H10=0,'Select LAs'!$H10=201, 'Select LAs'!$H10=420), \"-\",IF(INDEX('EY Data'!AH:AH, MATCH('Select LAs'!$H10,'EY Data'!$B:$B, 0))=\"-\", \"-\", ROUND(INDEX('EY Data'!AH:AH, MATCH('Select LAs'!$H10,'EY Data'!$B:$B, 0)),3)))","v":0.95},{"$f":"IF(OR('Select LAs'!$H10=0,'Select LAs'!$H10=201, 'Select LAs'!$H10=420), \"-\",IF(INDEX('EY Data'!AJ:AJ, MATCH('Select LAs'!$H10,'EY Data'!$B:$B, 0))=\"\", \"-\", ROUND(INDEX('EY Data'!AJ:AJ, MATCH('Select LAs'!$H10,'EY Data'!$B:$B, 0)),3)))","v":1.9E-2},{"$f":"IF('Select LAs'!$H10=0,\"-\",IF(INDEX('EY Data'!Z:Z, MATCH('Select LAs'!$H10,'EY Data'!$B:$B, 0))=\"\",\"-\", ROUND(INDEX('EY Data'!Z:Z, MATCH('Select LAs'!$H10,'EY Data'!$B:$B, 0)), 0)))","v":48000},{"$f":"IF('Select LAs'!$H10=0,\"-\",IF(INDEX('EY Data'!AC:AC, MATCH('Select LAs'!$H10,'EY Data'!$B:$B, 0))=\"\",\"-\", ROUND(INDEX('EY Data'!AC:AC, MATCH('Select LAs'!$H10,'EY Data'!$B:$B, 0)), 0)))","v":48000},{"$f":"IF('Select LAs'!$H10=0,\"-\",IF(INDEX('EY Data'!AB:AB, MATCH('Select LAs'!$H10,'EY Data'!$B:$B, 0))=\"\",\"-\", ROUND(INDEX('EY Data'!AB:AB, MATCH('Select LAs'!$H10,'EY Data'!$B:$B, 0)), 0)))","v":0},{"$f":"IF('Select LAs'!$H10=0,\"-\",IF(INDEX('EY Data'!AA:AA, MATCH('Select LAs'!$H10,'EY Data'!$B:$B, 0))=\"\",\"-\", ROUND(INDEX('EY Data'!AA:AA, MATCH('Select LAs'!$H10,'EY Data'!$B:$B, 0)), 0)))","v":0}]
["",{"$f":"'Select LAs'!G11","v":"No LA selected"},null,{"$f":"IF('Select LAs'!$H11=0,\"-\",IF(INDEX('EY Data'!E:E, MATCH('Select LAs'!$H11,'EY Data'!$B:$B, 0))=\"\",\"-\", ROUND(INDEX('EY Data'!E:E, MATCH('Select LAs'!$H11,'EY Data'!$B:$B, 0)), 5)))","v":5.5039100000000003},{"$f":"IF('Select LAs'!$H11=0,\"-\",IF(INDEX('EY Data'!H:H, MATCH('Select LAs'!$H11,'EY Data'!$B:$B, 0))=\"\",\"-\", ROUND(INDEX('EY Data'!H:H, MATCH('Select LAs'!$H11,'EY Data'!$B:$B, 0)), 5)))","v":5.2962199999999999},{"$f":"IF('Select LAs'!$H11=0,\"-\",IF(INDEX('EY Data'!G:G, MATCH('Select LAs'!$H11,'EY Data'!$B:$B, 0))=\"\",\"-\", ROUND(INDEX('EY Data'!G:G, MATCH('Select LAs'!$H11,'EY Data'!$B:$B, 0)), 5)))","v":10.03327},{"$f":"IF('Select LAs'!$H11=0,\"-\",IF(INDEX('EY Data'!F:F, MATCH('Select LAs'!$H11,'EY Data'!$B:$B, 0))=\"\",\"-\", ROUND(INDEX('EY Data'!F:F, MATCH('Select LAs'!$H11,'EY Data'!$B:$B, 0)), 5)))","v":5.5408499999999998},{"$f":"IF(OR('Select LAs'!$H11=0,'Select LAs'!$H11=201, 'Select LAs'!$H11=420), \"-\",IF(INDEX('EY Data'!AH:AH, MATCH('Select LAs'!$H11,'EY Data'!$B:$B, 0))=\"-\", \"-\", ROUND(INDEX('EY Data'!AH:AH, MATCH('Select LAs'!$H11,'EY Data'!$B:$B, 0)),3)))","v":0.95099999999999996},{"$f":"IF(OR('Select LAs'!$H11=0,'Select LAs'!$H11=201, 'Select LAs'!$H11=420), \"-\",IF(INDEX('EY Data'!AJ:AJ, MATCH('Select LAs'!$H11,'EY Data'!$B:$B, 0))=\"\", \"-\", ROUND(INDEX('EY Data'!AJ:AJ, MATCH('Select LAs'!$H11,'EY Data'!$B:$B, 0)),3)))","v":2.8000000000000001E-2},{"$f":"IF('Select LAs'!$H11=0,\"-\",IF(INDEX('EY Data'!Z:Z, MATCH('Select LAs'!$H11,'EY Data'!$B:$B, 0))=\"\",\"-\", ROUND(INDEX('EY Data'!Z:Z, MATCH('Select LAs'!$H11,'EY Data'!$B:$B, 0)), 0)))","v":279941},{"$f":"IF('Select LAs'!$H11=0,\"-\",IF(INDEX('EY Data'!AC:AC, MATCH('Select LAs'!$H11,'EY Data'!$B:$B, 0))=\"\",\"-\", ROUND(INDEX('EY Data'!AC:AC, MATCH('Select LAs'!$H11,'EY Data'!$B:$B, 0)), 0)))","v":129270},{"$f":"IF('Select LAs'!$H11=0,\"-\",IF(INDEX('EY Data'!AB:AB, MATCH('Select LAs'!$H11,'EY Data'!$B:$B, 0))=\"\",\"-\", ROUND(INDEX('EY Data'!AB:AB, MATCH('Select LAs'!$H11,'EY Data'!$B:$B, 0)), 0)))","v":14170},{"$f":"IF('Select LAs'!$H11=0,\"-\",IF(INDEX('EY Data'!AA:AA, MATCH('Select LAs'!$H11,'EY Data'!$B:$B, 0))=\"\",\"-\", ROUND(INDEX('EY Data'!AA:AA, MATCH('Select LAs'!$H11,'EY Data'!$B:$B, 0)), 0)))","v":136501}]
["",{"$f":"'Select LAs'!G12","v":"No LA selected"},null,{"$f":"IF('Select LAs'!$H12=0,\"-\",IF(INDEX('EY Data'!E:E, MATCH('Select LAs'!$H12,'EY Data'!$B:$B, 0))=\"\",\"-\", ROUND(INDEX('EY Data'!E:E, MATCH('Select LAs'!$H12,'EY Data'!$B:$B, 0)), 5)))","v":5.5711300000000001},{"$f":"IF('Select LAs'!$H12=0,\"-\",IF(INDEX('EY Data'!H:H, MATCH('Select LAs'!$H12,'EY Data'!$B:$B, 0))=\"\",\"-\", ROUND(INDEX('EY Data'!H:H, MATCH('Select LAs'!$H12,'EY Data'!$B:$B, 0)), 5)))","v":5.3626800000000001},{"$f":"IF('Select LAs'!$H12=0,\"-\",IF(INDEX('EY Data'!G:G, MATCH('Select LAs'!$H12,'EY Data'!$B:$B, 0))=\"\",\"-\", ROUND(INDEX('EY Data'!G:G, MATCH('Select LAs'!$H12,'EY Data'!$B:$B, 0)), 5)))","v":10.044499999999999},{"$f":"IF('Select LAs'!$H12=0,\"-\",IF(INDEX('EY Data'!F:F, MATCH('Select LAs'!$H12,'EY Data'!$B:$B, 0))=\"\",\"-\", ROUND(INDEX('EY Data'!F:F, MATCH('Select LAs'!$H12,'EY Data'!$B:$B, 0)), 5)))","v":5.6571600000000002},{"$f":"IF(OR('Select LAs'!$H12=0,'Select LAs'!$H12=201, 'Select LAs'!$H12=420), \"-\",IF(INDEX('EY Data'!AH:AH, MATCH('Select LAs'!$H12,'EY Data'!$B:$B, 0))=\"-\", \"-\", ROUND(INDEX('EY Data'!AH:AH, MATCH('Select LAs'!$H12,'EY Data'!$B:$B, 0)),3)))","v":0.95899999999999996},{"$f":"IF(OR('Select LAs'!$H12=0,'Select LAs'!$H12=201, 'Select LAs'!$H12=420), \"-\",IF(INDEX('EY Data'!AJ:AJ, MATCH('Select LAs'!$H12,'EY Data'!$B:$B, 0))=\"\", \"-\", ROUND(INDEX('EY Data'!AJ:AJ, MATCH('Select LAs'!$H12,'EY Data'!$B:$B, 0)),3)))","v":8.4000000000000005E-2},{"$f":"IF('Select LAs'!$H12=0,\"-\",IF(INDEX('EY Data'!Z:Z, MATCH('Select LAs'!$H12,'EY Data'!$B:$B, 0))=\"\",\"-\", ROUND(INDEX('EY Data'!Z:Z, MATCH('Select LAs'!$H12,'EY Data'!$B:$B, 0)), 0)))","v":452000},{"$f":"IF('Select LAs'!$H12=0,\"-\",IF(INDEX('EY Data'!AC:AC, MATCH('Select LAs'!$H12,'EY Data'!$B:$B, 0))=\"\",\"-\", ROUND(INDEX('EY Data'!AC:AC, MATCH('Select LAs'!$H12,'EY Data'!$B:$B, 0)), 0)))","v":255707},{"$f":"IF('Select LAs'!$H12=0,\"-\",IF(INDEX('EY Data'!AB:AB, MATCH('Select LAs'!$H12,'EY Data'!$B:$B, 0))=\"\",\"-\", ROUND(INDEX('EY Data'!AB:AB, MATCH('Select LAs'!$H12,'EY Data'!$B:$B, 0)), 0)))","v":8597},{"$f":"IF('Select LAs'!$H12=0,\"-\",IF(INDEX('EY Data'!AA:AA, MATCH('Select LAs'!$H12,'EY Data'!$B:$B, 0))=\"\",\"-\", ROUND(INDEX('EY Data'!AA:AA, MATCH('Select LAs'!$H12,'EY Data'!$B:$B, 0)), 0)))","v":187696}]
[null,{"$f":"'Select LAs'!G13","v":"No LA selected"},null,{"$f":"IF('Select LAs'!$H13=0,\"-\",IF(INDEX('EY Data'!E:E, MATCH('Select LAs'!$H13,'EY Data'!$B:$B, 0))=\"\",\"-\", ROUND(INDEX('EY Data'!E:E, MATCH('Select LAs'!$H13,'EY Data'!$B:$B, 0)), 5)))","v":5.5573800000000002},{"$f":"IF('Select LAs'!$H13=0,\"-\",IF(INDEX('EY Data'!H:H, MATCH('Select LAs'!$H13,'EY Data'!$B:$B, 0))=\"\",\"-\", ROUND(INDEX('EY Data'!H:H, MATCH('Select LAs'!$H13,'EY Data'!$B:$B, 0)), 5)))","v":5.4034500000000003},{"$f":"IF('Select LAs'!$H13=0,\"-\",IF(INDEX('EY Data'!G:G, MATCH('Select LAs'!$H13,'EY Data'!$B:$B, 0))=\"\",\"-\", ROUND(INDEX('EY Data'!G:G, MATCH('Select LAs'!$H13,'EY Data'!$B:$B, 0)), 5)))","v":10.456469999999999},{"$f":"IF('Select LAs'!$H13=0,\"-\",IF(INDEX('EY Data'!F:F, MATCH('Select LAs'!$H13,'EY Data'!$B:$B, 0))=\"\",\"-\", ROUND(INDEX('EY Data'!F:F, MATCH('Select LAs'!$H13,'EY Data'!$B:$B, 0)), 5)))","v":5.4096799999999998},{"$f":"IF(OR('Select LAs'!$H13=0,'Select LAs'!$H13=201, 'Select LAs'!$H13=420), \"-\",IF(INDEX('EY Data'!AH:AH, MATCH('Select LAs'!$H13,'EY Data'!$B:$B, 0))=\"-\", \"-\", ROUND(INDEX('EY Data'!AH:AH, MATCH('Select LAs'!$H13,'EY Data'!$B:$B, 0)),3)))","v":0.97},{"$f":"IF(OR('Select LAs'!$H13=0,'Select LAs'!$H13=201, 'Select LAs'!$H13=420), \"-\",IF(INDEX('EY Data'!AJ:AJ, MATCH('Select LAs'!$H13,'EY Data'!$B:$B, 0))=\"\", \"-\", ROUND(INDEX('EY Data'!AJ:AJ, MATCH('Select LAs'!$H13,'EY Data'!$B:$B, 0)),3)))","v":6.6000000000000003E-2},{"$f":"IF('Select LAs'!$H13=0,\"-\",IF(INDEX('EY Data'!Z:Z, MATCH('Select LAs'!$H13,'EY Data'!$B:$B, 0))=\"\",\"-\", ROUND(INDEX('EY Data'!Z:Z, MATCH('Select LAs'!$H13,'EY Data'!$B:$B, 0)), 0)))","v":404000},{"$f":"IF('Select LAs'!$H13=0,\"-\",IF(INDEX('EY Data'!AC:AC, MATCH('Select LAs'!$H13,'EY Data'!$B:$B, 0))=\"\",\"-\", ROUND(INDEX('EY Data'!AC:AC, MATCH('Select LAs'!$H13,'EY Data'!$B:$B, 0)), 0)))","v":218160},{"$f":"IF('Select LAs'!$H13=0,\"-\",IF(INDEX('EY Data'!AB:AB, MATCH('Select LAs'!$H13,'EY Data'!$B:$B, 0))=\"\",\"-\", ROUND(INDEX('EY Data'!AB:AB, MATCH('Select LAs'!$H13,'EY Data'!$B:$B, 0)), 0)))","v":36360},{"$f":"IF('Select LAs'!$H13=0,\"-\",IF(INDEX('EY Data'!AA:AA, MATCH('Select LAs'!$H13,'EY Data'!$B:$B, 0))=\"\",\"-\", ROUND(INDEX('EY Data'!AA:AA, MATCH('Select LAs'!$H13,'EY Data'!$B:$B, 0)), 0)))","v":149480}]
[null,"Selection Median",null,{"$f":"IF(COUNT(D$21:D$31)>0,MEDIAN(D$21:D$31),\"-\")","v":6.1477500000000003},5.73062,9.5872700000000002,{"$f":"IF(COUNT(G$21:G$31)>0,MEDIAN(G$21:G$31),\"-\")","v":5.7293000000000003},{"$f":"IF(COUNT(H$21:H$31)>0,MEDIAN(H$21:H$31),\"-\")","v":0.95899999999999996},{"$f":"IF(COUNT(I$21:I$31)>0,MEDIAN(I$21:I$31),\"-\")","v":5.2999999999999999E-2},{"$f":"IF(COUNT(J$21:J$31)>0,MEDIAN(J$21:J$31),\"-\")","v":452000},294416,14170,136501]
[null,"Selection Minimum",null,{"$f":"IF(COUNT(D$21:D$31)>0,MIN(D$21:D$31),\"-\")","v":5.5039100000000003},5.2962199999999999,0,{"$f":"IF(COUNT(G$21:G$31)>0,MIN(G$21:G$31),\"-\")","v":0},{"$f":"IF(COUNT(H$21:H$31)>0,MIN(H$21:H$31),\"-\")","v":0.95},{"$f":"IF(COUNT(I$21:I$31)>0,MIN(I$21:I$31),\"-\")","v":1.9E-2},{"$f":"IF(COUNT(J$21:J$31)>0,MIN(J$21:J$31),\"-\")","v":48000},48000,0,0]
[null,"Selection Maximum",null,{"$f":"IF(COUNT(D$21:D$31)>0,MAX(D$21:D$31),\"-\")","v":7.4563499999999996},7.1614699999999996,11.61922,{"$f":"IF(COUNT(G$21:G$31)>0,MAX(G$21:G$31),\"-\")","v":7.1477700000000004},{"$f":"IF(COUNT(H$21:H$31)>0,MAX(H$21:H$31),\"-\")","v":0.98099999999999998},{"$f":"IF(COUNT(I$21:I$31)>0,MAX(I$21:I$31),\"-\")","v":8.4000000000000005E-2},{"$f":"IF(COUNT(J$21:J$31)>0,MAX(J$21:J$31),\"-\")","v":1177665},702403,263092,718376]

{"sheet":"2 year olds  (D)","index":2,"n_rows":42,"n_cols":13,"rows_kept":42,"cut":false,"hidden":true,"merged":[[26,1,26,2],[43,1,43,11],[4,1,4,2],[5,1,5,2],[6,1,6,2],[22,3,22,4],[25,3,25,6],[25,9,25,12],[7,1,7,2],[25,7,26,7],[25,8,26,8]]}
[]
[null,{"$f":"CONCATENATE('Select LAs'!B3,\" - Key Budget Statistics\")","v":"No LA selected - Key Budget Statistics"},null,null,null,null,null,null,null,null,null,null,{"$f":"'3-4 year olds '!$K$2","v":"Financial Year 2024-2025"}]
[]
[]
[null,{"$f":"'Select LAs'!D3","v":"No LA selected"},null,"All providers","Private, Voluntary, Independent","Nursery schools","Primary nursery places"]
[null,"2 year old hourly average funding rate (£/hr)",null,{"$f":"IFERROR(IF(INDEX('EY Data'!AL:AL, MATCH('Select LAs'!$A$3,'EY Data'!$B:$B, 0))=\"\",\"-\", INDEX('EY Data'!AL:AL, MATCH('Select LAs'!$A$3,'EY Data'!$B:$B, 0))), 0)","v":0},{"$f":"IFERROR(IF(INDEX('EY Data'!AO:AO, MATCH('Select LAs'!$A$3,'EY Data'!$B:$B, 0))=\"\",\"-\", INDEX('EY Data'!AO:AO, MATCH('Select LAs'!$A$3,'EY Data'!$B:$B, 0))), 0)","v":0},{"$f":"IFERROR(IF(INDEX('EY Data'!AN:AN, MATCH('Select LAs'!$A$3,'EY Data'!$B:$B, 0))=\"\",\"-\", INDEX('EY Data'!AN:AN, MATCH('Select LAs'!$A$3,'EY Data'!$B:$B, 0))), 0)","v":0},{"$f":"IFERROR(IF(INDEX('EY Data'!AM:AM, MATCH('Select LAs'!$A$3,'EY Data'!$B:$B, 0))=\"\",\"-\", INDEX('EY Data'!AM:AM, MATCH('Select LAs'!$A$3,'EY Data'!$B:$B, 0))), 0)","v":0}]
[null,"2 year old hourly average base rate (£/hr)",null,{"$f":"IFERROR(IF(INDEX('EY Data'!AZ:AZ, MATCH('Select LAs'!$A$3,'EY Data'!$B:$B, 0))=\"\",\"-\", INDEX('EY Data'!AZ:AZ, MATCH('Select LAs'!$A$3,'EY Data'!$B:$B, 0))), 0)","v":0},{"$f":"IFERROR(IF(INDEX('EY Data'!BC:BC, MATCH('Select LAs'!$A$3,'EY Data'!$B:$B, 0))=\"\",\"-\", INDEX('EY Data'!BC:BC, MATCH('Select LAs'!$A$3,'EY Data'!$B:$B, 0))), 0)","v":0},{"$f":"IFERROR(IF(INDEX('EY Data'!BB:BB, MATCH('Select LAs'!$A$3,'EY Data'!$B:$B, 0))=\"\",\"-\", INDEX('EY Data'!BB:BB, MATCH('Select LAs'!$A$3,'EY Data'!$B:$B, 0))), 0)","v":0},{"$f":"IFERROR(IF(INDEX('EY Data'!BA:BA, MATCH('Select LAs'!$A$3,'EY Data'!$B:$B, 0))=\"\",\"-\", INDEX('EY Data'!BA:BA, MATCH('Select LAs'!$A$3,'EY Data'!$B:$B, 0))), 0)","v":0}]
[null,"Pass-through rate (%)",null,{"$f":"IF(OR('Select LAs'!$A$3 = \"LA No\", 'Select LAs'!$A$3 = 201, 'Select LAs'!$A$3 = 420), \"-\", INDEX('EY Data'!BO:BO, MATCH('Select LAs'!$A$3,'EY Data'!$B:$B, 0)))","v":"-"}]
[]
[]
[]
[]
[]
[]
[]
[]
[]
[]
[null,{"$f":"CONCATENATE(\"Benchmarking against \",IF(_SN=1,\"Statistical Neighbours\",\"Manual Selection\"))","v":"Benchmarking against Manual Selection"}]
[]
[]
[]
[null,null,"Table ordering"]
[]
[]
[null,null,null,"Average funding rate to providers per hour",null,null,null,"Pass-through rate","Funding paid through supplements","SEN Inclusion Fund (top-up grant element) budget"]
[null,"Local Authority",null,"All providers","Private, Voluntary, Independent","Nursery schools","Primary nursery places",null,null,"All providers","Private, Voluntary, Independent","Nursery schools","Primary nursery places"]
[null,"England",null,{"$f":"ROUND(INDEX('EY Data'!AL:AL, MATCH($B28,'EY Data'!$C:$C, 0)), 5)","v":8.1780899999999992},{"$f":"ROUND(INDEX('EY Data'!AO:AO, MATCH($B28,'EY Data'!$C:$C, 0)), 5)","v":8.1453000000000007},{"$f":"ROUND(INDEX('EY Data'!AN:AN, MATCH($B28,'EY Data'!$C:$C, 0)), 5)","v":8.5924700000000005},{"$f":"ROUND(INDEX('EY Data'!AM:AM, MATCH($B28,'EY Data'!$C:$C, 0)), 5)","v":8.1698699999999995},{"$f":"IF(INDEX('EY Data'!BO:BO, MATCH($B28,'EY Data'!$C:$C, 0))=\"-\", \"-\", ROUND(INDEX('EY Data'!BO:BO, MATCH($B28,'EY Data'!$C:$C, 0)), 3))","v":0.98799999999999999},{"$f":"IF(INDEX('EY Data'!AJ:AJ, MATCH($B28,'EY Data'!$C:$C, 0))=\"-\", \"-\", ROUND(INDEX('EY Data'!AJ:AJ, MATCH($B28,'EY Data'!$C:$C, 0)), 3))","v":4.1000000000000002E-2},{"$f":"ROUND(INDEX('EY Data'!BG:BG, MATCH($B28,'EY Data'!$C:$C, 0)), 3)","v":10212856.6},{"$f":"ROUND(INDEX('EY Data'!BJ:BJ, MATCH($B28,'EY Data'!$C:$C, 0)), 3)","v":7824160.3799999999},{"$f":"ROUND(INDEX('EY Data'!BI:BI, MATCH($B28,'EY Data'!$C:$C, 0)), 3)","v":978520.28},{"$f":"ROUND(INDEX('EY Data'!BH:BH, MATCH($B28,'EY Data'!$C:$C, 0)), 3)","v":1410175.94}]
[null,{"$f":"'Select LAs'!L3","v":"No LA selected"},null,{"$f":"IF('Select LAs'!$M3=0,\"-\",IF(INDEX('EY Data'!AL:AL, MATCH('Select LAs'!$M3,'EY Data'!$B:$B, 0))=\"\",\"-\", ROUND(INDEX('EY Data'!AL:AL, MATCH('Select LAs'!$M3,'EY Data'!$B:$B, 0)),5)))","v":8.7435200000000002},{"$f":"IF('Select LAs'!$M3=0,\"-\",IF(INDEX('EY Data'!AO:AO, MATCH('Select LAs'!$M3,'EY Data'!$B:$B, 0))=\"\",\"-\", ROUND(INDEX('EY Data'!AO:AO, MATCH('Select LAs'!$M3,'EY Data'!$B:$B, 0)),5)))","v":8.7435200000000002},{"$f":"IF('Select LAs'!$M3=0,\"-\",IF(INDEX('EY Data'!AN:AN, MATCH('Select LAs'!$M3,'EY Data'!$B:$B, 0))=\"\",\"-\", ROUND(INDEX('EY Data'!AN:AN, MATCH('Select LAs'!$M3,'EY Data'!$B:$B, 0)),5)))","v":0},{"$f":"IF('Select LAs'!$M3=0,\"-\",IF(INDEX('EY Data'!AM:AM, MATCH('Select LAs'!$M3,'EY Data'!$B:$B, 0))=\"\",\"-\", ROUND(INDEX('EY Data'!AM:AM, MATCH('Select LAs'!$M3,'EY Data'!$B:$B, 0)),5)))","v":0},{"$f":"IF(OR('Select LAs'!$M3=0,'Select LAs'!$M3=201, 'Select LAs'!$M3=420), \"-\",IF(INDEX('EY Data'!BO:BO, MATCH('Select LAs'!$M3,'EY Data'!$B:$B, 0))=\"-\", \"-\", ROUND(INDEX('EY Data'!BO:BO, MATCH('Select LAs'!$M3,'EY Data'!$B:$B, 0)),3)))","v":0.95},{"$f":"IF(OR('Select LAs'!$M3=0,'Select LAs'!$M3=201, 'Select LAs'!$M3=420), \"-\",IF(INDEX('EY Data'!BQ:BQ, MATCH('Select LAs'!$M3,'EY Data'!$B:$B, 0))=\"\", \"-\", ROUND(INDEX('EY Data'!BQ:BQ, MATCH('Select LAs'!$M3,'EY Data'!$B:$B, 0)),3)))","v":0},{"$f":"IF('Select LAs'!$M3=0,\"-\",IF(INDEX('EY Data'!BG:BG, MATCH('Select LAs'!$M3,'EY Data'!$B:$B, 0))=\"\",\"-\",ROUND(INDEX('EY Data'!BG:BG, MATCH('Select LAs'!$M3,'EY Data'!$B:$B, 0)),0)))","v":60000},{"$f":"IF('Select LAs'!$M3=0,\"-\",IF(INDEX('EY Data'!BJ:BJ, MATCH('Select LAs'!$M3,'EY Data'!$B:$B, 0))=\"\",\"-\",ROUND(INDEX('EY Data'!BJ:BJ, MATCH('Select LAs'!$M3,'EY Data'!$B:$B, 0)),0)))","v":60000},{"$f":"IF('Select LAs'!$M3=0,\"-\",IF(INDEX('EY Data'!BI:BI, MATCH('Select LAs'!$M3,'EY Data'!$B:$B, 0))=\"\",\"-\",ROUND(INDEX('EY Data'!BI:BI, MATCH('Select LAs'!$M3,'EY Data'!$B:$B, 0)),0)))","v":0},{"$f":"IF('Select LAs'!$M3=0,\"-\",IF(INDEX('EY Data'!BH:BH, MATCH('Select LAs'!$M3,'EY Data'!$B:$B, 0))=\"\",\"-\",ROUND(INDEX('EY Data'!BH:BH, MATCH('Select LAs'!$M3,'EY Data'!$B:$B, 0)),0)))","v":0}]
[null,{"$f":"'Select LAs'!L4","v":"No LA selected"},null,{"$f":"IF('Select LAs'!$M4=0,\"-\",IF(INDEX('EY Data'!AL:AL, MATCH('Select LAs'!$M4,'EY Data'!$B:$B, 0))=\"\",\"-\", ROUND(INDEX('EY Data'!AL:AL, MATCH('Select LAs'!$M4,'EY Data'!$B:$B, 0)),5)))","v":10.568530000000001},{"$f":"IF('Select LAs'!$M4=0,\"-\",IF(INDEX('EY Data'!AO:AO, MATCH('Select LAs'!$M4,'EY Data'!$B:$B, 0))=\"\",\"-\", ROUND(INDEX('EY Data'!AO:AO, MATCH('Select LAs'!$M4,'EY Data'!$B:$B, 0)),5)))","v":10.568530000000001},{"$f":"IF('Select LAs'!$M4=0,\"-\",IF(INDEX('EY Data'!AN:AN, MATCH('Select LAs'!$M4,'EY Data'!$B:$B, 0))=\"\",\"-\", ROUND(INDEX('EY Data'!AN:AN, MATCH('Select LAs'!$M4,'EY Data'!$B:$B, 0)),5)))","v":10.568530000000001},{"$f":"IF('Select LAs'!$M4=0,\"-\",IF(INDEX('EY Data'!AM:AM, MATCH('Select LAs'!$M4,'EY Data'!$B:$B, 0))=\"\",\"-\", ROUND(INDEX('EY Data'!AM:AM, MATCH('Select LAs'!$M4,'EY Data'!$B:$B, 0)),5)))","v":0},{"$f":"IF(OR('Select LAs'!$M4=0,'Select LAs'!$M4=201, 'Select LAs'!$M4=420), \"-\",IF(INDEX('EY Data'!BO:BO, MATCH('Select LAs'!$M4,'EY Data'!$B:$B, 0))=\"-\", \"-\", ROUND(INDEX('EY Data'!BO:BO, MATCH('Select LAs'!$M4,'EY Data'!$B:$B, 0)),3)))","v":0.97099999999999997},{"$f":"IF(OR('Select LAs'!$M4=0,'Select LAs'!$M4=201, 'Select LAs'!$M4=420), \"-\",IF(INDEX('EY Data'!BQ:BQ, MATCH('Select LAs'!$M4,'EY Data'!$B:$B, 0))=\"\", \"-\", ROUND(INDEX('EY Data'!BQ:BQ, MATCH('Select LAs'!$M4,'EY Data'!$B:$B, 0)),3)))","v":0},{"$f":"IF('Select LAs'!$M4=0,\"-\",IF(INDEX('EY Data'!BG:BG, MATCH('Select LAs'!$M4,'EY Data'!$B:$B, 0))=\"\",\"-\",ROUND(INDEX('EY Data'!BG:BG, MATCH('Select LAs'!$M4,'EY Data'!$B:$B, 0)),0)))","v":104216},{"$f":"IF('Select LAs'!$M4=0,\"-\",IF(INDEX('EY Data'!BJ:BJ, MATCH('Select LAs'!$M4,'EY Data'!$B:$B, 0))=\"\",\"-\",ROUND(INDEX('EY Data'!BJ:BJ, MATCH('Select LAs'!$M4,'EY Data'!$B:$B, 0)),0)))","v":86500},{"$f":"IF('Select LAs'!$M4=0,\"-\",IF(INDEX('EY Data'!BI:BI, MATCH('Select LAs'!$M4,'EY Data'!$B:$B, 0))=\"\",\"-\",ROUND(INDEX('EY Data'!BI:BI, MATCH('Select LAs'!$M4,'EY Data'!$B:$B, 0)),0)))","v":17717},{"$f":"IF('Select LAs'!$M4=0,\"-\",IF(INDEX('EY Data'!BH:BH, MATCH('Select LAs'!$M4,'EY Data'!$B:$B, 0))=\"\",\"-\",ROUND(INDEX('EY Data'!BH:BH, MATCH('Select LAs'!$M4,'EY Data'!$B:$B, 0)),0)))","v":0}]
["",{"$f":"'Select LAs'!L5","v":"No LA selected"},null,{"$f":"IF('Select LAs'!$M5=0,\"-\",IF(INDEX('EY Data'!AL:AL, MATCH('Select LAs'!$M5,'EY Data'!$B:$B, 0))=\"\",\"-\", ROUND(INDEX('EY Data'!AL:AL, MATCH('Select LAs'!$M5,'EY Data'!$B:$B, 0)),5)))","v":9.48},{"$f":"IF('Select LAs'!$M5=0,\"-\",IF(INDEX('EY Data'!AO:AO, MATCH('Select LAs'!$M5,'EY Data'!$B:$B, 0))=\"\",\"-\", ROUND(INDEX('EY Data'!AO:AO, MATCH('Select LAs'!$M5,'EY Data'!$B:$B, 0)),5)))","v":9.4801800000000007},{"$f":"IF('Select LAs'!$M5=0,\"-\",IF(INDEX('EY Data'!AN:AN, MATCH('Select LAs'!$M5,'EY Data'!$B:$B, 0))=\"\",\"-\", ROUND(INDEX('EY Data'!AN:AN, MATCH('Select LAs'!$M5,'EY Data'!$B:$B, 0)),5)))","v":0},{"$f":"IF('Select LAs'!$M5=0,\"-\",IF(INDEX('EY Data'!AM:AM, MATCH('Select LAs'!$M5,'EY Data'!$B:$B, 0))=\"\",\"-\", ROUND(INDEX('EY Data'!AM:AM, MATCH('Select LAs'!$M5,'EY Data'!$B:$B, 0)),5)))","v":9.47438},{"$f":"IF(OR('Select LAs'!$M5=0,'Select LAs'!$M5=201, 'Select LAs'!$M5=420), \"-\",IF(INDEX('EY Data'!BO:BO, MATCH('Select LAs'!$M5,'EY Data'!$B:$B, 0))=\"-\", \"-\", ROUND(INDEX('EY Data'!BO:BO, MATCH('Select LAs'!$M5,'EY Data'!$B:$B, 0)),3)))","v":0.97},{"$f":"IF(OR('Select LAs'!$M5=0,'Select LAs'!$M5=201, 'Select LAs'!$M5=420), \"-\",IF(INDEX('EY Data'!BQ:BQ, MATCH('Select LAs'!$M5,'EY Data'!$B:$B, 0))=\"\", \"-\", ROUND(INDEX('EY Data'!BQ:BQ, MATCH('Select LAs'!$M5,'EY Data'!$B:$B, 0)),3)))","v":0.02},{"$f":"IF('Select LAs'!$M5=0,\"-\",IF(INDEX('EY Data'!BG:BG, MATCH('Select LAs'!$M5,'EY Data'!$B:$B, 0))=\"\",\"-\",ROUND(INDEX('EY Data'!BG:BG, MATCH('Select LAs'!$M5,'EY Data'!$B:$B, 0)),0)))","v":107644},{"$f":"IF('Select LAs'!$M5=0,\"-\",IF(INDEX('EY Data'!BJ:BJ, MATCH('Select LAs'!$M5,'EY Data'!$B:$B, 0))=\"\",\"-\",ROUND(INDEX('EY Data'!BJ:BJ, MATCH('Select LAs'!$M5,'EY Data'!$B:$B, 0)),0)))","v":104470},{"$f":"IF('Select LAs'!$M5=0,\"-\",IF(INDEX('EY Data'!BI:BI, MATCH('Select LAs'!$M5,'EY Data'!$B:$B, 0))=\"\",\"-\",ROUND(INDEX('EY Data'!BI:BI, MATCH('Select LAs'!$M5,'EY Data'!$B:$B, 0)),0)))","v":0},{"$f":"IF('Select LAs'!$M5=0,\"-\",IF(INDEX('EY Data'!BH:BH, MATCH('Select LAs'!$M5,'EY Data'!$B:$B, 0))=\"\",\"-\",ROUND(INDEX('EY Data'!BH:BH, MATCH('Select LAs'!$M5,'EY Data'!$B:$B, 0)),0)))","v":3174}]
["",{"$f":"'Select LAs'!L6","v":"No LA selected"},null,{"$f":"IF('Select LAs'!$M6=0,\"-\",IF(INDEX('EY Data'!AL:AL, MATCH('Select LAs'!$M6,'EY Data'!$B:$B, 0))=\"\",\"-\", ROUND(INDEX('EY Data'!AL:AL, MATCH('Select LAs'!$M6,'EY Data'!$B:$B, 0)),5)))","v":8.3800000000000008},{"$f":"IF('Select LAs'!$M6=0,\"-\",IF(INDEX('EY Data'!AO:AO, MATCH('Select LAs'!$M6,'EY Data'!$B:$B, 0))=\"\",\"-\", ROUND(INDEX('EY Data'!AO:AO, MATCH('Select LAs'!$M6,'EY Data'!$B:$B, 0)),5)))","v":8.3800000000000008},{"$f":"IF('Select LAs'!$M6=0,\"-\",IF(INDEX('EY Data'!AN:AN, MATCH('Select LAs'!$M6,'EY Data'!$B:$B, 0))=\"\",\"-\", ROUND(INDEX('EY Data'!AN:AN, MATCH('Select LAs'!$M6,'EY Data'!$B:$B, 0)),5)))","v":0},{"$f":"IF('Select LAs'!$M6=0,\"-\",IF(INDEX('EY Data'!AM:AM, MATCH('Select LAs'!$M6,'EY Data'!$B:$B, 0))=\"\",\"-\", ROUND(INDEX('EY Data'!AM:AM, MATCH('Select LAs'!$M6,'EY Data'!$B:$B, 0)),5)))","v":8.3800000000000008},{"$f":"IF(OR('Select LAs'!$M6=0,'Select LAs'!$M6=201, 'Select LAs'!$M6=420), \"-\",IF(INDEX('EY Data'!BO:BO, MATCH('Select LAs'!$M6,'EY Data'!$B:$B, 0))=\"-\", \"-\", ROUND(INDEX('EY Data'!BO:BO, MATCH('Select LAs'!$M6,'EY Data'!$B:$B, 0)),3)))","v":0.98699999999999999},{"$f":"IF(OR('Select LAs'!$M6=0,'Select LAs'!$M6=201, 'Select LAs'!$M6=420), \"-\",IF(INDEX('EY Data'!BQ:BQ, MATCH('Select LAs'!$M6,'EY Data'!$B:$B, 0))=\"\", \"-\", ROUND(INDEX('EY Data'!BQ:BQ, MATCH('Select LAs'!$M6,'EY Data'!$B:$B, 0)),3)))","v":0},{"$f":"IF('Select LAs'!$M6=0,\"-\",IF(INDEX('EY Data'!BG:BG, MATCH('Select LAs'!$M6,'EY Data'!$B:$B, 0))=\"\",\"-\",ROUND(INDEX('EY Data'!BG:BG, MATCH('Select LAs'!$M6,'EY Data'!$B:$B, 0)),0)))","v":0},{"$f":"IF('Select LAs'!$M6=0,\"-\",IF(INDEX('EY Data'!BJ:BJ, MATCH('Select LAs'!$M6,'EY Data'!$B:$B, 0))=\"\",\"-\",ROUND(INDEX('EY Data'!BJ:BJ, MATCH('Select LAs'!$M6,'EY Data'!$B:$B, 0)),0)))","v":0},{"$f":"IF('Select LAs'!$M6=0,\"-\",IF(INDEX('EY Data'!BI:BI, MATCH('Select LAs'!$M6,'EY Data'!$B:$B, 0))=\"\",\"-\",ROUND(INDEX('EY Data'!BI:BI, MATCH('Select LAs'!$M6,'EY Data'!$B:$B, 0)),0)))","v":0},{"$f":"IF('Select LAs'!$M6=0,\"-\",IF(INDEX('EY Data'!BH:BH, MATCH('Select LAs'!$M6,'EY Data'!$B:$B, 0))=\"\",\"-\",ROUND(INDEX('EY Data'!BH:BH, MATCH('Select LAs'!$M6,'EY Data'!$B:$B, 0)),0)))","v":0}]
["",{"$f":"'Select LAs'!L7","v":"No LA selected"},null,{"$f":"IF('Select LAs'!$M7=0,\"-\",IF(INDEX('EY Data'!AL:AL, MATCH('Select LAs'!$M7,'EY Data'!$B:$B, 0))=\"\",\"-\", ROUND(INDEX('EY Data'!AL:AL, MATCH('Select LAs'!$M7,'EY Data'!$B:$B, 0)),5)))","v":8.3287800000000001},{"$f":"IF('Select LAs'!$M7=0,\"-\",IF(INDEX('EY Data'!AO:AO, MATCH('Select LAs'!$M7,'EY Data'!$B:$B, 0))=\"\",\"-\", ROUND(INDEX('EY Data'!AO:AO, MATCH('Select LAs'!$M7,'EY Data'!$B:$B, 0)),5)))","v":8.3287800000000001},{"$f":"IF('Select LAs'!$M7=0,\"-\",IF(INDEX('EY Data'!AN:AN, MATCH('Select LAs'!$M7,'EY Data'!$B:$B, 0))=\"\",\"-\", ROUND(INDEX('EY Data'!AN:AN, MATCH('Select LAs'!$M7,'EY Data'!$B:$B, 0)),5)))","v":8.3287800000000001},{"$f":"IF('Select LAs'!$M7=0,\"-\",IF(INDEX('EY Data'!AM:AM, MATCH('Select LAs'!$M7,'EY Data'!$B:$B, 0))=\"\",\"-\", ROUND(INDEX('EY Data'!AM:AM, MATCH('Select LAs'!$M7,'EY Data'!$B:$B, 0)),5)))","v":8.3288100000000007},{"$f":"IF(OR('Select LAs'!$M7=0,'Select LAs'!$M7=201, 'Select LAs'!$M7=420), \"-\",IF(INDEX('EY Data'!BO:BO, MATCH('Select LAs'!$M7,'EY Data'!$B:$B, 0))=\"-\", \"-\", ROUND(INDEX('EY Data'!BO:BO, MATCH('Select LAs'!$M7,'EY Data'!$B:$B, 0)),3)))","v":0.995},{"$f":"IF(OR('Select LAs'!$M7=0,'Select LAs'!$M7=201, 'Select LAs'!$M7=420), \"-\",IF(INDEX('EY Data'!BQ:BQ, MATCH('Select LAs'!$M7,'EY Data'!$B:$B, 0))=\"\", \"-\", ROUND(INDEX('EY Data'!BQ:BQ, MATCH('Select LAs'!$M7,'EY Data'!$B:$B, 0)),3)))","v":0},{"$f":"IF('Select LAs'!$M7=0,\"-\",IF(INDEX('EY Data'!BG:BG, MATCH('Select LAs'!$M7,'EY Data'!$B:$B, 0))=\"\",\"-\",ROUND(INDEX('EY Data'!BG:BG, MATCH('Select LAs'!$M7,'EY Data'!$B:$B, 0)),0)))","v":77000},{"$f":"IF('Select LAs'!$M7=0,\"-\",IF(INDEX('EY Data'!BJ:BJ, MATCH('Select LAs'!$M7,'EY Data'!$B:$B, 0))=\"\",\"-\",ROUND(INDEX('EY Data'!BJ:BJ, MATCH('Select LAs'!$M7,'EY Data'!$B:$B, 0)),0)))","v":62075},{"$f":"IF('Select LAs'!$M7=0,\"-\",IF(INDEX('EY Data'!BI:BI, MATCH('Select LAs'!$M7,'EY Data'!$B:$B, 0))=\"\",\"-\",ROUND(INDEX('EY Data'!BI:BI, MATCH('Select LAs'!$M7,'EY Data'!$B:$B, 0)),0)))","v":13600},{"$f":"IF('Select LAs'!$M7=0,\"-\",IF(INDEX('EY Data'!BH:BH, MATCH('Select LAs'!$M7,'EY Data'!$B:$B, 0))=\"\",\"-\",ROUND(INDEX('EY Data'!BH:BH, MATCH('Select LAs'!$M7,'EY Data'!$B:$B, 0)),0)))","v":1325}]
["",{"$f":"'Select LAs'!L8","v":"No LA selected"},null,{"$f":"IF('Select LAs'!$M8=0,\"-\",IF(INDEX('EY Data'!AL:AL, MATCH('Select LAs'!$M8,'EY Data'!$B:$B, 0))=\"\",\"-\", ROUND(INDEX('EY Data'!AL:AL, MATCH('Select LAs'!$M8,'EY Data'!$B:$B, 0)),5)))","v":8.35},{"$f":"IF('Select LAs'!$M8=0,\"-\",IF(INDEX('EY Data'!AO:AO, MATCH('Select LAs'!$M8,'EY Data'!$B:$B, 0))=\"\",\"-\", ROUND(INDEX('EY Data'!AO:AO, MATCH('Select LAs'!$M8,'EY Data'!$B:$B, 0)),5)))","v":8.35},{"$f":"IF('Select LAs'!$M8=0,\"-\",IF(INDEX('EY Data'!AN:AN, MATCH('Select LAs'!$M8,'EY Data'!$B:$B, 0))=\"\",\"-\", ROUND(INDEX('EY Data'!AN:AN, MATCH('Select LAs'!$M8,'EY Data'!$B:$B, 0)),5)))","v":8.35},{"$f":"IF('Select LAs'!$M8=0,\"-\",IF(INDEX('EY Data'!AM:AM, MATCH('Select LAs'!$M8,'EY Data'!$B:$B, 0))=\"\",\"-\", ROUND(INDEX('EY Data'!AM:AM, MATCH('Select LAs'!$M8,'EY Data'!$B:$B, 0)),5)))","v":0},{"$f":"IF(OR('Select LAs'!$M8=0,'Select LAs'!$M8=201, 'Select LAs'!$M8=420), \"-\",IF(INDEX('EY Data'!BO:BO, MATCH('Select LAs'!$M8,'EY Data'!$B:$B, 0))=\"-\", \"-\", ROUND(INDEX('EY Data'!BO:BO, MATCH('Select LAs'!$M8,'EY Data'!$B:$B, 0)),3)))","v":0.96299999999999997},{"$f":"IF(OR('Select LAs'!$M8=0,'Select LAs'!$M8=201, 'Select LAs'!$M8=420), \"-\",IF(INDEX('EY Data'!BQ:BQ, MATCH('Select LAs'!$M8,'EY Data'!$B:$B, 0))=\"\", \"-\", ROUND(INDEX('EY Data'!BQ:BQ, MATCH('Select LAs'!$M8,'EY Data'!$B:$B, 0)),3)))","v":5.1999999999999998E-2},{"$f":"IF('Select LAs'!$M8=0,\"-\",IF(INDEX('EY Data'!BG:BG, MATCH('Select LAs'!$M8,'EY Data'!$B:$B, 0))=\"\",\"-\",ROUND(INDEX('EY Data'!BG:BG, MATCH('Select LAs'!$M8,'EY Data'!$B:$B, 0)),0)))","v":206670},{"$f":"IF('Select LAs'!$M8=0,\"-\",IF(INDEX('EY Data'!BJ:BJ, MATCH('Select LAs'!$M8,'EY Data'!$B:$B, 0))=\"\",\"-\",ROUND(INDEX('EY Data'!BJ:BJ, MATCH('Select LAs'!$M8,'EY Data'!$B:$B, 0)),0)))","v":103335},{"$f":"IF('Select LAs'!$M8=0,\"-\",IF(INDEX('EY Data'!BI:BI, MATCH('Select LAs'!$M8,'EY Data'!$B:$B, 0))=\"\",\"-\",ROUND(INDEX('EY Data'!BI:BI, MATCH('Select LAs'!$M8,'EY Data'!$B:$B, 0)),0)))","v":103335},{"$f":"IF('Select LAs'!$M8=0,\"-\",IF(INDEX('EY Data'!BH:BH, MATCH('Select LAs'!$M8,'EY Data'!$B:$B, 0))=\"\",\"-\",ROUND(INDEX('EY Data'!BH:BH, MATCH('Select LAs'!$M8,'EY Data'!$B:$B, 0)),0)))","v":0}]
["",{"$f":"'Select LAs'!L9","v":"No LA selected"},null,{"$f":"IF('Select LAs'!$M9=0,\"-\",IF(INDEX('EY Data'!AL:AL, MATCH('Select LAs'!$M9,'EY Data'!$B:$B, 0))=\"\",\"-\", ROUND(INDEX('EY Data'!AL:AL, MATCH('Select LAs'!$M9,'EY Data'!$B:$B, 0)),5)))","v":8.8122799999999994},{"$f":"IF('Select LAs'!$M9=0,\"-\",IF(INDEX('EY Data'!AO:AO, MATCH('Select LAs'!$M9,'EY Data'!$B:$B, 0))=\"\",\"-\", ROUND(INDEX('EY Data'!AO:AO, MATCH('Select LAs'!$M9,'EY Data'!$B:$B, 0)),5)))","v":8.7893100000000004},{"$f":"IF('Select LAs'!$M9=0,\"-\",IF(INDEX('EY Data'!AN:AN, MATCH('Select LAs'!$M9,'EY Data'!$B:$B, 0))=\"\",\"-\", ROUND(INDEX('EY Data'!AN:AN, MATCH('Select LAs'!$M9,'EY Data'!$B:$B, 0)),5)))","v":8.6796399999999991},{"$f":"IF('Select LAs'!$M9=0,\"-\",IF(INDEX('EY Data'!AM:AM, MATCH('Select LAs'!$M9,'EY Data'!$B:$B, 0))=\"\",\"-\", ROUND(INDEX('EY Data'!AM:AM, MATCH('Select LAs'!$M9,'EY Data'!$B:$B, 0)),5)))","v":8.9574400000000001},{"$f":"IF(OR('Select LAs'!$M9=0,'Select LAs'!$M9=201, 'Select LAs'!$M9=420), \"-\",IF(INDEX('EY Data'!BO:BO, MATCH('Select LAs'!$M9,'EY Data'!$B:$B, 0))=\"-\", \"-\", ROUND(INDEX('EY Data'!BO:BO, MATCH('Select LAs'!$M9,'EY Data'!$B:$B, 0)),3)))","v":0.98399999999999999},{"$f":"IF(OR('Select LAs'!$M9=0,'Select LAs'!$M9=201, 'Select LAs'!$M9=420), \"-\",IF(INDEX('EY Data'!BQ:BQ, MATCH('Select LAs'!$M9,'EY Data'!$B:$B, 0))=\"\", \"-\", ROUND(INDEX('EY Data'!BQ:BQ, MATCH('Select LAs'!$M9,'EY Data'!$B:$B, 0)),3)))","v":3.1E-2},{"$f":"IF('Select LAs'!$M9=0,\"-\",IF(INDEX('EY Data'!BG:BG, MATCH('Select LAs'!$M9,'EY Data'!$B:$B, 0))=\"\",\"-\",ROUND(INDEX('EY Data'!BG:BG, MATCH('Select LAs'!$M9,'EY Data'!$B:$B, 0)),0)))","v":152892},{"$f":"IF('Select LAs'!$M9=0,\"-\",IF(INDEX('EY Data'!BJ:BJ, MATCH('Select LAs'!$M9,'EY Data'!$B:$B, 0))=\"\",\"-\",ROUND(INDEX('EY Data'!BJ:BJ, MATCH('Select LAs'!$M9,'EY Data'!$B:$B, 0)),0)))","v":96184},{"$f":"IF('Select LAs'!$M9=0,\"-\",IF(INDEX('EY Data'!BI:BI, MATCH('Select LAs'!$M9,'EY Data'!$B:$B, 0))=\"\",\"-\",ROUND(INDEX('EY Data'!BI:BI, MATCH('Select LAs'!$M9,'EY Data'!$B:$B, 0)),0)))","v":13118},{"$f":"IF('Select LAs'!$M9=0,\"-\",IF(INDEX('EY Data'!BH:BH, MATCH('Select LAs'!$M9,'EY Data'!$B:$B, 0))=\"\",\"-\",ROUND(INDEX('EY Data'!BH:BH, MATCH('Select LAs'!$M9,'EY Data'!$B:$B, 0)),0)))","v":43590}]
["",{"$f":"'Select LAs'!L10","v":"No LA selected"},null,{"$f":"IF('Select LAs'!$M10=0,\"-\",IF(INDEX('EY Data'!AL:AL, MATCH('Select LAs'!$M10,'EY Data'!$B:$B, 0))=\"\",\"-\", ROUND(INDEX('EY Data'!AL:AL, MATCH('Select LAs'!$M10,'EY Data'!$B:$B, 0)),5)))","v":9.33751},{"$f":"IF('Select LAs'!$M10=0,\"-\",IF(INDEX('EY Data'!AO:AO, MATCH('Select LAs'!$M10,'EY Data'!$B:$B, 0))=\"\",\"-\", ROUND(INDEX('EY Data'!AO:AO, MATCH('Select LAs'!$M10,'EY Data'!$B:$B, 0)),5)))","v":9.4036000000000008},{"$f":"IF('Select LAs'!$M10=0,\"-\",IF(INDEX('EY Data'!AN:AN, MATCH('Select LAs'!$M10,'EY Data'!$B:$B, 0))=\"\",\"-\", ROUND(INDEX('EY Data'!AN:AN, MATCH('Select LAs'!$M10,'EY Data'!$B:$B, 0)),5)))","v":9.15},{"$f":"IF('Select LAs'!$M10=0,\"-\",IF(INDEX('EY Data'!AM:AM, MATCH('Select LAs'!$M10,'EY Data'!$B:$B, 0))=\"\",\"-\", ROUND(INDEX('EY Data'!AM:AM, MATCH('Select LAs'!$M10,'EY Data'!$B:$B, 0)),5)))","v":9.15},{"$f":"IF(OR('Select LAs'!$M10=0,'Select LAs'!$M10=201, 'Select LAs'!$M10=420), \"-\",IF(INDEX('EY Data'!BO:BO, MATCH('Select LAs'!$M10,'EY Data'!$B:$B, 0))=\"-\", \"-\", ROUND(INDEX('EY Data'!BO:BO, MATCH('Select LAs'!$M10,'EY Data'!$B:$B, 0)),3)))","v":0.95099999999999996},{"$f":"IF(OR('Select LAs'!$M10=0,'Select LAs'!$M10=201, 'Select LAs'!$M10=420), \"-\",IF(INDEX('EY Data'!BQ:BQ, MATCH('Select LAs'!$M10,'EY Data'!$B:$B, 0))=\"\", \"-\", ROUND(INDEX('EY Data'!BQ:BQ, MATCH('Select LAs'!$M10,'EY Data'!$B:$B, 0)),3)))","v":1.9E-2},{"$f":"IF('Select LAs'!$M10=0,\"-\",IF(INDEX('EY Data'!BG:BG, MATCH('Select LAs'!$M10,'EY Data'!$B:$B, 0))=\"\",\"-\",ROUND(INDEX('EY Data'!BG:BG, MATCH('Select LAs'!$M10,'EY Data'!$B:$B, 0)),0)))","v":2000},{"$f":"IF('Select LAs'!$M10=0,\"-\",IF(INDEX('EY Data'!BJ:BJ, MATCH('Select LAs'!$M10,'EY Data'!$B:$B, 0))=\"\",\"-\",ROUND(INDEX('EY Data'!BJ:BJ, MATCH('Select LAs'!$M10,'EY Data'!$B:$B, 0)),0)))","v":2000},{"$f":"IF('Select LAs'!$M10=0,\"-\",IF(INDEX('EY Data'!BI:BI, MATCH('Select LAs'!$M10,'EY Data'!$B:$B, 0))=\"\",\"-\",ROUND(INDEX('EY Data'!BI:BI, MATCH('Select LAs'!$M10,'EY Data'!$B:$B, 0)),0)))","v":0},{"$f":"IF('Select LAs'!$M10=0,\"-\",IF(INDEX('EY Data'!BH:BH, MATCH('Select LAs'!$M10,'EY Data'!$B:$B, 0))=\"\",\"-\",ROUND(INDEX('EY Data'!BH:BH, MATCH('Select LAs'!$M10,'EY Data'!$B:$B, 0)),0)))","v":0}]
["",{"$f":"'Select LAs'!L11","v":"No LA selected"},null,{"$f":"IF('Select LAs'!$M11=0,\"-\",IF(INDEX('EY Data'!AL:AL, MATCH('Select LAs'!$M11,'EY Data'!$B:$B, 0))=\"\",\"-\", ROUND(INDEX('EY Data'!AL:AL, MATCH('Select LAs'!$M11,'EY Data'!$B:$B, 0)),5)))","v":8.0183300000000006},{"$f":"IF('Select LAs'!$M11=0,\"-\",IF(INDEX('EY Data'!AO:AO, MATCH('Select LAs'!$M11,'EY Data'!$B:$B, 0))=\"\",\"-\", ROUND(INDEX('EY Data'!AO:AO, MATCH('Select LAs'!$M11,'EY Data'!$B:$B, 0)),5)))","v":8.0160300000000007},{"$f":"IF('Select LAs'!$M11=0,\"-\",IF(INDEX('EY Data'!AN:AN, MATCH('Select LAs'!$M11,'EY Data'!$B:$B, 0))=\"\",\"-\", ROUND(INDEX('EY Data'!AN:AN, MATCH('Select LAs'!$M11,'EY Data'!$B:$B, 0)),5)))","v":0},{"$f":"IF('Select LAs'!$M11=0,\"-\",IF(INDEX('EY Data'!AM:AM, MATCH('Select LAs'!$M11,'EY Data'!$B:$B, 0))=\"\",\"-\", ROUND(INDEX('EY Data'!AM:AM, MATCH('Select LAs'!$M11,'EY Data'!$B:$B, 0)),5)))","v":0},{"$f":"IF(OR('Select LAs'!$M11=0,'Select LAs'!$M11=201, 'Select LAs'!$M11=420), \"-\",IF(INDEX('EY Data'!BO:BO, MATCH('Select LAs'!$M11,'EY Data'!$B:$B, 0))=\"-\", \"-\", ROUND(INDEX('EY Data'!BO:BO, MATCH('Select LAs'!$M11,'EY Data'!$B:$B, 0)),3)))","v":0.95899999999999996},{"$f":"IF(OR('Select LAs'!$M11=0,'Select LAs'!$M11=201, 'Select LAs'!$M11=420), \"-\",IF(INDEX('EY Data'!BQ:BQ, MATCH('Select LAs'!$M11,'EY Data'!$B:$B, 0))=\"\", \"-\", ROUND(INDEX('EY Data'!BQ:BQ, MATCH('Select LAs'!$M11,'EY Data'!$B:$B, 0)),3)))","v":0},{"$f":"IF('Select LAs'!$M11=0,\"-\",IF(INDEX('EY Data'!BG:BG, MATCH('Select LAs'!$M11,'EY Data'!$B:$B, 0))=\"\",\"-\",ROUND(INDEX('EY Data'!BG:BG, MATCH('Select LAs'!$M11,'EY Data'!$B:$B, 0)),0)))","v":10000},{"$f":"IF('Select LAs'!$M11=0,\"-\",IF(INDEX('EY Data'!BJ:BJ, MATCH('Select LAs'!$M11,'EY Data'!$B:$B, 0))=\"\",\"-\",ROUND(INDEX('EY Data'!BJ:BJ, MATCH('Select LAs'!$M11,'EY Data'!$B:$B, 0)),0)))","v":8745},{"$f":"IF('Select LAs'!$M11=0,\"-\",IF(INDEX('EY Data'!BI:BI, MATCH('Select LAs'!$M11,'EY Data'!$B:$B, 0))=\"\",\"-\",ROUND(INDEX('EY Data'!BI:BI, MATCH('Select LAs'!$M11,'EY Data'!$B:$B, 0)),0)))","v":837},{"$f":"IF('Select LAs'!$M11=0,\"-\",IF(INDEX('EY Data'!BH:BH, MATCH('Select LAs'!$M11,'EY Data'!$B:$B, 0))=\"\",\"-\",ROUND(INDEX('EY Data'!BH:BH, MATCH('Select LAs'!$M11,'EY Data'!$B:$B, 0)),0)))","v":419}]
["",{"$f":"'Select LAs'!L12","v":"No LA selected"},null,{"$f":"IF('Select LAs'!$M12=0,\"-\",IF(INDEX('EY Data'!AL:AL, MATCH('Select LAs'!$M12,'EY Data'!$B:$B, 0))=\"\",\"-\", ROUND(INDEX('EY Data'!AL:AL, MATCH('Select LAs'!$M12,'EY Data'!$B:$B, 0)),5)))","v":7.9323199999999998},{"$f":"IF('Select LAs'!$M12=0,\"-\",IF(INDEX('EY Data'!AO:AO, MATCH('Select LAs'!$M12,'EY Data'!$B:$B, 0))=\"\",\"-\", ROUND(INDEX('EY Data'!AO:AO, MATCH('Select LAs'!$M12,'EY Data'!$B:$B, 0)),5)))","v":7.91988},{"$f":"IF('Select LAs'!$M12=0,\"-\",IF(INDEX('EY Data'!AN:AN, MATCH('Select LAs'!$M12,'EY Data'!$B:$B, 0))=\"\",\"-\", ROUND(INDEX('EY Data'!AN:AN, MATCH('Select LAs'!$M12,'EY Data'!$B:$B, 0)),5)))","v":7.9143400000000002},{"$f":"IF('Select LAs'!$M12=0,\"-\",IF(INDEX('EY Data'!AM:AM, MATCH('Select LAs'!$M12,'EY Data'!$B:$B, 0))=\"\",\"-\", ROUND(INDEX('EY Data'!AM:AM, MATCH('Select LAs'!$M12,'EY Data'!$B:$B, 0)),5)))","v":8.0665800000000001},{"$f":"IF(OR('Select LAs'!$M12=0,'Select LAs'!$M12=201, 'Select LAs'!$M12=420), \"-\",IF(INDEX('EY Data'!BO:BO, MATCH('Select LAs'!$M12,'EY Data'!$B:$B, 0))=\"-\", \"-\", ROUND(INDEX('EY Data'!BO:BO, MATCH('Select LAs'!$M12,'EY Data'!$B:$B, 0)),3)))","v":0.95},{"$f":"IF(OR('Select LAs'!$M12=0,'Select LAs'!$M12=201, 'Select LAs'!$M12=420), \"-\",IF(INDEX('EY Data'!BQ:BQ, MATCH('Select LAs'!$M12,'EY Data'!$B:$B, 0))=\"\", \"-\", ROUND(INDEX('EY Data'!BQ:BQ, MATCH('Select LAs'!$M12,'EY Data'!$B:$B, 0)),3)))","v":5.8000000000000003E-2},{"$f":"IF('Select LAs'!$M12=0,\"-\",IF(INDEX('EY Data'!BG:BG, MATCH('Select LAs'!$M12,'EY Data'!$B:$B, 0))=\"\",\"-\",ROUND(INDEX('EY Data'!BG:BG, MATCH('Select LAs'!$M12,'EY Data'!$B:$B, 0)),0)))","v":19902},{"$f":"IF('Select LAs'!$M12=0,\"-\",IF(INDEX('EY Data'!BJ:BJ, MATCH('Select LAs'!$M12,'EY Data'!$B:$B, 0))=\"\",\"-\",ROUND(INDEX('EY Data'!BJ:BJ, MATCH('Select LAs'!$M12,'EY Data'!$B:$B, 0)),0)))","v":11259},{"$f":"IF('Select LAs'!$M12=0,\"-\",IF(INDEX('EY Data'!BI:BI, MATCH('Select LAs'!$M12,'EY Data'!$B:$B, 0))=\"\",\"-\",ROUND(INDEX('EY Data'!BI:BI, MATCH('Select LAs'!$M12,'EY Data'!$B:$B, 0)),0)))","v":379},{"$f":"IF('Select LAs'!$M12=0,\"-\",IF(INDEX('EY Data'!BH:BH, MATCH('Select LAs'!$M12,'EY Data'!$B:$B, 0))=\"\",\"-\",ROUND(INDEX('EY Data'!BH:BH, MATCH('Select LAs'!$M12,'EY Data'!$B:$B, 0)),0)))","v":8265}]
[null,{"$f":"'Select LAs'!L13","v":"No LA selected"},null,{"$f":"IF('Select LAs'!$M13=0,\"-\",IF(INDEX('EY Data'!AL:AL, MATCH('Select LAs'!$M13,'EY Data'!$B:$B, 0))=\"\",\"-\", ROUND(INDEX('EY Data'!AL:AL, MATCH('Select LAs'!$M13,'EY Data'!$B:$B, 0)),5)))","v":7.8059099999999999},{"$f":"IF('Select LAs'!$M13=0,\"-\",IF(INDEX('EY Data'!AO:AO, MATCH('Select LAs'!$M13,'EY Data'!$B:$B, 0))=\"\",\"-\", ROUND(INDEX('EY Data'!AO:AO, MATCH('Select LAs'!$M13,'EY Data'!$B:$B, 0)),5)))","v":7.7387699999999997},{"$f":"IF('Select LAs'!$M13=0,\"-\",IF(INDEX('EY Data'!AN:AN, MATCH('Select LAs'!$M13,'EY Data'!$B:$B, 0))=\"\",\"-\", ROUND(INDEX('EY Data'!AN:AN, MATCH('Select LAs'!$M13,'EY Data'!$B:$B, 0)),5)))","v":7.9690200000000004},{"$f":"IF('Select LAs'!$M13=0,\"-\",IF(INDEX('EY Data'!AM:AM, MATCH('Select LAs'!$M13,'EY Data'!$B:$B, 0))=\"\",\"-\", ROUND(INDEX('EY Data'!AM:AM, MATCH('Select LAs'!$M13,'EY Data'!$B:$B, 0)),5)))","v":7.9439399999999996},{"$f":"IF(OR('Select LAs'!$M13=0,'Select LAs'!$M13=201, 'Select LAs'!$M13=420), \"-\",IF(INDEX('EY Data'!BO:BO, MATCH('Select LAs'!$M13,'EY Data'!$B:$B, 0))=\"-\", \"-\", ROUND(INDEX('EY Data'!BO:BO, MATCH('Select LAs'!$M13,'EY Data'!$B:$B, 0)),3)))","v":0.97},{"$f":"IF(OR('Select LAs'!$M13=0,'Select LAs'!$M13=201, 'Select LAs'!$M13=420), \"-\",IF(INDEX('EY Data'!BQ:BQ, MATCH('Select LAs'!$M13,'EY Data'!$B:$B, 0))=\"\", \"-\", ROUND(INDEX('EY Data'!BQ:BQ, MATCH('Select LAs'!$M13,'EY Data'!$B:$B, 0)),3)))","v":0},{"$f":"IF('Select LAs'!$M13=0,\"-\",IF(INDEX('EY Data'!BG:BG, MATCH('Select LAs'!$M13,'EY Data'!$B:$B, 0))=\"\",\"-\",ROUND(INDEX('EY Data'!BG:BG, MATCH('Select LAs'!$M13,'EY Data'!$B:$B, 0)),0)))","v":172400},{"$f":"IF('Select LAs'!$M13=0,\"-\",IF(INDEX('EY Data'!BJ:BJ, MATCH('Select LAs'!$M13,'EY Data'!$B:$B, 0))=\"\",\"-\",ROUND(INDEX('EY Data'!BJ:BJ, MATCH('Select LAs'!$M13,'EY Data'!$B:$B, 0)),0)))","v":93096},{"$f":"IF('Select LAs'!$M13=0,\"-\",IF(INDEX('EY Data'!BI:BI, MATCH('Select LAs'!$M13,'EY Data'!$B:$B, 0))=\"\",\"-\",ROUND(INDEX('EY Data'!BI:BI, MATCH('Select LAs'!$M13,'EY Data'!$B:$B, 0)),0)))","v":15516},{"$f":"IF('Select LAs'!$M13=0,\"-\",IF(INDEX('EY Data'!BH:BH, MATCH('Select LAs'!$M13,'EY Data'!$B:$B, 0))=\"\",\"-\",ROUND(INDEX('EY Data'!BH:BH, MATCH('Select LAs'!$M13,'EY Data'!$B:$B, 0)),0)))","v":63788}]
[null,"Selection Median",null,{"$f":"IF(COUNT(D$29:D$39)>0,MEDIAN(D$29:D$39),\"-\")","v":8.3800000000000008},8.3800000000000008,7.9690200000000004,{"$f":"IF(COUNT(G$29:G$39)>0,MEDIAN(G$29:G$39),\"-\")","v":8.0665800000000001},{"$f":"IF(COUNT(H$29:H$39)>0,MEDIAN(H$29:H$39),\"-\")","v":0.97},{"$f":"IF(COUNT(I$29:I$39)>0,MEDIAN(I$29:I$39),\"-\")","v":0},{"$f":"IF(COUNT(J$29:J$39)>0,MEDIAN(J$29:J$39),\"-\")","v":77000},{"$f":"IF(COUNT(K$29:K$39)>0,MEDIAN(K$29:K$39),\"-\")","v":62075},837,419]
[null,"Selection Minimum",null,{"$f":"IF(COUNT(D$29:D$39)>0,MIN(D$29:D$39),\"-\")","v":7.8059099999999999},7.7387699999999997,0,{"$f":"IF(COUNT(G$29:G$39)>0,MIN(G$29:G$39),\"-\")","v":0},{"$f":"IF(COUNT(H$29:H$39)>0,MIN(H$29:H$39),\"-\")","v":0.95},{"$f":"IF(COUNT(I$29:I$39)>0,MIN(I$29:I$39),\"-\")","v":0},{"$f":"IF(COUNT(J$29:J$39)>0,MIN(J$29:J$39),\"-\")","v":0},{"$f":"IF(COUNT(K$29:K$39)>0,MIN(K$29:K$39),\"-\")","v":0},0,0]
[null,"Selection Maximum",null,{"$f":"IF(COUNT(D$29:D$39)>0,MAX(D$29:D$39),\"-\")","v":10.568530000000001},10.568530000000001,10.568530000000001,{"$f":"IF(COUNT(G$29:G$39)>0,MAX(G$29:G$39),\"-\")","v":9.47438},{"$f":"IF(COUNT(H$29:H$39)>0,MAX(H$29:H$39),\"-\")","v":0.995},{"$f":"IF(COUNT(I$29:I$39)>0,MAX(I$29:I$39),\"-\")","v":5.8000000000000003E-2},{"$f":"IF(COUNT(J$29:J$39)>0,MAX(J$29:J$39),\"-\")","v":206670},{"$f":"IF(COUNT(K$29:K$39)>0,MAX(K$29:K$39),\"-\")","v":104470},103335,63788]

{"sheet":"2 year olds (W)","index":3,"n_rows":42,"n_cols":13,"rows_kept":42,"cut":false,"hidden":true,"merged":[[43,1,43,11],[4,1,4,2],[22,3,22,4],[26,1,26,2],[25,3,25,6],[6,1,6,2],[5,1,5,2],[25,9,25,12],[7,1,7,2],[25,7,26,7],[25,8,26,8]]}
[]
[null,{"$f":"CONCATENATE('Select LAs'!B3,\" - Key Budget Statistics\")","v":"No LA selected - Key Budget Statistics"},null,null,null,null,null,null,null,null,null,null,{"$f":"'3-4 year olds '!$K$2","v":"Financial Year 2024-2025"}]
[]
[]
[null,{"$f":"'Select LAs'!D3","v":"No LA selected"},null,"All providers","Private, Voluntary, Independent","Nursery schools","Primary nursery places"]
[null,"2 year old hourly average funding rate (£/hr)",null,{"$f":"IFERROR(IF(INDEX('EY Data'!BS:BS, MATCH('Select LAs'!$A$3,'EY Data'!$B:$B, 0))=\"\",\"-\", INDEX('EY Data'!BS:BS, MATCH('Select LAs'!$A$3,'EY Data'!$B:$B, 0))), 0)","v":0},{"$f":"IFERROR(IF(INDEX('EY Data'!BV:BV, MATCH('Select LAs'!$A$3,'EY Data'!$B:$B, 0))=\"\",\"-\", INDEX('EY Data'!BV:BV, MATCH('Select LAs'!$A$3,'EY Data'!$B:$B, 0))), 0)","v":0},{"$f":"IFERROR(IF(INDEX('EY Data'!BU:BU, MATCH('Select LAs'!$A$3,'EY Data'!$B:$B, 0))=\"\",\"-\", INDEX('EY Data'!BU:BU, MATCH('Select LAs'!$A$3,'EY Data'!$B:$B, 0))), 0)","v":0},{"$f":"IFERROR(IF(INDEX('EY Data'!BT:BT, MATCH('Select LAs'!$A$3,'EY Data'!$B:$B, 0))=\"\",\"-\", INDEX('EY Data'!BT:BT, MATCH('Select LAs'!$A$3,'EY Data'!$B:$B, 0))), 0)","v":0}]
[null,"2 year old hourly average base rate (£/hr)",null,{"$f":"IFERROR(IF(INDEX('EY Data'!CF:CF, MATCH('Select LAs'!$A$3,'EY Data'!$B:$B, 0))=\"\",\"-\", INDEX('EY Data'!CF:CF, MATCH('Select LAs'!$A$3,'EY Data'!$B:$B, 0))), 0)","v":0},{"$f":"IFERROR(IF(INDEX('EY Data'!CI:CI, MATCH('Select LAs'!$A$3,'EY Data'!$B:$B, 0))=\"\",\"-\", INDEX('EY Data'!CI:CI, MATCH('Select LAs'!$A$3,'EY Data'!$B:$B, 0))), 0)","v":0},{"$f":"IFERROR(IF(INDEX('EY Data'!CH:CH, MATCH('Select LAs'!$A$3,'EY Data'!$B:$B, 0))=\"\",\"-\", INDEX('EY Data'!CH:CH, MATCH('Select LAs'!$A$3,'EY Data'!$B:$B, 0))), 0)","v":0},{"$f":"IFERROR(IF(INDEX('EY Data'!CG:CG, MATCH('Select LAs'!$A$3,'EY Data'!$B:$B, 0))=\"\",\"-\", INDEX('EY Data'!CG:CG, MATCH('Select LAs'!$A$3,'EY Data'!$B:$B, 0))), 0)","v":0}]
[null,"Pass-through rate (%)",null,{"$f":"IF(OR('Select LAs'!$A$3 = \"LA No\", 'Select LAs'!$A$3 = 201, 'Select LAs'!$A$3 = 420), \"-\", INDEX('EY Data'!CU:CU, MATCH('Select LAs'!$A$3,'EY Data'!$B:$B, 0)))","v":"-"}]
[]
[]
[]
[]
[]
[]
[]
[]
[]
[]
[null,{"$f":"CONCATENATE(\"Benchmarking against \",IF(_SN=1,\"Statistical Neighbours\",\"Manual Selection\"))","v":"Benchmarking against Manual Selection"}]
[]
[]
[]
[null,null,"Table ordering"]
[]
[]
[null,null,null,"Average funding rate to providers per hour",null,null,null,"Pass-through rate","Funding paid through supplements","SEN Inclusion Fund (top-up grant element) budget"]
[null,"Local Authority",null,"All providers","Private, Voluntary, Independent","Nursery schools","Primary nursery places",null,null,"All providers","Private, Voluntary, Independent","Nursery schools","Primary nursery places"]
[null,"England",null,{"$f":"ROUND(INDEX('EY Data'!BS:BS, MATCH($B28,'EY Data'!$C:$C, 0)), 5)","v":7.9558},{"$f":"ROUND(INDEX('EY Data'!BV:BV, MATCH($B28,'EY Data'!$C:$C, 0)), 5)","v":7.93865},{"$f":"ROUND(INDEX('EY Data'!BU:BU, MATCH($B28,'EY Data'!$C:$C, 0)), 5)","v":8.3906799999999997},{"$f":"ROUND(INDEX('EY Data'!BT:BT, MATCH($B28,'EY Data'!$C:$C, 0)), 5)","v":7.8838499999999998},{"$f":"IF(INDEX('EY Data'!CU:CU, MATCH($B28,'EY Data'!$C:$C, 0))=\"-\", \"-\", ROUND(INDEX('EY Data'!CU:CU, MATCH($B28,'EY Data'!$C:$C, 0)), 3))","v":0.97199999999999998},{"$f":"IF(INDEX('EY Data'!CW:CW, MATCH($B28,'EY Data'!$C:$C, 0))=\"-\", \"-\", ROUND(INDEX('EY Data'!CW:CW, MATCH($B28,'EY Data'!$C:$C, 0)), 3))","v":1.2E-2},{"$f":"ROUND(INDEX('EY Data'!CM:CM, MATCH($B28,'EY Data'!$C:$C, 0)), 3)","v":14766272.84},{"$f":"ROUND(INDEX('EY Data'!CP:CP, MATCH($B28,'EY Data'!$C:$C, 0)), 3)","v":12037185.779999999},{"$f":"ROUND(INDEX('EY Data'!CO:CO, MATCH($B28,'EY Data'!$C:$C, 0)), 3)","v":957702.65},{"$f":"ROUND(INDEX('EY Data'!CN:CN, MATCH($B28,'EY Data'!$C:$C, 0)), 3)","v":1771384.41}]
[null,{"$f":"'Select LAs'!Q3","v":"No LA selected"},null,{"$f":"IF('Select LAs'!$R3=0,\"-\",IF(INDEX('EY Data'!BS:BS, MATCH('Select LAs'!$R3,'EY Data'!$B:$B, 0))=\"\",\"-\", ROUND(INDEX('EY Data'!BS:BS, MATCH('Select LAs'!$R3,'EY Data'!$B:$B, 0)),5)))","v":8.7449700000000004},{"$f":"IF('Select LAs'!$R3=0,\"-\",IF(INDEX('EY Data'!BV:BV, MATCH('Select LAs'!$R3,'EY Data'!$B:$B, 0))=\"\",\"-\", ROUND(INDEX('EY Data'!BV:BV, MATCH('Select LAs'!$R3,'EY Data'!$B:$B, 0)),5)))","v":8.7449700000000004},{"$f":"IF('Select LAs'!$R3=0,\"-\",IF(INDEX('EY Data'!BU:BU, MATCH('Select LAs'!$R3,'EY Data'!$B:$B, 0))=\"\",\"-\", ROUND(INDEX('EY Data'!BU:BU, MATCH('Select LAs'!$R3,'EY Data'!$B:$B, 0)),5)))","v":0},{"$f":"IF('Select LAs'!$R3=0,\"-\",IF(INDEX('EY Data'!BT:BT, MATCH('Select LAs'!$R3,'EY Data'!$B:$B, 0))=\"\",\"-\", ROUND(INDEX('EY Data'!BT:BT, MATCH('Select LAs'!$R3,'EY Data'!$B:$B, 0)),5)))","v":0},{"$f":"IF(OR('Select LAs'!$R3=0,'Select LAs'!$R3=201, 'Select LAs'!$R3=420), \"-\",IF(INDEX('EY Data'!CU:CU, MATCH('Select LAs'!$R3,'EY Data'!$B:$B, 0))=\"-\", \"-\", ROUND(INDEX('EY Data'!CU:CU, MATCH('Select LAs'!$R3,'EY Data'!$B:$B, 0)),3)))","v":0.95},{"$f":"IF(OR('Select LAs'!$R3=0,'Select LAs'!$R3=201, 'Select LAs'!$R3=420), \"-\",IF(INDEX('EY Data'!CW:CW, MATCH('Select LAs'!$R3,'EY Data'!$B:$B, 0))=\"\", \"-\", INDEX('EY Data'!CW:CW, MATCH('Select LAs'!$R3,'EY Data'!$B:$B, 0))))","v":0},{"$f":"IF('Select LAs'!$R3=0,\"-\",IF(INDEX('EY Data'!CM:CM, MATCH('Select LAs'!$R3,'EY Data'!$B:$B, 0))=\"\",\"-\",ROUND(INDEX('EY Data'!CM:CM, MATCH('Select LAs'!$R3,'EY Data'!$B:$B, 0)),0)))","v":40000},{"$f":"IF('Select LAs'!$R3=0,\"-\",IF(INDEX('EY Data'!CP:CP, MATCH('Select LAs'!$R3,'EY Data'!$B:$B, 0))=\"\",\"-\",ROUND(INDEX('EY Data'!CP:CP, MATCH('Select LAs'!$R3,'EY Data'!$B:$B, 0)),0)))","v":40000},{"$f":"IF('Select LAs'!$R3=0,\"-\",IF(INDEX('EY Data'!CO:CO, MATCH('Select LAs'!$R3,'EY Data'!$B:$B, 0))=\"\",\"-\",ROUND(INDEX('EY Data'!CO:CO, MATCH('Select LAs'!$R3,'EY Data'!$B:$B, 0)),0)))","v":0},{"$f":"IF('Select LAs'!$R3=0,\"-\",IF(INDEX('EY Data'!CN:CN, MATCH('Select LAs'!$R3,'EY Data'!$B:$B, 0))=\"\",\"-\",ROUND(INDEX('EY Data'!CN:CN, MATCH('Select LAs'!$R3,'EY Data'!$B:$B, 0)),0)))","v":0}]
[null,{"$f":"'Select LAs'!Q4","v":"No LA selected"},null,{"$f":"IF('Select LAs'!$R4=0,\"-\",IF(INDEX('EY Data'!BS:BS, MATCH('Select LAs'!$R4,'EY Data'!$B:$B, 0))=\"\",\"-\", ROUND(INDEX('EY Data'!BS:BS, MATCH('Select LAs'!$R4,'EY Data'!$B:$B, 0)),5)))","v":10.568530000000001},{"$f":"IF('Select LAs'!$R4=0,\"-\",IF(INDEX('EY Data'!BV:BV, MATCH('Select LAs'!$R4,'EY Data'!$B:$B, 0))=\"\",\"-\", ROUND(INDEX('EY Data'!BV:BV, MATCH('Select LAs'!$R4,'EY Data'!$B:$B, 0)),5)))","v":10.568530000000001},{"$f":"IF('Select LAs'!$R4=0,\"-\",IF(INDEX('EY Data'!BU:BU, MATCH('Select LAs'!$R4,'EY Data'!$B:$B, 0))=\"\",\"-\", ROUND(INDEX('EY Data'!BU:BU, MATCH('Select LAs'!$R4,'EY Data'!$B:$B, 0)),5)))","v":10.568530000000001},{"$f":"IF('Select LAs'!$R4=0,\"-\",IF(INDEX('EY Data'!BT:BT, MATCH('Select LAs'!$R4,'EY Data'!$B:$B, 0))=\"\",\"-\", ROUND(INDEX('EY Data'!BT:BT, MATCH('Select LAs'!$R4,'EY Data'!$B:$B, 0)),5)))","v":0},{"$f":"IF(OR('Select LAs'!$R4=0,'Select LAs'!$R4=201, 'Select LAs'!$R4=420), \"-\",IF(INDEX('EY Data'!CU:CU, MATCH('Select LAs'!$R4,'EY Data'!$B:$B, 0))=\"-\", \"-\", ROUND(INDEX('EY Data'!CU:CU, MATCH('Select LAs'!$R4,'EY Data'!$B:$B, 0)),3)))","v":0.97099999999999997},{"$f":"IF(OR('Select LAs'!$R4=0,'Select LAs'!$R4=201, 'Select LAs'!$R4=420), \"-\",IF(INDEX('EY Data'!CW:CW, MATCH('Select LAs'!$R4,'EY Data'!$B:$B, 0))=\"\", \"-\", INDEX('EY Data'!CW:CW, MATCH('Select LAs'!$R4,'EY Data'!$B:$B, 0))))","v":0},{"$f":"IF('Select LAs'!$R4=0,\"-\",IF(INDEX('EY Data'!CM:CM, MATCH('Select LAs'!$R4,'EY Data'!$B:$B, 0))=\"\",\"-\",ROUND(INDEX('EY Data'!CM:CM, MATCH('Select LAs'!$R4,'EY Data'!$B:$B, 0)),0)))","v":155222},{"$f":"IF('Select LAs'!$R4=0,\"-\",IF(INDEX('EY Data'!CP:CP, MATCH('Select LAs'!$R4,'EY Data'!$B:$B, 0))=\"\",\"-\",ROUND(INDEX('EY Data'!CP:CP, MATCH('Select LAs'!$R4,'EY Data'!$B:$B, 0)),0)))","v":128834},{"$f":"IF('Select LAs'!$R4=0,\"-\",IF(INDEX('EY Data'!CO:CO, MATCH('Select LAs'!$R4,'EY Data'!$B:$B, 0))=\"\",\"-\",ROUND(INDEX('EY Data'!CO:CO, MATCH('Select LAs'!$R4,'EY Data'!$B:$B, 0)),0)))","v":26388},{"$f":"IF('Select LAs'!$R4=0,\"-\",IF(INDEX('EY Data'!CN:CN, MATCH('Select LAs'!$R4,'EY Data'!$B:$B, 0))=\"\",\"-\",ROUND(INDEX('EY Data'!CN:CN, MATCH('Select LAs'!$R4,'EY Data'!$B:$B, 0)),0)))","v":0}]
["",{"$f":"'Select LAs'!Q5","v":"No LA selected"},null,{"$f":"IF('Select LAs'!$R5=0,\"-\",IF(INDEX('EY Data'!BS:BS, MATCH('Select LAs'!$R5,'EY Data'!$B:$B, 0))=\"\",\"-\", ROUND(INDEX('EY Data'!BS:BS, MATCH('Select LAs'!$R5,'EY Data'!$B:$B, 0)),5)))","v":9.48},{"$f":"IF('Select LAs'!$R5=0,\"-\",IF(INDEX('EY Data'!BV:BV, MATCH('Select LAs'!$R5,'EY Data'!$B:$B, 0))=\"\",\"-\", ROUND(INDEX('EY Data'!BV:BV, MATCH('Select LAs'!$R5,'EY Data'!$B:$B, 0)),5)))","v":9.4800199999999997},{"$f":"IF('Select LAs'!$R5=0,\"-\",IF(INDEX('EY Data'!BU:BU, MATCH('Select LAs'!$R5,'EY Data'!$B:$B, 0))=\"\",\"-\", ROUND(INDEX('EY Data'!BU:BU, MATCH('Select LAs'!$R5,'EY Data'!$B:$B, 0)),5)))","v":0},{"$f":"IF('Select LAs'!$R5=0,\"-\",IF(INDEX('EY Data'!BT:BT, MATCH('Select LAs'!$R5,'EY Data'!$B:$B, 0))=\"\",\"-\", ROUND(INDEX('EY Data'!BT:BT, MATCH('Select LAs'!$R5,'EY Data'!$B:$B, 0)),5)))","v":9.4742099999999994},{"$f":"IF(OR('Select LAs'!$R5=0,'Select LAs'!$R5=201, 'Select LAs'!$R5=420), \"-\",IF(INDEX('EY Data'!CU:CU, MATCH('Select LAs'!$R5,'EY Data'!$B:$B, 0))=\"-\", \"-\", ROUND(INDEX('EY Data'!CU:CU, MATCH('Select LAs'!$R5,'EY Data'!$B:$B, 0)),3)))","v":0.97},{"$f":"IF(OR('Select LAs'!$R5=0,'Select LAs'!$R5=201, 'Select LAs'!$R5=420), \"-\",IF(INDEX('EY Data'!CW:CW, MATCH('Select LAs'!$R5,'EY Data'!$B:$B, 0))=\"\", \"-\", INDEX('EY Data'!CW:CW, MATCH('Select LAs'!$R5,'EY Data'!$B:$B, 0))))","v":2.0452099031216364E-2},{"$f":"IF('Select LAs'!$R5=0,\"-\",IF(INDEX('EY Data'!CM:CM, MATCH('Select LAs'!$R5,'EY Data'!$B:$B, 0))=\"\",\"-\",ROUND(INDEX('EY Data'!CM:CM, MATCH('Select LAs'!$R5,'EY Data'!$B:$B, 0)),0)))","v":101443},{"$f":"IF('Select LAs'!$R5=0,\"-\",IF(INDEX('EY Data'!CP:CP, MATCH('Select LAs'!$R5,'EY Data'!$B:$B, 0))=\"\",\"-\",ROUND(INDEX('EY Data'!CP:CP, MATCH('Select LAs'!$R5,'EY Data'!$B:$B, 0)),0)))","v":101023},{"$f":"IF('Select LAs'!$R5=0,\"-\",IF(INDEX('EY Data'!CO:CO, MATCH('Select LAs'!$R5,'EY Data'!$B:$B, 0))=\"\",\"-\",ROUND(INDEX('EY Data'!CO:CO, MATCH('Select LAs'!$R5,'EY Data'!$B:$B, 0)),0)))","v":0},{"$f":"IF('Select LAs'!$R5=0,\"-\",IF(INDEX('EY Data'!CN:CN, MATCH('Select LAs'!$R5,'EY Data'!$B:$B, 0))=\"\",\"-\",ROUND(INDEX('EY Data'!CN:CN, MATCH('Select LAs'!$R5,'EY Data'!$B:$B, 0)),0)))","v":420}]
["",{"$f":"'Select LAs'!Q6","v":"No LA selected"},null,{"$f":"IF('Select LAs'!$R6=0,\"-\",IF(INDEX('EY Data'!BS:BS, MATCH('Select LAs'!$R6,'EY Data'!$B:$B, 0))=\"\",\"-\", ROUND(INDEX('EY Data'!BS:BS, MATCH('Select LAs'!$R6,'EY Data'!$B:$B, 0)),5)))","v":8.3800000000000008},{"$f":"IF('Select LAs'!$R6=0,\"-\",IF(INDEX('EY Data'!BV:BV, MATCH('Select LAs'!$R6,'EY Data'!$B:$B, 0))=\"\",\"-\", ROUND(INDEX('EY Data'!BV:BV, MATCH('Select LAs'!$R6,'EY Data'!$B:$B, 0)),5)))","v":8.3800000000000008},{"$f":"IF('Select LAs'!$R6=0,\"-\",IF(INDEX('EY Data'!BU:BU, MATCH('Select LAs'!$R6,'EY Data'!$B:$B, 0))=\"\",\"-\", ROUND(INDEX('EY Data'!BU:BU, MATCH('Select LAs'!$R6,'EY Data'!$B:$B, 0)),5)))","v":0},{"$f":"IF('Select LAs'!$R6=0,\"-\",IF(INDEX('EY Data'!BT:BT, MATCH('Select LAs'!$R6,'EY Data'!$B:$B, 0))=\"\",\"-\", ROUND(INDEX('EY Data'!BT:BT, MATCH('Select LAs'!$R6,'EY Data'!$B:$B, 0)),5)))","v":0},{"$f":"IF(OR('Select LAs'!$R6=0,'Select LAs'!$R6=201, 'Select LAs'!$R6=420), \"-\",IF(INDEX('EY Data'!CU:CU, MATCH('Select LAs'!$R6,'EY Data'!$B:$B, 0))=\"-\", \"-\", ROUND(INDEX('EY Data'!CU:CU, MATCH('Select LAs'!$R6,'EY Data'!$B:$B, 0)),3)))","v":0.98699999999999999},{"$f":"IF(OR('Select LAs'!$R6=0,'Select LAs'!$R6=201, 'Select LAs'!$R6=420), \"-\",IF(INDEX('EY Data'!CW:CW, MATCH('Select LAs'!$R6,'EY Data'!$B:$B, 0))=\"\", \"-\", INDEX('EY Data'!CW:CW, MATCH('Select LAs'!$R6,'EY Data'!$B:$B, 0))))","v":0},{"$f":"IF('Select LAs'!$R6=0,\"-\",IF(INDEX('EY Data'!CM:CM, MATCH('Select LAs'!$R6,'EY Data'!$B:$B, 0))=\"\",\"-\",ROUND(INDEX('EY Data'!CM:CM, MATCH('Select LAs'!$R6,'EY Data'!$B:$B, 0)),0)))","v":0},{"$f":"IF('Select LAs'!$R6=0,\"-\",IF(INDEX('EY Data'!CP:CP, MATCH('Select LAs'!$R6,'EY Data'!$B:$B, 0))=\"\",\"-\",ROUND(INDEX('EY Data'!CP:CP, MATCH('Select LAs'!$R6,'EY Data'!$B:$B, 0)),0)))","v":0},{"$f":"IF('Select LAs'!$R6=0,\"-\",IF(INDEX('EY Data'!CO:CO, MATCH('Select LAs'!$R6,'EY Data'!$B:$B, 0))=\"\",\"-\",ROUND(INDEX('EY Data'!CO:CO, MATCH('Select LAs'!$R6,'EY Data'!$B:$B, 0)),0)))","v":0},{"$f":"IF('Select LAs'!$R6=0,\"-\",IF(INDEX('EY Data'!CN:CN, MATCH('Select LAs'!$R6,'EY Data'!$B:$B, 0))=\"\",\"-\",ROUND(INDEX('EY Data'!CN:CN, MATCH('Select LAs'!$R6,'EY Data'!$B:$B, 0)),0)))","v":0}]
["",{"$f":"'Select LAs'!Q7","v":"No LA selected"},null,{"$f":"IF('Select LAs'!$R7=0,\"-\",IF(INDEX('EY Data'!BS:BS, MATCH('Select LAs'!$R7,'EY Data'!$B:$B, 0))=\"\",\"-\", ROUND(INDEX('EY Data'!BS:BS, MATCH('Select LAs'!$R7,'EY Data'!$B:$B, 0)),5)))","v":8.1491299999999995},{"$f":"IF('Select LAs'!$R7=0,\"-\",IF(INDEX('EY Data'!BV:BV, MATCH('Select LAs'!$R7,'EY Data'!$B:$B, 0))=\"\",\"-\", ROUND(INDEX('EY Data'!BV:BV, MATCH('Select LAs'!$R7,'EY Data'!$B:$B, 0)),5)))","v":8.1842900000000007},{"$f":"IF('Select LAs'!$R7=0,\"-\",IF(INDEX('EY Data'!BU:BU, MATCH('Select LAs'!$R7,'EY Data'!$B:$B, 0))=\"\",\"-\", ROUND(INDEX('EY Data'!BU:BU, MATCH('Select LAs'!$R7,'EY Data'!$B:$B, 0)),5)))","v":7.9852100000000004},{"$f":"IF('Select LAs'!$R7=0,\"-\",IF(INDEX('EY Data'!BT:BT, MATCH('Select LAs'!$R7,'EY Data'!$B:$B, 0))=\"\",\"-\", ROUND(INDEX('EY Data'!BT:BT, MATCH('Select LAs'!$R7,'EY Data'!$B:$B, 0)),5)))","v":8.1842699999999997},{"$f":"IF(OR('Select LAs'!$R7=0,'Select LAs'!$R7=201, 'Select LAs'!$R7=420), \"-\",IF(INDEX('EY Data'!CU:CU, MATCH('Select LAs'!$R7,'EY Data'!$B:$B, 0))=\"-\", \"-\", ROUND(INDEX('EY Data'!CU:CU, MATCH('Select LAs'!$R7,'EY Data'!$B:$B, 0)),3)))","v":0.97399999999999998},{"$f":"IF(OR('Select LAs'!$R7=0,'Select LAs'!$R7=201, 'Select LAs'!$R7=420), \"-\",IF(INDEX('EY Data'!CW:CW, MATCH('Select LAs'!$R7,'EY Data'!$B:$B, 0))=\"\", \"-\", INDEX('EY Data'!CW:CW, MATCH('Select LAs'!$R7,'EY Data'!$B:$B, 0))))","v":0},{"$f":"IF('Select LAs'!$R7=0,\"-\",IF(INDEX('EY Data'!CM:CM, MATCH('Select LAs'!$R7,'EY Data'!$B:$B, 0))=\"\",\"-\",ROUND(INDEX('EY Data'!CM:CM, MATCH('Select LAs'!$R7,'EY Data'!$B:$B, 0)),0)))","v":65499},{"$f":"IF('Select LAs'!$R7=0,\"-\",IF(INDEX('EY Data'!CP:CP, MATCH('Select LAs'!$R7,'EY Data'!$B:$B, 0))=\"\",\"-\",ROUND(INDEX('EY Data'!CP:CP, MATCH('Select LAs'!$R7,'EY Data'!$B:$B, 0)),0)))","v":63169},{"$f":"IF('Select LAs'!$R7=0,\"-\",IF(INDEX('EY Data'!CO:CO, MATCH('Select LAs'!$R7,'EY Data'!$B:$B, 0))=\"\",\"-\",ROUND(INDEX('EY Data'!CO:CO, MATCH('Select LAs'!$R7,'EY Data'!$B:$B, 0)),0)))","v":982},{"$f":"IF('Select LAs'!$R7=0,\"-\",IF(INDEX('EY Data'!CN:CN, MATCH('Select LAs'!$R7,'EY Data'!$B:$B, 0))=\"\",\"-\",ROUND(INDEX('EY Data'!CN:CN, MATCH('Select LAs'!$R7,'EY Data'!$B:$B, 0)),0)))","v":1348}]
["",{"$f":"'Select LAs'!Q8","v":"No LA selected"},null,{"$f":"IF('Select LAs'!$R8=0,\"-\",IF(INDEX('EY Data'!BS:BS, MATCH('Select LAs'!$R8,'EY Data'!$B:$B, 0))=\"\",\"-\", ROUND(INDEX('EY Data'!BS:BS, MATCH('Select LAs'!$R8,'EY Data'!$B:$B, 0)),5)))","v":8.3291400000000007},{"$f":"IF('Select LAs'!$R8=0,\"-\",IF(INDEX('EY Data'!BV:BV, MATCH('Select LAs'!$R8,'EY Data'!$B:$B, 0))=\"\",\"-\", ROUND(INDEX('EY Data'!BV:BV, MATCH('Select LAs'!$R8,'EY Data'!$B:$B, 0)),5)))","v":8.3291400000000007},{"$f":"IF('Select LAs'!$R8=0,\"-\",IF(INDEX('EY Data'!BU:BU, MATCH('Select LAs'!$R8,'EY Data'!$B:$B, 0))=\"\",\"-\", ROUND(INDEX('EY Data'!BU:BU, MATCH('Select LAs'!$R8,'EY Data'!$B:$B, 0)),5)))","v":8.3291400000000007},{"$f":"IF('Select LAs'!$R8=0,\"-\",IF(INDEX('EY Data'!BT:BT, MATCH('Select LAs'!$R8,'EY Data'!$B:$B, 0))=\"\",\"-\", ROUND(INDEX('EY Data'!BT:BT, MATCH('Select LAs'!$R8,'EY Data'!$B:$B, 0)),5)))","v":0},{"$f":"IF(OR('Select LAs'!$R8=0,'Select LAs'!$R8=201, 'Select LAs'!$R8=420), \"-\",IF(INDEX('EY Data'!CU:CU, MATCH('Select LAs'!$R8,'EY Data'!$B:$B, 0))=\"-\", \"-\", ROUND(INDEX('EY Data'!CU:CU, MATCH('Select LAs'!$R8,'EY Data'!$B:$B, 0)),3)))","v":0.96099999999999997},{"$f":"IF(OR('Select LAs'!$R8=0,'Select LAs'!$R8=201, 'Select LAs'!$R8=420), \"-\",IF(INDEX('EY Data'!CW:CW, MATCH('Select LAs'!$R8,'EY Data'!$B:$B, 0))=\"\", \"-\", INDEX('EY Data'!CW:CW, MATCH('Select LAs'!$R8,'EY Data'!$B:$B, 0))))","v":5.2058111729527276E-2},{"$f":"IF('Select LAs'!$R8=0,\"-\",IF(INDEX('EY Data'!CM:CM, MATCH('Select LAs'!$R8,'EY Data'!$B:$B, 0))=\"\",\"-\",ROUND(INDEX('EY Data'!CM:CM, MATCH('Select LAs'!$R8,'EY Data'!$B:$B, 0)),0)))","v":128789},{"$f":"IF('Select LAs'!$R8=0,\"-\",IF(INDEX('EY Data'!CP:CP, MATCH('Select LAs'!$R8,'EY Data'!$B:$B, 0))=\"\",\"-\",ROUND(INDEX('EY Data'!CP:CP, MATCH('Select LAs'!$R8,'EY Data'!$B:$B, 0)),0)))","v":64395},{"$f":"IF('Select LAs'!$R8=0,\"-\",IF(INDEX('EY Data'!CO:CO, MATCH('Select LAs'!$R8,'EY Data'!$B:$B, 0))=\"\",\"-\",ROUND(INDEX('EY Data'!CO:CO, MATCH('Select LAs'!$R8,'EY Data'!$B:$B, 0)),0)))","v":64395},{"$f":"IF('Select LAs'!$R8=0,\"-\",IF(INDEX('EY Data'!CN:CN, MATCH('Select LAs'!$R8,'EY Data'!$B:$B, 0))=\"\",\"-\",ROUND(INDEX('EY Data'!CN:CN, MATCH('Select LAs'!$R8,'EY Data'!$B:$B, 0)),0)))","v":0}]
["",{"$f":"'Select LAs'!Q9","v":"No LA selected"},null,{"$f":"IF('Select LAs'!$R9=0,\"-\",IF(INDEX('EY Data'!BS:BS, MATCH('Select LAs'!$R9,'EY Data'!$B:$B, 0))=\"\",\"-\", ROUND(INDEX('EY Data'!BS:BS, MATCH('Select LAs'!$R9,'EY Data'!$B:$B, 0)),5)))","v":8.5500000000000007},{"$f":"IF('Select LAs'!$R9=0,\"-\",IF(INDEX('EY Data'!BV:BV, MATCH('Select LAs'!$R9,'EY Data'!$B:$B, 0))=\"\",\"-\", ROUND(INDEX('EY Data'!BV:BV, MATCH('Select LAs'!$R9,'EY Data'!$B:$B, 0)),5)))","v":8.5500000000000007},{"$f":"IF('Select LAs'!$R9=0,\"-\",IF(INDEX('EY Data'!BU:BU, MATCH('Select LAs'!$R9,'EY Data'!$B:$B, 0))=\"\",\"-\", ROUND(INDEX('EY Data'!BU:BU, MATCH('Select LAs'!$R9,'EY Data'!$B:$B, 0)),5)))","v":8.5500000000000007},{"$f":"IF('Select LAs'!$R9=0,\"-\",IF(INDEX('EY Data'!BT:BT, MATCH('Select LAs'!$R9,'EY Data'!$B:$B, 0))=\"\",\"-\", ROUND(INDEX('EY Data'!BT:BT, MATCH('Select LAs'!$R9,'EY Data'!$B:$B, 0)),5)))","v":8.5500000000000007},{"$f":"IF(OR('Select LAs'!$R9=0,'Select LAs'!$R9=201, 'Select LAs'!$R9=420), \"-\",IF(INDEX('EY Data'!CU:CU, MATCH('Select LAs'!$R9,'EY Data'!$B:$B, 0))=\"-\", \"-\", ROUND(INDEX('EY Data'!CU:CU, MATCH('Select LAs'!$R9,'EY Data'!$B:$B, 0)),3)))","v":0.95},{"$f":"IF(OR('Select LAs'!$R9=0,'Select LAs'!$R9=201, 'Select LAs'!$R9=420), \"-\",IF(INDEX('EY Data'!CW:CW, MATCH('Select LAs'!$R9,'EY Data'!$B:$B, 0))=\"\", \"-\", INDEX('EY Data'!CW:CW, MATCH('Select LAs'!$R9,'EY Data'!$B:$B, 0))))","v":0},{"$f":"IF('Select LAs'!$R9=0,\"-\",IF(INDEX('EY Data'!CM:CM, MATCH('Select LAs'!$R9,'EY Data'!$B:$B, 0))=\"\",\"-\",ROUND(INDEX('EY Data'!CM:CM, MATCH('Select LAs'!$R9,'EY Data'!$B:$B, 0)),0)))","v":282786},{"$f":"IF('Select LAs'!$R9=0,\"-\",IF(INDEX('EY Data'!CP:CP, MATCH('Select LAs'!$R9,'EY Data'!$B:$B, 0))=\"\",\"-\",ROUND(INDEX('EY Data'!CP:CP, MATCH('Select LAs'!$R9,'EY Data'!$B:$B, 0)),0)))","v":267233},{"$f":"IF('Select LAs'!$R9=0,\"-\",IF(INDEX('EY Data'!CO:CO, MATCH('Select LAs'!$R9,'EY Data'!$B:$B, 0))=\"\",\"-\",ROUND(INDEX('EY Data'!CO:CO, MATCH('Select LAs'!$R9,'EY Data'!$B:$B, 0)),0)))","v":1414},{"$f":"IF('Select LAs'!$R9=0,\"-\",IF(INDEX('EY Data'!CN:CN, MATCH('Select LAs'!$R9,'EY Data'!$B:$B, 0))=\"\",\"-\",ROUND(INDEX('EY Data'!CN:CN, MATCH('Select LAs'!$R9,'EY Data'!$B:$B, 0)),0)))","v":14139}]
["",{"$f":"'Select LAs'!Q10","v":"No LA selected"},null,{"$f":"IF('Select LAs'!$R10=0,\"-\",IF(INDEX('EY Data'!BS:BS, MATCH('Select LAs'!$R10,'EY Data'!$B:$B, 0))=\"\",\"-\", ROUND(INDEX('EY Data'!BS:BS, MATCH('Select LAs'!$R10,'EY Data'!$B:$B, 0)),5)))","v":9.3369300000000006},{"$f":"IF('Select LAs'!$R10=0,\"-\",IF(INDEX('EY Data'!BV:BV, MATCH('Select LAs'!$R10,'EY Data'!$B:$B, 0))=\"\",\"-\", ROUND(INDEX('EY Data'!BV:BV, MATCH('Select LAs'!$R10,'EY Data'!$B:$B, 0)),5)))","v":9.3369300000000006},{"$f":"IF('Select LAs'!$R10=0,\"-\",IF(INDEX('EY Data'!BU:BU, MATCH('Select LAs'!$R10,'EY Data'!$B:$B, 0))=\"\",\"-\", ROUND(INDEX('EY Data'!BU:BU, MATCH('Select LAs'!$R10,'EY Data'!$B:$B, 0)),5)))","v":0},{"$f":"IF('Select LAs'!$R10=0,\"-\",IF(INDEX('EY Data'!BT:BT, MATCH('Select LAs'!$R10,'EY Data'!$B:$B, 0))=\"\",\"-\", ROUND(INDEX('EY Data'!BT:BT, MATCH('Select LAs'!$R10,'EY Data'!$B:$B, 0)),5)))","v":0},{"$f":"IF(OR('Select LAs'!$R10=0,'Select LAs'!$R10=201, 'Select LAs'!$R10=420), \"-\",IF(INDEX('EY Data'!CU:CU, MATCH('Select LAs'!$R10,'EY Data'!$B:$B, 0))=\"-\", \"-\", ROUND(INDEX('EY Data'!CU:CU, MATCH('Select LAs'!$R10,'EY Data'!$B:$B, 0)),3)))","v":0.95099999999999996},{"$f":"IF(OR('Select LAs'!$R10=0,'Select LAs'!$R10=201, 'Select LAs'!$R10=420), \"-\",IF(INDEX('EY Data'!CW:CW, MATCH('Select LAs'!$R10,'EY Data'!$B:$B, 0))=\"\", \"-\", INDEX('EY Data'!CW:CW, MATCH('Select LAs'!$R10,'EY Data'!$B:$B, 0))))","v":1.9187479069059207E-2},{"$f":"IF('Select LAs'!$R10=0,\"-\",IF(INDEX('EY Data'!CM:CM, MATCH('Select LAs'!$R10,'EY Data'!$B:$B, 0))=\"\",\"-\",ROUND(INDEX('EY Data'!CM:CM, MATCH('Select LAs'!$R10,'EY Data'!$B:$B, 0)),0)))","v":2000},{"$f":"IF('Select LAs'!$R10=0,\"-\",IF(INDEX('EY Data'!CP:CP, MATCH('Select LAs'!$R10,'EY Data'!$B:$B, 0))=\"\",\"-\",ROUND(INDEX('EY Data'!CP:CP, MATCH('Select LAs'!$R10,'EY Data'!$B:$B, 0)),0)))","v":2000},{"$f":"IF('Select LAs'!$R10=0,\"-\",IF(INDEX('EY Data'!CO:CO, MATCH('Select LAs'!$R10,'EY Data'!$B:$B, 0))=\"\",\"-\",ROUND(INDEX('EY Data'!CO:CO, MATCH('Select LAs'!$R10,'EY Data'!$B:$B, 0)),0)))","v":0},{"$f":"IF('Select LAs'!$R10=0,\"-\",IF(INDEX('EY Data'!CN:CN, MATCH('Select LAs'!$R10,'EY Data'!$B:$B, 0))=\"\",\"-\",ROUND(INDEX('EY Data'!CN:CN, MATCH('Select LAs'!$R10,'EY Data'!$B:$B, 0)),0)))","v":0}]
["",{"$f":"'Select LAs'!Q11","v":"No LA selected"},null,{"$f":"IF('Select LAs'!$R11=0,\"-\",IF(INDEX('EY Data'!BS:BS, MATCH('Select LAs'!$R11,'EY Data'!$B:$B, 0))=\"\",\"-\", ROUND(INDEX('EY Data'!BS:BS, MATCH('Select LAs'!$R11,'EY Data'!$B:$B, 0)),5)))","v":8.0191499999999998},{"$f":"IF('Select LAs'!$R11=0,\"-\",IF(INDEX('EY Data'!BV:BV, MATCH('Select LAs'!$R11,'EY Data'!$B:$B, 0))=\"\",\"-\", ROUND(INDEX('EY Data'!BV:BV, MATCH('Select LAs'!$R11,'EY Data'!$B:$B, 0)),5)))","v":8.0167400000000004},{"$f":"IF('Select LAs'!$R11=0,\"-\",IF(INDEX('EY Data'!BU:BU, MATCH('Select LAs'!$R11,'EY Data'!$B:$B, 0))=\"\",\"-\", ROUND(INDEX('EY Data'!BU:BU, MATCH('Select LAs'!$R11,'EY Data'!$B:$B, 0)),5)))","v":0},{"$f":"IF('Select LAs'!$R11=0,\"-\",IF(INDEX('EY Data'!BT:BT, MATCH('Select LAs'!$R11,'EY Data'!$B:$B, 0))=\"\",\"-\", ROUND(INDEX('EY Data'!BT:BT, MATCH('Select LAs'!$R11,'EY Data'!$B:$B, 0)),5)))","v":0},{"$f":"IF(OR('Select LAs'!$R11=0,'Select LAs'!$R11=201, 'Select LAs'!$R11=420), \"-\",IF(INDEX('EY Data'!CU:CU, MATCH('Select LAs'!$R11,'EY Data'!$B:$B, 0))=\"-\", \"-\", ROUND(INDEX('EY Data'!CU:CU, MATCH('Select LAs'!$R11,'EY Data'!$B:$B, 0)),3)))","v":0.95899999999999996},{"$f":"IF(OR('Select LAs'!$R11=0,'Select LAs'!$R11=201, 'Select LAs'!$R11=420), \"-\",IF(INDEX('EY Data'!CW:CW, MATCH('Select LAs'!$R11,'EY Data'!$B:$B, 0))=\"\", \"-\", INDEX('EY Data'!CW:CW, MATCH('Select LAs'!$R11,'EY Data'!$B:$B, 0))))","v":0},{"$f":"IF('Select LAs'!$R11=0,\"-\",IF(INDEX('EY Data'!CM:CM, MATCH('Select LAs'!$R11,'EY Data'!$B:$B, 0))=\"\",\"-\",ROUND(INDEX('EY Data'!CM:CM, MATCH('Select LAs'!$R11,'EY Data'!$B:$B, 0)),0)))","v":10000},{"$f":"IF('Select LAs'!$R11=0,\"-\",IF(INDEX('EY Data'!CP:CP, MATCH('Select LAs'!$R11,'EY Data'!$B:$B, 0))=\"\",\"-\",ROUND(INDEX('EY Data'!CP:CP, MATCH('Select LAs'!$R11,'EY Data'!$B:$B, 0)),0)))","v":8745},{"$f":"IF('Select LAs'!$R11=0,\"-\",IF(INDEX('EY Data'!CO:CO, MATCH('Select LAs'!$R11,'EY Data'!$B:$B, 0))=\"\",\"-\",ROUND(INDEX('EY Data'!CO:CO, MATCH('Select LAs'!$R11,'EY Data'!$B:$B, 0)),0)))","v":837},{"$f":"IF('Select LAs'!$R11=0,\"-\",IF(INDEX('EY Data'!CN:CN, MATCH('Select LAs'!$R11,'EY Data'!$B:$B, 0))=\"\",\"-\",ROUND(INDEX('EY Data'!CN:CN, MATCH('Select LAs'!$R11,'EY Data'!$B:$B, 0)),0)))","v":419}]
["",{"$f":"'Select LAs'!Q12","v":"No LA selected"},null,{"$f":"IF('Select LAs'!$R12=0,\"-\",IF(INDEX('EY Data'!BS:BS, MATCH('Select LAs'!$R12,'EY Data'!$B:$B, 0))=\"\",\"-\", ROUND(INDEX('EY Data'!BS:BS, MATCH('Select LAs'!$R12,'EY Data'!$B:$B, 0)),5)))","v":8.0325799999999994},{"$f":"IF('Select LAs'!$R12=0,\"-\",IF(INDEX('EY Data'!BV:BV, MATCH('Select LAs'!$R12,'EY Data'!$B:$B, 0))=\"\",\"-\", ROUND(INDEX('EY Data'!BV:BV, MATCH('Select LAs'!$R12,'EY Data'!$B:$B, 0)),5)))","v":8.0191300000000005},{"$f":"IF('Select LAs'!$R12=0,\"-\",IF(INDEX('EY Data'!BU:BU, MATCH('Select LAs'!$R12,'EY Data'!$B:$B, 0))=\"\",\"-\", ROUND(INDEX('EY Data'!BU:BU, MATCH('Select LAs'!$R12,'EY Data'!$B:$B, 0)),5)))","v":8.0131399999999999},{"$f":"IF('Select LAs'!$R12=0,\"-\",IF(INDEX('EY Data'!BT:BT, MATCH('Select LAs'!$R12,'EY Data'!$B:$B, 0))=\"\",\"-\", ROUND(INDEX('EY Data'!BT:BT, MATCH('Select LAs'!$R12,'EY Data'!$B:$B, 0)),5)))","v":8.1777099999999994},{"$f":"IF(OR('Select LAs'!$R12=0,'Select LAs'!$R12=201, 'Select LAs'!$R12=420), \"-\",IF(INDEX('EY Data'!CU:CU, MATCH('Select LAs'!$R12,'EY Data'!$B:$B, 0))=\"-\", \"-\", ROUND(INDEX('EY Data'!CU:CU, MATCH('Select LAs'!$R12,'EY Data'!$B:$B, 0)),3)))","v":0.96199999999999997},{"$f":"IF(OR('Select LAs'!$R12=0,'Select LAs'!$R12=201, 'Select LAs'!$R12=420), \"-\",IF(INDEX('EY Data'!CW:CW, MATCH('Select LAs'!$R12,'EY Data'!$B:$B, 0))=\"\", \"-\", INDEX('EY Data'!CW:CW, MATCH('Select LAs'!$R12,'EY Data'!$B:$B, 0))))","v":6.9361378067442067E-2},{"$f":"IF('Select LAs'!$R12=0,\"-\",IF(INDEX('EY Data'!CM:CM, MATCH('Select LAs'!$R12,'EY Data'!$B:$B, 0))=\"\",\"-\",ROUND(INDEX('EY Data'!CM:CM, MATCH('Select LAs'!$R12,'EY Data'!$B:$B, 0)),0)))","v":26098},{"$f":"IF('Select LAs'!$R12=0,\"-\",IF(INDEX('EY Data'!CP:CP, MATCH('Select LAs'!$R12,'EY Data'!$B:$B, 0))=\"\",\"-\",ROUND(INDEX('EY Data'!CP:CP, MATCH('Select LAs'!$R12,'EY Data'!$B:$B, 0)),0)))","v":14764},{"$f":"IF('Select LAs'!$R12=0,\"-\",IF(INDEX('EY Data'!CO:CO, MATCH('Select LAs'!$R12,'EY Data'!$B:$B, 0))=\"\",\"-\",ROUND(INDEX('EY Data'!CO:CO, MATCH('Select LAs'!$R12,'EY Data'!$B:$B, 0)),0)))","v":496},{"$f":"IF('Select LAs'!$R12=0,\"-\",IF(INDEX('EY Data'!CN:CN, MATCH('Select LAs'!$R12,'EY Data'!$B:$B, 0))=\"\",\"-\",ROUND(INDEX('EY Data'!CN:CN, MATCH('Select LAs'!$R12,'EY Data'!$B:$B, 0)),0)))","v":10837}]
[null,{"$f":"'Select LAs'!Q13","v":"No LA selected"},null,{"$f":"IF('Select LAs'!$R13=0,\"-\",IF(INDEX('EY Data'!BS:BS, MATCH('Select LAs'!$R13,'EY Data'!$B:$B, 0))=\"\",\"-\", ROUND(INDEX('EY Data'!BS:BS, MATCH('Select LAs'!$R13,'EY Data'!$B:$B, 0)),5)))","v":7.8106099999999996},{"$f":"IF('Select LAs'!$R13=0,\"-\",IF(INDEX('EY Data'!BV:BV, MATCH('Select LAs'!$R13,'EY Data'!$B:$B, 0))=\"\",\"-\", ROUND(INDEX('EY Data'!BV:BV, MATCH('Select LAs'!$R13,'EY Data'!$B:$B, 0)),5)))","v":7.61273},{"$f":"IF('Select LAs'!$R13=0,\"-\",IF(INDEX('EY Data'!BU:BU, MATCH('Select LAs'!$R13,'EY Data'!$B:$B, 0))=\"\",\"-\", ROUND(INDEX('EY Data'!BU:BU, MATCH('Select LAs'!$R13,'EY Data'!$B:$B, 0)),5)))","v":9.4368099999999995},{"$f":"IF('Select LAs'!$R13=0,\"-\",IF(INDEX('EY Data'!BT:BT, MATCH('Select LAs'!$R13,'EY Data'!$B:$B, 0))=\"\",\"-\", ROUND(INDEX('EY Data'!BT:BT, MATCH('Select LAs'!$R13,'EY Data'!$B:$B, 0)),5)))","v":11.6463},{"$f":"IF(OR('Select LAs'!$R13=0,'Select LAs'!$R13=201, 'Select LAs'!$R13=420), \"-\",IF(INDEX('EY Data'!CU:CU, MATCH('Select LAs'!$R13,'EY Data'!$B:$B, 0))=\"-\", \"-\", ROUND(INDEX('EY Data'!CU:CU, MATCH('Select LAs'!$R13,'EY Data'!$B:$B, 0)),3)))","v":0.97},{"$f":"IF(OR('Select LAs'!$R13=0,'Select LAs'!$R13=201, 'Select LAs'!$R13=420), \"-\",IF(INDEX('EY Data'!CW:CW, MATCH('Select LAs'!$R13,'EY Data'!$B:$B, 0))=\"\", \"-\", INDEX('EY Data'!CW:CW, MATCH('Select LAs'!$R13,'EY Data'!$B:$B, 0))))","v":1.1616383050907852E-2},{"$f":"IF('Select LAs'!$R13=0,\"-\",IF(INDEX('EY Data'!CM:CM, MATCH('Select LAs'!$R13,'EY Data'!$B:$B, 0))=\"\",\"-\",ROUND(INDEX('EY Data'!CM:CM, MATCH('Select LAs'!$R13,'EY Data'!$B:$B, 0)),0)))","v":323600},{"$f":"IF('Select LAs'!$R13=0,\"-\",IF(INDEX('EY Data'!CP:CP, MATCH('Select LAs'!$R13,'EY Data'!$B:$B, 0))=\"\",\"-\",ROUND(INDEX('EY Data'!CP:CP, MATCH('Select LAs'!$R13,'EY Data'!$B:$B, 0)),0)))","v":174744},{"$f":"IF('Select LAs'!$R13=0,\"-\",IF(INDEX('EY Data'!CO:CO, MATCH('Select LAs'!$R13,'EY Data'!$B:$B, 0))=\"\",\"-\",ROUND(INDEX('EY Data'!CO:CO, MATCH('Select LAs'!$R13,'EY Data'!$B:$B, 0)),0)))","v":29124},{"$f":"IF('Select LAs'!$R13=0,\"-\",IF(INDEX('EY Data'!CN:CN, MATCH('Select LAs'!$R13,'EY Data'!$B:$B, 0))=\"\",\"-\",ROUND(INDEX('EY Data'!CN:CN, MATCH('Select LAs'!$R13,'EY Data'!$B:$B, 0)),0)))","v":119732}]
[null,"Selection Median",null,{"$f":"IF(COUNT(D$29:D$39)>0,MEDIAN(D$29:D$39),\"-\")","v":8.3800000000000008},8.3800000000000008,7.9852100000000004,{"$f":"IF(COUNT(G$29:G$39)>0,MEDIAN(G$29:G$39),\"-\")","v":0},{"$f":"IF(COUNT(H$29:H$39)>0,MEDIAN(H$29:H$39),\"-\")","v":0.96199999999999997},{"$f":"IF(COUNT(I$29:I$39)>0,MEDIAN(I$29:I$39),\"-\")","v":0},{"$f":"IF(COUNT(J$29:J$39)>0,MEDIAN(J$29:J$39),\"-\")","v":65499},{"$f":"IF(COUNT(K$29:K$39)>0,MEDIAN(K$29:K$39),\"-\")","v":63169},837,419]
[null,"Selection Minimum",null,{"$f":"IF(COUNT(D$29:D$39)>0,MIN(D$29:D$39),\"-\")","v":7.8106099999999996},7.61273,0,{"$f":"IF(COUNT(G$29:G$39)>0,MIN(G$29:G$39),\"-\")","v":0},{"$f":"IF(COUNT(H$29:H$39)>0,MIN(H$29:H$39),\"-\")","v":0.95},{"$f":"IF(COUNT(I$29:I$39)>0,MIN(I$29:I$39),\"-\")","v":0},{"$f":"IF(COUNT(J$29:J$39)>0,MIN(J$29:J$39),\"-\")","v":0},{"$f":"IF(COUNT(K$29:K$39)>0,MIN(K$29:K$39),\"-\")","v":0},0,0]
[null,"Selection Maximum",null,{"$f":"IF(COUNT(D$29:D$39)>0,MAX(D$29:D$39),\"-\")","v":10.568530000000001},10.568530000000001,10.568530000000001,{"$f":"IF(COUNT(G$29:G$39)>0,MAX(G$29:G$39),\"-\")","v":11.6463},{"$f":"IF(COUNT(H$29:H$39)>0,MAX(H$29:H$39),\"-\")","v":0.98699999999999999},{"$f":"IF(COUNT(I$29:I$39)>0,MAX(I$29:I$39),\"-\")","v":6.9361378067442067E-2},{"$f":"IF(COUNT(J$29:J$39)>0,MAX(J$29:J$39),\"-\")","v":323600},{"$f":"IF(COUNT(K$29:K$39)>0,MAX(K$29:K$39),\"-\")","v":267233},64395,119732]

{"sheet":"9mth - 2 year","index":4,"n_rows":42,"n_cols":13,"rows_kept":42,"cut":false,"hidden":true,"merged":[[26,1,26,2],[43,1,43,11],[4,1,4,2],[5,1,5,2],[6,1,6,2],[22,3,22,4],[25,3,25,6],[25,9,25,12],[7,1,7,2],[25,7,26,7],[25,8,26,8]]}
[]
[null,{"$f":"CONCATENATE('Select LAs'!B3,\" - Key Budget Statistics\")","v":"No LA selected - Key Budget Statistics"},null,null,null,null,null,null,null,null,null,null,{"$f":"'3-4 year olds '!$K$2","v":"Financial Year 2024-2025"}]
[]
[]
[null,{"$f":"'Select LAs'!D3","v":"No LA selected"},null,"All providers","Private, Voluntary, Independent","Nursery schools","Primary nursery places"]
[null,"9mth - 2 year old hourly average funding rate (£/hr)",null,{"$f":"IFERROR(IF(INDEX('EY Data'!CY:CY, MATCH('Select LAs'!$A$3,'EY Data'!$B:$B, 0))=\"\",\"-\", INDEX('EY Data'!CY:CY, MATCH('Select LAs'!$A$3,'EY Data'!$B:$B, 0))), 0)","v":0},{"$f":"IFERROR(IF(INDEX('EY Data'!DB:DB, MATCH('Select LAs'!$A$3,'EY Data'!$B:$B, 0))=\"\",\"-\", INDEX('EY Data'!DB:DB, MATCH('Select LAs'!$A$3,'EY Data'!$B:$B, 0))), 0)","v":0},{"$f":"IFERROR(IF(INDEX('EY Data'!DA:DA, MATCH('Select LAs'!$A$3,'EY Data'!$B:$B, 0))=\"\",\"-\", INDEX('EY Data'!DA:DA, MATCH('Select LAs'!$A$3,'EY Data'!$B:$B, 0))), 0)","v":0},{"$f":"IFERROR(IF(INDEX('EY Data'!CZ:CZ, MATCH('Select LAs'!$A$3,'EY Data'!$B:$B, 0))=\"\",\"-\", INDEX('EY Data'!CZ:CZ, MATCH('Select LAs'!$A$3,'EY Data'!$B:$B, 0))), 0)","v":0}]
[null,"9mth - 2 year old hourly average\nbase rate (£/hr)",null,{"$f":"IFERROR(IF(INDEX('EY Data'!DL:DL, MATCH('Select LAs'!$A$3,'EY Data'!$B:$B, 0))=\"\",\"-\", INDEX('EY Data'!DL:DL, MATCH('Select LAs'!$A$3,'EY Data'!$B:$B, 0))), 0)","v":0},{"$f":"IFERROR(IF(INDEX('EY Data'!DO:DO, MATCH('Select LAs'!$A$3,'EY Data'!$B:$B, 0))=\"\",\"-\", INDEX('EY Data'!DO:DO, MATCH('Select LAs'!$A$3,'EY Data'!$B:$B, 0))), 0)","v":0},{"$f":"IFERROR(IF(INDEX('EY Data'!DN:DN, MATCH('Select LAs'!$A$3,'EY Data'!$B:$B, 0))=\"\",\"-\", INDEX('EY Data'!DN:DN, MATCH('Select LAs'!$A$3,'EY Data'!$B:$B, 0))), 0)","v":0},{"$f":"IFERROR(IF(INDEX('EY Data'!DM:DM, MATCH('Select LAs'!$A$3,'EY Data'!$B:$B, 0))=\"\",\"-\", INDEX('EY Data'!DM:DM, MATCH('Select LAs'!$A$3,'EY Data'!$B:$B, 0))), 0)","v":0}]
[null,"Pass-through rate (%)",null,{"$f":"IF(OR('Select LAs'!$A$3 = \"LA No\", 'Select LAs'!$A$3 = 201, 'Select LAs'!$A$3 = 420), \"-\", INDEX('EY Data'!EA:EA, MATCH('Select LAs'!$A$3,'EY Data'!$B:$B, 0)))","v":"-"}]
[]
[]
[]
[]
[]
[]
[]
[]
[]
[]
[null,{"$f":"CONCATENATE(\"Benchmarking against \",IF(_SN=1,\"Statistical Neighbours\",\"Manual Selection\"))","v":"Benchmarking against Manual Selection"}]
[]
[]
[]
[null,null,"Table ordering"]
[]
[]
[null,null,null,"Average funding rate to providers per hour",null,null,null,"Pass-through rate","Funding paid through supplements","SEN Inclusion Fund (top-up grant element) budget"]
[null,"Local Authority",null,"All providers","Private, Voluntary, Independent","Nursery schools","Primary nursery places",null,null,"All providers","Private, Voluntary, Independent","Nursery schools","Primary nursery places"]
[null,"England",null,{"$f":"ROUND(INDEX('EY Data'!CY:CY, MATCH($B28,'EY Data'!$C:$C, 0)), 5)","v":10.834910000000001},{"$f":"ROUND(INDEX('EY Data'!DB:DB, MATCH($B28,'EY Data'!$C:$C, 0)), 5)","v":10.821059999999999},{"$f":"ROUND(INDEX('EY Data'!DA:DA, MATCH($B28,'EY Data'!$C:$C, 0)), 5)","v":11.73597},{"$f":"ROUND(INDEX('EY Data'!CZ:CZ, MATCH($B28,'EY Data'!$C:$C, 0)), 5)","v":10.70444},{"$f":"IF(INDEX('EY Data'!EA:EA, MATCH($B28,'EY Data'!$C:$C, 0))=\"-\", \"-\", ROUND(INDEX('EY Data'!EA:EA, MATCH($B28,'EY Data'!$C:$C, 0)), 3))","v":0.97199999999999998},{"$f":"IF(INDEX('EY Data'!EC:EC, MATCH($B28,'EY Data'!$C:$C, 0))=\"-\", \"-\", ROUND(INDEX('EY Data'!EC:EC, MATCH($B28,'EY Data'!$C:$C, 0)), 3))","v":0},{"$f":"ROUND(INDEX('EY Data'!DS:DS, MATCH($B28,'EY Data'!$C:$C, 0)), 3)","v":10526987.48},{"$f":"ROUND(INDEX('EY Data'!DV:DV, MATCH($B28,'EY Data'!$C:$C, 0)), 3)","v":9103085.5399999991},{"$f":"ROUND(INDEX('EY Data'!DU:DU, MATCH($B28,'EY Data'!$C:$C, 0)), 3)","v":482574.2},{"$f":"ROUND(INDEX('EY Data'!DT:DT, MATCH($B28,'EY Data'!$C:$C, 0)), 3)","v":35566995.079999998}]
[null,{"$f":"'Select LAs'!Q17","v":"No LA selected"},null,{"$f":"IF('Select LAs'!$R17=0,\"-\",IF(INDEX('EY Data'!CY:CY, MATCH('Select LAs'!$R17,'EY Data'!$B:$B, 0))=\"\",\"-\", ROUND(INDEX('EY Data'!CY:CY, MATCH('Select LAs'!$R17,'EY Data'!$B:$B, 0)),5)))","v":11.35853},{"$f":"IF('Select LAs'!$R17=0,\"-\",IF(INDEX('EY Data'!DB:DB, MATCH('Select LAs'!$R17,'EY Data'!$B:$B, 0))=\"\",\"-\", ROUND(INDEX('EY Data'!DB:DB, MATCH('Select LAs'!$R17,'EY Data'!$B:$B, 0)),5)))","v":11.35853},{"$f":"IF('Select LAs'!$R17=0,\"-\",IF(INDEX('EY Data'!DA:DA, MATCH('Select LAs'!$R17,'EY Data'!$B:$B, 0))=\"\",\"-\", ROUND(INDEX('EY Data'!DA:DA, MATCH('Select LAs'!$R17,'EY Data'!$B:$B, 0)),5)))","v":0},{"$f":"IF('Select LAs'!$R17=0,\"-\",IF(INDEX('EY Data'!CZ:CZ, MATCH('Select LAs'!$R17,'EY Data'!$B:$B, 0))=\"\",\"-\", ROUND(INDEX('EY Data'!CZ:CZ, MATCH('Select LAs'!$R17,'EY Data'!$B:$B, 0)),5)))","v":0},{"$f":"IF(OR('Select LAs'!$R17=0,'Select LAs'!$R17=201, 'Select LAs'!$R17=420), \"-\",IF(INDEX('EY Data'!EA:EA, MATCH('Select LAs'!$R17,'EY Data'!$B:$B, 0))=\"-\", \"-\", ROUND(INDEX('EY Data'!EA:EA, MATCH('Select LAs'!$R17,'EY Data'!$B:$B, 0)),3)))","v":0.95},{"$f":"IF(OR('Select LAs'!$R17=0,'Select LAs'!$R17=201, 'Select LAs'!$R17=420), \"-\",IF(INDEX('EY Data'!EC:EC, MATCH('Select LAs'!$R17,'EY Data'!$B:$B, 0))=\"\", \"-\", INDEX('EY Data'!EC:EC, MATCH('Select LAs'!$R17,'EY Data'!$B:$B, 0))))","v":0},{"$f":"IF('Select LAs'!$R17=0,\"-\",IF(INDEX('EY Data'!DS:DS, MATCH('Select LAs'!$R17,'EY Data'!$B:$B, 0))=\"\",\"-\",ROUND(INDEX('EY Data'!DS:DS, MATCH('Select LAs'!$R17,'EY Data'!$B:$B, 0)),0)))","v":76507},{"$f":"IF('Select LAs'!$R17=0,\"-\",IF(INDEX('EY Data'!DV:DV, MATCH('Select LAs'!$R17,'EY Data'!$B:$B, 0))=\"\",\"-\",ROUND(INDEX('EY Data'!DV:DV, MATCH('Select LAs'!$R17,'EY Data'!$B:$B, 0)),0)))","v":76507},{"$f":"IF('Select LAs'!$R17=0,\"-\",IF(INDEX('EY Data'!DU:DU, MATCH('Select LAs'!$R17,'EY Data'!$B:$B, 0))=\"\",\"-\",ROUND(INDEX('EY Data'!DU:DU, MATCH('Select LAs'!$R17,'EY Data'!$B:$B, 0)),0)))","v":0},{"$f":"IF('Select LAs'!$R17=0,\"-\",IF(INDEX('EY Data'!DT:DT, MATCH('Select LAs'!$R17,'EY Data'!$B:$B, 0))=\"\",\"-\",ROUND(INDEX('EY Data'!DT:DT, MATCH('Select LAs'!$R17,'EY Data'!$B:$B, 0)),0)))","v":0}]
[null,{"$f":"'Select LAs'!Q18","v":"No LA selected"},null,{"$f":"IF('Select LAs'!$R18=0,\"-\",IF(INDEX('EY Data'!CY:CY, MATCH('Select LAs'!$R18,'EY Data'!$B:$B, 0))=\"\",\"-\", ROUND(INDEX('EY Data'!CY:CY, MATCH('Select LAs'!$R18,'EY Data'!$B:$B, 0)),5)))","v":14.405989999999999},{"$f":"IF('Select LAs'!$R18=0,\"-\",IF(INDEX('EY Data'!DB:DB, MATCH('Select LAs'!$R18,'EY Data'!$B:$B, 0))=\"\",\"-\", ROUND(INDEX('EY Data'!DB:DB, MATCH('Select LAs'!$R18,'EY Data'!$B:$B, 0)),5)))","v":14.406029999999999},{"$f":"IF('Select LAs'!$R18=0,\"-\",IF(INDEX('EY Data'!DA:DA, MATCH('Select LAs'!$R18,'EY Data'!$B:$B, 0))=\"\",\"-\", ROUND(INDEX('EY Data'!DA:DA, MATCH('Select LAs'!$R18,'EY Data'!$B:$B, 0)),5)))","v":14.406029999999999},{"$f":"IF('Select LAs'!$R18=0,\"-\",IF(INDEX('EY Data'!CZ:CZ, MATCH('Select LAs'!$R18,'EY Data'!$B:$B, 0))=\"\",\"-\", ROUND(INDEX('EY Data'!CZ:CZ, MATCH('Select LAs'!$R18,'EY Data'!$B:$B, 0)),5)))","v":0},{"$f":"IF(OR('Select LAs'!$R18=0,'Select LAs'!$R18=201, 'Select LAs'!$R18=420), \"-\",IF(INDEX('EY Data'!EA:EA, MATCH('Select LAs'!$R18,'EY Data'!$B:$B, 0))=\"-\", \"-\", ROUND(INDEX('EY Data'!EA:EA, MATCH('Select LAs'!$R18,'EY Data'!$B:$B, 0)),3)))","v":0.97},{"$f":"IF(OR('Select LAs'!$R18=0,'Select LAs'!$R18=201, 'Select LAs'!$R18=420), \"-\",IF(INDEX('EY Data'!EC:EC, MATCH('Select LAs'!$R18,'EY Data'!$B:$B, 0))=\"\", \"-\", INDEX('EY Data'!EC:EC, MATCH('Select LAs'!$R18,'EY Data'!$B:$B, 0))))","v":0},{"$f":"IF('Select LAs'!$R18=0,\"-\",IF(INDEX('EY Data'!DS:DS, MATCH('Select LAs'!$R18,'EY Data'!$B:$B, 0))=\"\",\"-\",ROUND(INDEX('EY Data'!DS:DS, MATCH('Select LAs'!$R18,'EY Data'!$B:$B, 0)),0)))","v":126741},{"$f":"IF('Select LAs'!$R18=0,\"-\",IF(INDEX('EY Data'!DV:DV, MATCH('Select LAs'!$R18,'EY Data'!$B:$B, 0))=\"\",\"-\",ROUND(INDEX('EY Data'!DV:DV, MATCH('Select LAs'!$R18,'EY Data'!$B:$B, 0)),0)))","v":105195},{"$f":"IF('Select LAs'!$R18=0,\"-\",IF(INDEX('EY Data'!DU:DU, MATCH('Select LAs'!$R18,'EY Data'!$B:$B, 0))=\"\",\"-\",ROUND(INDEX('EY Data'!DU:DU, MATCH('Select LAs'!$R18,'EY Data'!$B:$B, 0)),0)))","v":21546},{"$f":"IF('Select LAs'!$R18=0,\"-\",IF(INDEX('EY Data'!DT:DT, MATCH('Select LAs'!$R18,'EY Data'!$B:$B, 0))=\"\",\"-\",ROUND(INDEX('EY Data'!DT:DT, MATCH('Select LAs'!$R18,'EY Data'!$B:$B, 0)),0)))","v":0}]
["",{"$f":"'Select LAs'!Q19","v":"No LA selected"},null,{"$f":"IF('Select LAs'!$R19=0,\"-\",IF(INDEX('EY Data'!CY:CY, MATCH('Select LAs'!$R19,'EY Data'!$B:$B, 0))=\"\",\"-\", ROUND(INDEX('EY Data'!CY:CY, MATCH('Select LAs'!$R19,'EY Data'!$B:$B, 0)),5)))","v":12.94},{"$f":"IF('Select LAs'!$R19=0,\"-\",IF(INDEX('EY Data'!DB:DB, MATCH('Select LAs'!$R19,'EY Data'!$B:$B, 0))=\"\",\"-\", ROUND(INDEX('EY Data'!DB:DB, MATCH('Select LAs'!$R19,'EY Data'!$B:$B, 0)),5)))","v":12.94},{"$f":"IF('Select LAs'!$R19=0,\"-\",IF(INDEX('EY Data'!DA:DA, MATCH('Select LAs'!$R19,'EY Data'!$B:$B, 0))=\"\",\"-\", ROUND(INDEX('EY Data'!DA:DA, MATCH('Select LAs'!$R19,'EY Data'!$B:$B, 0)),5)))","v":0},{"$f":"IF('Select LAs'!$R19=0,\"-\",IF(INDEX('EY Data'!CZ:CZ, MATCH('Select LAs'!$R19,'EY Data'!$B:$B, 0))=\"\",\"-\", ROUND(INDEX('EY Data'!CZ:CZ, MATCH('Select LAs'!$R19,'EY Data'!$B:$B, 0)),5)))","v":12.67},{"$f":"IF(OR('Select LAs'!$R19=0,'Select LAs'!$R19=201, 'Select LAs'!$R19=420), \"-\",IF(INDEX('EY Data'!EA:EA, MATCH('Select LAs'!$R19,'EY Data'!$B:$B, 0))=\"-\", \"-\", ROUND(INDEX('EY Data'!EA:EA, MATCH('Select LAs'!$R19,'EY Data'!$B:$B, 0)),3)))","v":0.97},{"$f":"IF(OR('Select LAs'!$R19=0,'Select LAs'!$R19=201, 'Select LAs'!$R19=420), \"-\",IF(INDEX('EY Data'!EC:EC, MATCH('Select LAs'!$R19,'EY Data'!$B:$B, 0))=\"\", \"-\", INDEX('EY Data'!EC:EC, MATCH('Select LAs'!$R19,'EY Data'!$B:$B, 0))))","v":0},{"$f":"IF('Select LAs'!$R19=0,\"-\",IF(INDEX('EY Data'!DS:DS, MATCH('Select LAs'!$R19,'EY Data'!$B:$B, 0))=\"\",\"-\",ROUND(INDEX('EY Data'!DS:DS, MATCH('Select LAs'!$R19,'EY Data'!$B:$B, 0)),0)))","v":86316},{"$f":"IF('Select LAs'!$R19=0,\"-\",IF(INDEX('EY Data'!DV:DV, MATCH('Select LAs'!$R19,'EY Data'!$B:$B, 0))=\"\",\"-\",ROUND(INDEX('EY Data'!DV:DV, MATCH('Select LAs'!$R19,'EY Data'!$B:$B, 0)),0)))","v":86316},{"$f":"IF('Select LAs'!$R19=0,\"-\",IF(INDEX('EY Data'!DU:DU, MATCH('Select LAs'!$R19,'EY Data'!$B:$B, 0))=\"\",\"-\",ROUND(INDEX('EY Data'!DU:DU, MATCH('Select LAs'!$R19,'EY Data'!$B:$B, 0)),0)))","v":0},{"$f":"IF('Select LAs'!$R19=0,\"-\",IF(INDEX('EY Data'!DT:DT, MATCH('Select LAs'!$R19,'EY Data'!$B:$B, 0))=\"\",\"-\",ROUND(INDEX('EY Data'!DT:DT, MATCH('Select LAs'!$R19,'EY Data'!$B:$B, 0)),0)))","v":0}]
["",{"$f":"'Select LAs'!Q20","v":"No LA selected"},null,{"$f":"IF('Select LAs'!$R20=0,\"-\",IF(INDEX('EY Data'!CY:CY, MATCH('Select LAs'!$R20,'EY Data'!$B:$B, 0))=\"\",\"-\", ROUND(INDEX('EY Data'!CY:CY, MATCH('Select LAs'!$R20,'EY Data'!$B:$B, 0)),5)))","v":11.61},{"$f":"IF('Select LAs'!$R20=0,\"-\",IF(INDEX('EY Data'!DB:DB, MATCH('Select LAs'!$R20,'EY Data'!$B:$B, 0))=\"\",\"-\", ROUND(INDEX('EY Data'!DB:DB, MATCH('Select LAs'!$R20,'EY Data'!$B:$B, 0)),5)))","v":11.61},{"$f":"IF('Select LAs'!$R20=0,\"-\",IF(INDEX('EY Data'!DA:DA, MATCH('Select LAs'!$R20,'EY Data'!$B:$B, 0))=\"\",\"-\", ROUND(INDEX('EY Data'!DA:DA, MATCH('Select LAs'!$R20,'EY Data'!$B:$B, 0)),5)))","v":0},{"$f":"IF('Select LAs'!$R20=0,\"-\",IF(INDEX('EY Data'!CZ:CZ, MATCH('Select LAs'!$R20,'EY Data'!$B:$B, 0))=\"\",\"-\", ROUND(INDEX('EY Data'!CZ:CZ, MATCH('Select LAs'!$R20,'EY Data'!$B:$B, 0)),5)))","v":0},{"$f":"IF(OR('Select LAs'!$R20=0,'Select LAs'!$R20=201, 'Select LAs'!$R20=420), \"-\",IF(INDEX('EY Data'!EA:EA, MATCH('Select LAs'!$R20,'EY Data'!$B:$B, 0))=\"-\", \"-\", ROUND(INDEX('EY Data'!EA:EA, MATCH('Select LAs'!$R20,'EY Data'!$B:$B, 0)),3)))","v":1},{"$f":"IF(OR('Select LAs'!$R20=0,'Select LAs'!$R20=201, 'Select LAs'!$R20=420), \"-\",IF(INDEX('EY Data'!EC:EC, MATCH('Select LAs'!$R20,'EY Data'!$B:$B, 0))=\"\", \"-\", INDEX('EY Data'!EC:EC, MATCH('Select LAs'!$R20,'EY Data'!$B:$B, 0))))","v":0},{"$f":"IF('Select LAs'!$R20=0,\"-\",IF(INDEX('EY Data'!DS:DS, MATCH('Select LAs'!$R20,'EY Data'!$B:$B, 0))=\"\",\"-\",ROUND(INDEX('EY Data'!DS:DS, MATCH('Select LAs'!$R20,'EY Data'!$B:$B, 0)),0)))","v":0},{"$f":"IF('Select LAs'!$R20=0,\"-\",IF(INDEX('EY Data'!DV:DV, MATCH('Select LAs'!$R20,'EY Data'!$B:$B, 0))=\"\",\"-\",ROUND(INDEX('EY Data'!DV:DV, MATCH('Select LAs'!$R20,'EY Data'!$B:$B, 0)),0)))","v":0},{"$f":"IF('Select LAs'!$R20=0,\"-\",IF(INDEX('EY Data'!DU:DU, MATCH('Select LAs'!$R20,'EY Data'!$B:$B, 0))=\"\",\"-\",ROUND(INDEX('EY Data'!DU:DU, MATCH('Select LAs'!$R20,'EY Data'!$B:$B, 0)),0)))","v":0},{"$f":"IF('Select LAs'!$R20=0,\"-\",IF(INDEX('EY Data'!DT:DT, MATCH('Select LAs'!$R20,'EY Data'!$B:$B, 0))=\"\",\"-\",ROUND(INDEX('EY Data'!DT:DT, MATCH('Select LAs'!$R20,'EY Data'!$B:$B, 0)),0)))","v":0}]
["",{"$f":"'Select LAs'!Q21","v":"No LA selected"},null,{"$f":"IF('Select LAs'!$R21=0,\"-\",IF(INDEX('EY Data'!CY:CY, MATCH('Select LAs'!$R21,'EY Data'!$B:$B, 0))=\"\",\"-\", ROUND(INDEX('EY Data'!CY:CY, MATCH('Select LAs'!$R21,'EY Data'!$B:$B, 0)),5)))","v":11.10505},{"$f":"IF('Select LAs'!$R21=0,\"-\",IF(INDEX('EY Data'!DB:DB, MATCH('Select LAs'!$R21,'EY Data'!$B:$B, 0))=\"\",\"-\", ROUND(INDEX('EY Data'!DB:DB, MATCH('Select LAs'!$R21,'EY Data'!$B:$B, 0)),5)))","v":11.10505},{"$f":"IF('Select LAs'!$R21=0,\"-\",IF(INDEX('EY Data'!DA:DA, MATCH('Select LAs'!$R21,'EY Data'!$B:$B, 0))=\"\",\"-\", ROUND(INDEX('EY Data'!DA:DA, MATCH('Select LAs'!$R21,'EY Data'!$B:$B, 0)),5)))","v":11.105040000000001},{"$f":"IF('Select LAs'!$R21=0,\"-\",IF(INDEX('EY Data'!CZ:CZ, MATCH('Select LAs'!$R21,'EY Data'!$B:$B, 0))=\"\",\"-\", ROUND(INDEX('EY Data'!CZ:CZ, MATCH('Select LAs'!$R21,'EY Data'!$B:$B, 0)),5)))","v":11.10496},{"$f":"IF(OR('Select LAs'!$R21=0,'Select LAs'!$R21=201, 'Select LAs'!$R21=420), \"-\",IF(INDEX('EY Data'!EA:EA, MATCH('Select LAs'!$R21,'EY Data'!$B:$B, 0))=\"-\", \"-\", ROUND(INDEX('EY Data'!EA:EA, MATCH('Select LAs'!$R21,'EY Data'!$B:$B, 0)),3)))","v":1.1339999999999999},{"$f":"IF(OR('Select LAs'!$R21=0,'Select LAs'!$R21=201, 'Select LAs'!$R21=420), \"-\",IF(INDEX('EY Data'!EC:EC, MATCH('Select LAs'!$R21,'EY Data'!$B:$B, 0))=\"\", \"-\", INDEX('EY Data'!EC:EC, MATCH('Select LAs'!$R21,'EY Data'!$B:$B, 0))))","v":0},{"$f":"IF('Select LAs'!$R21=0,\"-\",IF(INDEX('EY Data'!DS:DS, MATCH('Select LAs'!$R21,'EY Data'!$B:$B, 0))=\"\",\"-\",ROUND(INDEX('EY Data'!DS:DS, MATCH('Select LAs'!$R21,'EY Data'!$B:$B, 0)),0)))","v":11500},{"$f":"IF('Select LAs'!$R21=0,\"-\",IF(INDEX('EY Data'!DV:DV, MATCH('Select LAs'!$R21,'EY Data'!$B:$B, 0))=\"\",\"-\",ROUND(INDEX('EY Data'!DV:DV, MATCH('Select LAs'!$R21,'EY Data'!$B:$B, 0)),0)))","v":9291},{"$f":"IF('Select LAs'!$R21=0,\"-\",IF(INDEX('EY Data'!DU:DU, MATCH('Select LAs'!$R21,'EY Data'!$B:$B, 0))=\"\",\"-\",ROUND(INDEX('EY Data'!DU:DU, MATCH('Select LAs'!$R21,'EY Data'!$B:$B, 0)),0)))","v":2015},{"$f":"IF('Select LAs'!$R21=0,\"-\",IF(INDEX('EY Data'!DT:DT, MATCH('Select LAs'!$R21,'EY Data'!$B:$B, 0))=\"\",\"-\",ROUND(INDEX('EY Data'!DT:DT, MATCH('Select LAs'!$R21,'EY Data'!$B:$B, 0)),0)))","v":194}]
["",{"$f":"'Select LAs'!Q22","v":"No LA selected"},null,{"$f":"IF('Select LAs'!$R22=0,\"-\",IF(INDEX('EY Data'!CY:CY, MATCH('Select LAs'!$R22,'EY Data'!$B:$B, 0))=\"\",\"-\", ROUND(INDEX('EY Data'!CY:CY, MATCH('Select LAs'!$R22,'EY Data'!$B:$B, 0)),5)))","v":11.45},{"$f":"IF('Select LAs'!$R22=0,\"-\",IF(INDEX('EY Data'!DB:DB, MATCH('Select LAs'!$R22,'EY Data'!$B:$B, 0))=\"\",\"-\", ROUND(INDEX('EY Data'!DB:DB, MATCH('Select LAs'!$R22,'EY Data'!$B:$B, 0)),5)))","v":11.45},{"$f":"IF('Select LAs'!$R22=0,\"-\",IF(INDEX('EY Data'!DA:DA, MATCH('Select LAs'!$R22,'EY Data'!$B:$B, 0))=\"\",\"-\", ROUND(INDEX('EY Data'!DA:DA, MATCH('Select LAs'!$R22,'EY Data'!$B:$B, 0)),5)))","v":0},{"$f":"IF('Select LAs'!$R22=0,\"-\",IF(INDEX('EY Data'!CZ:CZ, MATCH('Select LAs'!$R22,'EY Data'!$B:$B, 0))=\"\",\"-\", ROUND(INDEX('EY Data'!CZ:CZ, MATCH('Select LAs'!$R22,'EY Data'!$B:$B, 0)),5)))","v":0},{"$f":"IF(OR('Select LAs'!$R22=0,'Select LAs'!$R22=201, 'Select LAs'!$R22=420), \"-\",IF(INDEX('EY Data'!EA:EA, MATCH('Select LAs'!$R22,'EY Data'!$B:$B, 0))=\"-\", \"-\", ROUND(INDEX('EY Data'!EA:EA, MATCH('Select LAs'!$R22,'EY Data'!$B:$B, 0)),3)))","v":0.96599999999999997},{"$f":"IF(OR('Select LAs'!$R22=0,'Select LAs'!$R22=201, 'Select LAs'!$R22=420), \"-\",IF(INDEX('EY Data'!EC:EC, MATCH('Select LAs'!$R22,'EY Data'!$B:$B, 0))=\"\", \"-\", INDEX('EY Data'!EC:EC, MATCH('Select LAs'!$R22,'EY Data'!$B:$B, 0))))","v":"No Base Rate"},{"$f":"IF('Select LAs'!$R22=0,\"-\",IF(INDEX('EY Data'!DS:DS, MATCH('Select LAs'!$R22,'EY Data'!$B:$B, 0))=\"\",\"-\",ROUND(INDEX('EY Data'!DS:DS, MATCH('Select LAs'!$R22,'EY Data'!$B:$B, 0)),0)))","v":178446},{"$f":"IF('Select LAs'!$R22=0,\"-\",IF(INDEX('EY Data'!DV:DV, MATCH('Select LAs'!$R22,'EY Data'!$B:$B, 0))=\"\",\"-\",ROUND(INDEX('EY Data'!DV:DV, MATCH('Select LAs'!$R22,'EY Data'!$B:$B, 0)),0)))","v":178446},{"$f":"IF('Select LAs'!$R22=0,\"-\",IF(INDEX('EY Data'!DU:DU, MATCH('Select LAs'!$R22,'EY Data'!$B:$B, 0))=\"\",\"-\",ROUND(INDEX('EY Data'!DU:DU, MATCH('Select LAs'!$R22,'EY Data'!$B:$B, 0)),0)))","v":0},{"$f":"IF('Select LAs'!$R22=0,\"-\",IF(INDEX('EY Data'!DT:DT, MATCH('Select LAs'!$R22,'EY Data'!$B:$B, 0))=\"\",\"-\",ROUND(INDEX('EY Data'!DT:DT, MATCH('Select LAs'!$R22,'EY Data'!$B:$B, 0)),0)))","v":0}]
["",{"$f":"'Select LAs'!Q23","v":"No LA selected"},null,{"$f":"IF('Select LAs'!$R23=0,\"-\",IF(INDEX('EY Data'!CY:CY, MATCH('Select LAs'!$R23,'EY Data'!$B:$B, 0))=\"\",\"-\", ROUND(INDEX('EY Data'!CY:CY, MATCH('Select LAs'!$R23,'EY Data'!$B:$B, 0)),5)))","v":11.653499999999999},{"$f":"IF('Select LAs'!$R23=0,\"-\",IF(INDEX('EY Data'!DB:DB, MATCH('Select LAs'!$R23,'EY Data'!$B:$B, 0))=\"\",\"-\", ROUND(INDEX('EY Data'!DB:DB, MATCH('Select LAs'!$R23,'EY Data'!$B:$B, 0)),5)))","v":11.653499999999999},{"$f":"IF('Select LAs'!$R23=0,\"-\",IF(INDEX('EY Data'!DA:DA, MATCH('Select LAs'!$R23,'EY Data'!$B:$B, 0))=\"\",\"-\", ROUND(INDEX('EY Data'!DA:DA, MATCH('Select LAs'!$R23,'EY Data'!$B:$B, 0)),5)))","v":11.653499999999999},{"$f":"IF('Select LAs'!$R23=0,\"-\",IF(INDEX('EY Data'!CZ:CZ, MATCH('Select LAs'!$R23,'EY Data'!$B:$B, 0))=\"\",\"-\", ROUND(INDEX('EY Data'!CZ:CZ, MATCH('Select LAs'!$R23,'EY Data'!$B:$B, 0)),5)))","v":11.653499999999999},{"$f":"IF(OR('Select LAs'!$R23=0,'Select LAs'!$R23=201, 'Select LAs'!$R23=420), \"-\",IF(INDEX('EY Data'!EA:EA, MATCH('Select LAs'!$R23,'EY Data'!$B:$B, 0))=\"-\", \"-\", ROUND(INDEX('EY Data'!EA:EA, MATCH('Select LAs'!$R23,'EY Data'!$B:$B, 0)),3)))","v":0.95},{"$f":"IF(OR('Select LAs'!$R23=0,'Select LAs'!$R23=201, 'Select LAs'!$R23=420), \"-\",IF(INDEX('EY Data'!EC:EC, MATCH('Select LAs'!$R23,'EY Data'!$B:$B, 0))=\"\", \"-\", INDEX('EY Data'!EC:EC, MATCH('Select LAs'!$R23,'EY Data'!$B:$B, 0))))","v":0},{"$f":"IF('Select LAs'!$R23=0,\"-\",IF(INDEX('EY Data'!DS:DS, MATCH('Select LAs'!$R23,'EY Data'!$B:$B, 0))=\"\",\"-\",ROUND(INDEX('EY Data'!DS:DS, MATCH('Select LAs'!$R23,'EY Data'!$B:$B, 0)),0)))","v":230848},{"$f":"IF('Select LAs'!$R23=0,\"-\",IF(INDEX('EY Data'!DV:DV, MATCH('Select LAs'!$R23,'EY Data'!$B:$B, 0))=\"\",\"-\",ROUND(INDEX('EY Data'!DV:DV, MATCH('Select LAs'!$R23,'EY Data'!$B:$B, 0)),0)))","v":218151},{"$f":"IF('Select LAs'!$R23=0,\"-\",IF(INDEX('EY Data'!DU:DU, MATCH('Select LAs'!$R23,'EY Data'!$B:$B, 0))=\"\",\"-\",ROUND(INDEX('EY Data'!DU:DU, MATCH('Select LAs'!$R23,'EY Data'!$B:$B, 0)),0)))","v":1154},{"$f":"IF('Select LAs'!$R23=0,\"-\",IF(INDEX('EY Data'!DT:DT, MATCH('Select LAs'!$R23,'EY Data'!$B:$B, 0))=\"\",\"-\",ROUND(INDEX('EY Data'!DT:DT, MATCH('Select LAs'!$R23,'EY Data'!$B:$B, 0)),0)))","v":11542}]
["",{"$f":"'Select LAs'!Q24","v":"No LA selected"},null,{"$f":"IF('Select LAs'!$R24=0,\"-\",IF(INDEX('EY Data'!CY:CY, MATCH('Select LAs'!$R24,'EY Data'!$B:$B, 0))=\"\",\"-\", ROUND(INDEX('EY Data'!CY:CY, MATCH('Select LAs'!$R24,'EY Data'!$B:$B, 0)),5)))","v":12.70524},{"$f":"IF('Select LAs'!$R24=0,\"-\",IF(INDEX('EY Data'!DB:DB, MATCH('Select LAs'!$R24,'EY Data'!$B:$B, 0))=\"\",\"-\", ROUND(INDEX('EY Data'!DB:DB, MATCH('Select LAs'!$R24,'EY Data'!$B:$B, 0)),5)))","v":12.70524},{"$f":"IF('Select LAs'!$R24=0,\"-\",IF(INDEX('EY Data'!DA:DA, MATCH('Select LAs'!$R24,'EY Data'!$B:$B, 0))=\"\",\"-\", ROUND(INDEX('EY Data'!DA:DA, MATCH('Select LAs'!$R24,'EY Data'!$B:$B, 0)),5)))","v":0},{"$f":"IF('Select LAs'!$R24=0,\"-\",IF(INDEX('EY Data'!CZ:CZ, MATCH('Select LAs'!$R24,'EY Data'!$B:$B, 0))=\"\",\"-\", ROUND(INDEX('EY Data'!CZ:CZ, MATCH('Select LAs'!$R24,'EY Data'!$B:$B, 0)),5)))","v":0},{"$f":"IF(OR('Select LAs'!$R24=0,'Select LAs'!$R24=201, 'Select LAs'!$R24=420), \"-\",IF(INDEX('EY Data'!EA:EA, MATCH('Select LAs'!$R24,'EY Data'!$B:$B, 0))=\"-\", \"-\", ROUND(INDEX('EY Data'!EA:EA, MATCH('Select LAs'!$R24,'EY Data'!$B:$B, 0)),3)))","v":0.95099999999999996},{"$f":"IF(OR('Select LAs'!$R24=0,'Select LAs'!$R24=201, 'Select LAs'!$R24=420), \"-\",IF(INDEX('EY Data'!EC:EC, MATCH('Select LAs'!$R24,'EY Data'!$B:$B, 0))=\"\", \"-\", INDEX('EY Data'!EC:EC, MATCH('Select LAs'!$R24,'EY Data'!$B:$B, 0))))","v":"No Base Rate"},{"$f":"IF('Select LAs'!$R24=0,\"-\",IF(INDEX('EY Data'!DS:DS, MATCH('Select LAs'!$R24,'EY Data'!$B:$B, 0))=\"\",\"-\",ROUND(INDEX('EY Data'!DS:DS, MATCH('Select LAs'!$R24,'EY Data'!$B:$B, 0)),0)))","v":2000},{"$f":"IF('Select LAs'!$R24=0,\"-\",IF(INDEX('EY Data'!DV:DV, MATCH('Select LAs'!$R24,'EY Data'!$B:$B, 0))=\"\",\"-\",ROUND(INDEX('EY Data'!DV:DV, MATCH('Select LAs'!$R24,'EY Data'!$B:$B, 0)),0)))","v":2000},{"$f":"IF('Select LAs'!$R24=0,\"-\",IF(INDEX('EY Data'!DU:DU, MATCH('Select LAs'!$R24,'EY Data'!$B:$B, 0))=\"\",\"-\",ROUND(INDEX('EY Data'!DU:DU, MATCH('Select LAs'!$R24,'EY Data'!$B:$B, 0)),0)))","v":0},{"$f":"IF('Select LAs'!$R24=0,\"-\",IF(INDEX('EY Data'!DT:DT, MATCH('Select LAs'!$R24,'EY Data'!$B:$B, 0))=\"\",\"-\",ROUND(INDEX('EY Data'!DT:DT, MATCH('Select LAs'!$R24,'EY Data'!$B:$B, 0)),0)))","v":0}]
["",{"$f":"'Select LAs'!Q25","v":"No LA selected"},null,{"$f":"IF('Select LAs'!$R25=0,\"-\",IF(INDEX('EY Data'!CY:CY, MATCH('Select LAs'!$R25,'EY Data'!$B:$B, 0))=\"\",\"-\", ROUND(INDEX('EY Data'!CY:CY, MATCH('Select LAs'!$R25,'EY Data'!$B:$B, 0)),5)))","v":10.892480000000001},{"$f":"IF('Select LAs'!$R25=0,\"-\",IF(INDEX('EY Data'!DB:DB, MATCH('Select LAs'!$R25,'EY Data'!$B:$B, 0))=\"\",\"-\", ROUND(INDEX('EY Data'!DB:DB, MATCH('Select LAs'!$R25,'EY Data'!$B:$B, 0)),5)))","v":10.888400000000001},{"$f":"IF('Select LAs'!$R25=0,\"-\",IF(INDEX('EY Data'!DA:DA, MATCH('Select LAs'!$R25,'EY Data'!$B:$B, 0))=\"\",\"-\", ROUND(INDEX('EY Data'!DA:DA, MATCH('Select LAs'!$R25,'EY Data'!$B:$B, 0)),5)))","v":0},{"$f":"IF('Select LAs'!$R25=0,\"-\",IF(INDEX('EY Data'!CZ:CZ, MATCH('Select LAs'!$R25,'EY Data'!$B:$B, 0))=\"\",\"-\", ROUND(INDEX('EY Data'!CZ:CZ, MATCH('Select LAs'!$R25,'EY Data'!$B:$B, 0)),5)))","v":0},{"$f":"IF(OR('Select LAs'!$R25=0,'Select LAs'!$R25=201, 'Select LAs'!$R25=420), \"-\",IF(INDEX('EY Data'!EA:EA, MATCH('Select LAs'!$R25,'EY Data'!$B:$B, 0))=\"-\", \"-\", ROUND(INDEX('EY Data'!EA:EA, MATCH('Select LAs'!$R25,'EY Data'!$B:$B, 0)),3)))","v":0.95299999999999996},{"$f":"IF(OR('Select LAs'!$R25=0,'Select LAs'!$R25=201, 'Select LAs'!$R25=420), \"-\",IF(INDEX('EY Data'!EC:EC, MATCH('Select LAs'!$R25,'EY Data'!$B:$B, 0))=\"\", \"-\", INDEX('EY Data'!EC:EC, MATCH('Select LAs'!$R25,'EY Data'!$B:$B, 0))))","v":0},{"$f":"IF('Select LAs'!$R25=0,\"-\",IF(INDEX('EY Data'!DS:DS, MATCH('Select LAs'!$R25,'EY Data'!$B:$B, 0))=\"\",\"-\",ROUND(INDEX('EY Data'!DS:DS, MATCH('Select LAs'!$R25,'EY Data'!$B:$B, 0)),0)))","v":10000},{"$f":"IF('Select LAs'!$R25=0,\"-\",IF(INDEX('EY Data'!DV:DV, MATCH('Select LAs'!$R25,'EY Data'!$B:$B, 0))=\"\",\"-\",ROUND(INDEX('EY Data'!DV:DV, MATCH('Select LAs'!$R25,'EY Data'!$B:$B, 0)),0)))","v":8745},{"$f":"IF('Select LAs'!$R25=0,\"-\",IF(INDEX('EY Data'!DU:DU, MATCH('Select LAs'!$R25,'EY Data'!$B:$B, 0))=\"\",\"-\",ROUND(INDEX('EY Data'!DU:DU, MATCH('Select LAs'!$R25,'EY Data'!$B:$B, 0)),0)))","v":837},{"$f":"IF('Select LAs'!$R25=0,\"-\",IF(INDEX('EY Data'!DT:DT, MATCH('Select LAs'!$R25,'EY Data'!$B:$B, 0))=\"\",\"-\",ROUND(INDEX('EY Data'!DT:DT, MATCH('Select LAs'!$R25,'EY Data'!$B:$B, 0)),0)))","v":419}]
["",{"$f":"'Select LAs'!Q26","v":"No LA selected"},null,{"$f":"IF('Select LAs'!$R26=0,\"-\",IF(INDEX('EY Data'!CY:CY, MATCH('Select LAs'!$R26,'EY Data'!$B:$B, 0))=\"\",\"-\", ROUND(INDEX('EY Data'!CY:CY, MATCH('Select LAs'!$R26,'EY Data'!$B:$B, 0)),5)))","v":10.81518},{"$f":"IF('Select LAs'!$R26=0,\"-\",IF(INDEX('EY Data'!DB:DB, MATCH('Select LAs'!$R26,'EY Data'!$B:$B, 0))=\"\",\"-\", ROUND(INDEX('EY Data'!DB:DB, MATCH('Select LAs'!$R26,'EY Data'!$B:$B, 0)),5)))","v":10.81517},{"$f":"IF('Select LAs'!$R26=0,\"-\",IF(INDEX('EY Data'!DA:DA, MATCH('Select LAs'!$R26,'EY Data'!$B:$B, 0))=\"\",\"-\", ROUND(INDEX('EY Data'!DA:DA, MATCH('Select LAs'!$R26,'EY Data'!$B:$B, 0)),5)))","v":13.24},{"$f":"IF('Select LAs'!$R26=0,\"-\",IF(INDEX('EY Data'!CZ:CZ, MATCH('Select LAs'!$R26,'EY Data'!$B:$B, 0))=\"\",\"-\", ROUND(INDEX('EY Data'!CZ:CZ, MATCH('Select LAs'!$R26,'EY Data'!$B:$B, 0)),5)))","v":13.24},{"$f":"IF(OR('Select LAs'!$R26=0,'Select LAs'!$R26=201, 'Select LAs'!$R26=420), \"-\",IF(INDEX('EY Data'!EA:EA, MATCH('Select LAs'!$R26,'EY Data'!$B:$B, 0))=\"-\", \"-\", ROUND(INDEX('EY Data'!EA:EA, MATCH('Select LAs'!$R26,'EY Data'!$B:$B, 0)),3)))","v":0.95},{"$f":"IF(OR('Select LAs'!$R26=0,'Select LAs'!$R26=201, 'Select LAs'!$R26=420), \"-\",IF(INDEX('EY Data'!EC:EC, MATCH('Select LAs'!$R26,'EY Data'!$B:$B, 0))=\"\", \"-\", INDEX('EY Data'!EC:EC, MATCH('Select LAs'!$R26,'EY Data'!$B:$B, 0))))","v":"No Base Rate"},{"$f":"IF('Select LAs'!$R26=0,\"-\",IF(INDEX('EY Data'!DS:DS, MATCH('Select LAs'!$R26,'EY Data'!$B:$B, 0))=\"\",\"-\",ROUND(INDEX('EY Data'!DS:DS, MATCH('Select LAs'!$R26,'EY Data'!$B:$B, 0)),0)))","v":0},{"$f":"IF('Select LAs'!$R26=0,\"-\",IF(INDEX('EY Data'!DV:DV, MATCH('Select LAs'!$R26,'EY Data'!$B:$B, 0))=\"\",\"-\",ROUND(INDEX('EY Data'!DV:DV, MATCH('Select LAs'!$R26,'EY Data'!$B:$B, 0)),0)))","v":0},{"$f":"IF('Select LAs'!$R26=0,\"-\",IF(INDEX('EY Data'!DU:DU, MATCH('Select LAs'!$R26,'EY Data'!$B:$B, 0))=\"\",\"-\",ROUND(INDEX('EY Data'!DU:DU, MATCH('Select LAs'!$R26,'EY Data'!$B:$B, 0)),0)))","v":0},{"$f":"IF('Select LAs'!$R26=0,\"-\",IF(INDEX('EY Data'!DT:DT, MATCH('Select LAs'!$R26,'EY Data'!$B:$B, 0))=\"\",\"-\",ROUND(INDEX('EY Data'!DT:DT, MATCH('Select LAs'!$R26,'EY Data'!$B:$B, 0)),0)))","v":0}]
[null,{"$f":"'Select LAs'!Q27","v":"No LA selected"},null,{"$f":"IF('Select LAs'!$R27=0,\"-\",IF(INDEX('EY Data'!CY:CY, MATCH('Select LAs'!$R27,'EY Data'!$B:$B, 0))=\"\",\"-\", ROUND(INDEX('EY Data'!CY:CY, MATCH('Select LAs'!$R27,'EY Data'!$B:$B, 0)),5)))","v":10.48395},{"$f":"IF('Select LAs'!$R27=0,\"-\",IF(INDEX('EY Data'!DB:DB, MATCH('Select LAs'!$R27,'EY Data'!$B:$B, 0))=\"\",\"-\", ROUND(INDEX('EY Data'!DB:DB, MATCH('Select LAs'!$R27,'EY Data'!$B:$B, 0)),5)))","v":10.48395},{"$f":"IF('Select LAs'!$R27=0,\"-\",IF(INDEX('EY Data'!DA:DA, MATCH('Select LAs'!$R27,'EY Data'!$B:$B, 0))=\"\",\"-\", ROUND(INDEX('EY Data'!DA:DA, MATCH('Select LAs'!$R27,'EY Data'!$B:$B, 0)),5)))","v":0},{"$f":"IF('Select LAs'!$R27=0,\"-\",IF(INDEX('EY Data'!CZ:CZ, MATCH('Select LAs'!$R27,'EY Data'!$B:$B, 0))=\"\",\"-\", ROUND(INDEX('EY Data'!CZ:CZ, MATCH('Select LAs'!$R27,'EY Data'!$B:$B, 0)),5)))","v":0},{"$f":"IF(OR('Select LAs'!$R27=0,'Select LAs'!$R27=201, 'Select LAs'!$R27=420), \"-\",IF(INDEX('EY Data'!EA:EA, MATCH('Select LAs'!$R27,'EY Data'!$B:$B, 0))=\"-\", \"-\", ROUND(INDEX('EY Data'!EA:EA, MATCH('Select LAs'!$R27,'EY Data'!$B:$B, 0)),3)))","v":0.95499999999999996},{"$f":"IF(OR('Select LAs'!$R27=0,'Select LAs'!$R27=201, 'Select LAs'!$R27=420), \"-\",IF(INDEX('EY Data'!EC:EC, MATCH('Select LAs'!$R27,'EY Data'!$B:$B, 0))=\"\", \"-\", INDEX('EY Data'!EC:EC, MATCH('Select LAs'!$R27,'EY Data'!$B:$B, 0))))","v":"No Base Rate"},{"$f":"IF('Select LAs'!$R27=0,\"-\",IF(INDEX('EY Data'!DS:DS, MATCH('Select LAs'!$R27,'EY Data'!$B:$B, 0))=\"\",\"-\",ROUND(INDEX('EY Data'!DS:DS, MATCH('Select LAs'!$R27,'EY Data'!$B:$B, 0)),0)))","v":100000},{"$f":"IF('Select LAs'!$R27=0,\"-\",IF(INDEX('EY Data'!DV:DV, MATCH('Select LAs'!$R27,'EY Data'!$B:$B, 0))=\"\",\"-\",ROUND(INDEX('EY Data'!DV:DV, MATCH('Select LAs'!$R27,'EY Data'!$B:$B, 0)),0)))","v":100000},{"$f":"IF('Select LAs'!$R27=0,\"-\",IF(INDEX('EY Data'!DU:DU, MATCH('Select LAs'!$R27,'EY Data'!$B:$B, 0))=\"\",\"-\",ROUND(INDEX('EY Data'!DU:DU, MATCH('Select LAs'!$R27,'EY Data'!$B:$B, 0)),0)))","v":0},{"$f":"IF('Select LAs'!$R27=0,\"-\",IF(INDEX('EY Data'!DT:DT, MATCH('Select LAs'!$R27,'EY Data'!$B:$B, 0))=\"\",\"-\",ROUND(INDEX('EY Data'!DT:DT, MATCH('Select LAs'!$R27,'EY Data'!$B:$B, 0)),0)))","v":0}]
[null,"Selection Median",null,{"$f":"IF(COUNT(D$29:D$39)>0,MEDIAN(D$29:D$39),\"-\")","v":11.45},{"$f":"IF(COUNT(E$29:E$39)>0,MEDIAN(E$29:E$39),\"-\")","v":11.45},0,{"$f":"IF(COUNT(G$29:G$39)>0,MEDIAN(G$29:G$39),\"-\")","v":0},{"$f":"IF(COUNT(H$29:H$39)>0,MEDIAN(H$29:H$39),\"-\")","v":0.95499999999999996},{"$f":"IF(COUNT(I$29:I$39)>0,MEDIAN(I$29:I$39),\"-\")","v":0},{"$f":"IF(COUNT(J$29:J$39)>0,MEDIAN(J$29:J$39),\"-\")","v":76507},{"$f":"IF(COUNT(K$29:K$39)>0,MEDIAN(K$29:K$39),\"-\")","v":76507},0,0]
[null,"Selection Minimum",null,{"$f":"IF(COUNT(D$29:D$39)>0,MIN(D$29:D$39),\"-\")","v":10.48395},10.48395,0,{"$f":"IF(COUNT(G$29:G$39)>0,MIN(G$29:G$39),\"-\")","v":0},{"$f":"IF(COUNT(H$29:H$39)>0,MIN(H$29:H$39),\"-\")","v":0.95},{"$f":"IF(COUNT(I$29:I$39)>0,MIN(I$29:I$39),\"-\")","v":0},{"$f":"IF(COUNT(J$29:J$39)>0,MIN(J$29:J$39),\"-\")","v":0},{"$f":"IF(COUNT(K$29:K$39)>0,MIN(K$29:K$39),\"-\")","v":0},0,0]
[null,"Selection Maximum",null,{"$f":"IF(COUNT(D$29:D$39)>0,MAX(D$29:D$39),\"-\")","v":14.405989999999999},14.406029999999999,14.406029999999999,{"$f":"IF(COUNT(G$29:G$39)>0,MAX(G$29:G$39),\"-\")","v":13.24},{"$f":"IF(COUNT(H$29:H$39)>0,MAX(H$29:H$39),\"-\")","v":1.1339999999999999},{"$f":"IF(COUNT(I$29:I$39)>0,MAX(I$29:I$39),\"-\")","v":0},{"$f":"IF(COUNT(J$29:J$39)>0,MAX(J$29:J$39),\"-\")","v":230848},{"$f":"IF(COUNT(K$29:K$39)>0,MAX(K$29:K$39),\"-\")","v":218151},21546,11542]

{"sheet":"Other EYFF funds","index":5,"n_rows":29,"n_cols":19,"rows_kept":29,"cut":false,"hidden":true,"merged":[[12,11,12,14],[12,15,12,18],[13,1,13,2],[30,1,30,10],[31,2,31,10],[9,3,9,4],[12,3,12,6],[12,7,12,10]]}
[]
[null,{"$f":"'Select LAs'!B3","v":"No LA selected"},null,null,null,null,null,null,null,null,null,null,null,null,null,{"$f":"'3-4 year olds '!K2","v":"Financial Year 2024-2025"}]
[]
[null,null,null,"PVIs","Nursery Schools","Primary Nursery Places"]
[]
[null,{"$f":"CONCATENATE(\"Benchmarking against \",IF(_SN=1,\"Statistical Neighbours\",\"Manual Selection\"))","v":"Benchmarking against Manual Selection"}]
[]
[]
[]
[null,null,"Table ordering"]
[]
[]
[null,null,null,"3-4 year olds",null,null,null,"2 year olds (D)",null,null,null,"2 year olds (W)",null,null,null,"9mth - 2 year olds"]
[null,"Local Authority",null,"Total EYFF Budget","SEN Inclusion Fund (top-up grant element) budget","Contingency funding","Central spend","Total EYFF Budget","SEN Inclusion Fund (top-up grant element) budget","Contingency funding","Central spend","Total EYFF Budget","SEN Inclusion Fund (top-up grant element) budget","Contingency funding","Central spend","Total EYFF Budget","SEN Inclusion Fund (top-up grant element) budget","Contingency funding","Central spend"]
[null,"England",null,{"$f":"ROUND(INDEX('EY Data'!X:X, MATCH($B15,'EY Data'!$C:$C, 0)), 0)","v":3554262593},{"$f":"ROUND(INDEX('EY Data'!Z:Z, MATCH($B15,'EY Data'!$C:$C, 0)), 0)","v":86778014},{"$f":"ROUND(INDEX('EY Data'!AE:AE, MATCH($B15,'EY Data'!$C:$C, 0)), 0)","v":30617803},{"$f":"ROUND(INDEX('EY Data'!AF:AF, MATCH($B15,'EY Data'!$C:$C, 0)), 0)","v":137637448},{"$f":"ROUND(INDEX('EY Data'!BE:BE, MATCH($B15,'EY Data'!$C:$C, 0)), 0)","v":558030146},{"$f":"ROUND(INDEX('EY Data'!BG:BG, MATCH($B15,'EY Data'!$C:$C, 0)), 0)","v":10212857},{"$f":"ROUND(INDEX('EY Data'!BL:BL, MATCH($B15,'EY Data'!$C:$C, 0)), 0)","v":2987135},{"$f":"ROUND(INDEX('EY Data'!BM:BM, MATCH($B15,'EY Data'!$C:$C, 0)), 0)","v":15060990},{"$f":"ROUND(INDEX('EY Data'!CK:CK, MATCH($B15,'EY Data'!$C:$C, 0)), 0)","v":884818292},{"$f":"ROUND(INDEX('EY Data'!CM:CM, MATCH($B15,'EY Data'!$C:$C, 0)), 0)","v":14766273},{"$f":"ROUND(INDEX('EY Data'!CR:CR, MATCH($B15,'EY Data'!$C:$C, 0)), 0)","v":6509565},{"$f":"ROUND(INDEX('EY Data'!CS:CS, MATCH($B15,'EY Data'!$C:$C, 0)), 0)","v":25652806},{"$f":"ROUND(INDEX('EY Data'!DQ:DQ, MATCH($B15,'EY Data'!$C:$C, 0)), 0)","v":697693914},{"$f":"ROUND(INDEX('EY Data'!DS:DS, MATCH($B15,'EY Data'!$C:$C, 0)), 0)","v":10526987},{"$f":"ROUND(INDEX('EY Data'!DX:DX, MATCH($B15,'EY Data'!$C:$C, 0)), 0)","v":5987592},{"$f":"ROUND(INDEX('EY Data'!DY:DY, MATCH($B15,'EY Data'!$C:$C, 0)), 0)","v":19102937}]
[null,{"$f":"'Select LAs'!Q31","v":"No LA selected"},null,{"$f":"IF('Select LAs'!$M3=0,\"-\",IF(INDEX('EY Data'!X:X, MATCH('Select LAs'!$M3,'EY Data'!$B:$B, 0))=\"\",\"-\",ROUND(INDEX('EY Data'!X:X, MATCH('Select LAs'!$M3,'EY Data'!$B:$B, 0)),0)))","v":18317947},{"$f":"IF('Select LAs'!$M3=0,\"-\",IF(INDEX('EY Data'!Z:Z, MATCH('Select LAs'!$M3,'EY Data'!$B:$B, 0))=\"\",\"-\",ROUND(INDEX('EY Data'!Z:Z, MATCH('Select LAs'!$M3,'EY Data'!$B:$B, 0)),0)))","v":300000},{"$f":"IF('Select LAs'!$M3=0,\"-\",IF(INDEX('EY Data'!AE:AE, MATCH('Select LAs'!$M3,'EY Data'!$B:$B, 0))=\"\",\"-\",ROUND(INDEX('EY Data'!AE:AE, MATCH('Select LAs'!$M3,'EY Data'!$B:$B, 0)),0)))","v":68459},{"$f":"IF('Select LAs'!$M3=0,\"-\",IF(INDEX('EY Data'!AF:AF, MATCH('Select LAs'!$M3,'EY Data'!$B:$B, 0))=\"\",\"-\",ROUND(INDEX('EY Data'!AF:AF, MATCH('Select LAs'!$M3,'EY Data'!$B:$B, 0)),0)))","v":983944},{"$f":"IF('Select LAs'!$M3=0,\"-\",IF(INDEX('EY Data'!BE:BE, MATCH('Select LAs'!$M3,'EY Data'!$B:$B, 0))=\"\",\"-\",ROUND(INDEX('EY Data'!BE:BE, MATCH('Select LAs'!$M3,'EY Data'!$B:$B, 0)),0)))","v":5549572},{"$f":"IF('Select LAs'!$M3=0,\"-\",IF(INDEX('EY Data'!BG:BG, MATCH('Select LAs'!$M3,'EY Data'!$B:$B, 0))=\"\",\"-\",ROUND(INDEX('EY Data'!BG:BG, MATCH('Select LAs'!$M3,'EY Data'!$B:$B, 0)),0)))","v":60000},{"$f":"IF('Select LAs'!$M3=0,\"-\",IF(INDEX('EY Data'!BL:BL, MATCH('Select LAs'!$M3,'EY Data'!$B:$B, 0))=\"\",\"-\",ROUND(INDEX('EY Data'!BL:BL, MATCH('Select LAs'!$M3,'EY Data'!$B:$B, 0)),0)))","v":6171},{"$f":"IF('Select LAs'!$M3=0,\"-\",IF(INDEX('EY Data'!BM:BM, MATCH('Select LAs'!$M3,'EY Data'!$B:$B, 0))=\"\",\"-\",ROUND(INDEX('EY Data'!BM:BM, MATCH('Select LAs'!$M3,'EY Data'!$B:$B, 0)),0)))","v":244698},{"$f":"IF('Select LAs'!$M3=0,\"-\",IF(INDEX('EY Data'!CK:CK, MATCH('Select LAs'!$M3,'EY Data'!$B:$B, 0))=\"\",\"-\",ROUND(INDEX('EY Data'!CK:CK, MATCH('Select LAs'!$M3,'EY Data'!$B:$B, 0)),0)))","v":3643196},{"$f":"IF('Select LAs'!$M3=0,\"-\",IF(INDEX('EY Data'!CM:CM, MATCH('Select LAs'!$M3,'EY Data'!$B:$B, 0))=\"\",\"-\",ROUND(INDEX('EY Data'!CM:CM, MATCH('Select LAs'!$M3,'EY Data'!$B:$B, 0)),0)))","v":40000},{"$f":"IF('Select LAs'!$M3=0,\"-\",IF(INDEX('EY Data'!CR:CR, MATCH('Select LAs'!$M3,'EY Data'!$B:$B, 0))=\"\",\"-\",ROUND(INDEX('EY Data'!CR:CR, MATCH('Select LAs'!$M3,'EY Data'!$B:$B, 0)),0)))","v":0},{"$f":"IF('Select LAs'!$M3=0,\"-\",IF(INDEX('EY Data'!CS:CS, MATCH('Select LAs'!$M3,'EY Data'!$B:$B, 0))=\"\",\"-\",ROUND(INDEX('EY Data'!CS:CS, MATCH('Select LAs'!$M3,'EY Data'!$B:$B, 0)),0)))","v":244698},{"$f":"IF('Select LAs'!$M3=0,\"-\",IF(INDEX('EY Data'!DQ:DQ, MATCH('Select LAs'!$M3,'EY Data'!$B:$B, 0))=\"\",\"-\",ROUND(INDEX('EY Data'!DQ:DQ, MATCH('Select LAs'!$M3,'EY Data'!$B:$B, 0)),0)))","v":2347300},{"$f":"IF('Select LAs'!$M3=0,\"-\",IF(INDEX('EY Data'!DS:DS, MATCH('Select LAs'!$M3,'EY Data'!$B:$B, 0))=\"\",\"-\",ROUND(INDEX('EY Data'!DS:DS, MATCH('Select LAs'!$M3,'EY Data'!$B:$B, 0)),0)))","v":76507},{"$f":"IF('Select LAs'!$M3=0,\"-\",IF(INDEX('EY Data'!DX:DX, MATCH('Select LAs'!$M3,'EY Data'!$B:$B, 0))=\"\",\"-\",ROUND(INDEX('EY Data'!DX:DX, MATCH('Select LAs'!$M3,'EY Data'!$B:$B, 0)),0)))","v":127000},{"$f":"IF('Select LAs'!$M3=0,\"-\",IF(INDEX('EY Data'!DY:DY, MATCH('Select LAs'!$M3,'EY Data'!$B:$B, 0))=\"\",\"-\",ROUND(INDEX('EY Data'!DY:DY, MATCH('Select LAs'!$M3,'EY Data'!$B:$B, 0)),0)))","v":134223}]
[{"$f":"'Select LAs'!P32","v":0},{"$f":"'Select LAs'!Q32","v":"No LA selected"},null,{"$f":"IF('Select LAs'!$M4=0,\"-\",IF(INDEX('EY Data'!X:X, MATCH('Select LAs'!$M4,'EY Data'!$B:$B, 0))=\"\",\"-\",ROUND(INDEX('EY Data'!X:X, MATCH('Select LAs'!$M4,'EY Data'!$B:$B, 0)),0)))","v":25522464},{"$f":"IF('Select LAs'!$M4=0,\"-\",IF(INDEX('EY Data'!Z:Z, MATCH('Select LAs'!$M4,'EY Data'!$B:$B, 0))=\"\",\"-\",ROUND(INDEX('EY Data'!Z:Z, MATCH('Select LAs'!$M4,'EY Data'!$B:$B, 0)),0)))","v":1177665},{"$f":"IF('Select LAs'!$M4=0,\"-\",IF(INDEX('EY Data'!AE:AE, MATCH('Select LAs'!$M4,'EY Data'!$B:$B, 0))=\"\",\"-\",ROUND(INDEX('EY Data'!AE:AE, MATCH('Select LAs'!$M4,'EY Data'!$B:$B, 0)),0)))","v":642565},{"$f":"IF('Select LAs'!$M4=0,\"-\",IF(INDEX('EY Data'!AF:AF, MATCH('Select LAs'!$M4,'EY Data'!$B:$B, 0))=\"\",\"-\",ROUND(INDEX('EY Data'!AF:AF, MATCH('Select LAs'!$M4,'EY Data'!$B:$B, 0)),0)))","v":1360304},{"$f":"IF('Select LAs'!$M4=0,\"-\",IF(INDEX('EY Data'!BE:BE, MATCH('Select LAs'!$M4,'EY Data'!$B:$B, 0))=\"\",\"-\",ROUND(INDEX('EY Data'!BE:BE, MATCH('Select LAs'!$M4,'EY Data'!$B:$B, 0)),0)))","v":3997470},{"$f":"IF('Select LAs'!$M4=0,\"-\",IF(INDEX('EY Data'!BG:BG, MATCH('Select LAs'!$M4,'EY Data'!$B:$B, 0))=\"\",\"-\",ROUND(INDEX('EY Data'!BG:BG, MATCH('Select LAs'!$M4,'EY Data'!$B:$B, 0)),0)))","v":104216},{"$f":"IF('Select LAs'!$M4=0,\"-\",IF(INDEX('EY Data'!BL:BL, MATCH('Select LAs'!$M4,'EY Data'!$B:$B, 0))=\"\",\"-\",ROUND(INDEX('EY Data'!BL:BL, MATCH('Select LAs'!$M4,'EY Data'!$B:$B, 0)),0)))","v":83708},{"$f":"IF('Select LAs'!$M4=0,\"-\",IF(INDEX('EY Data'!BM:BM, MATCH('Select LAs'!$M4,'EY Data'!$B:$B, 0))=\"\",\"-\",ROUND(INDEX('EY Data'!BM:BM, MATCH('Select LAs'!$M4,'EY Data'!$B:$B, 0)),0)))","v":128124},{"$f":"IF('Select LAs'!$M4=0,\"-\",IF(INDEX('EY Data'!CK:CK, MATCH('Select LAs'!$M4,'EY Data'!$B:$B, 0))=\"\",\"-\",ROUND(INDEX('EY Data'!CK:CK, MATCH('Select LAs'!$M4,'EY Data'!$B:$B, 0)),0)))","v":5953921},{"$f":"IF('Select LAs'!$M4=0,\"-\",IF(INDEX('EY Data'!CM:CM, MATCH('Select LAs'!$M4,'EY Data'!$B:$B, 0))=\"\",\"-\",ROUND(INDEX('EY Data'!CM:CM, MATCH('Select LAs'!$M4,'EY Data'!$B:$B, 0)),0)))","v":155222},{"$f":"IF('Select LAs'!$M4=0,\"-\",IF(INDEX('EY Data'!CR:CR, MATCH('Select LAs'!$M4,'EY Data'!$B:$B, 0))=\"\",\"-\",ROUND(INDEX('EY Data'!CR:CR, MATCH('Select LAs'!$M4,'EY Data'!$B:$B, 0)),0)))","v":124676},{"$f":"IF('Select LAs'!$M4=0,\"-\",IF(INDEX('EY Data'!CS:CS, MATCH('Select LAs'!$M4,'EY Data'!$B:$B, 0))=\"\",\"-\",ROUND(INDEX('EY Data'!CS:CS, MATCH('Select LAs'!$M4,'EY Data'!$B:$B, 0)),0)))","v":190831},{"$f":"IF('Select LAs'!$M4=0,\"-\",IF(INDEX('EY Data'!DQ:DQ, MATCH('Select LAs'!$M4,'EY Data'!$B:$B, 0))=\"\",\"-\",ROUND(INDEX('EY Data'!DQ:DQ, MATCH('Select LAs'!$M4,'EY Data'!$B:$B, 0)),0)))","v":4861451},{"$f":"IF('Select LAs'!$M4=0,\"-\",IF(INDEX('EY Data'!DS:DS, MATCH('Select LAs'!$M4,'EY Data'!$B:$B, 0))=\"\",\"-\",ROUND(INDEX('EY Data'!DS:DS, MATCH('Select LAs'!$M4,'EY Data'!$B:$B, 0)),0)))","v":126741},{"$f":"IF('Select LAs'!$M4=0,\"-\",IF(INDEX('EY Data'!DX:DX, MATCH('Select LAs'!$M4,'EY Data'!$B:$B, 0))=\"\",\"-\",ROUND(INDEX('EY Data'!DX:DX, MATCH('Select LAs'!$M4,'EY Data'!$B:$B, 0)),0)))","v":101800},{"$f":"IF('Select LAs'!$M4=0,\"-\",IF(INDEX('EY Data'!DY:DY, MATCH('Select LAs'!$M4,'EY Data'!$B:$B, 0))=\"\",\"-\",ROUND(INDEX('EY Data'!DY:DY, MATCH('Select LAs'!$M4,'EY Data'!$B:$B, 0)),0)))","v":155816}]
[{"$f":"'Select LAs'!P33","v":0},{"$f":"'Select LAs'!Q33","v":"No LA selected"},null,{"$f":"IF('Select LAs'!$M5=0,\"-\",IF(INDEX('EY Data'!X:X, MATCH('Select LAs'!$M5,'EY Data'!$B:$B, 0))=\"\",\"-\",ROUND(INDEX('EY Data'!X:X, MATCH('Select LAs'!$M5,'EY Data'!$B:$B, 0)),0)))","v":22607824},{"$f":"IF('Select LAs'!$M5=0,\"-\",IF(INDEX('EY Data'!Z:Z, MATCH('Select LAs'!$M5,'EY Data'!$B:$B, 0))=\"\",\"-\",ROUND(INDEX('EY Data'!Z:Z, MATCH('Select LAs'!$M5,'EY Data'!$B:$B, 0)),0)))","v":467996},{"$f":"IF('Select LAs'!$M5=0,\"-\",IF(INDEX('EY Data'!AE:AE, MATCH('Select LAs'!$M5,'EY Data'!$B:$B, 0))=\"\",\"-\",ROUND(INDEX('EY Data'!AE:AE, MATCH('Select LAs'!$M5,'EY Data'!$B:$B, 0)),0)))","v":0},{"$f":"IF('Select LAs'!$M5=0,\"-\",IF(INDEX('EY Data'!AF:AF, MATCH('Select LAs'!$M5,'EY Data'!$B:$B, 0))=\"\",\"-\",ROUND(INDEX('EY Data'!AF:AF, MATCH('Select LAs'!$M5,'EY Data'!$B:$B, 0)),0)))","v":0},{"$f":"IF('Select LAs'!$M5=0,\"-\",IF(INDEX('EY Data'!BE:BE, MATCH('Select LAs'!$M5,'EY Data'!$B:$B, 0))=\"\",\"-\",ROUND(INDEX('EY Data'!BE:BE, MATCH('Select LAs'!$M5,'EY Data'!$B:$B, 0)),0)))","v":5263212},{"$f":"IF('Select LAs'!$M5=0,\"-\",IF(INDEX('EY Data'!BG:BG, MATCH('Select LAs'!$M5,'EY Data'!$B:$B, 0))=\"\",\"-\",ROUND(INDEX('EY Data'!BG:BG, MATCH('Select LAs'!$M5,'EY Data'!$B:$B, 0)),0)))","v":107644},{"$f":"IF('Select LAs'!$M5=0,\"-\",IF(INDEX('EY Data'!BL:BL, MATCH('Select LAs'!$M5,'EY Data'!$B:$B, 0))=\"\",\"-\",ROUND(INDEX('EY Data'!BL:BL, MATCH('Select LAs'!$M5,'EY Data'!$B:$B, 0)),0)))","v":0},{"$f":"IF('Select LAs'!$M5=0,\"-\",IF(INDEX('EY Data'!BM:BM, MATCH('Select LAs'!$M5,'EY Data'!$B:$B, 0))=\"\",\"-\",ROUND(INDEX('EY Data'!BM:BM, MATCH('Select LAs'!$M5,'EY Data'!$B:$B, 0)),0)))","v":0},{"$f":"IF('Select LAs'!$M5=0,\"-\",IF(INDEX('EY Data'!CK:CK, MATCH('Select LAs'!$M5,'EY Data'!$B:$B, 0))=\"\",\"-\",ROUND(INDEX('EY Data'!CK:CK, MATCH('Select LAs'!$M5,'EY Data'!$B:$B, 0)),0)))","v":4960052},{"$f":"IF('Select LAs'!$M5=0,\"-\",IF(INDEX('EY Data'!CM:CM, MATCH('Select LAs'!$M5,'EY Data'!$B:$B, 0))=\"\",\"-\",ROUND(INDEX('EY Data'!CM:CM, MATCH('Select LAs'!$M5,'EY Data'!$B:$B, 0)),0)))","v":101443},{"$f":"IF('Select LAs'!$M5=0,\"-\",IF(INDEX('EY Data'!CR:CR, MATCH('Select LAs'!$M5,'EY Data'!$B:$B, 0))=\"\",\"-\",ROUND(INDEX('EY Data'!CR:CR, MATCH('Select LAs'!$M5,'EY Data'!$B:$B, 0)),0)))","v":0},{"$f":"IF('Select LAs'!$M5=0,\"-\",IF(INDEX('EY Data'!CS:CS, MATCH('Select LAs'!$M5,'EY Data'!$B:$B, 0))=\"\",\"-\",ROUND(INDEX('EY Data'!CS:CS, MATCH('Select LAs'!$M5,'EY Data'!$B:$B, 0)),0)))","v":0},{"$f":"IF('Select LAs'!$M5=0,\"-\",IF(INDEX('EY Data'!DQ:DQ, MATCH('Select LAs'!$M5,'EY Data'!$B:$B, 0))=\"\",\"-\",ROUND(INDEX('EY Data'!DQ:DQ, MATCH('Select LAs'!$M5,'EY Data'!$B:$B, 0)),0)))","v":4050485},{"$f":"IF('Select LAs'!$M5=0,\"-\",IF(INDEX('EY Data'!DS:DS, MATCH('Select LAs'!$M5,'EY Data'!$B:$B, 0))=\"\",\"-\",ROUND(INDEX('EY Data'!DS:DS, MATCH('Select LAs'!$M5,'EY Data'!$B:$B, 0)),0)))","v":86316},{"$f":"IF('Select LAs'!$M5=0,\"-\",IF(INDEX('EY Data'!DX:DX, MATCH('Select LAs'!$M5,'EY Data'!$B:$B, 0))=\"\",\"-\",ROUND(INDEX('EY Data'!DX:DX, MATCH('Select LAs'!$M5,'EY Data'!$B:$B, 0)),0)))","v":0},{"$f":"IF('Select LAs'!$M5=0,\"-\",IF(INDEX('EY Data'!DY:DY, MATCH('Select LAs'!$M5,'EY Data'!$B:$B, 0))=\"\",\"-\",ROUND(INDEX('EY Data'!DY:DY, MATCH('Select LAs'!$M5,'EY Data'!$B:$B, 0)),0)))","v":0}]
[{"$f":"'Select LAs'!P34","v":0},{"$f":"'Select LAs'!Q34","v":"No LA selected"},null,{"$f":"IF('Select LAs'!$M6=0,\"-\",IF(INDEX('EY Data'!X:X, MATCH('Select LAs'!$M6,'EY Data'!$B:$B, 0))=\"\",\"-\",ROUND(INDEX('EY Data'!X:X, MATCH('Select LAs'!$M6,'EY Data'!$B:$B, 0)),0)))","v":33638639},{"$f":"IF('Select LAs'!$M6=0,\"-\",IF(INDEX('EY Data'!Z:Z, MATCH('Select LAs'!$M6,'EY Data'!$B:$B, 0))=\"\",\"-\",ROUND(INDEX('EY Data'!Z:Z, MATCH('Select LAs'!$M6,'EY Data'!$B:$B, 0)),0)))","v":489063},{"$f":"IF('Select LAs'!$M6=0,\"-\",IF(INDEX('EY Data'!AE:AE, MATCH('Select LAs'!$M6,'EY Data'!$B:$B, 0))=\"\",\"-\",ROUND(INDEX('EY Data'!AE:AE, MATCH('Select LAs'!$M6,'EY Data'!$B:$B, 0)),0)))","v":370938},{"$f":"IF('Select LAs'!$M6=0,\"-\",IF(INDEX('EY Data'!AF:AF, MATCH('Select LAs'!$M6,'EY Data'!$B:$B, 0))=\"\",\"-\",ROUND(INDEX('EY Data'!AF:AF, MATCH('Select LAs'!$M6,'EY Data'!$B:$B, 0)),0)))","v":1206680},{"$f":"IF('Select LAs'!$M6=0,\"-\",IF(INDEX('EY Data'!BE:BE, MATCH('Select LAs'!$M6,'EY Data'!$B:$B, 0))=\"\",\"-\",ROUND(INDEX('EY Data'!BE:BE, MATCH('Select LAs'!$M6,'EY Data'!$B:$B, 0)),0)))","v":9889154},{"$f":"IF('Select LAs'!$M6=0,\"-\",IF(INDEX('EY Data'!BG:BG, MATCH('Select LAs'!$M6,'EY Data'!$B:$B, 0))=\"\",\"-\",ROUND(INDEX('EY Data'!BG:BG, MATCH('Select LAs'!$M6,'EY Data'!$B:$B, 0)),0)))","v":0},{"$f":"IF('Select LAs'!$M6=0,\"-\",IF(INDEX('EY Data'!BL:BL, MATCH('Select LAs'!$M6,'EY Data'!$B:$B, 0))=\"\",\"-\",ROUND(INDEX('EY Data'!BL:BL, MATCH('Select LAs'!$M6,'EY Data'!$B:$B, 0)),0)))","v":0},{"$f":"IF('Select LAs'!$M6=0,\"-\",IF(INDEX('EY Data'!BM:BM, MATCH('Select LAs'!$M6,'EY Data'!$B:$B, 0))=\"\",\"-\",ROUND(INDEX('EY Data'!BM:BM, MATCH('Select LAs'!$M6,'EY Data'!$B:$B, 0)),0)))","v":54495},{"$f":"IF('Select LAs'!$M6=0,\"-\",IF(INDEX('EY Data'!CK:CK, MATCH('Select LAs'!$M6,'EY Data'!$B:$B, 0))=\"\",\"-\",ROUND(INDEX('EY Data'!CK:CK, MATCH('Select LAs'!$M6,'EY Data'!$B:$B, 0)),0)))","v":6504153},{"$f":"IF('Select LAs'!$M6=0,\"-\",IF(INDEX('EY Data'!CM:CM, MATCH('Select LAs'!$M6,'EY Data'!$B:$B, 0))=\"\",\"-\",ROUND(INDEX('EY Data'!CM:CM, MATCH('Select LAs'!$M6,'EY Data'!$B:$B, 0)),0)))","v":0},{"$f":"IF('Select LAs'!$M6=0,\"-\",IF(INDEX('EY Data'!CR:CR, MATCH('Select LAs'!$M6,'EY Data'!$B:$B, 0))=\"\",\"-\",ROUND(INDEX('EY Data'!CR:CR, MATCH('Select LAs'!$M6,'EY Data'!$B:$B, 0)),0)))","v":0},{"$f":"IF('Select LAs'!$M6=0,\"-\",IF(INDEX('EY Data'!CS:CS, MATCH('Select LAs'!$M6,'EY Data'!$B:$B, 0))=\"\",\"-\",ROUND(INDEX('EY Data'!CS:CS, MATCH('Select LAs'!$M6,'EY Data'!$B:$B, 0)),0)))","v":85377},{"$f":"IF('Select LAs'!$M6=0,\"-\",IF(INDEX('EY Data'!DQ:DQ, MATCH('Select LAs'!$M6,'EY Data'!$B:$B, 0))=\"\",\"-\",ROUND(INDEX('EY Data'!DQ:DQ, MATCH('Select LAs'!$M6,'EY Data'!$B:$B, 0)),0)))","v":5094967},{"$f":"IF('Select LAs'!$M6=0,\"-\",IF(INDEX('EY Data'!DS:DS, MATCH('Select LAs'!$M6,'EY Data'!$B:$B, 0))=\"\",\"-\",ROUND(INDEX('EY Data'!DS:DS, MATCH('Select LAs'!$M6,'EY Data'!$B:$B, 0)),0)))","v":0},{"$f":"IF('Select LAs'!$M6=0,\"-\",IF(INDEX('EY Data'!DX:DX, MATCH('Select LAs'!$M6,'EY Data'!$B:$B, 0))=\"\",\"-\",ROUND(INDEX('EY Data'!DX:DX, MATCH('Select LAs'!$M6,'EY Data'!$B:$B, 0)),0)))","v":0},{"$f":"IF('Select LAs'!$M6=0,\"-\",IF(INDEX('EY Data'!DY:DY, MATCH('Select LAs'!$M6,'EY Data'!$B:$B, 0))=\"\",\"-\",ROUND(INDEX('EY Data'!DY:DY, MATCH('Select LAs'!$M6,'EY Data'!$B:$B, 0)),0)))","v":0}]
[{"$f":"'Select LAs'!P35","v":0},{"$f":"'Select LAs'!Q35","v":"No LA selected"},null,{"$f":"IF('Select LAs'!$M7=0,\"-\",IF(INDEX('EY Data'!X:X, MATCH('Select LAs'!$M7,'EY Data'!$B:$B, 0))=\"\",\"-\",ROUND(INDEX('EY Data'!X:X, MATCH('Select LAs'!$M7,'EY Data'!$B:$B, 0)),0)))","v":17101809},{"$f":"IF('Select LAs'!$M7=0,\"-\",IF(INDEX('EY Data'!Z:Z, MATCH('Select LAs'!$M7,'EY Data'!$B:$B, 0))=\"\",\"-\",ROUND(INDEX('EY Data'!Z:Z, MATCH('Select LAs'!$M7,'EY Data'!$B:$B, 0)),0)))","v":425000},{"$f":"IF('Select LAs'!$M7=0,\"-\",IF(INDEX('EY Data'!AE:AE, MATCH('Select LAs'!$M7,'EY Data'!$B:$B, 0))=\"\",\"-\",ROUND(INDEX('EY Data'!AE:AE, MATCH('Select LAs'!$M7,'EY Data'!$B:$B, 0)),0)))","v":785902},{"$f":"IF('Select LAs'!$M7=0,\"-\",IF(INDEX('EY Data'!AF:AF, MATCH('Select LAs'!$M7,'EY Data'!$B:$B, 0))=\"\",\"-\",ROUND(INDEX('EY Data'!AF:AF, MATCH('Select LAs'!$M7,'EY Data'!$B:$B, 0)),0)))","v":220532},{"$f":"IF('Select LAs'!$M7=0,\"-\",IF(INDEX('EY Data'!BE:BE, MATCH('Select LAs'!$M7,'EY Data'!$B:$B, 0))=\"\",\"-\",ROUND(INDEX('EY Data'!BE:BE, MATCH('Select LAs'!$M7,'EY Data'!$B:$B, 0)),0)))","v":3510164},{"$f":"IF('Select LAs'!$M7=0,\"-\",IF(INDEX('EY Data'!BG:BG, MATCH('Select LAs'!$M7,'EY Data'!$B:$B, 0))=\"\",\"-\",ROUND(INDEX('EY Data'!BG:BG, MATCH('Select LAs'!$M7,'EY Data'!$B:$B, 0)),0)))","v":77000},{"$f":"IF('Select LAs'!$M7=0,\"-\",IF(INDEX('EY Data'!BL:BL, MATCH('Select LAs'!$M7,'EY Data'!$B:$B, 0))=\"\",\"-\",ROUND(INDEX('EY Data'!BL:BL, MATCH('Select LAs'!$M7,'EY Data'!$B:$B, 0)),0)))","v":0},{"$f":"IF('Select LAs'!$M7=0,\"-\",IF(INDEX('EY Data'!BM:BM, MATCH('Select LAs'!$M7,'EY Data'!$B:$B, 0))=\"\",\"-\",ROUND(INDEX('EY Data'!BM:BM, MATCH('Select LAs'!$M7,'EY Data'!$B:$B, 0)),0)))","v":44106},{"$f":"IF('Select LAs'!$M7=0,\"-\",IF(INDEX('EY Data'!CK:CK, MATCH('Select LAs'!$M7,'EY Data'!$B:$B, 0))=\"\",\"-\",ROUND(INDEX('EY Data'!CK:CK, MATCH('Select LAs'!$M7,'EY Data'!$B:$B, 0)),0)))","v":2914310},{"$f":"IF('Select LAs'!$M7=0,\"-\",IF(INDEX('EY Data'!CM:CM, MATCH('Select LAs'!$M7,'EY Data'!$B:$B, 0))=\"\",\"-\",ROUND(INDEX('EY Data'!CM:CM, MATCH('Select LAs'!$M7,'EY Data'!$B:$B, 0)),0)))","v":65499},{"$f":"IF('Select LAs'!$M7=0,\"-\",IF(INDEX('EY Data'!CR:CR, MATCH('Select LAs'!$M7,'EY Data'!$B:$B, 0))=\"\",\"-\",ROUND(INDEX('EY Data'!CR:CR, MATCH('Select LAs'!$M7,'EY Data'!$B:$B, 0)),0)))","v":0},{"$f":"IF('Select LAs'!$M7=0,\"-\",IF(INDEX('EY Data'!CS:CS, MATCH('Select LAs'!$M7,'EY Data'!$B:$B, 0))=\"\",\"-\",ROUND(INDEX('EY Data'!CS:CS, MATCH('Select LAs'!$M7,'EY Data'!$B:$B, 0)),0)))","v":88213},{"$f":"IF('Select LAs'!$M7=0,\"-\",IF(INDEX('EY Data'!DQ:DQ, MATCH('Select LAs'!$M7,'EY Data'!$B:$B, 0))=\"\",\"-\",ROUND(INDEX('EY Data'!DQ:DQ, MATCH('Select LAs'!$M7,'EY Data'!$B:$B, 0)),0)))","v":2308356},{"$f":"IF('Select LAs'!$M7=0,\"-\",IF(INDEX('EY Data'!DS:DS, MATCH('Select LAs'!$M7,'EY Data'!$B:$B, 0))=\"\",\"-\",ROUND(INDEX('EY Data'!DS:DS, MATCH('Select LAs'!$M7,'EY Data'!$B:$B, 0)),0)))","v":11500},{"$f":"IF('Select LAs'!$M7=0,\"-\",IF(INDEX('EY Data'!DX:DX, MATCH('Select LAs'!$M7,'EY Data'!$B:$B, 0))=\"\",\"-\",ROUND(INDEX('EY Data'!DX:DX, MATCH('Select LAs'!$M7,'EY Data'!$B:$B, 0)),0)))","v":382742},{"$f":"IF('Select LAs'!$M7=0,\"-\",IF(INDEX('EY Data'!DY:DY, MATCH('Select LAs'!$M7,'EY Data'!$B:$B, 0))=\"\",\"-\",ROUND(INDEX('EY Data'!DY:DY, MATCH('Select LAs'!$M7,'EY Data'!$B:$B, 0)),0)))","v":88213}]
[{"$f":"'Select LAs'!P36","v":0},{"$f":"'Select LAs'!Q36","v":"No LA selected"},null,{"$f":"IF('Select LAs'!$M8=0,\"-\",IF(INDEX('EY Data'!X:X, MATCH('Select LAs'!$M8,'EY Data'!$B:$B, 0))=\"\",\"-\",ROUND(INDEX('EY Data'!X:X, MATCH('Select LAs'!$M8,'EY Data'!$B:$B, 0)),0)))","v":81406851},{"$f":"IF('Select LAs'!$M8=0,\"-\",IF(INDEX('EY Data'!Z:Z, MATCH('Select LAs'!$M8,'EY Data'!$B:$B, 0))=\"\",\"-\",ROUND(INDEX('EY Data'!Z:Z, MATCH('Select LAs'!$M8,'EY Data'!$B:$B, 0)),0)))","v":789277},{"$f":"IF('Select LAs'!$M8=0,\"-\",IF(INDEX('EY Data'!AE:AE, MATCH('Select LAs'!$M8,'EY Data'!$B:$B, 0))=\"\",\"-\",ROUND(INDEX('EY Data'!AE:AE, MATCH('Select LAs'!$M8,'EY Data'!$B:$B, 0)),0)))","v":0},{"$f":"IF('Select LAs'!$M8=0,\"-\",IF(INDEX('EY Data'!AF:AF, MATCH('Select LAs'!$M8,'EY Data'!$B:$B, 0))=\"\",\"-\",ROUND(INDEX('EY Data'!AF:AF, MATCH('Select LAs'!$M8,'EY Data'!$B:$B, 0)),0)))","v":2930176},{"$f":"IF('Select LAs'!$M8=0,\"-\",IF(INDEX('EY Data'!BE:BE, MATCH('Select LAs'!$M8,'EY Data'!$B:$B, 0))=\"\",\"-\",ROUND(INDEX('EY Data'!BE:BE, MATCH('Select LAs'!$M8,'EY Data'!$B:$B, 0)),0)))","v":18967737},{"$f":"IF('Select LAs'!$M8=0,\"-\",IF(INDEX('EY Data'!BG:BG, MATCH('Select LAs'!$M8,'EY Data'!$B:$B, 0))=\"\",\"-\",ROUND(INDEX('EY Data'!BG:BG, MATCH('Select LAs'!$M8,'EY Data'!$B:$B, 0)),0)))","v":206670},{"$f":"IF('Select LAs'!$M8=0,\"-\",IF(INDEX('EY Data'!BL:BL, MATCH('Select LAs'!$M8,'EY Data'!$B:$B, 0))=\"\",\"-\",ROUND(INDEX('EY Data'!BL:BL, MATCH('Select LAs'!$M8,'EY Data'!$B:$B, 0)),0)))","v":0},{"$f":"IF('Select LAs'!$M8=0,\"-\",IF(INDEX('EY Data'!BM:BM, MATCH('Select LAs'!$M8,'EY Data'!$B:$B, 0))=\"\",\"-\",ROUND(INDEX('EY Data'!BM:BM, MATCH('Select LAs'!$M8,'EY Data'!$B:$B, 0)),0)))","v":736642},{"$f":"IF('Select LAs'!$M8=0,\"-\",IF(INDEX('EY Data'!CK:CK, MATCH('Select LAs'!$M8,'EY Data'!$B:$B, 0))=\"\",\"-\",ROUND(INDEX('EY Data'!CK:CK, MATCH('Select LAs'!$M8,'EY Data'!$B:$B, 0)),0)))","v":15385173},{"$f":"IF('Select LAs'!$M8=0,\"-\",IF(INDEX('EY Data'!CM:CM, MATCH('Select LAs'!$M8,'EY Data'!$B:$B, 0))=\"\",\"-\",ROUND(INDEX('EY Data'!CM:CM, MATCH('Select LAs'!$M8,'EY Data'!$B:$B, 0)),0)))","v":128789},{"$f":"IF('Select LAs'!$M8=0,\"-\",IF(INDEX('EY Data'!CR:CR, MATCH('Select LAs'!$M8,'EY Data'!$B:$B, 0))=\"\",\"-\",ROUND(INDEX('EY Data'!CR:CR, MATCH('Select LAs'!$M8,'EY Data'!$B:$B, 0)),0)))","v":0},{"$f":"IF('Select LAs'!$M8=0,\"-\",IF(INDEX('EY Data'!CS:CS, MATCH('Select LAs'!$M8,'EY Data'!$B:$B, 0))=\"\",\"-\",ROUND(INDEX('EY Data'!CS:CS, MATCH('Select LAs'!$M8,'EY Data'!$B:$B, 0)),0)))","v":597507},{"$f":"IF('Select LAs'!$M8=0,\"-\",IF(INDEX('EY Data'!DQ:DQ, MATCH('Select LAs'!$M8,'EY Data'!$B:$B, 0))=\"\",\"-\",ROUND(INDEX('EY Data'!DQ:DQ, MATCH('Select LAs'!$M8,'EY Data'!$B:$B, 0)),0)))","v":12591565},{"$f":"IF('Select LAs'!$M8=0,\"-\",IF(INDEX('EY Data'!DS:DS, MATCH('Select LAs'!$M8,'EY Data'!$B:$B, 0))=\"\",\"-\",ROUND(INDEX('EY Data'!DS:DS, MATCH('Select LAs'!$M8,'EY Data'!$B:$B, 0)),0)))","v":178446},{"$f":"IF('Select LAs'!$M8=0,\"-\",IF(INDEX('EY Data'!DX:DX, MATCH('Select LAs'!$M8,'EY Data'!$B:$B, 0))=\"\",\"-\",ROUND(INDEX('EY Data'!DX:DX, MATCH('Select LAs'!$M8,'EY Data'!$B:$B, 0)),0)))","v":0},{"$f":"IF('Select LAs'!$M8=0,\"-\",IF(INDEX('EY Data'!DY:DY, MATCH('Select LAs'!$M8,'EY Data'!$B:$B, 0))=\"\",\"-\",ROUND(INDEX('EY Data'!DY:DY, MATCH('Select LAs'!$M8,'EY Data'!$B:$B, 0)),0)))","v":488997}]
[{"$f":"'Select LAs'!P37","v":0},{"$f":"'Select LAs'!Q37","v":"No LA selected"},null,{"$f":"IF('Select LAs'!$M9=0,\"-\",IF(INDEX('EY Data'!X:X, MATCH('Select LAs'!$M9,'EY Data'!$B:$B, 0))=\"\",\"-\",ROUND(INDEX('EY Data'!X:X, MATCH('Select LAs'!$M9,'EY Data'!$B:$B, 0)),0)))","v":20490430},{"$f":"IF('Select LAs'!$M9=0,\"-\",IF(INDEX('EY Data'!Z:Z, MATCH('Select LAs'!$M9,'EY Data'!$B:$B, 0))=\"\",\"-\",ROUND(INDEX('EY Data'!Z:Z, MATCH('Select LAs'!$M9,'EY Data'!$B:$B, 0)),0)))","v":1116521},{"$f":"IF('Select LAs'!$M9=0,\"-\",IF(INDEX('EY Data'!AE:AE, MATCH('Select LAs'!$M9,'EY Data'!$B:$B, 0))=\"\",\"-\",ROUND(INDEX('EY Data'!AE:AE, MATCH('Select LAs'!$M9,'EY Data'!$B:$B, 0)),0)))","v":171345},{"$f":"IF('Select LAs'!$M9=0,\"-\",IF(INDEX('EY Data'!AF:AF, MATCH('Select LAs'!$M9,'EY Data'!$B:$B, 0))=\"\",\"-\",ROUND(INDEX('EY Data'!AF:AF, MATCH('Select LAs'!$M9,'EY Data'!$B:$B, 0)),0)))","v":1116521},{"$f":"IF('Select LAs'!$M9=0,\"-\",IF(INDEX('EY Data'!BE:BE, MATCH('Select LAs'!$M9,'EY Data'!$B:$B, 0))=\"\",\"-\",ROUND(INDEX('EY Data'!BE:BE, MATCH('Select LAs'!$M9,'EY Data'!$B:$B, 0)),0)))","v":2826048},{"$f":"IF('Select LAs'!$M9=0,\"-\",IF(INDEX('EY Data'!BG:BG, MATCH('Select LAs'!$M9,'EY Data'!$B:$B, 0))=\"\",\"-\",ROUND(INDEX('EY Data'!BG:BG, MATCH('Select LAs'!$M9,'EY Data'!$B:$B, 0)),0)))","v":152892},{"$f":"IF('Select LAs'!$M9=0,\"-\",IF(INDEX('EY Data'!BL:BL, MATCH('Select LAs'!$M9,'EY Data'!$B:$B, 0))=\"\",\"-\",ROUND(INDEX('EY Data'!BL:BL, MATCH('Select LAs'!$M9,'EY Data'!$B:$B, 0)),0)))","v":14343},{"$f":"IF('Select LAs'!$M9=0,\"-\",IF(INDEX('EY Data'!BM:BM, MATCH('Select LAs'!$M9,'EY Data'!$B:$B, 0))=\"\",\"-\",ROUND(INDEX('EY Data'!BM:BM, MATCH('Select LAs'!$M9,'EY Data'!$B:$B, 0)),0)))","v":64556},{"$f":"IF('Select LAs'!$M9=0,\"-\",IF(INDEX('EY Data'!CK:CK, MATCH('Select LAs'!$M9,'EY Data'!$B:$B, 0))=\"\",\"-\",ROUND(INDEX('EY Data'!CK:CK, MATCH('Select LAs'!$M9,'EY Data'!$B:$B, 0)),0)))","v":5090150},{"$f":"IF('Select LAs'!$M9=0,\"-\",IF(INDEX('EY Data'!CM:CM, MATCH('Select LAs'!$M9,'EY Data'!$B:$B, 0))=\"\",\"-\",ROUND(INDEX('EY Data'!CM:CM, MATCH('Select LAs'!$M9,'EY Data'!$B:$B, 0)),0)))","v":282786},{"$f":"IF('Select LAs'!$M9=0,\"-\",IF(INDEX('EY Data'!CR:CR, MATCH('Select LAs'!$M9,'EY Data'!$B:$B, 0))=\"\",\"-\",ROUND(INDEX('EY Data'!CR:CR, MATCH('Select LAs'!$M9,'EY Data'!$B:$B, 0)),0)))","v":0},{"$f":"IF('Select LAs'!$M9=0,\"-\",IF(INDEX('EY Data'!CS:CS, MATCH('Select LAs'!$M9,'EY Data'!$B:$B, 0))=\"\",\"-\",ROUND(INDEX('EY Data'!CS:CS, MATCH('Select LAs'!$M9,'EY Data'!$B:$B, 0)),0)))","v":282786},{"$f":"IF('Select LAs'!$M9=0,\"-\",IF(INDEX('EY Data'!DQ:DQ, MATCH('Select LAs'!$M9,'EY Data'!$B:$B, 0))=\"\",\"-\",ROUND(INDEX('EY Data'!DQ:DQ, MATCH('Select LAs'!$M9,'EY Data'!$B:$B, 0)),0)))","v":4154129},{"$f":"IF('Select LAs'!$M9=0,\"-\",IF(INDEX('EY Data'!DS:DS, MATCH('Select LAs'!$M9,'EY Data'!$B:$B, 0))=\"\",\"-\",ROUND(INDEX('EY Data'!DS:DS, MATCH('Select LAs'!$M9,'EY Data'!$B:$B, 0)),0)))","v":230848},{"$f":"IF('Select LAs'!$M9=0,\"-\",IF(INDEX('EY Data'!DX:DX, MATCH('Select LAs'!$M9,'EY Data'!$B:$B, 0))=\"\",\"-\",ROUND(INDEX('EY Data'!DX:DX, MATCH('Select LAs'!$M9,'EY Data'!$B:$B, 0)),0)))","v":1129},{"$f":"IF('Select LAs'!$M9=0,\"-\",IF(INDEX('EY Data'!DY:DY, MATCH('Select LAs'!$M9,'EY Data'!$B:$B, 0))=\"\",\"-\",ROUND(INDEX('EY Data'!DY:DY, MATCH('Select LAs'!$M9,'EY Data'!$B:$B, 0)),0)))","v":230848}]
[{"$f":"'Select LAs'!P38","v":0},{"$f":"'Select LAs'!Q38","v":"No LA selected"},null,{"$f":"IF('Select LAs'!$M10=0,\"-\",IF(INDEX('EY Data'!X:X, MATCH('Select LAs'!$M10,'EY Data'!$B:$B, 0))=\"\",\"-\",ROUND(INDEX('EY Data'!X:X, MATCH('Select LAs'!$M10,'EY Data'!$B:$B, 0)),0)))","v":13997332},{"$f":"IF('Select LAs'!$M10=0,\"-\",IF(INDEX('EY Data'!Z:Z, MATCH('Select LAs'!$M10,'EY Data'!$B:$B, 0))=\"\",\"-\",ROUND(INDEX('EY Data'!Z:Z, MATCH('Select LAs'!$M10,'EY Data'!$B:$B, 0)),0)))","v":48000},{"$f":"IF('Select LAs'!$M10=0,\"-\",IF(INDEX('EY Data'!AE:AE, MATCH('Select LAs'!$M10,'EY Data'!$B:$B, 0))=\"\",\"-\",ROUND(INDEX('EY Data'!AE:AE, MATCH('Select LAs'!$M10,'EY Data'!$B:$B, 0)),0)))","v":343},{"$f":"IF('Select LAs'!$M10=0,\"-\",IF(INDEX('EY Data'!AF:AF, MATCH('Select LAs'!$M10,'EY Data'!$B:$B, 0))=\"\",\"-\",ROUND(INDEX('EY Data'!AF:AF, MATCH('Select LAs'!$M10,'EY Data'!$B:$B, 0)),0)))","v":674996},{"$f":"IF('Select LAs'!$M10=0,\"-\",IF(INDEX('EY Data'!BE:BE, MATCH('Select LAs'!$M10,'EY Data'!$B:$B, 0))=\"\",\"-\",ROUND(INDEX('EY Data'!BE:BE, MATCH('Select LAs'!$M10,'EY Data'!$B:$B, 0)),0)))","v":1581837},{"$f":"IF('Select LAs'!$M10=0,\"-\",IF(INDEX('EY Data'!BG:BG, MATCH('Select LAs'!$M10,'EY Data'!$B:$B, 0))=\"\",\"-\",ROUND(INDEX('EY Data'!BG:BG, MATCH('Select LAs'!$M10,'EY Data'!$B:$B, 0)),0)))","v":2000},{"$f":"IF('Select LAs'!$M10=0,\"-\",IF(INDEX('EY Data'!BL:BL, MATCH('Select LAs'!$M10,'EY Data'!$B:$B, 0))=\"\",\"-\",ROUND(INDEX('EY Data'!BL:BL, MATCH('Select LAs'!$M10,'EY Data'!$B:$B, 0)),0)))","v":198},{"$f":"IF('Select LAs'!$M10=0,\"-\",IF(INDEX('EY Data'!BM:BM, MATCH('Select LAs'!$M10,'EY Data'!$B:$B, 0))=\"\",\"-\",ROUND(INDEX('EY Data'!BM:BM, MATCH('Select LAs'!$M10,'EY Data'!$B:$B, 0)),0)))","v":83284},{"$f":"IF('Select LAs'!$M10=0,\"-\",IF(INDEX('EY Data'!CK:CK, MATCH('Select LAs'!$M10,'EY Data'!$B:$B, 0))=\"\",\"-\",ROUND(INDEX('EY Data'!CK:CK, MATCH('Select LAs'!$M10,'EY Data'!$B:$B, 0)),0)))","v":2354230},{"$f":"IF('Select LAs'!$M10=0,\"-\",IF(INDEX('EY Data'!CM:CM, MATCH('Select LAs'!$M10,'EY Data'!$B:$B, 0))=\"\",\"-\",ROUND(INDEX('EY Data'!CM:CM, MATCH('Select LAs'!$M10,'EY Data'!$B:$B, 0)),0)))","v":2000},{"$f":"IF('Select LAs'!$M10=0,\"-\",IF(INDEX('EY Data'!CR:CR, MATCH('Select LAs'!$M10,'EY Data'!$B:$B, 0))=\"\",\"-\",ROUND(INDEX('EY Data'!CR:CR, MATCH('Select LAs'!$M10,'EY Data'!$B:$B, 0)),0)))","v":0},{"$f":"IF('Select LAs'!$M10=0,\"-\",IF(INDEX('EY Data'!CS:CS, MATCH('Select LAs'!$M10,'EY Data'!$B:$B, 0))=\"\",\"-\",ROUND(INDEX('EY Data'!CS:CS, MATCH('Select LAs'!$M10,'EY Data'!$B:$B, 0)),0)))","v":123907},{"$f":"IF('Select LAs'!$M10=0,\"-\",IF(INDEX('EY Data'!DQ:DQ, MATCH('Select LAs'!$M10,'EY Data'!$B:$B, 0))=\"\",\"-\",ROUND(INDEX('EY Data'!DQ:DQ, MATCH('Select LAs'!$M10,'EY Data'!$B:$B, 0)),0)))","v":1917778},{"$f":"IF('Select LAs'!$M10=0,\"-\",IF(INDEX('EY Data'!DS:DS, MATCH('Select LAs'!$M10,'EY Data'!$B:$B, 0))=\"\",\"-\",ROUND(INDEX('EY Data'!DS:DS, MATCH('Select LAs'!$M10,'EY Data'!$B:$B, 0)),0)))","v":2000},{"$f":"IF('Select LAs'!$M10=0,\"-\",IF(INDEX('EY Data'!DX:DX, MATCH('Select LAs'!$M10,'EY Data'!$B:$B, 0))=\"\",\"-\",ROUND(INDEX('EY Data'!DX:DX, MATCH('Select LAs'!$M10,'EY Data'!$B:$B, 0)),0)))","v":56},{"$f":"IF('Select LAs'!$M10=0,\"-\",IF(INDEX('EY Data'!DY:DY, MATCH('Select LAs'!$M10,'EY Data'!$B:$B, 0))=\"\",\"-\",ROUND(INDEX('EY Data'!DY:DY, MATCH('Select LAs'!$M10,'EY Data'!$B:$B, 0)),0)))","v":100936}]
[{"$f":"'Select LAs'!P39","v":0},{"$f":"'Select LAs'!Q39","v":"No LA selected"},null,{"$f":"IF('Select LAs'!$M11=0,\"-\",IF(INDEX('EY Data'!X:X, MATCH('Select LAs'!$M11,'EY Data'!$B:$B, 0))=\"\",\"-\",ROUND(INDEX('EY Data'!X:X, MATCH('Select LAs'!$M11,'EY Data'!$B:$B, 0)),0)))","v":17118655},{"$f":"IF('Select LAs'!$M11=0,\"-\",IF(INDEX('EY Data'!Z:Z, MATCH('Select LAs'!$M11,'EY Data'!$B:$B, 0))=\"\",\"-\",ROUND(INDEX('EY Data'!Z:Z, MATCH('Select LAs'!$M11,'EY Data'!$B:$B, 0)),0)))","v":279941},{"$f":"IF('Select LAs'!$M11=0,\"-\",IF(INDEX('EY Data'!AE:AE, MATCH('Select LAs'!$M11,'EY Data'!$B:$B, 0))=\"\",\"-\",ROUND(INDEX('EY Data'!AE:AE, MATCH('Select LAs'!$M11,'EY Data'!$B:$B, 0)),0)))","v":0},{"$f":"IF('Select LAs'!$M11=0,\"-\",IF(INDEX('EY Data'!AF:AF, MATCH('Select LAs'!$M11,'EY Data'!$B:$B, 0))=\"\",\"-\",ROUND(INDEX('EY Data'!AF:AF, MATCH('Select LAs'!$M11,'EY Data'!$B:$B, 0)),0)))","v":716351},{"$f":"IF('Select LAs'!$M11=0,\"-\",IF(INDEX('EY Data'!BE:BE, MATCH('Select LAs'!$M11,'EY Data'!$B:$B, 0))=\"\",\"-\",ROUND(INDEX('EY Data'!BE:BE, MATCH('Select LAs'!$M11,'EY Data'!$B:$B, 0)),0)))","v":4364321},{"$f":"IF('Select LAs'!$M11=0,\"-\",IF(INDEX('EY Data'!BG:BG, MATCH('Select LAs'!$M11,'EY Data'!$B:$B, 0))=\"\",\"-\",ROUND(INDEX('EY Data'!BG:BG, MATCH('Select LAs'!$M11,'EY Data'!$B:$B, 0)),0)))","v":10000},{"$f":"IF('Select LAs'!$M11=0,\"-\",IF(INDEX('EY Data'!BL:BL, MATCH('Select LAs'!$M11,'EY Data'!$B:$B, 0))=\"\",\"-\",ROUND(INDEX('EY Data'!BL:BL, MATCH('Select LAs'!$M11,'EY Data'!$B:$B, 0)),0)))","v":0},{"$f":"IF('Select LAs'!$M11=0,\"-\",IF(INDEX('EY Data'!BM:BM, MATCH('Select LAs'!$M11,'EY Data'!$B:$B, 0))=\"\",\"-\",ROUND(INDEX('EY Data'!BM:BM, MATCH('Select LAs'!$M11,'EY Data'!$B:$B, 0)),0)))","v":45000},{"$f":"IF('Select LAs'!$M11=0,\"-\",IF(INDEX('EY Data'!CK:CK, MATCH('Select LAs'!$M11,'EY Data'!$B:$B, 0))=\"\",\"-\",ROUND(INDEX('EY Data'!CK:CK, MATCH('Select LAs'!$M11,'EY Data'!$B:$B, 0)),0)))","v":4177765},{"$f":"IF('Select LAs'!$M11=0,\"-\",IF(INDEX('EY Data'!CM:CM, MATCH('Select LAs'!$M11,'EY Data'!$B:$B, 0))=\"\",\"-\",ROUND(INDEX('EY Data'!CM:CM, MATCH('Select LAs'!$M11,'EY Data'!$B:$B, 0)),0)))","v":10000},{"$f":"IF('Select LAs'!$M11=0,\"-\",IF(INDEX('EY Data'!CR:CR, MATCH('Select LAs'!$M11,'EY Data'!$B:$B, 0))=\"\",\"-\",ROUND(INDEX('EY Data'!CR:CR, MATCH('Select LAs'!$M11,'EY Data'!$B:$B, 0)),0)))","v":0},{"$f":"IF('Select LAs'!$M11=0,\"-\",IF(INDEX('EY Data'!CS:CS, MATCH('Select LAs'!$M11,'EY Data'!$B:$B, 0))=\"\",\"-\",ROUND(INDEX('EY Data'!CS:CS, MATCH('Select LAs'!$M11,'EY Data'!$B:$B, 0)),0)))","v":0},{"$f":"IF('Select LAs'!$M11=0,\"-\",IF(INDEX('EY Data'!DQ:DQ, MATCH('Select LAs'!$M11,'EY Data'!$B:$B, 0))=\"\",\"-\",ROUND(INDEX('EY Data'!DQ:DQ, MATCH('Select LAs'!$M11,'EY Data'!$B:$B, 0)),0)))","v":3343706},{"$f":"IF('Select LAs'!$M11=0,\"-\",IF(INDEX('EY Data'!DS:DS, MATCH('Select LAs'!$M11,'EY Data'!$B:$B, 0))=\"\",\"-\",ROUND(INDEX('EY Data'!DS:DS, MATCH('Select LAs'!$M11,'EY Data'!$B:$B, 0)),0)))","v":10000},{"$f":"IF('Select LAs'!$M11=0,\"-\",IF(INDEX('EY Data'!DX:DX, MATCH('Select LAs'!$M11,'EY Data'!$B:$B, 0))=\"\",\"-\",ROUND(INDEX('EY Data'!DX:DX, MATCH('Select LAs'!$M11,'EY Data'!$B:$B, 0)),0)))","v":0},{"$f":"IF('Select LAs'!$M11=0,\"-\",IF(INDEX('EY Data'!DY:DY, MATCH('Select LAs'!$M11,'EY Data'!$B:$B, 0))=\"\",\"-\",ROUND(INDEX('EY Data'!DY:DY, MATCH('Select LAs'!$M11,'EY Data'!$B:$B, 0)),0)))","v":0}]
[{"$f":"'Select LAs'!P40","v":0},{"$f":"'Select LAs'!Q40","v":"No LA selected"},null,{"$f":"IF('Select LAs'!$M12=0,\"-\",IF(INDEX('EY Data'!X:X, MATCH('Select LAs'!$M12,'EY Data'!$B:$B, 0))=\"\",\"-\",ROUND(INDEX('EY Data'!X:X, MATCH('Select LAs'!$M12,'EY Data'!$B:$B, 0)),0)))","v":21202884},{"$f":"IF('Select LAs'!$M12=0,\"-\",IF(INDEX('EY Data'!Z:Z, MATCH('Select LAs'!$M12,'EY Data'!$B:$B, 0))=\"\",\"-\",ROUND(INDEX('EY Data'!Z:Z, MATCH('Select LAs'!$M12,'EY Data'!$B:$B, 0)),0)))","v":452000},{"$f":"IF('Select LAs'!$M12=0,\"-\",IF(INDEX('EY Data'!AE:AE, MATCH('Select LAs'!$M12,'EY Data'!$B:$B, 0))=\"\",\"-\",ROUND(INDEX('EY Data'!AE:AE, MATCH('Select LAs'!$M12,'EY Data'!$B:$B, 0)),0)))","v":0},{"$f":"IF('Select LAs'!$M12=0,\"-\",IF(INDEX('EY Data'!AF:AF, MATCH('Select LAs'!$M12,'EY Data'!$B:$B, 0))=\"\",\"-\",ROUND(INDEX('EY Data'!AF:AF, MATCH('Select LAs'!$M12,'EY Data'!$B:$B, 0)),0)))","v":1141955},{"$f":"IF('Select LAs'!$M12=0,\"-\",IF(INDEX('EY Data'!BE:BE, MATCH('Select LAs'!$M12,'EY Data'!$B:$B, 0))=\"\",\"-\",ROUND(INDEX('EY Data'!BE:BE, MATCH('Select LAs'!$M12,'EY Data'!$B:$B, 0)),0)))","v":4462136},{"$f":"IF('Select LAs'!$M12=0,\"-\",IF(INDEX('EY Data'!BG:BG, MATCH('Select LAs'!$M12,'EY Data'!$B:$B, 0))=\"\",\"-\",ROUND(INDEX('EY Data'!BG:BG, MATCH('Select LAs'!$M12,'EY Data'!$B:$B, 0)),0)))","v":19902},{"$f":"IF('Select LAs'!$M12=0,\"-\",IF(INDEX('EY Data'!BL:BL, MATCH('Select LAs'!$M12,'EY Data'!$B:$B, 0))=\"\",\"-\",ROUND(INDEX('EY Data'!BL:BL, MATCH('Select LAs'!$M12,'EY Data'!$B:$B, 0)),0)))","v":0},{"$f":"IF('Select LAs'!$M12=0,\"-\",IF(INDEX('EY Data'!BM:BM, MATCH('Select LAs'!$M12,'EY Data'!$B:$B, 0))=\"\",\"-\",ROUND(INDEX('EY Data'!BM:BM, MATCH('Select LAs'!$M12,'EY Data'!$B:$B, 0)),0)))","v":87487},{"$f":"IF('Select LAs'!$M12=0,\"-\",IF(INDEX('EY Data'!CK:CK, MATCH('Select LAs'!$M12,'EY Data'!$B:$B, 0))=\"\",\"-\",ROUND(INDEX('EY Data'!CK:CK, MATCH('Select LAs'!$M12,'EY Data'!$B:$B, 0)),0)))","v":5479819},{"$f":"IF('Select LAs'!$M12=0,\"-\",IF(INDEX('EY Data'!CM:CM, MATCH('Select LAs'!$M12,'EY Data'!$B:$B, 0))=\"\",\"-\",ROUND(INDEX('EY Data'!CM:CM, MATCH('Select LAs'!$M12,'EY Data'!$B:$B, 0)),0)))","v":26098},{"$f":"IF('Select LAs'!$M12=0,\"-\",IF(INDEX('EY Data'!CR:CR, MATCH('Select LAs'!$M12,'EY Data'!$B:$B, 0))=\"\",\"-\",ROUND(INDEX('EY Data'!CR:CR, MATCH('Select LAs'!$M12,'EY Data'!$B:$B, 0)),0)))","v":0},{"$f":"IF('Select LAs'!$M12=0,\"-\",IF(INDEX('EY Data'!CS:CS, MATCH('Select LAs'!$M12,'EY Data'!$B:$B, 0))=\"\",\"-\",ROUND(INDEX('EY Data'!CS:CS, MATCH('Select LAs'!$M12,'EY Data'!$B:$B, 0)),0)))","v":286174},{"$f":"IF('Select LAs'!$M12=0,\"-\",IF(INDEX('EY Data'!DQ:DQ, MATCH('Select LAs'!$M12,'EY Data'!$B:$B, 0))=\"\",\"-\",ROUND(INDEX('EY Data'!DQ:DQ, MATCH('Select LAs'!$M12,'EY Data'!$B:$B, 0)),0)))","v":4438909},{"$f":"IF('Select LAs'!$M12=0,\"-\",IF(INDEX('EY Data'!DS:DS, MATCH('Select LAs'!$M12,'EY Data'!$B:$B, 0))=\"\",\"-\",ROUND(INDEX('EY Data'!DS:DS, MATCH('Select LAs'!$M12,'EY Data'!$B:$B, 0)),0)))","v":0},{"$f":"IF('Select LAs'!$M12=0,\"-\",IF(INDEX('EY Data'!DX:DX, MATCH('Select LAs'!$M12,'EY Data'!$B:$B, 0))=\"\",\"-\",ROUND(INDEX('EY Data'!DX:DX, MATCH('Select LAs'!$M12,'EY Data'!$B:$B, 0)),0)))","v":0},{"$f":"IF('Select LAs'!$M12=0,\"-\",IF(INDEX('EY Data'!DY:DY, MATCH('Select LAs'!$M12,'EY Data'!$B:$B, 0))=\"\",\"-\",ROUND(INDEX('EY Data'!DY:DY, MATCH('Select LAs'!$M12,'EY Data'!$B:$B, 0)),0)))","v":233536}]
[{"$f":"'Select LAs'!P41","v":0},{"$f":"'Select LAs'!Q41","v":"No LA selected"},null,{"$f":"IF('Select LAs'!$M13=0,\"-\",IF(INDEX('EY Data'!X:X, MATCH('Select LAs'!$M13,'EY Data'!$B:$B, 0))=\"\",\"-\",ROUND(INDEX('EY Data'!X:X, MATCH('Select LAs'!$M13,'EY Data'!$B:$B, 0)),0)))","v":21179717},{"$f":"IF('Select LAs'!$M13=0,\"-\",IF(INDEX('EY Data'!Z:Z, MATCH('Select LAs'!$M13,'EY Data'!$B:$B, 0))=\"\",\"-\",ROUND(INDEX('EY Data'!Z:Z, MATCH('Select LAs'!$M13,'EY Data'!$B:$B, 0)),0)))","v":404000},{"$f":"IF('Select LAs'!$M13=0,\"-\",IF(INDEX('EY Data'!AE:AE, MATCH('Select LAs'!$M13,'EY Data'!$B:$B, 0))=\"\",\"-\",ROUND(INDEX('EY Data'!AE:AE, MATCH('Select LAs'!$M13,'EY Data'!$B:$B, 0)),0)))","v":0},{"$f":"IF('Select LAs'!$M13=0,\"-\",IF(INDEX('EY Data'!AF:AF, MATCH('Select LAs'!$M13,'EY Data'!$B:$B, 0))=\"\",\"-\",ROUND(INDEX('EY Data'!AF:AF, MATCH('Select LAs'!$M13,'EY Data'!$B:$B, 0)),0)))","v":697000},{"$f":"IF('Select LAs'!$M13=0,\"-\",IF(INDEX('EY Data'!BE:BE, MATCH('Select LAs'!$M13,'EY Data'!$B:$B, 0))=\"\",\"-\",ROUND(INDEX('EY Data'!BE:BE, MATCH('Select LAs'!$M13,'EY Data'!$B:$B, 0)),0)))","v":3956834},{"$f":"IF('Select LAs'!$M13=0,\"-\",IF(INDEX('EY Data'!BG:BG, MATCH('Select LAs'!$M13,'EY Data'!$B:$B, 0))=\"\",\"-\",ROUND(INDEX('EY Data'!BG:BG, MATCH('Select LAs'!$M13,'EY Data'!$B:$B, 0)),0)))","v":172400},{"$f":"IF('Select LAs'!$M13=0,\"-\",IF(INDEX('EY Data'!BL:BL, MATCH('Select LAs'!$M13,'EY Data'!$B:$B, 0))=\"\",\"-\",ROUND(INDEX('EY Data'!BL:BL, MATCH('Select LAs'!$M13,'EY Data'!$B:$B, 0)),0)))","v":0},{"$f":"IF('Select LAs'!$M13=0,\"-\",IF(INDEX('EY Data'!BM:BM, MATCH('Select LAs'!$M13,'EY Data'!$B:$B, 0))=\"\",\"-\",ROUND(INDEX('EY Data'!BM:BM, MATCH('Select LAs'!$M13,'EY Data'!$B:$B, 0)),0)))","v":133800},{"$f":"IF('Select LAs'!$M13=0,\"-\",IF(INDEX('EY Data'!CK:CK, MATCH('Select LAs'!$M13,'EY Data'!$B:$B, 0))=\"\",\"-\",ROUND(INDEX('EY Data'!CK:CK, MATCH('Select LAs'!$M13,'EY Data'!$B:$B, 0)),0)))","v":5108603},{"$f":"IF('Select LAs'!$M13=0,\"-\",IF(INDEX('EY Data'!CM:CM, MATCH('Select LAs'!$M13,'EY Data'!$B:$B, 0))=\"\",\"-\",ROUND(INDEX('EY Data'!CM:CM, MATCH('Select LAs'!$M13,'EY Data'!$B:$B, 0)),0)))","v":323600},{"$f":"IF('Select LAs'!$M13=0,\"-\",IF(INDEX('EY Data'!CR:CR, MATCH('Select LAs'!$M13,'EY Data'!$B:$B, 0))=\"\",\"-\",ROUND(INDEX('EY Data'!CR:CR, MATCH('Select LAs'!$M13,'EY Data'!$B:$B, 0)),0)))","v":0},{"$f":"IF('Select LAs'!$M13=0,\"-\",IF(INDEX('EY Data'!CS:CS, MATCH('Select LAs'!$M13,'EY Data'!$B:$B, 0))=\"\",\"-\",ROUND(INDEX('EY Data'!CS:CS, MATCH('Select LAs'!$M13,'EY Data'!$B:$B, 0)),0)))","v":172700},{"$f":"IF('Select LAs'!$M13=0,\"-\",IF(INDEX('EY Data'!DQ:DQ, MATCH('Select LAs'!$M13,'EY Data'!$B:$B, 0))=\"\",\"-\",ROUND(INDEX('EY Data'!DQ:DQ, MATCH('Select LAs'!$M13,'EY Data'!$B:$B, 0)),0)))","v":4268549},{"$f":"IF('Select LAs'!$M13=0,\"-\",IF(INDEX('EY Data'!DS:DS, MATCH('Select LAs'!$M13,'EY Data'!$B:$B, 0))=\"\",\"-\",ROUND(INDEX('EY Data'!DS:DS, MATCH('Select LAs'!$M13,'EY Data'!$B:$B, 0)),0)))","v":100000},{"$f":"IF('Select LAs'!$M13=0,\"-\",IF(INDEX('EY Data'!DX:DX, MATCH('Select LAs'!$M13,'EY Data'!$B:$B, 0))=\"\",\"-\",ROUND(INDEX('EY Data'!DX:DX, MATCH('Select LAs'!$M13,'EY Data'!$B:$B, 0)),0)))","v":0},{"$f":"IF('Select LAs'!$M13=0,\"-\",IF(INDEX('EY Data'!DY:DY, MATCH('Select LAs'!$M13,'EY Data'!$B:$B, 0))=\"\",\"-\",ROUND(INDEX('EY Data'!DY:DY, MATCH('Select LAs'!$M13,'EY Data'!$B:$B, 0)),0)))","v":144300}]
[null,"Selection Median",null,{"$f":"IF(COUNT(D$16:D$26)>0,MEDIAN(D$16:D$26),\"-\")","v":21179717},452000,343,983944,{"$f":"IF(COUNT(H$16:H$26)>0,MEDIAN(H$16:H$26),\"-\")","v":4364321},{"$f":"IF(COUNT(I$16:I$26)>0,MEDIAN(I$16:I$26),\"-\")","v":77000},{"$f":"IF(COUNT(J$16:J$26)>0,MEDIAN(J$16:J$26),\"-\")","v":0},{"$f":"IF(COUNT(K$16:K$26)>0,MEDIAN(K$16:K$26),\"-\")","v":83284},{"$f":"IF(COUNT(L$16:L$26)>0,MEDIAN(L$16:L$26),\"-\")","v":5090150},{"$f":"IF(COUNT(M$16:M$26)>0,MEDIAN(M$16:M$26),\"-\")","v":65499},{"$f":"IF(COUNT(N$16:N$26)>0,MEDIAN(N$16:N$26),\"-\")","v":0},{"$f":"IF(COUNT(O$16:O$26)>0,MEDIAN(O$16:O$26),\"-\")","v":172700},{"$f":"IF(COUNT(P$16:P$26)>0,MEDIAN(P$16:P$26),\"-\")","v":4154129},{"$f":"IF(COUNT(Q$16:Q$26)>0,MEDIAN(Q$16:Q$26),\"-\")","v":76507},{"$f":"IF(COUNT(R$16:R$26)>0,MEDIAN(R$16:R$26),\"-\")","v":0},{"$f":"IF(COUNT(S$16:S$26)>0,MEDIAN(S$16:S$26),\"-\")","v":134223}]
[null,"Selection Minimum",null,{"$f":"IF(COUNT(D$16:D$26)>0,MIN(D$16:D$26),\"-\")","v":13997332},48000,0,0,{"$f":"IF(COUNT(H$16:H$26)>0,MIN(H$16:H$26),\"-\")","v":1581837},{"$f":"IF(COUNT(I$16:I$26)>0,MIN(I$16:I$26),\"-\")","v":0},{"$f":"IF(COUNT(J$16:J$26)>0,MIN(J$16:J$26),\"-\")","v":0},{"$f":"IF(COUNT(K$16:K$26)>0,MIN(K$16:K$26),\"-\")","v":0},{"$f":"IF(COUNT(L$16:L$26)>0,MIN(L$16:L$26),\"-\")","v":2354230},{"$f":"IF(COUNT(M$16:M$26)>0,MIN(M$16:M$26),\"-\")","v":0},{"$f":"IF(COUNT(N$16:N$26)>0,MIN(N$16:N$26),\"-\")","v":0},{"$f":"IF(COUNT(O$16:O$26)>0,MIN(O$16:O$26),\"-\")","v":0},{"$f":"IF(COUNT(P$16:P$26)>0,MIN(P$16:P$26),\"-\")","v":1917778},{"$f":"IF(COUNT(Q$16:Q$26)>0,MIN(Q$16:Q$26),\"-\")","v":0},{"$f":"IF(COUNT(R$16:R$26)>0,MIN(R$16:R$26),\"-\")","v":0},{"$f":"IF(COUNT(S$16:S$26)>0,MIN(S$16:S$26),\"-\")","v":0}]
[null,"Selection Maximum",null,{"$f":"IF(COUNT(D$16:D$26)>0,MAX(D$16:D$26),\"-\")","v":81406851},1177665,785902,2930176,{"$f":"IF(COUNT(H$16:H$26)>0,MAX(H$16:H$26),\"-\")","v":18967737},{"$f":"IF(COUNT(I$16:I$26)>0,MAX(I$16:I$26),\"-\")","v":206670},{"$f":"IF(COUNT(J$16:J$26)>0,MAX(J$16:J$26),\"-\")","v":83708},{"$f":"IF(COUNT(K$16:K$26)>0,MAX(K$16:K$26),\"-\")","v":736642},{"$f":"IF(COUNT(L$16:L$26)>0,MAX(L$16:L$26),\"-\")","v":15385173},{"$f":"IF(COUNT(M$16:M$26)>0,MAX(M$16:M$26),\"-\")","v":323600},{"$f":"IF(COUNT(N$16:N$26)>0,MAX(N$16:N$26),\"-\")","v":124676},{"$f":"IF(COUNT(O$16:O$26)>0,MAX(O$16:O$26),\"-\")","v":597507},{"$f":"IF(COUNT(P$16:P$26)>0,MAX(P$16:P$26),\"-\")","v":12591565},{"$f":"IF(COUNT(Q$16:Q$26)>0,MAX(Q$16:Q$26),\"-\")","v":230848},{"$f":"IF(COUNT(R$16:R$26)>0,MAX(R$16:R$26),\"-\")","v":382742},{"$f":"IF(COUNT(S$16:S$26)>0,MAX(S$16:S$26),\"-\")","v":488997}]

{"sheet":"DAF","index":6,"n_rows":25,"n_cols":8,"rows_kept":25,"cut":false,"hidden":true,"merged":[[3,1,3,2],[4,1,4,2],[6,1,7,7],[9,1,9,2]]}
[]
[null,{"$f":"CONCATENATE('Select LAs'!B3,\" - Key Budget Statistics\")","v":"No LA selected - Key Budget Statistics"}]
[null,null,null,null,null,null,null,{"$f":"'3-4 year olds '!K2","v":"Financial Year 2024-2025"}]
[null,{"$f":"'Select LAs'!D3","v":"No LA selected"},null,"All establishments"]
[null,"Disability Access Fund - total",null,{"$f":"IF('Select LAs'!$A$3=\"LA No\", \"-\", INDEX('EY Data'!EO:EO, MATCH('Select LAs'!$A$3,'EY Data'!$B:$B, 0)))","v":"-"}]
[]
[null,{"$f":"CONCATENATE(\"Benchmarking against \",IF(_SN=1,\"Statistical Neighbours\",\"Manual Selection\"))","v":"Benchmarking against Manual Selection"}]
[]
[]
[null,"Local Authority",null,"Disability Access Fund\n3-4 year olds","Disability Access Fund\n2 year olds (D)","Disability Access Fund\n2 year olds (W)","Disability Access Fund\n9 mth -  2 year olds","Disability Access Fund\nAll Providers"]
[null,"England",null,{"$f":"ROUND(INDEX('EY Data'!EK:EK, MATCH($B11,'EY Data'!$C:$C, 0)), 0)","v":28226195},{"$f":"ROUND(INDEX('EY Data'!EL:EL, MATCH($B11,'EY Data'!$C:$C, 0)), 0)","v":4386632},{"$f":"ROUND(INDEX('EY Data'!EM:EM, MATCH($B11,'EY Data'!$C:$C, 0)), 0)","v":3974927},{"$f":"ROUND(INDEX('EY Data'!EN:EN, MATCH($B11,'EY Data'!$C:$C, 0)), 0)","v":2457379},{"$f":"ROUND(INDEX('EY Data'!EO:EO, MATCH($B11,'EY Data'!$C:$C, 0)), 0)","v":39045133}]
[null,{"$f":"'Select LAs'!B3","v":"No LA selected"},null,{"$f":"IF(OR('Select LAs'!$B3=0, 'Select LAs'!$B3=\"No LA selected\"),\"-\",IF(INDEX('EY Data'!EK:EK, MATCH('Select LAs'!$A3,'EY Data'!$B:$B, 0))=\"\",\"-\",ROUND(INDEX('EY Data'!EK:EK, MATCH('Select LAs'!$A3,'EY Data'!$B:$B, 0)),0)))","v":"-"},{"$f":"IF(OR('Select LAs'!$B3=0, 'Select LAs'!$B3=\"No LA selected\"),\"-\",IF(INDEX('EY Data'!EL:EL, MATCH('Select LAs'!$A3,'EY Data'!$B:$B, 0))=\"\",\"-\",ROUND(INDEX('EY Data'!EL:EL, MATCH('Select LAs'!$A3,'EY Data'!$B:$B, 0)),0)))","v":"-"},{"$f":"IF(OR('Select LAs'!$B3=0, 'Select LAs'!$B3=\"No LA selected\"),\"-\",IF(INDEX('EY Data'!EM:EM, MATCH('Select LAs'!$A3,'EY Data'!$B:$B, 0))=\"\",\"-\",ROUND(INDEX('EY Data'!EM:EM, MATCH('Select LAs'!$A3,'EY Data'!$B:$B, 0)),0)))","v":"-"},{"$f":"IF(OR('Select LAs'!$B3=0, 'Select LAs'!$B3=\"No LA selected\"),\"-\",IF(INDEX('EY Data'!EN:EN, MATCH('Select LAs'!$A3,'EY Data'!$B:$B, 0))=\"\",\"-\",ROUND(INDEX('EY Data'!EN:EN, MATCH('Select LAs'!$A3,'EY Data'!$B:$B, 0)),0)))","v":"-"},{"$f":"IF(OR('Select LAs'!$B3=0, 'Select LAs'!$B3=\"No LA selected\"),\"-\",IF(INDEX('EY Data'!EO:EO, MATCH('Select LAs'!$A3,'EY Data'!$B:$B, 0))=\"\",\"-\",ROUND(INDEX('EY Data'!EO:EO, MATCH('Select LAs'!$A3,'EY Data'!$B:$B, 0)),0)))","v":"-"}]
[null,{"$f":"'Select LAs'!B4","v":"No LA selected"},null,{"$f":"IF(OR('Select LAs'!$B4=0, 'Select LAs'!$B4=\"No LA selected\"),\"-\",IF(INDEX('EY Data'!EK:EK, MATCH('Select LAs'!$A4,'EY Data'!$B:$B, 0))=\"\",\"-\",ROUND(INDEX('EY Data'!EK:EK, MATCH('Select LAs'!$A4,'EY Data'!$B:$B, 0)),0)))","v":"-"},{"$f":"IF(OR('Select LAs'!$B4=0, 'Select LAs'!$B4=\"No LA selected\"),\"-\",IF(INDEX('EY Data'!EL:EL, MATCH('Select LAs'!$A4,'EY Data'!$B:$B, 0))=\"\",\"-\",ROUND(INDEX('EY Data'!EL:EL, MATCH('Select LAs'!$A4,'EY Data'!$B:$B, 0)),0)))","v":"-"},{"$f":"IF(OR('Select LAs'!$B4=0, 'Select LAs'!$B4=\"No LA selected\"),\"-\",IF(INDEX('EY Data'!EM:EM, MATCH('Select LAs'!$A4,'EY Data'!$B:$B, 0))=\"\",\"-\",ROUND(INDEX('EY Data'!EM:EM, MATCH('Select LAs'!$A4,'EY Data'!$B:$B, 0)),0)))","v":"-"},{"$f":"IF(OR('Select LAs'!$B4=0, 'Select LAs'!$B4=\"No LA selected\"),\"-\",IF(INDEX('EY Data'!EN:EN, MATCH('Select LAs'!$A4,'EY Data'!$B:$B, 0))=\"\",\"-\",ROUND(INDEX('EY Data'!EN:EN, MATCH('Select LAs'!$A4,'EY Data'!$B:$B, 0)),0)))","v":"-"},{"$f":"IF(OR('Select LAs'!$B4=0, 'Select LAs'!$B4=\"No LA selected\"),\"-\",IF(INDEX('EY Data'!EO:EO, MATCH('Select LAs'!$A4,'EY Data'!$B:$B, 0))=\"\",\"-\",ROUND(INDEX('EY Data'!EO:EO, MATCH('Select LAs'!$A4,'EY Data'!$B:$B, 0)),0)))","v":"-"}]
[null,{"$f":"'Select LAs'!B5","v":"No LA selected"},null,{"$f":"IF(OR('Select LAs'!$B5=0, 'Select LAs'!$B5=\"No LA selected\"),\"-\",IF(INDEX('EY Data'!EK:EK, MATCH('Select LAs'!$A5,'EY Data'!$B:$B, 0))=\"\",\"-\",ROUND(INDEX('EY Data'!EK:EK, MATCH('Select LAs'!$A5,'EY Data'!$B:$B, 0)),0)))","v":"-"},{"$f":"IF(OR('Select LAs'!$B5=0, 'Select LAs'!$B5=\"No LA selected\"),\"-\",IF(INDEX('EY Data'!EL:EL, MATCH('Select LAs'!$A5,'EY Data'!$B:$B, 0))=\"\",\"-\",ROUND(INDEX('EY Data'!EL:EL, MATCH('Select LAs'!$A5,'EY Data'!$B:$B, 0)),0)))","v":"-"},{"$f":"IF(OR('Select LAs'!$B5=0, 'Select LAs'!$B5=\"No LA selected\"),\"-\",IF(INDEX('EY Data'!EM:EM, MATCH('Select LAs'!$A5,'EY Data'!$B:$B, 0))=\"\",\"-\",ROUND(INDEX('EY Data'!EM:EM, MATCH('Select LAs'!$A5,'EY Data'!$B:$B, 0)),0)))","v":"-"},{"$f":"IF(OR('Select LAs'!$B5=0, 'Select LAs'!$B5=\"No LA selected\"),\"-\",IF(INDEX('EY Data'!EN:EN, MATCH('Select LAs'!$A5,'EY Data'!$B:$B, 0))=\"\",\"-\",ROUND(INDEX('EY Data'!EN:EN, MATCH('Select LAs'!$A5,'EY Data'!$B:$B, 0)),0)))","v":"-"},{"$f":"IF(OR('Select LAs'!$B5=0, 'Select LAs'!$B5=\"No LA selected\"),\"-\",IF(INDEX('EY Data'!EO:EO, MATCH('Select LAs'!$A5,'EY Data'!$B:$B, 0))=\"\",\"-\",ROUND(INDEX('EY Data'!EO:EO, MATCH('Select LAs'!$A5,'EY Data'!$B:$B, 0)),0)))","v":"-"}]
[null,{"$f":"'Select LAs'!B6","v":"No LA selected"},null,{"$f":"IF(OR('Select LAs'!$B6=0, 'Select LAs'!$B6=\"No LA selected\"),\"-\",IF(INDEX('EY Data'!EK:EK, MATCH('Select LAs'!$A6,'EY Data'!$B:$B, 0))=\"\",\"-\",ROUND(INDEX('EY Data'!EK:EK, MATCH('Select LAs'!$A6,'EY Data'!$B:$B, 0)),0)))","v":"-"},{"$f":"IF(OR('Select LAs'!$B6=0, 'Select LAs'!$B6=\"No LA selected\"),\"-\",IF(INDEX('EY Data'!EL:EL, MATCH('Select LAs'!$A6,'EY Data'!$B:$B, 0))=\"\",\"-\",ROUND(INDEX('EY Data'!EL:EL, MATCH('Select LAs'!$A6,'EY Data'!$B:$B, 0)),0)))","v":"-"},{"$f":"IF(OR('Select LAs'!$B6=0, 'Select LAs'!$B6=\"No LA selected\"),\"-\",IF(INDEX('EY Data'!EM:EM, MATCH('Select LAs'!$A6,'EY Data'!$B:$B, 0))=\"\",\"-\",ROUND(INDEX('EY Data'!EM:EM, MATCH('Select LAs'!$A6,'EY Data'!$B:$B, 0)),0)))","v":"-"},{"$f":"IF(OR('Select LAs'!$B6=0, 'Select LAs'!$B6=\"No LA selected\"),\"-\",IF(INDEX('EY Data'!EN:EN, MATCH('Select LAs'!$A6,'EY Data'!$B:$B, 0))=\"\",\"-\",ROUND(INDEX('EY Data'!EN:EN, MATCH('Select LAs'!$A6,'EY Data'!$B:$B, 0)),0)))","v":"-"},{"$f":"IF(OR('Select LAs'!$B6=0, 'Select LAs'!$B6=\"No LA selected\"),\"-\",IF(INDEX('EY Data'!EO:EO, MATCH('Select LAs'!$A6,'EY Data'!$B:$B, 0))=\"\",\"-\",ROUND(INDEX('EY Data'!EO:EO, MATCH('Select LAs'!$A6,'EY Data'!$B:$B, 0)),0)))","v":"-"}]
[null,{"$f":"'Select LAs'!B7","v":"No LA selected"},null,{"$f":"IF(OR('Select LAs'!$B7=0, 'Select LAs'!$B7=\"No LA selected\"),\"-\",IF(INDEX('EY Data'!EK:EK, MATCH('Select LAs'!$A7,'EY Data'!$B:$B, 0))=\"\",\"-\",ROUND(INDEX('EY Data'!EK:EK, MATCH('Select LAs'!$A7,'EY Data'!$B:$B, 0)),0)))","v":"-"},{"$f":"IF(OR('Select LAs'!$B7=0, 'Select LAs'!$B7=\"No LA selected\"),\"-\",IF(INDEX('EY Data'!EL:EL, MATCH('Select LAs'!$A7,'EY Data'!$B:$B, 0))=\"\",\"-\",ROUND(INDEX('EY Data'!EL:EL, MATCH('Select LAs'!$A7,'EY Data'!$B:$B, 0)),0)))","v":"-"},{"$f":"IF(OR('Select LAs'!$B7=0, 'Select LAs'!$B7=\"No LA selected\"),\"-\",IF(INDEX('EY Data'!EM:EM, MATCH('Select LAs'!$A7,'EY Data'!$B:$B, 0))=\"\",\"-\",ROUND(INDEX('EY Data'!EM:EM, MATCH('Select LAs'!$A7,'EY Data'!$B:$B, 0)),0)))","v":"-"},{"$f":"IF(OR('Select LAs'!$B7=0, 'Select LAs'!$B7=\"No LA selected\"),\"-\",IF(INDEX('EY Data'!EN:EN, MATCH('Select LAs'!$A7,'EY Data'!$B:$B, 0))=\"\",\"-\",ROUND(INDEX('EY Data'!EN:EN, MATCH('Select LAs'!$A7,'EY Data'!$B:$B, 0)),0)))","v":"-"},{"$f":"IF(OR('Select LAs'!$B7=0, 'Select LAs'!$B7=\"No LA selected\"),\"-\",IF(INDEX('EY Data'!EO:EO, MATCH('Select LAs'!$A7,'EY Data'!$B:$B, 0))=\"\",\"-\",ROUND(INDEX('EY Data'!EO:EO, MATCH('Select LAs'!$A7,'EY Data'!$B:$B, 0)),0)))","v":"-"}]
[null,{"$f":"'Select LAs'!B8","v":"No LA selected"},null,{"$f":"IF(OR('Select LAs'!$B8=0, 'Select LAs'!$B8=\"No LA selected\"),\"-\",IF(INDEX('EY Data'!EK:EK, MATCH('Select LAs'!$A8,'EY Data'!$B:$B, 0))=\"\",\"-\",ROUND(INDEX('EY Data'!EK:EK, MATCH('Select LAs'!$A8,'EY Data'!$B:$B, 0)),0)))","v":"-"},{"$f":"IF(OR('Select LAs'!$B8=0, 'Select LAs'!$B8=\"No LA selected\"),\"-\",IF(INDEX('EY Data'!EL:EL, MATCH('Select LAs'!$A8,'EY Data'!$B:$B, 0))=\"\",\"-\",ROUND(INDEX('EY Data'!EL:EL, MATCH('Select LAs'!$A8,'EY Data'!$B:$B, 0)),0)))","v":"-"},{"$f":"IF(OR('Select LAs'!$B8=0, 'Select LAs'!$B8=\"No LA selected\"),\"-\",IF(INDEX('EY Data'!EM:EM, MATCH('Select LAs'!$A8,'EY Data'!$B:$B, 0))=\"\",\"-\",ROUND(INDEX('EY Data'!EM:EM, MATCH('Select LAs'!$A8,'EY Data'!$B:$B, 0)),0)))","v":"-"},{"$f":"IF(OR('Select LAs'!$B8=0, 'Select LAs'!$B8=\"No LA selected\"),\"-\",IF(INDEX('EY Data'!EN:EN, MATCH('Select LAs'!$A8,'EY Data'!$B:$B, 0))=\"\",\"-\",ROUND(INDEX('EY Data'!EN:EN, MATCH('Select LAs'!$A8,'EY Data'!$B:$B, 0)),0)))","v":"-"},{"$f":"IF(OR('Select LAs'!$B8=0, 'Select LAs'!$B8=\"No LA selected\"),\"-\",IF(INDEX('EY Data'!EO:EO, MATCH('Select LAs'!$A8,'EY Data'!$B:$B, 0))=\"\",\"-\",ROUND(INDEX('EY Data'!EO:EO, MATCH('Select LAs'!$A8,'EY Data'!$B:$B, 0)),0)))","v":"-"}]
[null,{"$f":"'Select LAs'!B9","v":"No LA selected"},null,{"$f":"IF(OR('Select LAs'!$B9=0, 'Select LAs'!$B9=\"No LA selected\"),\"-\",IF(INDEX('EY Data'!EK:EK, MATCH('Select LAs'!$A9,'EY Data'!$B:$B, 0))=\"\",\"-\",ROUND(INDEX('EY Data'!EK:EK, MATCH('Select LAs'!$A9,'EY Data'!$B:$B, 0)),0)))","v":"-"},{"$f":"IF(OR('Select LAs'!$B9=0, 'Select LAs'!$B9=\"No LA selected\"),\"-\",IF(INDEX('EY Data'!EL:EL, MATCH('Select LAs'!$A9,'EY Data'!$B:$B, 0))=\"\",\"-\",ROUND(INDEX('EY Data'!EL:EL, MATCH('Select LAs'!$A9,'EY Data'!$B:$B, 0)),0)))","v":"-"},{"$f":"IF(OR('Select LAs'!$B9=0, 'Select LAs'!$B9=\"No LA selected\"),\"-\",IF(INDEX('EY Data'!EM:EM, MATCH('Select LAs'!$A9,'EY Data'!$B:$B, 0))=\"\",\"-\",ROUND(INDEX('EY Data'!EM:EM, MATCH('Select LAs'!$A9,'EY Data'!$B:$B, 0)),0)))","v":"-"},{"$f":"IF(OR('Select LAs'!$B9=0, 'Select LAs'!$B9=\"No LA selected\"),\"-\",IF(INDEX('EY Data'!EN:EN, MATCH('Select LAs'!$A9,'EY Data'!$B:$B, 0))=\"\",\"-\",ROUND(INDEX('EY Data'!EN:EN, MATCH('Select LAs'!$A9,'EY Data'!$B:$B, 0)),0)))","v":"-"},{"$f":"IF(OR('Select LAs'!$B9=0, 'Select LAs'!$B9=\"No LA selected\"),\"-\",IF(INDEX('EY Data'!EO:EO, MATCH('Select LAs'!$A9,'EY Data'!$B:$B, 0))=\"\",\"-\",ROUND(INDEX('EY Data'!EO:EO, MATCH('Select LAs'!$A9,'EY Data'!$B:$B, 0)),0)))","v":"-"}]
[null,{"$f":"'Select LAs'!B10","v":"No LA selected"},null,{"$f":"IF(OR('Select LAs'!$B10=0, 'Select LAs'!$B10=\"No LA selected\"),\"-\",IF(INDEX('EY Data'!EK:EK, MATCH('Select LAs'!$A10,'EY Data'!$B:$B, 0))=\"\",\"-\",ROUND(INDEX('EY Data'!EK:EK, MATCH('Select LAs'!$A10,'EY Data'!$B:$B, 0)),0)))","v":"-"},{"$f":"IF(OR('Select LAs'!$B10=0, 'Select LAs'!$B10=\"No LA selected\"),\"-\",IF(INDEX('EY Data'!EL:EL, MATCH('Select LAs'!$A10,'EY Data'!$B:$B, 0))=\"\",\"-\",ROUND(INDEX('EY Data'!EL:EL, MATCH('Select LAs'!$A10,'EY Data'!$B:$B, 0)),0)))","v":"-"},{"$f":"IF(OR('Select LAs'!$B10=0, 'Select LAs'!$B10=\"No LA selected\"),\"-\",IF(INDEX('EY Data'!EM:EM, MATCH('Select LAs'!$A10,'EY Data'!$B:$B, 0))=\"\",\"-\",ROUND(INDEX('EY Data'!EM:EM, MATCH('Select LAs'!$A10,'EY Data'!$B:$B, 0)),0)))","v":"-"},{"$f":"IF(OR('Select LAs'!$B10=0, 'Select LAs'!$B10=\"No LA selected\"),\"-\",IF(INDEX('EY Data'!EN:EN, MATCH('Select LAs'!$A10,'EY Data'!$B:$B, 0))=\"\",\"-\",ROUND(INDEX('EY Data'!EN:EN, MATCH('Select LAs'!$A10,'EY Data'!$B:$B, 0)),0)))","v":"-"},{"$f":"IF(OR('Select LAs'!$B10=0, 'Select LAs'!$B10=\"No LA selected\"),\"-\",IF(INDEX('EY Data'!EO:EO, MATCH('Select LAs'!$A10,'EY Data'!$B:$B, 0))=\"\",\"-\",ROUND(INDEX('EY Data'!EO:EO, MATCH('Select LAs'!$A10,'EY Data'!$B:$B, 0)),0)))","v":"-"}]
[null,{"$f":"'Select LAs'!B11","v":"No LA selected"},null,{"$f":"IF(OR('Select LAs'!$B11=0, 'Select LAs'!$B11=\"No LA selected\"),\"-\",IF(INDEX('EY Data'!EK:EK, MATCH('Select LAs'!$A11,'EY Data'!$B:$B, 0))=\"\",\"-\",ROUND(INDEX('EY Data'!EK:EK, MATCH('Select LAs'!$A11,'EY Data'!$B:$B, 0)),0)))","v":"-"},{"$f":"IF(OR('Select LAs'!$B11=0, 'Select LAs'!$B11=\"No LA selected\"),\"-\",IF(INDEX('EY Data'!EL:EL, MATCH('Select LAs'!$A11,'EY Data'!$B:$B, 0))=\"\",\"-\",ROUND(INDEX('EY Data'!EL:EL, MATCH('Select LAs'!$A11,'EY Data'!$B:$B, 0)),0)))","v":"-"},{"$f":"IF(OR('Select LAs'!$B11=0, 'Select LAs'!$B11=\"No LA selected\"),\"-\",IF(INDEX('EY Data'!EM:EM, MATCH('Select LAs'!$A11,'EY Data'!$B:$B, 0))=\"\",\"-\",ROUND(INDEX('EY Data'!EM:EM, MATCH('Select LAs'!$A11,'EY Data'!$B:$B, 0)),0)))","v":"-"},{"$f":"IF(OR('Select LAs'!$B11=0, 'Select LAs'!$B11=\"No LA selected\"),\"-\",IF(INDEX('EY Data'!EN:EN, MATCH('Select LAs'!$A11,'EY Data'!$B:$B, 0))=\"\",\"-\",ROUND(INDEX('EY Data'!EN:EN, MATCH('Select LAs'!$A11,'EY Data'!$B:$B, 0)),0)))","v":"-"},{"$f":"IF(OR('Select LAs'!$B11=0, 'Select LAs'!$B11=\"No LA selected\"),\"-\",IF(INDEX('EY Data'!EO:EO, MATCH('Select LAs'!$A11,'EY Data'!$B:$B, 0))=\"\",\"-\",ROUND(INDEX('EY Data'!EO:EO, MATCH('Select LAs'!$A11,'EY Data'!$B:$B, 0)),0)))","v":"-"}]
[null,{"$f":"'Select LAs'!B12","v":"No LA selected"},null,{"$f":"IF(OR('Select LAs'!$B12=0, 'Select LAs'!$B12=\"No LA selected\"),\"-\",IF(INDEX('EY Data'!EK:EK, MATCH('Select LAs'!$A12,'EY Data'!$B:$B, 0))=\"\",\"-\",ROUND(INDEX('EY Data'!EK:EK, MATCH('Select LAs'!$A12,'EY Data'!$B:$B, 0)),0)))","v":"-"},{"$f":"IF(OR('Select LAs'!$B12=0, 'Select LAs'!$B12=\"No LA selected\"),\"-\",IF(INDEX('EY Data'!EL:EL, MATCH('Select LAs'!$A12,'EY Data'!$B:$B, 0))=\"\",\"-\",ROUND(INDEX('EY Data'!EL:EL, MATCH('Select LAs'!$A12,'EY Data'!$B:$B, 0)),0)))","v":"-"},{"$f":"IF(OR('Select LAs'!$B12=0, 'Select LAs'!$B12=\"No LA selected\"),\"-\",IF(INDEX('EY Data'!EM:EM, MATCH('Select LAs'!$A12,'EY Data'!$B:$B, 0))=\"\",\"-\",ROUND(INDEX('EY Data'!EM:EM, MATCH('Select LAs'!$A12,'EY Data'!$B:$B, 0)),0)))","v":"-"},{"$f":"IF(OR('Select LAs'!$B12=0, 'Select LAs'!$B12=\"No LA selected\"),\"-\",IF(INDEX('EY Data'!EN:EN, MATCH('Select LAs'!$A12,'EY Data'!$B:$B, 0))=\"\",\"-\",ROUND(INDEX('EY Data'!EN:EN, MATCH('Select LAs'!$A12,'EY Data'!$B:$B, 0)),0)))","v":"-"},{"$f":"IF(OR('Select LAs'!$B12=0, 'Select LAs'!$B12=\"No LA selected\"),\"-\",IF(INDEX('EY Data'!EO:EO, MATCH('Select LAs'!$A12,'EY Data'!$B:$B, 0))=\"\",\"-\",ROUND(INDEX('EY Data'!EO:EO, MATCH('Select LAs'!$A12,'EY Data'!$B:$B, 0)),0)))","v":"-"}]
[null,{"$f":"'Select LAs'!B13","v":"No LA selected"},null,{"$f":"IF(OR('Select LAs'!$B13=0, 'Select LAs'!$B13=\"No LA selected\"),\"-\",IF(INDEX('EY Data'!EK:EK, MATCH('Select LAs'!$A13,'EY Data'!$B:$B, 0))=\"\",\"-\",ROUND(INDEX('EY Data'!EK:EK, MATCH('Select LAs'!$A13,'EY Data'!$B:$B, 0)),0)))","v":"-"},{"$f":"IF(OR('Select LAs'!$B13=0, 'Select LAs'!$B13=\"No LA selected\"),\"-\",IF(INDEX('EY Data'!EL:EL, MATCH('Select LAs'!$A13,'EY Data'!$B:$B, 0))=\"\",\"-\",ROUND(INDEX('EY Data'!EL:EL, MATCH('Select LAs'!$A13,'EY Data'!$B:$B, 0)),0)))","v":"-"},{"$f":"IF(OR('Select LAs'!$B13=0, 'Select LAs'!$B13=\"No LA selected\"),\"-\",IF(INDEX('EY Data'!EM:EM, MATCH('Select LAs'!$A13,'EY Data'!$B:$B, 0))=\"\",\"-\",ROUND(INDEX('EY Data'!EM:EM, MATCH('Select LAs'!$A13,'EY Data'!$B:$B, 0)),0)))","v":"-"},{"$f":"IF(OR('Select LAs'!$B13=0, 'Select LAs'!$B13=\"No LA selected\"),\"-\",IF(INDEX('EY Data'!EN:EN, MATCH('Select LAs'!$A13,'EY Data'!$B:$B, 0))=\"\",\"-\",ROUND(INDEX('EY Data'!EN:EN, MATCH('Select LAs'!$A13,'EY Data'!$B:$B, 0)),0)))","v":"-"},{"$f":"IF(OR('Select LAs'!$B13=0, 'Select LAs'!$B13=\"No LA selected\"),\"-\",IF(INDEX('EY Data'!EO:EO, MATCH('Select LAs'!$A13,'EY Data'!$B:$B, 0))=\"\",\"-\",ROUND(INDEX('EY Data'!EO:EO, MATCH('Select LAs'!$A13,'EY Data'!$B:$B, 0)),0)))","v":"-"}]
[null,"Selection Median",null,{"$f":"IFERROR(MEDIAN(D12:D22), 0)","v":0},{"$f":"IFERROR(MEDIAN(E12:E22), 0)","v":0},{"$f":"IFERROR(MEDIAN(F12:F22), 0)","v":0},{"$f":"IFERROR(MEDIAN(G12:G22), 0)","v":0},{"$f":"IFERROR(MEDIAN(H12:H22), 0)","v":0}]
[null,"Selection Minimum",null,{"$f":"MIN(D12:D22)","v":0},{"$f":"MIN(E12:E22)","v":0},{"$f":"MIN(F12:F22)","v":0},{"$f":"MIN(G12:G22)","v":0},{"$f":"MIN(H12:H22)","v":0}]
[null,"Selection Maximum",null,{"$f":"MAX(D12:D22)","v":0},{"$f":"MAX(E12:E22)","v":0},{"$f":"MAX(F12:F22)","v":0},{"$f":"MAX(G12:G22)","v":0},{"$f":"MAX(H12:H22)","v":0}]

{"sheet":"EYPP","index":7,"n_rows":25,"n_cols":8,"rows_kept":25,"cut":false,"hidden":true,"merged":[[3,1,3,2],[4,1,4,2],[9,1,9,2],[6,1,7,7]]}
[]
[null,{"$f":"CONCATENATE('Select LAs'!B3,\" - Key Budget Statistics\")","v":"No LA selected - Key Budget Statistics"}]
[null,null,null,null,null,null,null,{"$f":"'3-4 year olds '!K2","v":"Financial Year 2024-2025"}]
[null,{"$f":"'Select LAs'!D3","v":"No LA selected"},null,"All establishments"]
[null,"Early Years Pupil Premium - total",null,{"$f":"IF('Select LAs'!$A$3=\"LA No\", \"-\", INDEX('EY Data'!EI:EI, MATCH('Select LAs'!$A$3,'EY Data'!$B:$B, 0)))","v":"-"}]
[]
[null,{"$f":"CONCATENATE(\"Benchmarking against \",IF(_SN=1,\"Statistical Neighbours\",\"Manual Selection\"))","v":"Benchmarking against Manual Selection"}]
[]
[]
[null,"Local Authority",null,"Early Years Pupil Premium\n3-4 year olds","Early Years Pupil Premium\n2 year olds (D)","Early Years Pupil Premium\n2 year olds (W)","Early Years Pupil Premium\n9 mth - 2 year olds","Early Years Pupil Premium\nAll providers"]
[null,"England",null,{"$f":"ROUND(INDEX('EY Data'!EE:EE, MATCH($B11,'EY Data'!$C:$C, 0)), 0)","v":44196992},{"$f":"ROUND(INDEX('EY Data'!EF:EF, MATCH($B11,'EY Data'!$C:$C, 0)), 0)","v":14168649},{"$f":"ROUND(INDEX('EY Data'!EG:EG, MATCH($B11,'EY Data'!$C:$C, 0)), 0)","v":14624088},{"$f":"ROUND(INDEX('EY Data'!EH:EH, MATCH($B11,'EY Data'!$C:$C, 0)), 0)","v":1467351},{"$f":"ROUND(INDEX('EY Data'!EI:EI, MATCH($B11,'EY Data'!$C:$C, 0)), 0)","v":74457080}]
[null,{"$f":"'Select LAs'!B3","v":"No LA selected"},null,{"$f":"IF(OR('Select LAs'!$B3=0, 'Select LAs'!$B3=\"No LA selected\"),\"-\",IF(INDEX('EY Data'!EE:EE, MATCH('Select LAs'!$A3,'EY Data'!$B:$B, 0))=\"\",\"-\",ROUND(INDEX('EY Data'!EE:EE, MATCH('Select LAs'!$A3,'EY Data'!$B:$B, 0)),0)))","v":"-"},{"$f":"IF(OR('Select LAs'!$B3=0, 'Select LAs'!$B3=\"No LA selected\"),\"-\",IF(INDEX('EY Data'!EF:EF, MATCH('Select LAs'!$A3,'EY Data'!$B:$B, 0))=\"\",\"-\",ROUND(INDEX('EY Data'!EF:EF, MATCH('Select LAs'!$A3,'EY Data'!$B:$B, 0)),0)))","v":"-"},{"$f":"IF(OR('Select LAs'!$B3=0, 'Select LAs'!$B3=\"No LA selected\"),\"-\",IF(INDEX('EY Data'!EG:EG, MATCH('Select LAs'!$A3,'EY Data'!$B:$B, 0))=\"\",\"-\",ROUND(INDEX('EY Data'!EG:EG, MATCH('Select LAs'!$A3,'EY Data'!$B:$B, 0)),0)))","v":"-"},{"$f":"IF(OR('Select LAs'!$B3=0, 'Select LAs'!$B3=\"No LA selected\"),\"-\",IF(INDEX('EY Data'!EH:EH, MATCH('Select LAs'!$A3,'EY Data'!$B:$B, 0))=\"\",\"-\",ROUND(INDEX('EY Data'!EH:EH, MATCH('Select LAs'!$A3,'EY Data'!$B:$B, 0)),0)))","v":"-"},{"$f":"IF(OR('Select LAs'!$B3=0, 'Select LAs'!$B3=\"No LA selected\"),\"-\",IF(INDEX('EY Data'!EI:EI, MATCH('Select LAs'!$A3,'EY Data'!$B:$B, 0))=\"\",\"-\",ROUND(INDEX('EY Data'!EI:EI, MATCH('Select LAs'!$A3,'EY Data'!$B:$B, 0)),0)))","v":"-"}]
[null,{"$f":"'Select LAs'!B4","v":"No LA selected"},null,{"$f":"IF(OR('Select LAs'!$B4=0, 'Select LAs'!$B4=\"No LA selected\"),\"-\",IF(INDEX('EY Data'!EE:EE, MATCH('Select LAs'!$A4,'EY Data'!$B:$B, 0))=\"\",\"-\",ROUND(INDEX('EY Data'!EE:EE, MATCH('Select LAs'!$A4,'EY Data'!$B:$B, 0)),0)))","v":"-"},{"$f":"IF(OR('Select LAs'!$B4=0, 'Select LAs'!$B4=\"No LA selected\"),\"-\",IF(INDEX('EY Data'!EF:EF, MATCH('Select LAs'!$A4,'EY Data'!$B:$B, 0))=\"\",\"-\",ROUND(INDEX('EY Data'!EF:EF, MATCH('Select LAs'!$A4,'EY Data'!$B:$B, 0)),0)))","v":"-"},{"$f":"IF(OR('Select LAs'!$B4=0, 'Select LAs'!$B4=\"No LA selected\"),\"-\",IF(INDEX('EY Data'!EG:EG, MATCH('Select LAs'!$A4,'EY Data'!$B:$B, 0))=\"\",\"-\",ROUND(INDEX('EY Data'!EG:EG, MATCH('Select LAs'!$A4,'EY Data'!$B:$B, 0)),0)))","v":"-"},{"$f":"IF(OR('Select LAs'!$B4=0, 'Select LAs'!$B4=\"No LA selected\"),\"-\",IF(INDEX('EY Data'!EH:EH, MATCH('Select LAs'!$A4,'EY Data'!$B:$B, 0))=\"\",\"-\",ROUND(INDEX('EY Data'!EH:EH, MATCH('Select LAs'!$A4,'EY Data'!$B:$B, 0)),0)))","v":"-"},{"$f":"IF(OR('Select LAs'!$B4=0, 'Select LAs'!$B4=\"No LA selected\"),\"-\",IF(INDEX('EY Data'!EI:EI, MATCH('Select LAs'!$A4,'EY Data'!$B:$B, 0))=\"\",\"-\",ROUND(INDEX('EY Data'!EI:EI, MATCH('Select LAs'!$A4,'EY Data'!$B:$B, 0)),0)))","v":"-"}]
[null,{"$f":"'Select LAs'!B5","v":"No LA selected"},null,{"$f":"IF(OR('Select LAs'!$B5=0, 'Select LAs'!$B5=\"No LA selected\"),\"-\",IF(INDEX('EY Data'!EE:EE, MATCH('Select LAs'!$A5,'EY Data'!$B:$B, 0))=\"\",\"-\",ROUND(INDEX('EY Data'!EE:EE, MATCH('Select LAs'!$A5,'EY Data'!$B:$B, 0)),0)))","v":"-"},{"$f":"IF(OR('Select LAs'!$B5=0, 'Select LAs'!$B5=\"No LA selected\"),\"-\",IF(INDEX('EY Data'!EF:EF, MATCH('Select LAs'!$A5,'EY Data'!$B:$B, 0))=\"\",\"-\",ROUND(INDEX('EY Data'!EF:EF, MATCH('Select LAs'!$A5,'EY Data'!$B:$B, 0)),0)))","v":"-"},{"$f":"IF(OR('Select LAs'!$B5=0, 'Select LAs'!$B5=\"No LA selected\"),\"-\",IF(INDEX('EY Data'!EG:EG, MATCH('Select LAs'!$A5,'EY Data'!$B:$B, 0))=\"\",\"-\",ROUND(INDEX('EY Data'!EG:EG, MATCH('Select LAs'!$A5,'EY Data'!$B:$B, 0)),0)))","v":"-"},{"$f":"IF(OR('Select LAs'!$B5=0, 'Select LAs'!$B5=\"No LA selected\"),\"-\",IF(INDEX('EY Data'!EH:EH, MATCH('Select LAs'!$A5,'EY Data'!$B:$B, 0))=\"\",\"-\",ROUND(INDEX('EY Data'!EH:EH, MATCH('Select LAs'!$A5,'EY Data'!$B:$B, 0)),0)))","v":"-"},{"$f":"IF(OR('Select LAs'!$B5=0, 'Select LAs'!$B5=\"No LA selected\"),\"-\",IF(INDEX('EY Data'!EI:EI, MATCH('Select LAs'!$A5,'EY Data'!$B:$B, 0))=\"\",\"-\",ROUND(INDEX('EY Data'!EI:EI, MATCH('Select LAs'!$A5,'EY Data'!$B:$B, 0)),0)))","v":"-"}]
[null,{"$f":"'Select LAs'!B6","v":"No LA selected"},null,{"$f":"IF(OR('Select LAs'!$B6=0, 'Select LAs'!$B6=\"No LA selected\"),\"-\",IF(INDEX('EY Data'!EE:EE, MATCH('Select LAs'!$A6,'EY Data'!$B:$B, 0))=\"\",\"-\",ROUND(INDEX('EY Data'!EE:EE, MATCH('Select LAs'!$A6,'EY Data'!$B:$B, 0)),0)))","v":"-"},{"$f":"IF(OR('Select LAs'!$B6=0, 'Select LAs'!$B6=\"No LA selected\"),\"-\",IF(INDEX('EY Data'!EF:EF, MATCH('Select LAs'!$A6,'EY Data'!$B:$B, 0))=\"\",\"-\",ROUND(INDEX('EY Data'!EF:EF, MATCH('Select LAs'!$A6,'EY Data'!$B:$B, 0)),0)))","v":"-"},{"$f":"IF(OR('Select LAs'!$B6=0, 'Select LAs'!$B6=\"No LA selected\"),\"-\",IF(INDEX('EY Data'!EG:EG, MATCH('Select LAs'!$A6,'EY Data'!$B:$B, 0))=\"\",\"-\",ROUND(INDEX('EY Data'!EG:EG, MATCH('Select LAs'!$A6,'EY Data'!$B:$B, 0)),0)))","v":"-"},{"$f":"IF(OR('Select LAs'!$B6=0, 'Select LAs'!$B6=\"No LA selected\"),\"-\",IF(INDEX('EY Data'!EH:EH, MATCH('Select LAs'!$A6,'EY Data'!$B:$B, 0))=\"\",\"-\",ROUND(INDEX('EY Data'!EH:EH, MATCH('Select LAs'!$A6,'EY Data'!$B:$B, 0)),0)))","v":"-"},{"$f":"IF(OR('Select LAs'!$B6=0, 'Select LAs'!$B6=\"No LA selected\"),\"-\",IF(INDEX('EY Data'!EI:EI, MATCH('Select LAs'!$A6,'EY Data'!$B:$B, 0))=\"\",\"-\",ROUND(INDEX('EY Data'!EI:EI, MATCH('Select LAs'!$A6,'EY Data'!$B:$B, 0)),0)))","v":"-"}]
[null,{"$f":"'Select LAs'!B7","v":"No LA selected"},null,{"$f":"IF(OR('Select LAs'!$B7=0, 'Select LAs'!$B7=\"No LA selected\"),\"-\",IF(INDEX('EY Data'!EE:EE, MATCH('Select LAs'!$A7,'EY Data'!$B:$B, 0))=\"\",\"-\",ROUND(INDEX('EY Data'!EE:EE, MATCH('Select LAs'!$A7,'EY Data'!$B:$B, 0)),0)))","v":"-"},{"$f":"IF(OR('Select LAs'!$B7=0, 'Select LAs'!$B7=\"No LA selected\"),\"-\",IF(INDEX('EY Data'!EF:EF, MATCH('Select LAs'!$A7,'EY Data'!$B:$B, 0))=\"\",\"-\",ROUND(INDEX('EY Data'!EF:EF, MATCH('Select LAs'!$A7,'EY Data'!$B:$B, 0)),0)))","v":"-"},{"$f":"IF(OR('Select LAs'!$B7=0, 'Select LAs'!$B7=\"No LA selected\"),\"-\",IF(INDEX('EY Data'!EG:EG, MATCH('Select LAs'!$A7,'EY Data'!$B:$B, 0))=\"\",\"-\",ROUND(INDEX('EY Data'!EG:EG, MATCH('Select LAs'!$A7,'EY Data'!$B:$B, 0)),0)))","v":"-"},{"$f":"IF(OR('Select LAs'!$B7=0, 'Select LAs'!$B7=\"No LA selected\"),\"-\",IF(INDEX('EY Data'!EH:EH, MATCH('Select LAs'!$A7,'EY Data'!$B:$B, 0))=\"\",\"-\",ROUND(INDEX('EY Data'!EH:EH, MATCH('Select LAs'!$A7,'EY Data'!$B:$B, 0)),0)))","v":"-"},{"$f":"IF(OR('Select LAs'!$B7=0, 'Select LAs'!$B7=\"No LA selected\"),\"-\",IF(INDEX('EY Data'!EI:EI, MATCH('Select LAs'!$A7,'EY Data'!$B:$B, 0))=\"\",\"-\",ROUND(INDEX('EY Data'!EI:EI, MATCH('Select LAs'!$A7,'EY Data'!$B:$B, 0)),0)))","v":"-"}]
[null,{"$f":"'Select LAs'!B8","v":"No LA selected"},null,{"$f":"IF(OR('Select LAs'!$B8=0, 'Select LAs'!$B8=\"No LA selected\"),\"-\",IF(INDEX('EY Data'!EE:EE, MATCH('Select LAs'!$A8,'EY Data'!$B:$B, 0))=\"\",\"-\",ROUND(INDEX('EY Data'!EE:EE, MATCH('Select LAs'!$A8,'EY Data'!$B:$B, 0)),0)))","v":"-"},{"$f":"IF(OR('Select LAs'!$B8=0, 'Select LAs'!$B8=\"No LA selected\"),\"-\",IF(INDEX('EY Data'!EF:EF, MATCH('Select LAs'!$A8,'EY Data'!$B:$B, 0))=\"\",\"-\",ROUND(INDEX('EY Data'!EF:EF, MATCH('Select LAs'!$A8,'EY Data'!$B:$B, 0)),0)))","v":"-"},{"$f":"IF(OR('Select LAs'!$B8=0, 'Select LAs'!$B8=\"No LA selected\"),\"-\",IF(INDEX('EY Data'!EG:EG, MATCH('Select LAs'!$A8,'EY Data'!$B:$B, 0))=\"\",\"-\",ROUND(INDEX('EY Data'!EG:EG, MATCH('Select LAs'!$A8,'EY Data'!$B:$B, 0)),0)))","v":"-"},{"$f":"IF(OR('Select LAs'!$B8=0, 'Select LAs'!$B8=\"No LA selected\"),\"-\",IF(INDEX('EY Data'!EH:EH, MATCH('Select LAs'!$A8,'EY Data'!$B:$B, 0))=\"\",\"-\",ROUND(INDEX('EY Data'!EH:EH, MATCH('Select LAs'!$A8,'EY Data'!$B:$B, 0)),0)))","v":"-"},{"$f":"IF(OR('Select LAs'!$B8=0, 'Select LAs'!$B8=\"No LA selected\"),\"-\",IF(INDEX('EY Data'!EI:EI, MATCH('Select LAs'!$A8,'EY Data'!$B:$B, 0))=\"\",\"-\",ROUND(INDEX('EY Data'!EI:EI, MATCH('Select LAs'!$A8,'EY Data'!$B:$B, 0)),0)))","v":"-"}]
[null,{"$f":"'Select LAs'!B9","v":"No LA selected"},null,{"$f":"IF(OR('Select LAs'!$B9=0, 'Select LAs'!$B9=\"No LA selected\"),\"-\",IF(INDEX('EY Data'!EE:EE, MATCH('Select LAs'!$A9,'EY Data'!$B:$B, 0))=\"\",\"-\",ROUND(INDEX('EY Data'!EE:EE, MATCH('Select LAs'!$A9,'EY Data'!$B:$B, 0)),0)))","v":"-"},{"$f":"IF(OR('Select LAs'!$B9=0, 'Select LAs'!$B9=\"No LA selected\"),\"-\",IF(INDEX('EY Data'!EF:EF, MATCH('Select LAs'!$A9,'EY Data'!$B:$B, 0))=\"\",\"-\",ROUND(INDEX('EY Data'!EF:EF, MATCH('Select LAs'!$A9,'EY Data'!$B:$B, 0)),0)))","v":"-"},{"$f":"IF(OR('Select LAs'!$B9=0, 'Select LAs'!$B9=\"No LA selected\"),\"-\",IF(INDEX('EY Data'!EG:EG, MATCH('Select LAs'!$A9,'EY Data'!$B:$B, 0))=\"\",\"-\",ROUND(INDEX('EY Data'!EG:EG, MATCH('Select LAs'!$A9,'EY Data'!$B:$B, 0)),0)))","v":"-"},{"$f":"IF(OR('Select LAs'!$B9=0, 'Select LAs'!$B9=\"No LA selected\"),\"-\",IF(INDEX('EY Data'!EH:EH, MATCH('Select LAs'!$A9,'EY Data'!$B:$B, 0))=\"\",\"-\",ROUND(INDEX('EY Data'!EH:EH, MATCH('Select LAs'!$A9,'EY Data'!$B:$B, 0)),0)))","v":"-"},{"$f":"IF(OR('Select LAs'!$B9=0, 'Select LAs'!$B9=\"No LA selected\"),\"-\",IF(INDEX('EY Data'!EI:EI, MATCH('Select LAs'!$A9,'EY Data'!$B:$B, 0))=\"\",\"-\",ROUND(INDEX('EY Data'!EI:EI, MATCH('Select LAs'!$A9,'EY Data'!$B:$B, 0)),0)))","v":"-"}]
[null,{"$f":"'Select LAs'!B10","v":"No LA selected"},null,{"$f":"IF(OR('Select LAs'!$B10=0, 'Select LAs'!$B10=\"No LA selected\"),\"-\",IF(INDEX('EY Data'!EE:EE, MATCH('Select LAs'!$A10,'EY Data'!$B:$B, 0))=\"\",\"-\",ROUND(INDEX('EY Data'!EE:EE, MATCH('Select LAs'!$A10,'EY Data'!$B:$B, 0)),0)))","v":"-"},{"$f":"IF(OR('Select LAs'!$B10=0, 'Select LAs'!$B10=\"No LA selected\"),\"-\",IF(INDEX('EY Data'!EF:EF, MATCH('Select LAs'!$A10,'EY Data'!$B:$B, 0))=\"\",\"-\",ROUND(INDEX('EY Data'!EF:EF, MATCH('Select LAs'!$A10,'EY Data'!$B:$B, 0)),0)))","v":"-"},{"$f":"IF(OR('Select LAs'!$B10=0, 'Select LAs'!$B10=\"No LA selected\"),\"-\",IF(INDEX('EY Data'!EG:EG, MATCH('Select LAs'!$A10,'EY Data'!$B:$B, 0))=\"\",\"-\",ROUND(INDEX('EY Data'!EG:EG, MATCH('Select LAs'!$A10,'EY Data'!$B:$B, 0)),0)))","v":"-"},{"$f":"IF(OR('Select LAs'!$B10=0, 'Select LAs'!$B10=\"No LA selected\"),\"-\",IF(INDEX('EY Data'!EH:EH, MATCH('Select LAs'!$A10,'EY Data'!$B:$B, 0))=\"\",\"-\",ROUND(INDEX('EY Data'!EH:EH, MATCH('Select LAs'!$A10,'EY Data'!$B:$B, 0)),0)))","v":"-"},{"$f":"IF(OR('Select LAs'!$B10=0, 'Select LAs'!$B10=\"No LA selected\"),\"-\",IF(INDEX('EY Data'!EI:EI, MATCH('Select LAs'!$A10,'EY Data'!$B:$B, 0))=\"\",\"-\",ROUND(INDEX('EY Data'!EI:EI, MATCH('Select LAs'!$A10,'EY Data'!$B:$B, 0)),0)))","v":"-"}]
[null,{"$f":"'Select LAs'!B11","v":"No LA selected"},null,{"$f":"IF(OR('Select LAs'!$B11=0, 'Select LAs'!$B11=\"No LA selected\"),\"-\",IF(INDEX('EY Data'!EE:EE, MATCH('Select LAs'!$A11,'EY Data'!$B:$B, 0))=\"\",\"-\",ROUND(INDEX('EY Data'!EE:EE, MATCH('Select LAs'!$A11,'EY Data'!$B:$B, 0)),0)))","v":"-"},{"$f":"IF(OR('Select LAs'!$B11=0, 'Select LAs'!$B11=\"No LA selected\"),\"-\",IF(INDEX('EY Data'!EF:EF, MATCH('Select LAs'!$A11,'EY Data'!$B:$B, 0))=\"\",\"-\",ROUND(INDEX('EY Data'!EF:EF, MATCH('Select LAs'!$A11,'EY Data'!$B:$B, 0)),0)))","v":"-"},{"$f":"IF(OR('Select LAs'!$B11=0, 'Select LAs'!$B11=\"No LA selected\"),\"-\",IF(INDEX('EY Data'!EG:EG, MATCH('Select LAs'!$A11,'EY Data'!$B:$B, 0))=\"\",\"-\",ROUND(INDEX('EY Data'!EG:EG, MATCH('Select LAs'!$A11,'EY Data'!$B:$B, 0)),0)))","v":"-"},{"$f":"IF(OR('Select LAs'!$B11=0, 'Select LAs'!$B11=\"No LA selected\"),\"-\",IF(INDEX('EY Data'!EH:EH, MATCH('Select LAs'!$A11,'EY Data'!$B:$B, 0))=\"\",\"-\",ROUND(INDEX('EY Data'!EH:EH, MATCH('Select LAs'!$A11,'EY Data'!$B:$B, 0)),0)))","v":"-"},{"$f":"IF(OR('Select LAs'!$B11=0, 'Select LAs'!$B11=\"No LA selected\"),\"-\",IF(INDEX('EY Data'!EI:EI, MATCH('Select LAs'!$A11,'EY Data'!$B:$B, 0))=\"\",\"-\",ROUND(INDEX('EY Data'!EI:EI, MATCH('Select LAs'!$A11,'EY Data'!$B:$B, 0)),0)))","v":"-"}]
[null,{"$f":"'Select LAs'!B12","v":"No LA selected"},null,{"$f":"IF(OR('Select LAs'!$B12=0, 'Select LAs'!$B12=\"No LA selected\"),\"-\",IF(INDEX('EY Data'!EE:EE, MATCH('Select LAs'!$A12,'EY Data'!$B:$B, 0))=\"\",\"-\",ROUND(INDEX('EY Data'!EE:EE, MATCH('Select LAs'!$A12,'EY Data'!$B:$B, 0)),0)))","v":"-"},{"$f":"IF(OR('Select LAs'!$B12=0, 'Select LAs'!$B12=\"No LA selected\"),\"-\",IF(INDEX('EY Data'!EF:EF, MATCH('Select LAs'!$A12,'EY Data'!$B:$B, 0))=\"\",\"-\",ROUND(INDEX('EY Data'!EF:EF, MATCH('Select LAs'!$A12,'EY Data'!$B:$B, 0)),0)))","v":"-"},{"$f":"IF(OR('Select LAs'!$B12=0, 'Select LAs'!$B12=\"No LA selected\"),\"-\",IF(INDEX('EY Data'!EG:EG, MATCH('Select LAs'!$A12,'EY Data'!$B:$B, 0))=\"\",\"-\",ROUND(INDEX('EY Data'!EG:EG, MATCH('Select LAs'!$A12,'EY Data'!$B:$B, 0)),0)))","v":"-"},{"$f":"IF(OR('Select LAs'!$B12=0, 'Select LAs'!$B12=\"No LA selected\"),\"-\",IF(INDEX('EY Data'!EH:EH, MATCH('Select LAs'!$A12,'EY Data'!$B:$B, 0))=\"\",\"-\",ROUND(INDEX('EY Data'!EH:EH, MATCH('Select LAs'!$A12,'EY Data'!$B:$B, 0)),0)))","v":"-"},{"$f":"IF(OR('Select LAs'!$B12=0, 'Select LAs'!$B12=\"No LA selected\"),\"-\",IF(INDEX('EY Data'!EI:EI, MATCH('Select LAs'!$A12,'EY Data'!$B:$B, 0))=\"\",\"-\",ROUND(INDEX('EY Data'!EI:EI, MATCH('Select LAs'!$A12,'EY Data'!$B:$B, 0)),0)))","v":"-"}]
[null,{"$f":"'Select LAs'!B13","v":"No LA selected"},null,{"$f":"IF(OR('Select LAs'!$B13=0, 'Select LAs'!$B13=\"No LA selected\"),\"-\",IF(INDEX('EY Data'!EE:EE, MATCH('Select LAs'!$A13,'EY Data'!$B:$B, 0))=\"\",\"-\",ROUND(INDEX('EY Data'!EE:EE, MATCH('Select LAs'!$A13,'EY Data'!$B:$B, 0)),0)))","v":"-"},{"$f":"IF(OR('Select LAs'!$B13=0, 'Select LAs'!$B13=\"No LA selected\"),\"-\",IF(INDEX('EY Data'!EF:EF, MATCH('Select LAs'!$A13,'EY Data'!$B:$B, 0))=\"\",\"-\",ROUND(INDEX('EY Data'!EF:EF, MATCH('Select LAs'!$A13,'EY Data'!$B:$B, 0)),0)))","v":"-"},{"$f":"IF(OR('Select LAs'!$B13=0, 'Select LAs'!$B13=\"No LA selected\"),\"-\",IF(INDEX('EY Data'!EG:EG, MATCH('Select LAs'!$A13,'EY Data'!$B:$B, 0))=\"\",\"-\",ROUND(INDEX('EY Data'!EG:EG, MATCH('Select LAs'!$A13,'EY Data'!$B:$B, 0)),0)))","v":"-"},{"$f":"IF(OR('Select LAs'!$B13=0, 'Select LAs'!$B13=\"No LA selected\"),\"-\",IF(INDEX('EY Data'!EH:EH, MATCH('Select LAs'!$A13,'EY Data'!$B:$B, 0))=\"\",\"-\",ROUND(INDEX('EY Data'!EH:EH, MATCH('Select LAs'!$A13,'EY Data'!$B:$B, 0)),0)))","v":"-"},{"$f":"IF(OR('Select LAs'!$B13=0, 'Select LAs'!$B13=\"No LA selected\"),\"-\",IF(INDEX('EY Data'!EI:EI, MATCH('Select LAs'!$A13,'EY Data'!$B:$B, 0))=\"\",\"-\",ROUND(INDEX('EY Data'!EI:EI, MATCH('Select LAs'!$A13,'EY Data'!$B:$B, 0)),0)))","v":"-"}]
[null,"Selection Median",null,{"$f":"IFERROR(MEDIAN(D12:D22), 0)","v":0},{"$f":"IFERROR(MEDIAN(E12:E22), 0)","v":0},{"$f":"IFERROR(MEDIAN(F12:F22), 0)","v":0},{"$f":"IFERROR(MEDIAN(G12:G22), 0)","v":0},{"$f":"IFERROR(MEDIAN(H12:H22), 0)","v":0}]
[null,"Selection Minimum",null,{"$f":"MIN(D12:D22)","v":0},{"$f":"MIN(E12:E22)","v":0},{"$f":"MIN(F12:F22)","v":0},{"$f":"MIN(G12:G22)","v":0},{"$f":"MIN(H12:H22)","v":0}]
[null,"Selection Maximum",null,{"$f":"MAX(D12:D22)","v":0},{"$f":"MAX(E12:E22)","v":0},{"$f":"MAX(F12:F22)","v":0},{"$f":"MAX(G12:G22)","v":0},{"$f":"MAX(H12:H22)","v":0}]

{"sheet":"EY Data","index":8,"n_rows":177,"n_cols":156,"rows_kept":177,"cut":false,"hidden":true,"merged":[[2,4,2,7],[8,149,8,153],[2,30,2,31],[2,9,2,16],[2,18,2,21],[2,25,2,28],[15,149,15,153],[19,149,19,153],[23,149,23,153],[0,25,0,28],[2,42,2,49],[2,63,2,64],[2,75,2,81],[2,107,2,113],[2,127,2,128]]}
[]
[null,2,3,4,5,6,7,8,9,10,11,12,13,14,15,16,17,18,19,20,21,22,23,24,25,26,27,28,29,30,31,32,33,34,35,36,37,38,39,40,41,42,43,44,45,46,47,48,49,50,51,52,53,54,55,56,57,58,59,60,61,62,63,64,65,66,67,68,69,70,71,72,73,74,75,76,77,78,79,80,81,82,83,84,85,86,87,88,89,90,91,92,93,94,95,96,97,98,99,100,101,102,103,104,105,106,107,108,109,110,111,112,113,114,115,116,117,118,119,120,121,122,123,124,125,126,127,128,129,130,131,132,133,134,135,136,137,138,139,140,141,142,143,144,145]
[null,null,null,null,"3 and 4 year olds hourly average funding rate",null,null,null,null,"3 and 4 year olds components of hourly average funding rate for all providers",null,null,null,null,null,null,null,null,"3 and 4 year olds hourly average base rate",null,null,null,null,"3 and 4 year olds EYSFF total budget ",null,"3 and 4 year olds SEN Inclusion Fund (top-up grant element)",null,null,null,null,"3 and 4 year olds contingency funding & central spend",null,null,"3 and 4 year olds",null,"3 and 4 year olds",null,"2 year olds (disadvantaged parents) hourly average funding rate",null,null,null,null,"2 year olds (disadvantaged parents) components of hourly average funding rate for all providers",null,null,null,null,null,null,null,null,"2 year olds (disadvantaged parents) hourly average base rate",null,null,null,null,"2 year olds (disadvantaged parents) EYSFF total budget ",null,"2 year olds (disadvantaged parents) SEN Inclusion Fund (top-up grant element)",null,null,null,null,"2 year olds (disadvantaged parents) contingency funding & central spend",null,null,"2 year olds (disadvantaged parents)",null,"2 year olds (disadvantaged parents)",null,"2 year olds (working parents) hourly average funding rate",null,null,null,null,"2 year olds (working parents) components of hourly average funding rate for all providers",null,null,null,null,null,null,null,"2 year olds (working parents) hourly average base rate",null,null,null,null,"2 year olds (working parents) EYSFF total budget ",null,"2 year olds (working parents) SEN Inclusion Fund (top-up grant element)",null,null,null,null,"2 year olds (working parents) contingency funding & central spend",null,null,"2 year olds (working parents)",null,"2 year olds (working parents)",null,"9mth - 2 year olds hourly average funding rate",null,null,null,null,"9mth - 2 year olds components of hourly average funding rate for all providers",null,null,null,null,null,null,null,"9mth - 2 year olds hourly average base rate",null,null,null,null,"9mth - 2yr olds EYSFF total budget ",null,"9mth - 2yr olds SEN Inclusion Fund (top-up grant element)",null,null,null,null,"9mth - 2yr olds contingency funding & central spend",null,null,"9mth - 2yr olds",null,"9mth - 2yr olds",null,"EYPP",null,null,null,null,null,"DAF"]
[null,"LA Number","LA name",null,"All Providers","Primary Nursery Class","Maintained Nursery School","Private, Voluntary and Independent (PVI)",null,"Base rate","Supplements - Deprivation","Supplements - Quality","Supplements - Flexibility","Supplements - Rurality/Sparsity","Supplements - EAL","Maintained nursery school (MNS) lump sums","SEN Inclusion Fund (top-up grant element)",null,"All Providers","Primary Nursery Class","Maintained Nursery School","Private, Voluntary and Independent (PVI)",null,"All Providers",null,"All Providers","Primary Nursery Class","Maintained Nursery School","Private, Voluntary and Independent (PVI)",null,"Contingency Funding","Central Spend",null,"Pass Through Rate (%)",null,"Funding Paid Through Supplements (%)",null,"All Providers","Primary Nursery Class","Maintained Nursery School","Private, Voluntary and Independent (PVI)",null,"Base rate","Supplements - Deprivation","Supplements - Quality","Supplements - Flexibility","Supplements - Rurality/Sparsity","Supplements - EAL","6. Total 'top-up' amount paid to individual providers to ensure the disadvantaged 2 year old rate is at least equal to the 2 year old working parent rate","SEN Inclusion Fund (top-up grant element)",null,"All Providers","Primary Nursery Class","Maintained Nursery School","Private, Voluntary and Independent (PVI)",null,"All Providers",null,"All Providers","Primary Nursery Class","Maintained Nursery School","Private, Voluntary and Independent (PVI)",null,"Contingency Funding","Central Spend",null,"Pass Through Rate (%)",null,"Funding Paid Through Supplements (%)",null,"All Providers","Primary Nursery Class","Maintained Nursery School","Private, Voluntary and Independent (PVI)",null,"Base rate","Supplements - Deprivation","Supplements - Quality","Supplements - Flexibility","Supplements - Rurality/Sparsity","Supplements - EAL","SEN Inclusion Fund (top-up grant element)",null,"All Providers","Primary Nursery Class","Maintained Nursery School","Private, Voluntary and Independent (PVI)",null,"All Providers",null,"All Providers","Primary Nursery Class","Maintained Nursery School","Private, Voluntary and Independent (PVI)",null,"Contingency Funding","Central Spend",null,"Pass Through Rate (%)",null,"Funding Paid Through Supplements (%)",null,"All Providers","Primary Nursery Class","Maintained Nursery School","Private, Voluntary and Independent (PVI)",null,"Base rate","Supplements - Deprivation","Supplements - Quality","Supplements - Flexibility","Supplements - Rurality/Sparsity","Supplements - EAL","SEN Inclusion Fund (top-up grant element)",null,"All Providers","Primary Nursery Class","Maintained Nursery School","Private, Voluntary and Independent (PVI)",null,"All Providers",null,"All Providers","Primary Nursery Class","Maintained Nursery School","Private, Voluntary and Independent (PVI)",null,"Contingency Funding","Central Spend",null,"Pass Through Rate (%)",null,"Funding Paid Through Supplements (%)",null,"Early Years Pupil Premium: 3yr & 4yr olds","Early Years Pupil Premium: 2yr olds - disadvantaged parents","Early Years Pupil Premium: 2yr olds - working parents ","Early Years Pupil Premium: 9mth to 2yr olds","Early Years Pupil Premium: Total",null,"Disability Access Fund: 3yr & 4 yr olds","Disability Access Fund: 2yr olds - disadvantaged parents","Disability Access Fund: 2yr olds working parents","Disability Access Fund: 9mth to 2yr olds","Disability Access Fund: Total"]
[null,301,"Barking and Dagenham",null,5.9508895323433908,0,0,5.9508895323433908,null,5.45,0.3,0,0.10499996643865192,0,0,0,9.5889565904738835E-2,null,5.45,0,0,5.45,null,18317947.039999999,null,300000,0,0,300000,null,68459,983944,null,0.94956617037376245,null,6.9171642828376692E-2,null,8.7435207280900418,0,0,8.7435207280900418,null,8.6499999999999986,0,0,0,0,0,0,9.3520728090041763E-2,null,8.6499999999999986,0,0,8.6499999999999986,null,5549571.8499999996,null,60000,0,0,60000,null,6171,244698,null,0.95039515037720979,null,0,null,8.7449715761979405,0,0,8.7449715761979405,null,8.6500000118714446,0,0,0,0,0,9.4971564326496088E-2,null,8.6500000118714446,0,0,8.6500000118714446,null,3643195.76,null,40000,0,0,40000,null,0,244698,null,0.94950831446231698,null,0,null,11.358529815470106,0,0,11.358529815470106,null,11,0,0,0,0,0,0.35852981547010676,null,11,0,0,11,null,2347299.9,null,76507,0,0,76507,null,127000,134223,null,0.95021317308816022,null,0,null,193222,54560.5,54560.5,5457,307800,null,172900,24115,24115,11130,232260]
[null,302,"Barnet",null,6.6145474632915189,6.4396233184629104,9.7316225087924959,6.4207429489429355,null,6.23000000167261,0.10453815558583744,0,0,0,0,0.1870865010678828,9.2922804965188829E-2,null,6.23000000167261,6.2300000025714777,6.2299999999999995,6.2300000012769265,null,28073300.890000001,null,400000,155354.64000000001,21399.48,223245.88,null,285323,1160532.48,null,0.96346341290853665,null,1.6502885133946522E-2,null,9.835094434885761,10.078416186846159,9.7922019334049413,9.7801941912509402,null,9.59,0,0,0,0,0,0,0.24509443488576149,null,9.59,9.59,9.59,9.59,null,3912777.54,null,100000,36135.96,5647.5,58216.54,null,0,0,null,1.0255572924802672,null,0,null,9.2831371981245443,9.3557454159670321,9.2703379606461169,9.2667547330583595,null,9.2099999942952966,0,0,0,0,0,7.3137203829247502E-2,null,9.2099999942952966,9.20999998064039,9.2100000555568133,9.2099999920058977,null,6296385.0899999999,null,50000,18067.98,2823.75,29108.27,null,0,262246.84000000003,null,0.96800179333936853,null,0,null,12.684353522904138,0,0,12.624037631228166,null,12.54000001154828,0,0,0,0,0,0.14435351135585767,null,12.54000001154828,0,0,12.54000001154828,null,4343503.63,null,50000,18067.98,2823.75,29108.27,null,0,180944.68,null,0.97123687005391557,null,0,null,178141,97625,3880,1000,280646,null,164710,53690,9830,2000,230230]
[null,370,"Barnsley",null,5.3628819060663036,5.3868522457040866,0,5.3460883282010281,null,5.1700000017969279,0.14605863052876586,0,0,0,0,0,4.6823273740609475E-2,null,5.1700000017969279,5.17,0,5.1700000030558524,null,14792074.02,null,130287,65143.5,0,65143.5,null,0,553242,null,0.98041716747098795,null,2.7474984877069997E-2,null,7.3765887346445762,0,0,7.3532943724545508,null,7.3300000102645253,0,0,0,0,0,0,4.6588724380050787E-2,null,7.3300000102645253,0,0,7.3300000102645253,null,2999261.99,null,19063,9531.5,0,9531.5,null,0,158859,null,0.95059133178409494,null,0,null,7.3765890252937201,0,0,7.3532945136013179,null,7.3300000019089167,0,0,0,0,0,4.658902338480346E-2,null,7.3300000019089167,0,0,7.3300000019089167,null,3839874.01,null,24406,12203,0,12203,null,0,203383,null,0.95059136923888143,null,0,null,10.042920501368883,0,0,10.011460249420088,null,9.9799999974712943,0,0,0,0,0,6.2920503897587951E-2,null,9.9799999974712943,0,0,9.9799999974712943,null,3157347.25,null,19906,9953,0,9953,null,0,140359,null,0.95013438991190946,null,0,null,156696,46099.5,46099.5,5532,254427,null,150150,23660,23660,12740,210210,null,null,"3 and 4 year olds components of hourly average funding rate for all providers"]
[null,800,"Bath and North East Somerset",null,5.4939830457966821,5.4939737076035113,0,5.4939853804940535,null,5.29,6.4250600874554822E-2,0,0,0,0,0,0.13973244492212797,null,5.2900000000000009,5.29,0,5.29,null,10690687.609999999,null,279000,55800,0,223200,null,0,562667,null,0.96725053623181023,null,1.1999924109652289E-2,null,7.8635279662064406,7.8635306092773014,0,7.8635273054447303,null,7.5,0,0,0,0,0,0,0.36352796620644023,null,7.5,7.5,0,7.5,null,1031557.5,null,50000,10000,0,40000,null,0,54297,null,0.99538328686157473,null,0,null,7.8308331171890302,7.8308234858209058,0,7.8308355251186876,null,7.5,0,0,0,0,0,0.33083311718903008,null,7.5,7.5,0,7.5,null,2833755,null,125000,25000,0,100000,null,0,149143,null,0.99124469837835816,null,0,null,10.356854987752792,0,0,10.321483990202234,null,10.18,0,0,0,0,0,0.1768549877527921,null,10.18,0,0,10.18,null,2302451.3199999998,null,40000,8000,0,32000,null,0,121181,null,0.96612453243962604,null,0,null,94413,40000,11400,3086,148899,null,89180,10465,10465,4550,114660]
[null,822,"Bedford Borough",null,6.18793858317109,5.938157552519848,9.4820069497888664,5.9411869642928892,null,5.2999999990689783,0.12511870986669898,8.0049264431751352E-2,0,0,0,0.24783704208137922,0.43493356772228214,null,5.2999999990689783,5.3000000014006403,5.2999999733887693,5.3000000007788719,null,12358482.49,null,934315,308323.95,65402.05,560589,null,21614,691331,null,1.0294399194010981,null,3.7268249632163755E-2,null,8.6648557188438886,9.001642526433967,8.4306962247109585,8.6643849115719807,null,7.93,0,0,0,0,0,0,0.73485571884388756,null,7.9300000000000006,7.9300001651017382,7.9299999867761075,7.929999974231233,null,1361961.6400000001,null,126210,22717.8,15145.2,88347,null,12611,87744,null,1.0708680227802976,null,0,null,8.0112949828574429,8.0112950410170978,8.0112948956179615,8.0112949828574411,null,7.9300000000000006,0,0,0,0,0,8.1294982857441966E-2,null,7.9300000000000006,7.9300000581596546,7.9299999127605192,7.93,null,3029973.7,null,31062,5591.16,3727.44,21743.4,null,34357,15284,null,0.99279578289480097,null,0,null,10.430819850371483,10.430819965426091,10.43081967778957,10.430819850371483,null,10.26,0,0,0,0,0,0.17081985037148256,null,10.26,10.260000115054607,10.259999827418087,10.26,null,1981667.7,null,32993,5938.74,3959.16,23095.1,null,32132,97111,null,0.95470107296973117,null,0,null,165227,27955.65,62193.35,4508,259884,null,89180,6208.3,13811.7,9100,118300,null,null,"3 and 4 year olds",null,"Supplements"]
[null,303,"Bexley",null,6.2863827588197942,6.3977302868304413,0,6.2376093524108107,null,6.0000000000000009,0.11842116621634541,3.6552427416859837E-2,0,0,9.4646925642585492E-2,0,3.6762239544002789E-2,null,6.0000000000000009,6.0000000000000009,0,6.0000000000000009,null,18700119.079999998,null,110000,30000,0,80000,null,0,484961,null,0.97012079611416568,null,3.9941708221464436E-2,null,9.2229570029413459,14.015442154167262,0,9.1872312416011628,null,8.8499999960801947,0.11392054066983057,0,0,0,0.12184325275544729,0,0.13719321343587232,null,8.8499999960801947,8.8500018541179966,0,8.8499999822293809,null,2317911.5400000005,null,35000,0,0,35000,null,0,85344,null,0.97804422088455401,null,2.5948703806013235E-2,null,9.1286092964835976,14.167900128200341,0,9.0901690170612142,null,8.8500000094225584,0.12007598350298648,0,0,0,0.10199795907406413,5.6535344483987775E-2,null,8.8500000094225584,8.850000622331752,0,8.8500000047472174,null,4814018.9300000006,null,30000,0,0,30000,null,0,79942,null,0.96803916187524874,null,2.4478850564054595E-2,null,12.36469486685438,0,0,12.36469486685438,null,12.220000003068384,7.1192645574492772E-2,0,0,0,2.7476458207305855E-2,4.6025760004197551E-2,null,12.220000003068384,0,0,12.220000003068384,null,4014709.08,null,15000,0,0,15000,null,0,91753,null,0.96298246626591744,null,"No Base Rate",null,100129,28190,28190,2818,159327,null,118300,25000,9580,10010,162890,null,null,null,{"$f":"\"Base rate, \"&TEXT($ES$11, \"£#,##0.00\")","v":"Base rate, "},{"$f":"\"Deprivation, \"&TEXT($ET$11, \"£#,##0.00\")","v":"Deprivation, "},{"$f":"\"Quality, \"&TEXT($EU$11, \"£#,##0.00\")","v":"Quality, "},{"$f":"\"Flexibility, \"&TEXT($EV$11, \"£#,##0.00\")","v":"Flexibility, "},{"$f":"\"Rurality/ Sparsity, \"&TEXT($EW$11, \"£#,##0.00\")","v":"Rurality/ Sparsity, "},{"$f":"\"EAL, \"&TEXT($EX$11, \"£#,##0.00\")","v":"EAL, "},{"$f":"\"Maintained nursery school (MNS) lump sums, \"&TEXT($EY$11, \"£#,##0.00\")","v":"Maintained nursery school (MNS) lump sums, "},{"$f":"\"SEN Inclusion Fund (top-up grant element), \"&TEXT($EZ$11, \"£#,##0.00\")","v":"SEN Inclusion Fund (top-up grant element), "}]
[null,330,"Birmingham",null,6.1755610338817819,5.7292999994207321,7.0680831028038842,5.7292999994207321,null,5.3699999993238121,0.30000000000000004,0,0,0,0,0.44626103446105064,5.9300000096920304E-2,null,5.3699999993238121,5.3699999993238121,5.3699999993238121,5.3699999993238121,null,81406851.479999989,null,789277.35000000009,263092.45,263092.45,263092.45,null,0,2930175.52,null,0.9629075609074973,null,5.2910052916362818E-2,null,8.3499999956452378,0,8.3499999956452378,8.3499999956452378,null,7.8299999973871417,0.42999999738714217,0,0,0,0,0,9.0000000870952598E-2,null,7.8299999973871417,0,7.8299999973871417,7.8299999973871417,null,18967737,null,206670.26,0,103335.13,103335.13,null,0,736641.69,null,0.96309111829818195,null,5.2058111096753401E-2,null,8.3291445270560409,0,8.3291445270560409,8.3291445270560409,null,7.8300000032212829,0.43000000322128312,0,0,0,0,6.9144520613474036E-2,null,7.8300000032212829,0,7.8300000032212829,7.8300000032212829,null,15385173.48,null,128789.4,0,64394.7,64394.7,null,0,597507.24,null,0.96068564325905892,null,5.2058111729527276E-2,null,11.45,0,0,11.45,null,10.7,0.5899999982067361,0,0,0,0,0.16000000179326393,null,10.7,0,0,10.7,null,12591565.389999999,null,178445.57,0,0,178445.57,null,0,488996.62,null,0.96624472573839659,null,"No Base Rate",null,1455787,456727.05,370461.95,49633,2332609,null,726180,126617.55,102702.45,90090,1045590,null,null,"Hourly rate (£ per hour)",{"$f":"IF($ES$13=\"\", \"\", INDEX(J:J, MATCH($ES$13, $B:$B,0)))","v":""},"","","","","","",""]
[null,889,"Blackburn with Darwen",null,5.5805021044692875,5.3173074977242836,9.4904849406058354,5.1806391596551764,null,4.9500000015817252,0.13742259789198449,0,0,0,0,0.35335368352591134,0.13972582146966653,null,4.9500000015817243,4.9500000090922152,4.9499999877872707,4.9500000011127963,null,10319321.57,null,265012.86,69268.639999999999,47212.959999999999,148531.26,null,34087.07,518737.55,null,0.9588885840985899,null,2.7012223813724607E-2,null,7.6305576428177684,8.2141942408376973,8.0097715053763441,7.560014224310005,null,7.34,0.11964279071654903,0,0,0,0,0,0.17091485210122112,null,7.34,7.34,7.34,7.34,null,2205883.5099999998,null,50541.06,13210.34,9004.06,28326.66,null,0,116620.1,null,0.97080886040938541,null,1.6038675587180029E-2,null,7.6226029047450297,8.174292853664106,7.9649845295681354,7.557341248089454,null,7.3399999980489055,0.11084259705210975,0,0,0,0,0.17176030964401329,null,7.3399999980489055,7.3400001212510695,7.339999833985976,7.3400000007450172,null,2291280.06,null,52819.66,13805.92,9410,29603.74,null,0,120855.2,null,0.96979680721946937,null,1.4876518412157785E-2,null,10.301052587285898,0,0,10.301052587285898,null,10.130000014062187,0,0,0,0,0,0.17105257322371026,null,10.130000014062187,0,0,10.130000014062187,null,1872965.89,null,31626.42,0,0,31626.42,null,0,99195.15,null,0.96002354028759529,null,0,null,98373,44559,10585,3342,156859,null,101010,23296,5824,9100,139230]
[null,890,"Blackpool",null,5.3789230052486889,5.6062645608872934,0,5.2904085159152787,null,5.1400000057679609,8.1624444873225968E-2,0.11705697123694599,0,0,0,0,4.024158337055736E-2,null,5.14000000576796,5.1400000114878797,0,5.1400000035409326,null,7959947.3599999994,null,60000,25200,0,34800,null,0,299428,null,0.96396469628112724,null,3.7215447113208046E-2,null,7.6709382573804339,7.7753833018150367,0,7.6540571532844286,null,7.5100000044842838,0.10919651742245992,0,0,0,0,0,5.1741735473688863E-2,null,7.5100000044842838,7.5099999107504987,0,7.5100000196341625,null,2208815.5100000002,null,15000,6300,0,8700,null,0,40681,null,0.9576701944295174,null,1.4331762818887485E-2,null,7.6698756221943549,7.7585179705266301,0,7.6542328540360076,null,7.510000022324995,0.11062928516807373,0,0,0,0,4.924631470128564E-2,null,7.510000022324995,7.5100000656617505,0,7.5100000146773329,null,2321177.54,null,15000,6300,0,8700,null,0,40681,null,0.95753753086071847,null,1.4517079981740648E-2,null,10.491549909887379,10.752509697640217,0,10.462554377914842,null,10.410000027183294,0,0,0,0,0,8.1549882704085377E-2,null,10.410000027183294,10.410000190283059,0,10.410000009061099,null,1914778.97,null,15000,6300,0,8700,null,0,13983,null,0.95900821845405659,null,0,null,136672,79121,2374.5,2374.5,220542,null,96460,44590,4095,4095,149240,null,null,"LA Number",{"$f":"IF($ES$14=\"Choice\", \"\", INDEX('Stat Neighbours'!$A:$A, MATCH($ES$14,$C:$C,0)))","v":""}]
[null,350,"Bolton",null,5.5573793743952438,5.4096831041683879,10.456465528082889,5.4034523186375036,null,4.96,0.21195731802459145,0.13635055566798857,0,0,0,0.14504950571528769,0.10402199498737574,null,4.96,4.9599999981023943,4.9600000274700911,4.9599999998254622,null,21179716.670000002,null,404000,149480,36360,218160,null,0,697000,null,0.96995156168312602,null,6.5615612730142797E-2,null,7.8059050054963377,7.9439428320690197,7.9690208016651169,7.7387662551652632,null,7.4799999999999995,0,0,0,0,0,0,0.32590500549633877,null,7.4799999999999986,7.4799999738164802,7.4799999747862431,7.4800000122300796,null,3956833.9799999995,null,172400,63788,15516,93096,null,0,133800,null,0.96967764043432769,null,0,null,7.8106093787361237,11.646301079125186,9.4368053104913976,7.6127313527440492,null,7.2599999884973236,8.5326121730238361E-2,0,0,0,0,0.4652832685085615,null,7.2599999884973236,7.2599998490683753,7.259999755634599,7.2599999993881443,null,5108603.0600000005,null,323600,119732,29124,174744,null,0,172700,null,0.97026203462560534,null,1.1616383050907852E-2,null,10.483952040022166,0,0,10.483952040022166,null,10.129999992800389,0.11396496812611609,0,0,0,0,0.2399870790956615,null,10.129999992800389,0,0,10.129999992800389,null,4268548.54,null,100000,0,0,100000,null,0,144300,null,0.95482259016595306,null,"No Base Rate",null,214133,120000,9935,7795,351863,null,199290,48230,0,18200,265720,null,null,"LA Name",{"$f":"LAchoice","v":"Choice"}]
[null,839,"Bournemouth, Christchurch & Poole",null,5.3999999947241433,0,0,5.3999999947241433,null,5.0999999999999996,7.9999928248346397E-2,0,0,0,0,0,0.22000006647579673,null,5.0999999999999996,0,0,5.0999999999999996,null,19636620.34,null,833988,0,0,833988,null,227451,530719,null,0.97499998944828625,null,1.5444001806270091E-2,null,7.720000461195049,0,0,7.720000461195049,null,7.25,0.15000039531004167,0,0,0,0,0,0.32000006588500696,null,7.25,0,0,7.25,null,5615845.5,null,242847.41,0,0,242847.41,null,0,151779.79999999999,null,0.97474753297917283,null,2.0270322607699946E-2,null,7.7199992660002446,0,0,7.7199992660002446,null,7.2500000126551676,0.14999917741406824,0,0,0,0,0.3200000759310091,null,7.2500000126551676,0,0,7.2500000126551676,null,2923706.38,null,126430.59,0,0,126430.59,null,0,79019.199999999997,null,0.97474738207073797,null,2.0270161328580474E-2,null,10.377691761421465,0,0,10.377691761421465,null,9.8800000088026287,6.76921289312266E-2,0,0,0,0,0.42999962368761052,null,9.8800000088026287,0,0,9.8800000088026287,null,4520327.8,null,195396,0,0,195396,null,49985,122691,null,0.97378752218917652,null,"No Base Rate",null,208316,115000,862,6954,331132,null,153790,46000,410,14560,214760]
[null,867,"Bracknell Forest",null,6.2393413192604426,6.3362602978041966,0,6.1931184215832102,null,5.8499999992932246,0.21552623582345226,9.2368443323486579E-2,0,0,0,0,8.1446640820278637E-2,null,5.8499999992932246,5.8499999945281926,0,5.8500000015657783,null,8712665.1500000004,null,115237,38412.33,0,76824.67,null,175069,442678,null,0.97443732421871876,null,4.9999991104903184E-2,null,9.0543476385439625,0,0,9.0543476385439625,null,8.4900000211890667,0.31280593608711171,0.13405334458842807,0,0,0,0,0.11748833667935622,null,8.4900000211890667,0,0,8.4900000211890667,null,885711.65999999992,null,11644,0,0,11644,null,11644,45447,null,0.95242325807095718,null,5.000182565057347E-2,null,9.0543358072572762,0,0,9.0543358072572762,null,8.49000001772575,0.31279214252921644,0.13405382601466628,0,0,0,0.11748982098764338,null,8.49000001772575,0,0,8.49000001772575,null,2520865.2999999998,null,33141,0,0,33141,null,33141,129349,null,0.95242218361837161,null,5.0000410573305926E-2,null,12.273578075707469,0,0,12.273578075707469,null,11.510000029291755,0.42405145975459374,0.18173776263719527,0,0,0,0.15778882402392549,null,11.510000029291755,0,0,11.510000029291755,null,2068122.82,null,26934,0,0,26934,null,27023,85558,null,0.95190568858839308,null,"No Base Rate",null,60655,32752,3240,2159,98806,null,50960,2839.2,8080.8,4550,66430,null,null,"2 year olds (disadvantaged)",null,"Supplements"]
[null,380,"Bradford",null,5.6118517611073955,5.3317674933353931,8.9226757462032005,5.3418491115442119,null,4.9399999998291584,0.25094678361252487,0,0,0,0,0.26714728880960736,0.15375768885610597,null,4.9399999998291584,4.9399999977930182,4.9400000075126478,4.9399999994540256,null,38337865.519999996,null,1080000,162000,86400,831600,null,0,515071,null,0.96935240850595372,null,4.8343162448323734E-2,null,7.7752544784031752,7.8107037505267591,7.779573512906846,7.7730588368684828,null,7.6000000017479818,0,0,0,0,0,521.91,0.17479833166878705,null,7.6000000017479818,7.6,7.6,7.6000000020297547,null,8696257.0800000001,null,200000,10000,20000,170000,null,59898.32,52337,null,0.97358272517810851,null,0,null,7.6807786947542747,11.019382388131971,8.7550334572490698,7.6561258796766607,null,7.3500000009023179,0.15031532274601656,0,0,0,0,0.1804633711059411,null,7.3500000009023179,7.3499987719341329,7.35,7.350000004131215,null,8312285.5099999998,null,200000,10000,20000,170000,null,0,100148,null,0.9553207331783925,null,2.004120043754368E-2,null,10.479556977456523,0,10.372134032634033,10.480931174314826,null,10.149999998527878,0.20737074750327161,0,0,0,0,0.12218623142537424,null,10.149999998527878,0,10.15,10.149999998509045,null,7035668.1100000003,null,83000,0,0,83000,null,100000,16985,null,0.96871187825661298,null,"No Base Rate",null,600505,171403,163992,16772,952672,null,388570,62317,59623,31850,542360,null,null,null,{"$f":"\"Base rate, \"&TEXT($ES$11, \"£#,##0.00\")","v":"Base rate, "},{"$f":"\"Deprivation, \"&TEXT($ET$11, \"£#,##0.00\")","v":"Deprivation, "},{"$f":"\"Quality, \"&TEXT($EU$11, \"£#,##0.00\")","v":"Quality, "},{"$f":"\"Flexibility, \"&TEXT($EV$11, \"£#,##0.00\")","v":"Flexibility, "},{"$f":"\"Rurality/ Sparsity, \"&TEXT($EW$11, \"£#,##0.00\")","v":"Rurality/ Sparsity, "},{"$f":"\"EAL, \"&TEXT($EX$11, \"£#,##0.00\")","v":"EAL, "},{"$f":"\"Maintained nursery school (MNS) lump sums, \"&TEXT($EY$11, \"£#,##0.00\")","v":"Maintained nursery school (MNS) lump sums, "},{"$f":"\"SEN Inclusion Fund (top-up grant element), \"&TEXT($EZ$11, \"£#,##0.00\")","v":"SEN Inclusion Fund (top-up grant element), "}]
[null,304,"Brent",null,6.5289989819761463,6.2044661332848641,11.205256658459048,6.2944312527744808,null,5.3899999991099374,0.61250008566851877,0.12517029492251666,0,0,0,0.27144504055228741,0.12988356172288457,null,5.3899999991099383,5.3900000014334717,5.3899999771738862,5.3899999996892571,null,21568536.560000002,null,437779,0,0,437779,null,0,1109600,null,0.94955295014019092,null,0.12038349566495993,null,9.5596193461769552,0,9.540000037684738,9.5621571293780061,null,9.5399999972532896,0,0,0,0,0,0,1.961934892366584E-2,null,9.5399999972532896,0,9.540000037684738,9.5399999920234286,null,4862546.68,null,10000,0,0,10000,null,0,24435,null,0.99683204861073571,null,0,null,9.5399724388711498,0,9.4100000598292066,9.5567845330040484,null,9.4100000172496312,0,0,0,0,0,0.12997242162151867,null,9.4100000172496312,0,9.4100000598292066,9.4100000117419089,null,3982288.2,null,55004,0,0,55004,null,0,20288,null,0.9947833617175339,null,0,null,12.978314257686922,0,0,12.978314257686922,null,12.870000013215217,0,0,0,0,0,0.1083142444717058,null,12.870000013215217,0,0,12.870000013215217,null,3311183.05,null,27867,0,0,27867,null,0,14008,null,0.99298502354146301,null,0,null,69304,40000,66400,3985,179689,null,88310,40000,24570,10920,163800,null,null,"Hourly rate (£ per hour)",{"$f":"IF($ES$13=\"\", \"\", INDEX(AQ:AQ, MATCH($ES$13, $B:$B,0)))","v":""},{"$f":"IF($ES$13=\"\", \"\", INDEX(AR:AR, MATCH($ES$13, $B:$B,0)))","v":""},"","","","","",""]
[null,846,"Brighton and Hove",null,5.9620664311961233,6.0344572850701041,9.6308072864907839,5.7692131486698184,null,5.15,0.19711686991087043,0.10198841007310627,0,0,0,0.15871536310482162,0.35424578810732527,null,5.15,5.15,5.15,5.1499999999999995,null,14559136.109999999,null,919700,49700,70000,800000,null,0,727767,null,0.99372449796083939,null,5.4890714092581498E-2,null,9.0329951473365124,9.0329950210647265,9.0329950210647247,9.0329951583166714,null,8.649999994255074,0,0,0,0,0,0,0.38299515308143922,null,8.649999994255074,8.65,8.6499999999999986,8.6499999937555128,null,2258514.2200000002,null,100000,1000,7000,92000,null,0,80160,null,0.96713010142789213,null,0,null,8.9411077981242091,8.9411080634554008,8.9411078107590196,8.9411077942788317,null,8.5,0,0,0,0,0,0.44110779812420914,null,8.5,8.5,8.5,8.5,null,4239326.55,null,220000,2200,15400,202400,null,0,198945,null,0.95729205547368412,null,0,null,12.167428802575991,0,0,12.167428802575991,null,11.999999999999998,0,0,0,0,0,0.16742880257599257,null,11.999999999999998,0,0,11.999999999999998,null,3583612.8,null,50000,0,0,50000,null,0,159044,null,0.95806526004535364,null,0,null,199959,57206,57206,6865,321236,null,120120,10465,10465,10010,151060]
[null,801,"Bristol, City of",null,6.246518420869057,6.0693672717881091,9.9113274026338729,5.3880100896020116,null,5.079999999778563,0.10208938749040238,0.15666598862340306,0,0,0,0.57442904487487612,0.33333400010181252,null,5.0799999997785639,5.0800000037001434,5.0799999976897281,5.0799999990784563,null,32044565.75,null,1806394.41,602131.47,602131.47,602131.47,null,0,1614430.64,null,0.95009872356529002,null,4.8467359505220763E-2,null,7.97,0,0,7.9366666666666656,null,7.82,0.1,0,0,0,0,0,0.05,null,7.82,0,0,7.82,null,3918047.76,null,24735.149999999998,8245.0499999999993,8245.0499999999993,8245.0499999999993,null,0,123675.75,null,0.96606060606060606,null,1.2626262626262628E-2,null,7.9700000142830412,0,0,7.9366666714276812,null,7.82,9.9999999999999992E-2,0,0,0,0,5.0000014283041315E-2,null,7.82,0,0,7.82,null,8317556.2800000003,null,52509.84,17503.28,17503.28,17503.28,null,0,262549.13,null,0.96606060779188374,null,1.2626262626262624E-2,null,10.900000015902558,0,0,10.880000006361023,null,10.770000001590256,0.1,0,0,0,0,3.0000014312301093E-2,null,10.770000001590256,0,0,10.770000001590256,null,6835378.8399999999,null,18864.900000000001,6288.3,6288.3,6288.3,null,0,213802.1,null,0.96975089109453361,null,"No Base Rate",null,423085,76385.95,162171.04999999999,14315,675957,null,213850,23601.94,50108.06,27300,314860,null,null,"2 year olds (working)",null,"Supplements"]
[null,305,"Bromley",null,6.2379989215544258,0,0,6.2379989215544258,null,6.0099999989736919,0.12828863423766043,0,0,0,0,0,9.9710288343073772E-2,null,6.0099999989736919,0,0,6.0099999989736919,null,23923743.010000002,null,388617,0,0,388617,null,0,810379,null,0.97468733149287901,null,2.089973963484738E-2,null,9.4095651808948215,0,0,9.4095651808948215,null,9.1,0.2098547804918996,0,0,0,0,0,9.9710400402921173E-2,null,9.1,0,0,9.1,null,2218166,null,23757,0,0,23757,null,0,49541,null,0.99677597255241757,null,2.2541144350783485E-2,null,9.0766511922216608,0,0,9.0766511922216608,null,8.9,7.6941353453805025E-2,0,0,0,0,9.9709838767855011E-2,null,8.9,0,0,8.9,null,5833625.8399999999,null,64796,0,0,64796,null,0,135120,null,0.96150966019297257,null,8.5709987872653829E-3,null,12.312870123011329,0,0,12.312870123011329,null,12.1,0.1284982029526317,0,0,0,0,8.437192005869798E-2,null,12.1,0,0,12.1,null,4758237.05,null,32830,0,0,32830,null,0,80906,null,0.95969369625965151,null,"No Base Rate",null,194738,55235,55235,6628,311836,null,130130,18655,18655,4550,171990,null,null,null,{"$f":"\"Base rate, \"&TEXT($ES$11, \"£#,##0.00\")","v":"Base rate, "},{"$f":"\"Deprivation, \"&TEXT($ET$11, \"£#,##0.00\")","v":"Deprivation, "},{"$f":"\"Quality, \"&TEXT($EU$11, \"£#,##0.00\")","v":"Quality, "},{"$f":"\"Flexibility, \"&TEXT($EV$11, \"£#,##0.00\")","v":"Flexibility, "},{"$f":"\"Rurality/ Sparsity, \"&TEXT($EW$11, \"£#,##0.00\")","v":"Rurality/ Sparsity, "},{"$f":"\"EAL, \"&TEXT($EX$11, \"£#,##0.00\")","v":"EAL, "},{"$f":"\"Maintained nursery school (MNS) lump sums, \"&TEXT($EY$11, \"£#,##0.00\")","v":"Maintained nursery school (MNS) lump sums, "},{"$f":"\"SEN Inclusion Fund (top-up grant element), \"&TEXT($EZ$11, \"£#,##0.00\")","v":"SEN Inclusion Fund (top-up grant element), "}]
[null,825,"Buckinghamshire",null,5.9123890254899774,6.1460656540825394,8.2414184431030009,5.8041447095155014,null,5.6099999996833745,0.10802110537740808,8.1015947767664298E-2,0,0,0,4.3694335830422405E-2,6.9657636831108191E-2,null,5.6099999996833745,5.6100000034098878,5.6099999948732169,5.60999999906862,null,36906245,null,440000,71498.45,9510.91,358990.64,null,75000,1941644,null,0.95119769492892092,null,3.2598007466234528E-2,null,8.3611352253695213,8.3611351038141635,8.3611354756398999,8.3611352344114724,null,8.3199999963435349,0,0,0,0,0,0,4.1135229025986562E-2,null,8.3199999963435349,8.3199999628366879,8.3200001293056065,8.3199999954858441,null,3640675,null,18000,2656.5,763.5,14580,null,2000,192667,null,0.95064838708777366,null,0,null,8.350595726092422,8.3505956966171713,8.3505955335726441,8.3505957415443763,null,8.2199999949480862,8.0000001443403718E-2,1.0000000180425465E-2,0,0,0,4.0595729520505434E-2,null,8.2199999949480862,8.2199999731043167,8.2199998979121762,8.2200000040094547,null,9211560.040000001,null,45000,6641.26,1908.74,36450,null,22000,488345,null,0.951186650817197,null,1.0830325109621715E-2,null,11.323010151317117,0,0,11.323010151317117,null,11.229999995635273,8.0000002408125381E-2,9.9999965383197539E-3,0,0,0,3.010156735399532E-3,null,11.229999995635273,0,0,11.229999995635273,null,7521203.04,null,2000,0,0,2000,null,15000,396748,null,0.95021661028748872,null,"No Base Rate",null,267340,39873,100873,8446,416532,null,185640,13148,33262,21840,253890,null,null,"Hourly rate (£ per hour)",{"$f":"IF($ES$13=\"\", \"\", INDEX(BX:BX, MATCH($ES$13, $B:$B,0)))","v":""},{"$f":"IF($ES$13=\"\", \"\", INDEX(BY:BY, MATCH($ES$13, $B:$B,0)))","v":""},"","","","","",""]
[null,351,"Bury",null,5.5703122927472108,5.3675614146032986,18.687622885685094,5.3692944712083879,null,5.1099999999999994,0.17,0,0,0,0,0.20134000009455993,8.8972292652650886E-2,null,5.1100000000000003,5.1100000000000003,5.1099999999999994,5.1099999999999994,null,12752704.76,null,207000,81000,4000,122000,null,251669,135000,null,1.0182787516552043,null,3.2196969696969696E-2,null,7.9143217665615149,7.7899055330634273,7.926283856988082,7.9174396519265366,null,7.3500000000000005,0.17,0,0,0,0,0,0.39432176656151419,null,7.3500000000000005,7.35,7.3500000000000005,7.35,null,1964284.1600000001,null,103000,2000,6000,95000,null,0,100000,null,1.0225221920622112,null,2.2606382978723402E-2,null,7.6175863004447981,7.6231991744066043,7.6408229770781544,7.6159766584766579,null,7.3500000000000005,0.17,0,0,0,0,9.7586300444798352E-2,null,7.35,7.35,7.35,7.35,null,3852999.84,null,50000,1500,3500,45000,null,0,135000,null,0.98418427654325569,null,2.2606382978723402E-2,null,10.162977401553501,0,0,10.162977401553501,null,9.83,0.17,0,0,0,0,0.1629774015535006,null,9.83,0,0,9.83,null,3067910,null,50000,0,0,50000,null,0,60000.24,null,0.96514505237924997,null,"No Base Rate",null,161486,77500,10075,5256,254317,null,123760,10800,21960,11830,168350]
[null,381,"Calderdale",null,5.5797357432514918,5.6198878611194774,0,5.5678301538198278,null,5.22,0.1328882144872256,0,0,0,0,0,0.22684752876426664,null,5.22,5.22,0,5.2200000000000006,null,12978270.18,null,550000,110000,0,440000,null,0,464349,null,1.0200613790222106,null,2.4825516461855629E-2,null,8.2949187125649964,9.3360938247965528,0,8.2343223703456054,null,7.12,0.78,0,0,0,0,0,0.39491871256499705,null,7.12,7.1199999999999992,0,7.12,null,3000617.5,null,150000,30000,0,120000,null,29095,67630,null,1.092887699588188,null,9.8734177215189872E-2,null,7.6070639703619438,8.3862173743669643,0,7.5660553919839906,null,7.1199999999999992,9.7499620174758564E-2,0,0,0,0,0.38956435018718566,null,7.1199999999999992,7.12,0,7.12,null,3705421,null,200000,30000,0,170000,null,39326,187851,null,1.003089296153949,null,1.3508780783614062E-2,null,10.267003646620555,0,0,10.267003646620555,null,9.7200000000000006,9.7497260820461534E-2,0,0,0,0,0.44950638580009328,null,9.7200000000000006,0,0,9.7200000000000006,null,1747249.44,null,80000,0,0,80000,null,18563,91445,null,0.99437257762374343,null,"No Base Rate",null,198258,117300,0,5865,321423,null,165620,52780,0,0,218400,null,null,"9mth - 2yr olds",null,"Supplements"]
[null,873,"Cambridgeshire",null,5.7832327796692145,5.5716534867668397,9.3885863146607758,5.575249122999633,null,5.4000000006499178,2.9027366193160424E-2,0,0,0,0,0.20797381903340481,0.1462315937927314,null,5.4000000006499187,5.4000000040204998,5.4000000059497442,5.3999999999999995,null,34693604.409999996,null,900000,70290,49320,780390,null,0,1612297,null,0.95877160221752888,null,5.3466973422238483E-3,null,8.2955520410871237,8.5851688693098378,8.1494541031270398,8.2955349822609161,null,8,0,0,0,0,0,0,0.29555204108712457,null,8,8,8,8,null,3383498.88,null,125000,9962.5,5037.5,110000,null,0,0,null,1.0178591461456592,null,0,null,8,8,8,8,null,8,0,0,0,0,0,0,null,8,8,8,8,null,12993639.68,null,0,0,0,0,null,0,0,null,0.98159509202453987,null,0,null,10.7,0,0,10.7,null,10.7,0,0,0,0,0,0,null,10.7,0,0,10.7,null,10731618.5,null,0,0,0,0,null,0,0,null,0.96657633242999086,null,0,null,444644,30555,117342,72459,665000,null,96218,6612,25480,15470,143780,null,null,null,{"$f":"\"Base rate, \"&TEXT($ES$11, \"£#,##0.00\")","v":"Base rate, "},{"$f":"\"Deprivation, \"&TEXT($ET$11, \"£#,##0.00\")","v":"Deprivation, "},{"$f":"\"Quality, \"&TEXT($EU$11, \"£#,##0.00\")","v":"Quality, "},{"$f":"\"Flexibility, \"&TEXT($EV$11, \"£#,##0.00\")","v":"Flexibility, "},{"$f":"\"Rurality/ Sparsity, \"&TEXT($EW$11, \"£#,##0.00\")","v":"Rurality/ Sparsity, "},{"$f":"\"EAL, \"&TEXT($EX$11, \"£#,##0.00\")","v":"EAL, "},{"$f":"\"Maintained nursery school (MNS) lump sums, \"&TEXT($EY$11, \"£#,##0.00\")","v":"Maintained nursery school (MNS) lump sums, "},{"$f":"\"SEN Inclusion Fund (top-up grant element), \"&TEXT($EZ$11, \"£#,##0.00\")","v":"SEN Inclusion Fund (top-up grant element), "}]
[null,202,"Camden",null,8.740299508449862,8.4786410408273518,13.894600032104448,8.1567281069889752,null,7.2200000000000006,0.86754095904303807,0.11261556561563082,0,0,0,0.14127009452246939,0.39887288926872377,null,7.2200000000000006,7.2200000000000006,7.22,7.22,null,12024683.640000001,null,575000,245000,115000,215000,null,0,477998,null,0.95040824878097774,null,0.1195290018807864,null,11.474191056965173,11.533060927100154,11.778355248243027,11.23439831746561,null,9.5,1.0563367764062199,0,0,0,0,0,0.91785428055895091,null,9.5,9.5,9.5,9.5,null,2357726.1500000004,null,205000,55000,70000,80000,null,0,70732,null,0.96992316626924513,null,0.10006660442732079,null,11.47714730752114,11.783333333333333,11.591045958795563,11.352735562310031,null,9.5,1.0514686248331109,0,0,0,0,0.92567868268802844,null,9.5,9.5,9.5,9.5,null,1185457.5,null,104000,20000,36000,48000,null,0,35564,null,0.9701730606526745,null,9.9651400408702975E-2,null,15.668853333333333,0,0,15.668853333333333,null,12.66,1.4088533333333333,0,0,0,0,1.6,null,12.66,0,0,12.66,null,659477.5,null,75000,0,0,75000,null,0,19785,null,0.9702076367389062,null,"No Base Rate",null,85000,60000,20000,10000,175000,null,31850,9100,9100,9100,59150,null,null,"Hourly rate (£ per hour)",{"$f":"IF($ES$13=\"\", \"\", INDEX(DD:DD, MATCH($ES$13, $B:$B,0)))","v":""},{"$f":"IF($ES$13=\"\", \"\", INDEX(DE:DE, MATCH($ES$13, $B:$B,0)))","v":""},"","","","","",""]
[null,823,"Central Bedfordshire",null,5.6339007482378189,5.7487022629317925,8.7631997403159474,5.3425822750327594,null,5.0199999993139777,4.1343800973546931E-2,0.32199613297983004,0,0,0,0.118633375368318,0.13192743960214717,null,5.0199999993139777,5.0200000007737016,5.0199999999999996,5.0199999981907757,null,20852270.479999997,null,500000,159815.13,29385.18,310799.69,null,0,795000,null,0.99914264001259101,null,6.7493403436786517E-2,null,7.5413981027428525,7.5117122095404705,7.5993383917262074,7.5634273935772116,null,7.439999979763277,0,0,0,0,0,0,0.10139812297957594,null,7.439999979763277,7.4399999796467799,7.4400002459510315,7.4399999603711642,null,1617653.23,null,22046.639999999999,7046.77,1295.69,13704.18,null,0,42500,null,0.97182965241531605,null,0,null,7.5413963001247808,7.5117122717288494,7.5993382804055036,7.5634230346995279,null,7.440000005202922,0,0,0,0,0,0.10139629492185799,null,7.440000005202922,7.4400000069075185,7.440000055647606,7.44,null,5719863.8200000003,null,77953.36,24916.25,4581.3500000000004,48455.76,null,0,150272,null,0.97182942011917284,null,0,null,10.320000005173119,10.32,10.320000137290503,10.32,null,10.320000005173119,0,0,0,0,0,0,null,10.320000005173119,10.32,10.320000137290503,10.32,null,3989855.45,null,0,0,0,0,null,0,103413,null,0.97912713521566608,null,0,null,209812,27164.77,96050.23,6159,339186,null,124670,9629.9699999999993,34050.03,10920,179270]
[null,895,"Cheshire East",null,5.3529673163557581,5.2627772353133802,11.365728069918173,5.3223782943301581,null,5.0599999991881202,0.12871025550315895,0,0,8.0885944770225267E-3,0,4.2075662341078054E-2,0.1140928048463779,null,5.0599999991881202,5.0599999963986289,5.0600000000000005,5.0600000000000005,null,24520535.020000003,null,534011,0,0,534011,null,0,800875,null,0.9709125510081682,null,2.6323676161157335E-2,null,7.2595997637440357,7.11,7.1099999999999994,7.2949891406715484,null,7.11,0,0,0,0,0,0,0.1495997637440353,null,7.11,7.11,7.1099999999999994,7.1099999999999994,null,2287180.35,null,48124,0,0,48124,null,0,72186,null,0.97053472777326677,null,0,null,7.2597105963889259,7.1100000237677037,7.11,7.2949890105054198,null,7.1100000039571691,0,0,0,0,0,0.14971059243175566,null,7.11000000395717,7.1100000237677037,7.11,7.11,null,7186955.8000000007,null,151331,0,0,151331,null,0,226997,null,0.97054954497178136,null,0,null,9.8531575591382605,0,0,9.8531575591382605,null,9.6500000082531354,0,0,0,0,0,0.20315755088512408,null,9.6500000082531354,0,0,9.6500000082531354,null,5846262.4000000004,null,123079,0,0,123079,null,0,184619,null,0.969798972356128,null,0,null,166742,21795,68536,5419,262492,null,169260,17345,54545,16380,257530]
[null,896,"Cheshire West and Chester",null,5.3577401184832727,5.3631431789468333,0,5.3556646157662007,null,5.1000000012035915,0.13000000156466948,1.960000090991549E-2,0,6.7401147401025593E-3,0,0,0.10140000006499396,null,5.1000000012035915,5.1000000034694777,0,5.1000000003331856,null,21836056.059999999,null,421239.12,116905.2,0,304333.92,null,0,466367,null,0.97947716974100052,null,2.9743150879234372E-2,null,7.4964799419199251,0,0,7.4964799419199251,null,7.1000000000000005,0.25500000124571193,0,0,3.4879934545311402E-2,0,0,0.10660000612890277,null,7.1000000000000005,0,0,7.1000000000000005,null,2966127.1,null,42786.78,0,0,42786.78,null,0,57605,null,0.98121465208375991,null,3.9226609675627182E-2,null,7.2880070965949937,0,0,7.2700000045017728,null,7.1000000000000005,0.10500000675265952,0,0,1.8007092093220912E-2,0,6.4999997749113483E-2,null,7.1000000000000005,0,0,7.1000000000000005,null,6417922.0600000005,null,57755.02,0,0,57755.02,null,80000,232760,null,0.96571237657867781,null,1.7029901419525807E-2,null,9.8805918001899773,0,0,9.8805918001899773,null,9.6999999925618763,8.7899154363420995E-2,0,0,3.7190619142361263E-2,0,5.5502034122318682E-2,null,9.6999999925618763,0,0,9.6999999925618763,null,5283638.7200000007,null,29847.33,0,0,29847.33,null,35000,174010,null,0.95815755141513581,null,"No Base Rate",null,176614,30670,68265,5935,281484,null,155610,17208,38302,16380,227500]
[null,201,"City of London",null,8.5560422896651183,8.575691302161891,0,8.541706100289792,null,8.4500000000000011,0,0,0,0,0,0,0.10604228966511844,null,8.4500000000000011,8.4499999999999993,0,8.4500000000000011,null,398425.95,null,5000,2500,0,2500,null,0,0,null,"-",null,"N/A",null,13.442598925256473,17.849315068493151,0,12.709401709401709,null,11,0,0,0,0,0,0,2.442598925256473,null,11,11,0,11,null,22517,null,5000,2000,0,3000,null,0,0,null,"-",null,"N/A",null,12.22100122100122,12.13960113960114,0,12.282051282051283,null,11,0,0,0,0,0,1.2210012210012211,null,11,11,0,11,null,45045,null,5000,2000,0,3000,null,0,0,null,"-",null,"N/A",null,12.709401709401709,14.418803418803419,0,12.282051282051283,null,11,0,0,0,0,0,1.7094017094017093,null,11,11,0,11,null,32175,null,5000,2000,0,3000,null,0,0,null,"-",null,"N/A",null,0,0,0,0,0,null,0,0,0,0,0]
[null,908,"Cornwall",null,5.4922026358366409,5.434095857913559,9.5512574750275636,5.4222322457921601,null,5.2999999992721269,3.3439590794987865E-2,3.4366804672132947E-2,0,0,0,6.6948857241791726E-2,5.744738385560156E-2,null,5.2999999992721261,5.3000000000000007,5.3,5.2999999990583184,null,29866499.010000002,null,315700,77212.81,5465.54,233021.65,null,100000,350000,null,0.9951463630560996,null,1.2632049384935881E-2,null,7.5388620508901623,7.5502105758484799,7.537413545358751,7.5368032913773488,null,7.520000003592771,0,0,0,0,0,0,1.8862047297391972E-2,null,7.5200000035927701,7.52,7.52,7.5200000043362367,null,4186183.9699999997,null,10500,2568.0500000000002,181.78,7750.17,null,0,0,null,1.0025082514481602,null,0,null,7.5809088963951918,7.616879506246252,7.5758443785999328,7.574339166345383,null,7.5200000010941723,0,0,0,0,0,6.0908895301019152E-2,null,7.5200000010941723,7.5200000260911546,7.5199997875291178,7.5200000013225017,null,8247333.9500000002,null,66800,16337.71,1156.47,49305.82,null,0,0,null,1.0080995872865948,null,0,null,10.258069639073538,10.280551902394581,10.254904032258064,10.253963426154471,null,10.220000006395697,0,0,0,0,0,3.8069632677839735E-2,null,10.220000006395697,10.220000000000001,10.220000000000001,10.220000007730345,null,6711386.0099999998,null,25000,6114.41,432.81,18452.78,null,0,0,null,1.0037250136079783,null,0,null,300127,54805,108728,9811,473471,null,204750,25923,51427,19110,301210]
[null,331,"Coventry",null,5.5711338990071591,5.6571578006935734,10.044501072303921,5.3626750596970414,null,4.9300000019552455,0.3270417611238966,0.12328228842194515,0,0,0,7.4524186861712652E-2,0.11628566064435923,null,4.9300000019552455,4.930000002859364,4.9300000000000006,4.9300000012808161,null,21202884.259999998,null,452000,187695.81,8596.85,255707.34,null,0,1141955.27,null,0.95926871067110742,null,8.369831356537033E-2,null,7.9323223172460562,8.0665832701023312,7.9143365209471765,7.9198767353063309,null,7.4400000028316846,0.45709914252016243,0,0,0,0,0,3.5223171894208441E-2,null,7.4400000028316846,7.4399999999999995,7.4399999999999995,7.4400000032368236,null,4462136.3100000005,null,19902.32,8264.56,378.53,11259.23,null,0,87486.8,null,0.94997872062827027,null,5.7881905001687405E-2,null,8.0325841734410695,8.1777118790480703,8.0131431018891632,8.0191312569099313,null,7.4400000116712013,0.55451024862870668,0,0,0,0,3.8073913141161146E-2,null,7.4400000116712031,7.4400000743811914,7.4400001801813298,7.4399999979988438,null,5479819.4699999997,null,26097.68,10837.23,496.37,14764.08,null,0,286174.46000000002,null,0.96198612855581678,null,6.9361378067442067E-2,null,10.815180454717646,13.239999999999998,13.239999999999998,10.8151686387554,null,10.189999999025421,0.62518045569222536,0,0,0,0,0,null,10.189999999025421,10.19,10.19,10.189999999025416,null,4438908.6900000004,null,0,0,0,0,null,0,233536.47,null,0.95036735102966996,null,"No Base Rate",null,442349,108892.07,142788.93,14874.36,708904.36,null,216580,23623.19,30976.81,17290,288470]
[null,306,"Croydon",null,6.9523318163678729,7.4964841032336729,7.7938170509876459,6.4656748943986235,null,6.3999999991358569,3.940493612197371E-2,0,0,0,0,0.18398164675349526,0.32894523435654766,null,6.399999999135856,6.3999999942390442,6.3999999982717135,6.4000000007201194,null,30658740.539999999,null,1522642,761321,761321,0,null,0,1727750.93,null,1.0012352194082907,null,6.1193443366511875E-3,null,9.8200000035745028,9.8199999523399626,9.8200000270073549,9.8200000066194484,null,9.8200000035745028,0,0,0,0,0,0,0,null,9.8200000035745028,9.8199999523399626,9.8200000270073549,9.8200000066194484,null,4945023.13,null,0,0,0,0,null,0,0,null,0.9703557315785083,null,0,null,9.8199999947333918,9.8199999947333918,9.8199999947333918,9.8199999947333918,null,9.8199999947333918,0,0,0,0,0,0,null,9.8199999947333918,9.8199999947333918,9.8199999947333918,9.8199999947333918,null,7458311.5999999996,null,0,0,0,0,null,0,0,null,0.97035573070488068,null,0,null,13.380000013193518,13.379999976544857,13.380000035182713,13.380000013193516,null,13.380000013193515,0,0,0,0,0,0,null,13.380000013193518,13.379999976544857,13.380000035182713,13.380000013193516,null,6084806.5500000007,null,0,0,0,0,null,0,0,null,0.97026831132657831,null,0,null,179021,102866,5000,144,287031,null,185640,49140,14000,560,249340]
[null,942,"Cumberland",null,5.4266589821388127,5.4077772114732152,9.0584861650983139,5.1922450997379137,null,5.080000000135982,5.916525294328337E-2,9.5518072922538153E-2,0,0,0,0.12505460147384093,6.6921054663168902E-2,null,5.080000000135982,5.0800000024290757,5.0800000083568371,5.0799999970669951,null,15766014.119999997,null,196852.59000000003,99180.02,6406.35,91266.22,null,158184.88,335944,null,0.98143723523528237,null,2.954970076173968E-2,null,7.3255205716491956,7.3255205302410031,7.3255207530322801,7.3255205806747385,null,7.1200000033852904,7.6587008710409105E-2,0,0,0,0,0,0.12893355955349597,null,7.1200000033852904,7.1199999640154727,7.1200001072542776,7.1200000139486912,null,2551008.31,null,45703.69,11465.69,961.7,33276.300000000003,null,9527.5,18979.849999999999,null,0.99761171890877121,null,1.064212919008484E-2,null,7.3255205949997189,7.3255205732298307,7.3255209903225786,7.3255205910756986,null,7.1200000093963158,7.6586998444283461E-2,0,0,0,0,0.12893358715912129,null,7.1200000093963149,7.120000019975949,7.1199998809207505,7.120000009464011,null,4595367.68,null,82330.31,20654.21,1732.41,59943.69,null,17162.77,34190.15,null,0.99761172235159834,null,1.064212776985018E-2,null,9.9661893818312688,9.9661894125588706,9.966189711490177,9.9661893617164203,null,9.7699999973845983,7.6587019808798368E-2,0,0,0,0,0.11960236463787266,null,9.7699999973845966,9.769999973936681,9.7700000497173569,9.7700000039513686,null,3764845.5,null,45730,11472.29,962.26,33295.449999999997,null,10276.73,18990,null,0.99731209271788568,null,"No Base Rate",null,189417,38327.370000000003,69042.63,6442,303229,null,147420,21439.34,38620.660000000003,12740,220220]
[null,841,"Darlington",null,5.6886136134419187,5.3901163402790511,7.6862055862678602,5.3901163402790511,null,5.1800000000000006,2.144038201615061E-2,0,0,0,0,0.29849786968364289,0.18867536174212537,null,5.1800000000000006,5.18,5.18,5.18,null,6413060,null,220000,63800,28600,127600,null,2696,113754,null,0.98222724956612173,null,4.1220086055932109E-3,null,7.8549133910726185,7.8543668588511641,7.8564912880081996,7.854732198455987,null,7.6,9.7712636020430829E-2,0,0,0,0,0,0.15720075505218742,null,7.6,7.6,7.6000000000000005,7.6000000000000005,null,1386512,null,28315,3681,3681,20953,null,0,0,null,0.99935284873697428,null,1.2693723530701501E-2,null,7.7752947902228762,7.775398633257403,7.775398633257403,7.7752583049415582,null,7.6,1.8096644306343286E-2,0,0,0,0,0.15719814591653333,null,7.6,7.6,7.6,7.6000000000000005,null,1852256.4,null,38221,4969,4969,28283,null,11514.6,10000,null,0.99524845875290524,null,2.3754810619091397E-3,null,10.332364820309925,10.875,10.323025491015462,10.332457250280179,null,10,0.15111550719859326,0,0,0,0,0.18124931311133091,null,10,10,10,10,null,1477840,null,26387,0,1319,25068,null,44975,10000,null,0.99358478050706656,null,"No Base Rate",null,101513,53264,5919,3551,164247,null,50960,7745,10455,7280,76440]
[null,831,"Derby",null,6.0887633396250598,5.5877814055290385,11.118241844876776,5.5750187176404307,null,5.25,0.22770943905166413,0,0,0,2.0078600607316689E-2,0.49359688908436705,9.7378410881712826E-2,null,5.25,5.25,5.25,5.25,null,18458048.989999998,null,300000,50950,37407,211643,null,26040,627735,null,0.98136933504327839,null,4.5070497056549079E-2,null,7.997058363560579,8.1923540441032792,8.0216580987015984,7.9682810838744169,null,7.7099999885176649,0,0,0,0,0,0,0.2870583750429152,null,7.709999988517664,7.7099999909114123,7.7099999940011914,7.7099999874059222,null,3357331.0599999996,null,125000,21229,15586,88185,null,4077,141877,null,0.98117905141188477,null,0,null,7.8538571623860944,7.9517206054381333,7.8661917892412712,7.8394356399620131,null,7.7100000040280001,0,0,0,0,0,0.14385715835809418,null,7.7100000040280001,7.7100000607290369,7.7099999832985668,7.7099999997553708,null,4019612.28,null,75000,12737,9352,52911,null,21704,212905,null,0.96758425317640717,null,0,null,10.799999974319466,10.799999936478576,10.799999888195952,10.799999991811925,null,10.799999974319467,0,0,0,0,0,0,null,10.799999974319466,10.799999936478576,10.799999888195952,10.799999991811925,null,3364416.0999999996,null,0,0,0,0,null,9013,104166,null,0.97207650854427474,null,0,null,339472,92733.5,92733.5,9272,534211,null,164710,32760,32760,17290,247520]
[null,830,"Derbyshire",null,5.4883363038162232,5.7775538023992592,8.9742628550815073,5.1026958359835035,null,5,0.13852408922172235,0.16596935048872005,0,0,0,0.16367593158036969,2.0166932525410429E-2,null,5,5,5,5,null,44250916.210000001,null,163200,0,0,163200,null,40000,1466000,null,0.97344760228820859,null,5.7402925118343412E-2,null,7.5300000027011755,7.5299999999999994,7.5300001447115177,7.5299999984661925,null,7.2100000054023505,0.31999999729882533,0,0,0,0,0,0,null,7.2100000054023505,7.21,7.2100000482371724,7.2100000046014268,null,5575352.0600000005,null,0,0,0,0,null,0,157683.22,null,1.0000000003587217,null,4.2496679572912921E-2,null,7.2099999993952535,7.2099999735506426,7.2099999784022408,7.2100000027471518,null,7.2099999993952535,0,0,0,0,0,0,null,7.2099999993952535,7.2099999735506426,7.2099999784022408,7.2100000027471518,null,11922362.99,null,0,0,0,0,null,0,371316.78,null,0.95750331997280924,null,0,null,9.9315200059466626,9.9315200886965975,9.9315197945521714,9.9315200040740734,null,9.8400000060597765,9.1519999886884196E-2,0,0,0,0,0,null,9.8400000060597765,9.840000044171612,9.8399999278624204,9.8400000045879192,null,9833551.5200000014,null,0,0,0,0,null,0,306000,null,0.96987500058072873,null,"No Base Rate",null,564000,310000,0,18000,892000,null,380000,106000,0,29000,515000]
[null,878,"Devon",null,5.3739642058770354,5.3802887398490116,8.5103012156267503,5.3194231700887746,null,5.1199999998465211,0.10829815664079528,0,0,0,0,4.5666029053802334E-2,0.10000002033591734,null,5.119999999846522,5.1200000008512401,5.1199999758029202,5.1200000001182886,null,41235430.439999998,null,781868.01,93980.53,11571.65,676315.83,null,89631,1083170,null,0.97619047143744198,null,2.0713844811321259E-2,null,7.2799990292533723,7.3764617883398875,7.282221168661847,7.2722234713036826,null,7,9.9999506922347978E-2,0,0,0,0,0,0.17999952233102459,null,7,7,7,7,null,4607793.18,null,116816.99,8422.5,3037.24,105357.25,null,28191,69157,null,0.98565782362438614,null,1.408443857282674E-2,null,7.2800003173106855,7.376461991253084,7.2822493707253813,7.2722240758182686,null,7,0.10000054207242219,0,0,0,0,0.17999977523826396,null,7,7,7,7,null,10740263.119999999,null,272288,19631.96,7079.49,245576.55,null,65710,6197,null,0.98565798494195833,null,1.4084582315149091E-2,null,9.7799804808252802,10.095315938615538,9.8818171781850292,9.7690655227734045,null,9.5,9.9980127537051114E-2,0,0,0,0,0.18000035328823019,null,9.5,9.5,9.5,9.5,null,8695431.5999999996,null,163040,4891.2,1630.4,156518.39999999999,null,81314,163630,null,0.97817177682568923,null,"No Base Rate",null,550249,152081,152080,18248,872658,null,343980,48230,48230,22750,463190]
[null,371,"Doncaster",null,5.242839646504879,5.1935476671352268,0,5.2963388381812821,null,5.0099999983117636,9.1029629250068911E-2,0,0.14078128396809775,0,0,0,1.0287349749485606E-3,null,5.0099999983117645,5.0099999979072853,0,5.0099999987507662,null,19250401.810000002,null,3778,0,0,3778,null,0,838010,null,0.95847159899540735,null,4.4223440549576769E-2,null,7.9249548176528712,7.8918755658006399,0,7.9580340695051017,null,7.8900000036312914,0,0,0,0,0,0,3.4954814021579315E-2,null,7.8900000036312914,7.8900000036312914,0,7.8900000036312914,null,4345561.0999999996,null,19252,516.5,0,18735.5,null,0,0,null,1.0044302683970687,null,0,null,7.9184123158260737,7.8915245017216824,0,7.945300129930466,null,7.8899999881935061,0,0,0,0,0,2.8412327632567742E-2,null,7.8899999881935061,7.8899999881935061,0,7.8899999881935061,null,5346210.34,null,19252,516.5,0,18735.5,null,0,0,null,1.0036010539703515,null,0,null,11.520979084406717,11.362406550233409,0,11.679551618580026,null,10.76,0,0,0,0,0,0.7609790844067178,null,10.76,10.76,0,10.76,null,4365611.76,null,308749,122206,0,186543,null,0,0,null,1.070722963234825,null,0,null,320519,174420.28,14325.72,11326,520591,null,178360,68250,9100,9100,264810]
[null,838,"Dorset",null,5.2635722248395531,5.2635735898084217,0,5.2635719731213806,null,5.1899999981738043,2.0571288040041599E-2,0,2.8542953980077848E-2,0,0,0,2.4457984645629437E-2,null,5.1899999981738043,5.189999992459966,0,5.1899999992275108,null,16065656.01,null,75000,11678,0,63322,null,32371,585468,null,0.96419170331244408,null,9.3745316037051139E-3,null,7.2799154894001541,7.2799095383356143,0,7.2799163224949428,null,7.2200000116199714,0,0,0,0,0,0,5.9915477780181657E-2,null,7.2200000116199723,7.2199999763437068,0,7.2200000165583278,null,1988300.9300000002,null,16500,2026,0,14474,null,11229,33000,null,0.98001214129322289,null,0,null,7.280360975410721,7.2803564379373356,0,7.2803616106157909,null,7.2200000112299456,0,0,0,0,0,6.0360964180774433E-2,null,7.2200000112299465,7.2200000609660373,0,7.2200000042673453,null,3857542.7600000002,null,32250,3960,0,28290,null,21947,64500,null,0.98011221542654836,null,0,null,9.8719664452792006,9.8719536909662811,0,9.8719682307683261,null,9.7900000000000009,0,0,0,0,0,8.1966445279201133E-2,null,9.7900000000000009,9.7900000254277586,0,9.7899999964403417,null,3135276.87,null,26250,3223,0,23027,null,17864,52500,null,0.97906778535567451,null,0,null,150692,27776,53919,4904,237291,null,139230,15779,30631,13650,199290]
[null,332,"Dudley",null,5.3476877712607189,5.2688503285600401,11.234749500402962,5.2191782744013082,null,5.0699999992080826,2.6705237104654739E-2,0.10127482354811553,0,0,0,0.11451135277758707,3.5196358622279725E-2,null,5.0699999992080826,5.069999998088651,5.069999955787873,5.0700000010477924,null,18112639.899999999,null,120000,60000,0,60000,null,361944,445500,null,0.97611250129006677,null,2.4621114198001795E-2,null,7.5799999956411144,7.580000036523443,7.5799997354333417,7.5800000004991741,null,7.5799999956411144,0,0,0,0,0,0,0,null,7.5799999956411144,7.580000036523443,7.5799997354333417,7.5800000004991741,null,3477953.38,null,0,0,0,0,null,50260,47183,null,0.98837259436542868,null,0,null,7.5799999965263805,7.58,7.5799997891654325,7.580000003580146,null,7.5799999965263805,0,0,0,0,0,0,null,7.5799999965263805,7.58,7.5799997891654325,7.580000003580146,null,4364324.47,null,0,0,0,0,null,50260,59213,null,0.98551311563579636,null,0,null,10.410000026105639,10.410000026105639,0,10.410000026105639,null,10.410000026105639,0,0,0,0,0,0,null,10.410000026105639,10.410000026105639,0,10.410000026105639,null,3588879.78,null,0,0,0,0,null,68951,0,null,1.0000001063471946,null,0,null,200781,55310,55319,6640,318050,null,192010,31850,31850,20020,275730]
[null,840,"Durham",null,5.4829427583051187,5.2000214054505598,8.1900663820391149,5.1686937989615229,null,4.9400000000000004,0.16449312565964383,0,0,0,0,0.29633710094312488,8.2112531702349639E-2,null,4.9400000000000004,4.9400000000000004,4.9399999999999995,4.9400000000000004,null,31148299.980000004,null,473569,217044,47005,209520,null,152765,1435985,null,0.95303358512718395,null,3.2225163519715133E-2,null,7.32,7.32,7.32,7.32,null,7.32,0,0,0,0,0,0,0,null,7.32,7.32,7.32,7.32,null,6144547.0800000001,null,0,0,0,0,null,32947,309698,null,0.95203748600297422,null,0,null,7.3353694357160162,7.4252866077463793,7.3353560202841459,7.2728243597376521,null,7.13,0,0,0,0,0,0.2053694357160169,null,7.129999999999999,7.13,7.13,7.13,null,8384273.9499999993,null,241497,127997,24500,89000,null,44956,422585,null,0.95389393145440737,null,0,null,9.9859430847072623,9.9859445887720177,9.9859424460431647,9.9859421607356342,null,9.82,0,0,0,0,0,0.16594308470726316,null,9.82,9.82,9.82,9.82,null,6726876.7599999998,null,113674,41903,11533,60238,null,36669,344688,null,0.95341624548350989,null,0,null,618936,172729,172729,20729,985123,null,351260,53690,53690,30030,488670]
[null,307,"Ealing",null,6.8246171740687238,6.5239400099914784,10.641829759584146,6.6166718220565244,null,5.27,0.25807058215871065,0.27160432370928744,0,0,0,0.25505902432086475,0.7698832438798604,null,5.27,5.27,5.2700000000000005,5.27,null,24265375.530000001,null,3085437.98,1164954,164997.76000000001,1755486.22,null,776193.76,1350446.55,null,1.0034919121960495,null,9.1328378653100603E-2,null,10.107356392126173,10.186508771929825,10.186506658211794,10.097381410557585,null,8.2399999906498831,0.90999999766247053,0,0,0,0,0,0.95735640381381948,null,8.2399999906498831,8.24,8.24,8.2399999894715261,null,3914389.21,null,409559.07999999996,590.80999999999995,49037.130000000005,359931.14,null,122357.16,223355.7,null,1.0692767340425089,null,9.9453551784136451E-2,null,9.2591543311403512,9.2765087719298247,9.2765065124933557,9.2558863837312124,null,8.24,0,0,0,0,0,1.0191543311403508,null,8.24,8.24,8.24,8.24,null,4208332.7999999998,null,520502.5,5908.1,77986.75,436607.65,null,133742.75,244071.25,null,0.97952935362132176,null,0,null,12.800101069411907,0,12.956506315789474,12.783646366051897,null,11.919999986639866,0,0,0,0,0,0.88010108277204069,null,11.919999986639866,0,11.92,11.919999985234305,null,3568826.54,null,263500.68,0,29540.43,233960.25,null,67706.33,199366.44999999998,null,0.98237122743134753,null,0,null,197832,81993,27330,5466,312621,null,132860,15925,15925,12740,177450]
[null,811,"East Riding of Yorkshire",null,5.5117080177872726,5.4066127796381016,15.309220402579701,5.2973295530700728,null,5.1799999977122804,0.14817416721421664,0,0,0,0,0.18353385286077484,0,null,5.1799999977122804,5.1799999958607525,5.1799999349459842,5.1799999997218649,null,20237781.359999999,null,0,0,0,0,null,0,602539,null,0.97407205940155339,null,2.7809557763632285E-2,null,7.1500000297947652,7.1500000593119095,7.1500008293753696,7.1500000063102309,null,7.1500000297947652,0,0,0,0,0,0,0,null,7.1500000297947652,7.1500000593119095,7.1500008293753696,7.1500000063102309,null,2039787.83,null,0,0,0,0,null,0,80751,null,0.97014925777405225,null,0,null,7.1499999981490179,7.15,7.1499997080278703,7.1500000044428873,null,7.1499999981490179,0,0,0,0,0,0,null,7.1499999981490179,7.15,7.1499997080278703,7.1500000044428873,null,5794219.9299999997,null,0,0,0,0,null,0,161501,null,0.97014925348019232,null,0,null,9.7100000250515226,9.7100000876043016,9.7100004171139673,9.710000005010901,null,9.7100000250515226,0,0,0,0,0,0,null,9.7100000250515226,9.7100000876043016,9.7100004171139673,9.710000005010901,null,2325607.15,null,0,0,0,0,null,0,71924,null,0.97002997253261969,null,0,null,169200,24900,70729,4783,269612,null,126490,10425,29615,10920,177450]
[null,845,"East Sussex",null,5.5311061895459881,5.4856563208775668,0,5.5358923674697618,null,5.42,4.8272017122774152E-2,0,0,0,0,0,6.2834172423213513E-2,null,5.42,5.42,0,5.42,null,26621571.440000001,null,305900,9000,0,296900,null,0,935300,null,0.97036950693789248,null,8.8276546908457043E-3,null,8.2245168367106043,8.2232426011053157,0,8.224613220815753,null,8.2000000000000011,0,0,0,0,0,0,2.451683671060326E-2,null,8.2000000000000011,8.2000000000000011,0,8.1999999999999993,null,4515264.4000000004,null,13500,900,0,12600,null,0,0,null,0.98261849900963028,null,0,null,8.2245893696400021,8.2242259799408881,0,8.2246297462732372,null,8.1999999999999993,0,0,0,0,0,2.4589369640001937E-2,null,8.1999999999999993,8.1999999999999993,0,8.1999999999999993,null,6769592,null,20300,2000,0,18300,null,0,0,null,0.98262716483154156,null,0,null,11.174625124321016,0,0,11.174625124321016,null,11.15,0,0,0,0,0,2.462512432101599E-2,null,11.15,0,0,11.15,null,4663732.8,null,10300,0,0,10300,null,0,0,null,0.9819529986222334,null,0,null,356410,198107,0,11888,566405,null,219310,50960,0,24570,294840]
[null,308,"Enfield",null,6.4099998999992236,6.3789036273756325,0,6.4166260908595261,null,6.03,0.12000000000000001,0.13,0,0,0,0,0.12999989999922221,null,6.0300000000000011,6.03,0,6.03,null,22607824.160000004,null,467996,78531,0,389465,null,0,0,null,0.95529059612507028,null,3.9808917197452227E-2,null,9.4800004589212516,9.4743848030672702,0,9.4801764324670703,null,9.1,0.19,0,0,0,0,0,0.19000045892125264,null,9.1000000000000014,9.1,0,9.1,null,5263212.34,null,107644,3174,0,104470,null,0,0,null,0.97031734482305543,null,2.0452099031216364E-2,null,9.4799991197067683,9.4742105263157903,0,9.480023945089938,null,9.1,0.19,0,0,0,0,0.18999911970676869,null,9.1,9.1,0,9.1,null,4960051.7699999996,null,101443,420,0,101023,null,0,0,null,0.97031720774890162,null,2.0452099031216364E-2,null,12.939998217028316,12.67,0,12.939999061590916,null,12.67,0,0,0,0,0,0.26999821702831794,null,12.67,12.67,0,12.67,null,4050484.9699999997,null,86316,0,0,86316,null,0,0,null,0.9700148588477,null,0,null,220157,64775,61044,7550,353526,null,172900,21551,20309,11830,226590]
[null,881,"Essex",null,5.5181434437852976,5.7052493559738222,9.9752148027514238,5.4533200423288486,null,5.2299999998261075,8.3948273273453652E-2,3.4657196143754752E-2,0,0,0,2.8122850836133466E-2,0.14141512370584869,null,5.2299999998261075,5.23,5.2299999741102008,5.23,null,89667355.320000008,null,2358371,337247,18867,2002257,null,10336305,3696382,null,1.0890939376199531,null,2.2175026761506102E-2,null,8.1890104603391833,8.1793373143793264,0,8.1896750927170547,null,7.8500000000000005,0.15,0,0,0,0,0,0.18901046033918298,null,7.8500000000000005,7.85,0,7.8500000000000005,null,11773232,null,278158,16968,0,261190,null,484932,0,null,1.0769311522454836,null,1.8749999999999999E-2,null,7.9951518421682817,8.0561024628342111,0,7.9930652280099324,null,7.8500000014140365,0,0,0,0,0,0.14515184075424506,null,7.8500000014140365,7.8500000427184791,0,7.85,null,24981665.969999999,null,461928,21711,0,440217,null,0,34000,null,1.0107650875054717,null,0,null,11.029707076626211,11.031008709268249,0,11.029646021221039,null,10.72999999809927,0,0,0,0,0,0.29970707852694201,null,10.72999999809927,10.729999957577844,0,10.729999999999999,null,20322720,null,567648,25544,0,542104,null,0,34000,null,1.0260192629419731,null,0,null,829050,400000,60051,27605,1316706,null,791700,101110,100000,64610,1057420]
[null,390,"Gateshead",null,5.4404422904700072,5.6239479675529145,8.6687840126075066,5.1446529105302226,null,4.57,0.25965900717581308,0.25965905949672519,0.1038636595513133,0,0,8.5778173285116707E-2,0.16148239096103922,null,4.57,4.5699999999999994,4.5699999999999994,4.57,null,12107495.129999999,null,370366,157744,9632,202990,null,0,256515.68,null,0.9789147896126309,null,0.11999998441745063,null,7.4093061867558996,7.8430467625899274,8.8495661337428118,7.3291722282193863,null,6.5700000178577511,0.27280119770127775,0.33978927283831079,0,0,0,0,0.22671569835855948,null,6.5700000178577511,6.5699999999999994,6.5700003010869246,6.5700000052974916,null,2775258.37,null,87599.959999999992,4971.21,9569.57,73059.179999999993,null,0,121711.02,null,0.96475340973384116,null,8.5288235703978796E-2,null,7.0958627092480242,7.0754727061304257,8.0097909665533074,7.0541786757836329,null,6.57000000840842,0.31541206841234265,0,0,0,0,0.21045063242726209,null,6.57000000840842,6.5700004090344866,6.5700001565123678,6.5699999891298742,null,2866048.99,null,87599.959999999992,4971.21,9569.57,73059.179999999993,null,0,0,null,0.92394045693333648,null,4.5808742438837376E-2,null,10.249087491777088,0,0,10.109404789365319,null,9.94,0,0,0,0,0,0.30908749177708861,null,9.94,0,0,9.94,null,1163486.94,null,36179,15409,941,19829,null,0,25057.45,null,0.97983628028461633,null,0,null,186076,101179,1,5059,292315,null,131950,48229,1,11830,192010]
[null,916,"Gloucestershire",null,5.3198104524683014,0,0,5.3198104524683014,null,5.09,0.12,0,0,0,0,0,0.10981045246830147,null,5.09,0,0,5.09,null,36912183.119999997,null,777993,0,0,777993,null,2050836,1917653,null,1.0254620405264951,null,2.3032629558541268E-2,null,7.378419992588177,0,0,7.378419992588177,null,7.14,0.12000000000000001,0,0,0,0,0,0.11841999258817654,null,7.14,0,0,7.14,null,3604619.04,null,58796,0,0,58796,null,141304,132128,null,1.0082918291006508,null,1.6528925619834711E-2,null,7.3672477494699526,0,0,7.3672477494699526,null,7.14,0.12,0,0,0,0,0.10724774946995239,null,7.14,0,0,7.14,null,10026118.08,null,148110,0,0,148110,null,402173,376056,null,1.0076927295516258,null,1.6528925619834711E-2,null,9.9832542840212355,0,0,9.9832542840212355,null,9.76,0.12,0,0,0,0,0.10325428402123568,null,9.76,0,0,9.76,null,8169870.7999999998,null,85382,0,0,85382,null,239363,223819,null,0.99445509140310251,null,"No Base Rate",null,312712,44699,124330,10144,491885,null,445080,31942,89790,56607,623419]
[null,203,"Greenwich",null,7.4563525372008197,7.1477677070983718,9.1830747307064193,7.1614709474302209,null,6.4600000025692168,0.35888973411187919,0,0,0,0,0.30858483331339764,0.32887796720632601,null,6.4600000025692159,6.4600000013734231,6.4600000070746582,6.4600000027926274,null,25522463.5,null,1177664.8,718375.53,164873.07,294416.2,null,642564.80000000005,1360304.32,null,0.96920795606616716,null,5.2631696356855703E-2,null,10.568526870472748,0,10.568526831657866,10.568526878422784,null,10.300000007729889,0,0,0,0,0,0,0.26852686274285992,null,10.300000007729889,0,10.30000003031329,10.300000003104373,null,3997470.07,null,104216.32000000001,0,17716.77,86499.55,null,83707.89,128124.32,null,0.97067606695658626,null,0,null,10.568526865442696,0,10.568526874301657,10.568526863628207,null,10.300000005189858,0,0,0,0,0,0.26852686025283701,null,10.300000005189858,0,10.299999999999999,10.300000006252841,null,5953921.0800000001,null,155222.11000000002,0,26387.759999999998,128834.35,null,124676.39,190831.21,null,0.97067606519910099,null,0,null,14.405989190261971,0,14.406030743554775,14.40603080571359,null,14.039959462615984,0,0,0,0,0,0.36602972764598524,null,14.039959462615984,0,14.040000020386071,14.040000008350921,null,4861450.53,null,126740.78,0,21545.93,105194.85,null,101799.82,155816.06,null,0.97029630112164911,null,0,null,326813,77498.399999999994,116247.6,11625,532184,null,145600,16380,24570,10920,197470]
[null,204,"Hackney",null,7.3950218916788666,7.6074065990437285,13.211609480072168,7.059014851576495,null,6.3100000000000005,0.16606420810656816,0.33175454170365459,0.1368752706318771,0,0,0.16801847581657786,0.28230939542018779,null,6.3100000000000005,6.31,6.3100000000000005,6.3100000000000005,null,27875211.050000004,null,1106390,291676.42,34424.81,780288.77,null,0,1468658.94,null,0.95069128495085253,null,9.1392654388205152E-2,null,10.838081259495448,19.014957650027032,11.663723193368172,10.792613995956792,null,10.679999989250474,0,0,0,0,0,0,0.15808127024497429,null,10.679999989250474,10.67999924120989,10.67999924120989,10.679999996806439,null,6756018.5800000001,null,100000,26362.89,3111.45,70525.66,null,0,108753.38,null,0.98438521884608976,null,0,null,10.597135317089991,17.690573034231754,11.313379209715771,10.557692519468887,null,10.459999990949067,0,0,0,0,0,0.13713532614092372,null,10.459999990949068,10.459998957770507,10.459998957770507,10.460000001385206,null,7627502.1800000006,null,100000,26362.89,3111.45,70525.66,null,0,301063.7,null,0.9625009370653943,null,0,null,14.529029119035863,26.375731174964383,15.725224791927186,14.463155855513261,null,14.300000009161163,0,0,0,0,0,0.22902910987469999,null,14.300000009161163,14.300000458057925,14.300000458057925,14.300000004626851,null,6243747.7999999998,null,100000,26362.89,3111.45,70525.66,null,0,227469.29,null,0.96538399462032309,null,0,null,201708,56884.5,56884.5,6826,322303,null,182000,26390,26390,20930,255710]
[null,876,"Halton",null,5.8785948342300314,5.5643355332936437,8.437105149343914,5.5536081525269365,null,5.1899999973523725,0.17000000156142139,0.13999999769181182,0,0,0,0.32139483866446844,5.7199998959957553E-2,null,5.1899999973523734,5.1899999995277479,5.189999970810363,5.1900000012428347,null,8575012.4499999993,null,84256.56,27246.2,9563.2099999999991,47447.15,null,16851.310000000001,210641.4,null,0.97353846048947512,null,5.6363636262646108E-2,null,7.9674000147283222,7.9674000019757578,7.9674000881385521,7.9674000157513065,null,7.9100000045585688,0,0,0,0,0,0,5.7400010169753241E-2,null,7.9100000045585688,7.9100000348663082,7.9099995974937265,7.9100000159724635,null,1908712.98,null,13850.84,3951.09,556.16999999999996,9343.58,null,5936.07,49467.28,null,0.97463414650318658,null,0,null,7.9673999666401025,7.9674000115805699,7.9673995954505186,7.9673999697308844,null,7.9100000032514508,0,0,0,0,0,5.7399963388650277E-2,null,7.9100000032514526,7.9100000501520746,7.9099998866354531,7.9099999903601539,null,2432759.2600000002,null,17653.64,5035.88,708.86,11908.9,null,7565.85,63048.75,null,0.97463414205906318,null,0,null,10.785900021503554,10.785899940341421,10.785901005737996,10.785899997238964,null,10.730000010860381,0,0,0,0,0,5.5900010643173487E-2,null,10.73000001086038,10.730000003807184,10.730000527414036,10.729999983095702,null,1975989.5899999999,null,10294.300000000001,2936.55,413.36,6944.39,null,20588.599999999999,51471.49,null,0.97474955660017015,null,0,null,179277,52177,52177,6260,289891,null,85540,15015,15015,8190,123760]
[null,205,"Hammersmith and Fulham",null,8.8702235744324334,8.4483967513911864,16.156501650165019,7.5498126874133309,null,6.6799999970060826,0.72150736403578064,0.16848184003530972,0,0,0,0.96015261029627952,0.3400817630589798,null,6.6799999970060826,6.68,6.6800000000000006,6.6799999944417259,null,12536293.740000002,null,499800,171000,59800,269000,null,146850,631944,null,0.95063060326066495,null,0.11756809427739331,null,10.594694334956333,10.639863547758285,10.596435709526983,10.587381916329285,null,9.36,0.89,0,0,0,0,0,0.34469433495633356,null,9.36,9.3600000000000012,9.36,9.36,null,1326247.5,null,44600,4000,15600,25000,null,18100,71873,null,0.94996296440684569,null,8.6829268292682935E-2,null,10.596609243344261,0,10.653508771929825,10.59443168771527,null,9.36,0.8899999999999999,0,0,0,0,0.34660924334426185,null,9.36,0,9.36,9.36,null,1585070.25,null,53600,0,2300,51300,null,21700,87224,null,0.95017117293591147,null,8.6829268292682921E-2,null,14.56044852742502,0,14.595939849624061,14.558849042751454,null,13.45,0.77,0,0,0,0,0.34044852742502024,null,13.45,0,13.45,13.45,null,1315705.5,null,31500,0,1500,30000,null,8250,71341,null,0.95065630226743014,null,"No Base Rate",null,88761,21544,25771,2838,138914,null,70070,7043.96,8426.0400000000009,3640,89180]
[null,850,"Hampshire",null,5.8483133434485355,5.8326712179193878,9.6782617504051878,5.8086329818593567,null,5.6099999999999994,4.524181096909409E-2,0,0,0,0,3.95305776549741E-2,0.1535409548244682,null,5.6099999999999994,5.61,5.61,5.61,null,87012198.399999991,null,2346000,33079,22052,2290869,null,225804,4882573,null,0.96527221556462206,null,7.9999781585539942E-3,null,7.9266187320928516,7.9265753984470768,7.9266503355428384,7.926618303134755,null,7.81,4.7142933896048921E-2,0,0,0,0,0,6.9475798196802857E-2,null,7.8100000000000014,7.81,7.81,7.8100000000000005,null,8481997.9399999995,null,75001,510,1688,72803,null,0,478872,null,0.95271859760731381,null,6.0000097099764211E-3,null,7.9057751345279073,7.8813903608953852,7.9714506955389561,7.9054950385327549,null,7.8100000000000005,4.7142829537007575E-2,0,0,0,0,4.8632304990898351E-2,null,7.8100000000000005,7.81,7.8100000000000005,7.8100000000000005,null,24395894.200000003,null,151000,2130,1419,147451,null,87107,1378974,null,0.95358528042581203,null,5.9999965076090542E-3,null,10.717207182902714,10.717194644147742,10.717201300924341,10.717207420573109,null,10.629999999999999,4.2690820994345346E-2,0,0,0,0,4.4516361908368163E-2,null,10.629999999999999,10.63,10.63,10.63,null,19899050.600000001,null,83000,1170,780,81050,null,46947,649581,null,0.95065370063272969,null,"No Base Rate",null,729000,104000,301000,24000,1158000,null,637000,46000,131000,51000,865000]
[null,309,"Haringey",null,6.8596767081174308,6.2435732264089028,14.347832223859781,6.2422286167127021,null,6.01,2.9667050198220701E-2,0,0,0,0,0.59892686440936327,0.22108279350984819,null,6.01,6.01,6.01,6.01,null,17637993.869999997,null,587392,226968,80284,280140,null,0,907932.12,null,0.95148173916535983,null,4.9120340495006319E-3,null,9.6420657423274658,10.214058759521219,10.011120943952802,9.4912348685005785,null,9.2800000000000011,0,0,0,0,0,0,0.36206574232746536,null,9.2800000000000011,9.2800000000000011,9.2799999999999994,9.2800000000000011,null,3574099.2,null,139446,38628,39656,61162,null,0,187280,null,0.97888992307893052,null,0,null,0,0,0,0,null,0,0,0,0,0,0,0,null,"",0,0,0,null,0,null,33000,11000,11000,11000,null,0,217466,null,"-",null,0,null,12.776928422541918,0,0,12.625642812556826,null,12.550000007564281,0,0,0,0,0,0.22692841497763847,null,12.550000007564281,0,0,12.550000007564281,null,3318227.03,null,60000,20000,20000,20000,null,0,165911.35,null,0.94995750353471509,null,0,null,254654,149234,4349000,8818.73,4761706.7300000004,null,93730,30030,30000,10920,164680]
[null,310,"Harrow",null,6.3377175182564365,6.2735000228540612,9.8264351470698301,6.273500000531274,null,5.3599999970863195,5.9999999514386594E-2,0.27000000128340684,0.27000000128340684,0,0,6.4217517290412876E-2,0.31350000179850396,null,5.3599999970863195,5.3599999970064269,5.3599999232362086,5.3599999987806823,null,17367528.07,null,903805.35999999987,167558.95000000001,16335.83,719910.58,null,0,951374.06,null,0.95053030317667031,null,0.10067114130285353,null,8.9102807179717392,0,0,8.9102807179717392,null,7.6199999973691606,8.4666668099012327E-2,0.38000000263083894,0.38000000263083894,0,0,0,0.44561404724188763,null,7.6199999973691606,0,0,7.6199999973691606,null,1930486.8399999999,null,101628.58,0,0,101628.58,null,0,106977.45,null,0.94992331748099557,null,9.9787352085756773E-2,null,8.912280736635628,0,0,8.912280736635628,null,7.6199999966054595,8.4666674441780568E-2,0.38100001074129564,0.38100001074129564,0,0,0.44561404410579653,null,7.6199999966054595,0,0,7.6199999966054595,null,3491881.69,null,183783.25,0,0,183783.25,null,0,193456.05,null,0.95013653908695384,null,0.100000003150164,null,12.126432746786312,0,0,12.126432746786312,null,10.370000004047849,0.11000001214355133,0.51999998380859824,0.51999998380859824,0,0,0.60643276297771209,null,10.370000004047849,0,0,10.370000004047849,null,2845954.9400000004,null,149816,0,0,149816,null,0,157701,null,0.94960319082116773,null,"No Base Rate",null,84121,18420.93,33312.07,3105,138959,null,70980,10368.959999999999,18751.04,4550,104650]
[null,805,"Hartlepool",null,5.3609119075078375,5.3868542338794141,0,5.3385237999177866,null,5.1000000000000005,1.0215161956285235E-2,0.22061207207409669,0,0,0,0,3.0084673477455647E-2,null,5.0999999999999996,5.0999999999999996,0,5.0999999999999996,null,5218544.0199999996,null,29451,14725.5,0,14725.5,null,19634,221080,null,0.95576702602003716,null,4.330045298726827E-2,null,7.5962335009783057,7.6153073297121807,0,7.5884614552924647,null,7.57,0,0,0,0,0,0,2.6233500978305565E-2,null,7.57,7.57,0,7.57,null,1675248.57,null,5805.5,2902.75,0,2902.75,null,18097,58057,null,0.95735773083727571,null,0,null,7.6099574649671,0,0,7.5899787324835497,null,7.5699999999999994,0,0,0,0,0,3.9957464967100738E-2,null,7.5699999999999994,0,0,7.5699999999999994,null,1099860.44,null,5805.5,2902.75,0,2902.75,null,18097,58057,null,0.96440318346275655,null,0,null,10.412540011992066,0,0,10.396270005996033,null,10.38,0,0,0,0,0,3.2540011992066784E-2,null,10.38,0,0,10.38,null,900195.12,null,2822,1411,0,1411,null,7268,37622,null,0.95857042095861145,null,0,null,194099,57421.5,57421.5,6785,315727,null,83720,10920,10920,5460,111020]
[null,311,"Havering",null,6.0651981961656993,6.1164205185624381,0,6.037616945735242,null,5.5599999988008371,0.13406637541705937,5.7461172277645772E-2,0,0,0,0,0.31367064967015612,null,5.559999998800838,5.559999996573822,0,5.5600000000000005,null,19185146.990000002,null,1046299,287074.75,0,759224.25,null,0,841069,null,0.98461009678014588,null,3.3300292165236105E-2,null,8.9675651468146711,8.6220436718240254,0,9.153615179044797,null,8.5900000017694165,0,0,0,0,0,0,0.37756514504525374,null,8.5900000017694165,8.5900000475214675,0,8.5899999771336955,null,2427354.04,null,106692,3169.2,0,103522.8,null,0,103528,null,1.0075915895297383,null,0,null,8.3794973000663706,8.0500000190841963,0,8.5494347869094973,null,8.0500000064935797,0,0,0,0,0,0.32949729357278973,null,8.0500000064935797,8.0500000190841963,0,8.0500000000000007,null,4958743.01,null,202968,0,0,202968,null,322000,229396,null,1.0002506270597751,null,0,null,11.479155441628105,11.049999967403883,0,11.591543999857683,null,11.04999998376451,0,0,0,0,0,0.42915545786359549,null,11.04999998376451,11.049999967403883,0,11.04999998804908,null,4083645.95,null,158599,0,0,158599,null,232050,186898,null,0.9997574800078235,null,0,null,128602,35580,35580,4272,204034,null,138320,19565,19565,15470,192920]
[null,884,"Herefordshire",null,5.300822551081338,5.0910890030743046,0,5.3951489313301657,null,5,3.1647976434666991E-2,0,0,0.17827412295713246,0,0,9.0900451689538947E-2,null,5,5,0,5,null,10004677.75,null,174557.26,0,0,174557.26,null,0,351054.05,null,0.96907176436587539,null,4.0292752057906112E-2,null,7.469570695000205,0,0,7.469570695000205,null,7.339999999999999,0,0,0,0,0,0,0.12957069500020485,null,7.339999999999999,0,0,7.339999999999999,null,1074913.6399999999,null,18975.11,0,0,18975.11,null,0,38161.050000000003,null,1.0388832677329909,null,0,null,6.9709925976744707,0,0,6.9709925976744707,null,6.85,0,0,0,0,0,0.12099259767447079,null,6.85,0,0,6.85,null,2564056.38,null,45289.32,0,0,45289.32,null,0,91081.86,null,0.96953999967656057,null,0,null,9.6779730661766781,0,0,9.6779730661766781,null,9.5100000032324985,0,0,0,0,0,0.16797306294417896,null,9.5100000032324985,0,0,9.5100000032324985,null,1765198.08,null,31178.31,0,0,31178.31,null,0,62703.040000000001,null,0.99058066183998761,null,0,null,128281,70086,1,3504,201872,null,84630,10920,10920,6370,112840]
[null,919,"Hertfordshire",null,6.2290396383749584,6.052677275630777,9.5766007284741743,5.9485171236428789,null,5.7699999993913744,0.13975506817462832,0,0,0,0,0.23260725016121628,8.6677320647740239E-2,null,5.7699999993913744,5.7699999993482312,5.7699999993749254,5.7699999994196904,null,87801883.349999994,null,1239007.3400000001,379379.23,74820.69,784807.42,null,0,2626848.25,null,0.99114749114344125,null,2.3648199726860754E-2,null,8.5763856428134417,8.5809982137586864,8.5125579502224706,8.581225504313716,null,8.3299999979738413,9.6642681672669845E-2,0,0,0,0,0,0.14974296316692962,null,8.3299999979738413,8.329999957321931,8.3299999688197879,8.3300000014010056,null,9981419.6000000015,null,177371.63,3470.33,7458.43,166442.87,null,0,257529.83000000002,null,0.98240385370142513,null,1.1468705313220175E-2,null,8.5669211859867893,8.4258771546469546,8.3908181348943653,8.5846008524573687,null,8.3299999976398613,8.7548672512720305E-2,0,0,0,0,0.14937251583420713,null,8.3299999976398613,8.3299999654980468,8.3299999774188969,8.3300000001223626,null,22825909.490000002,null,405054.21,4222.49,6395.5499999999993,394436.17000000004,null,0,556238.20000000007,null,0.9813197234807316,null,1.0400732558061152E-2,null,11.747602194238397,0,0,11.747602194238397,null,11.449999997794098,9.2771715473721317E-2,0,0,0,0,0.20483048097057743,null,11.449999997794098,0,0,11.449999997794098,null,15698021.09,null,278566.82,0,0,278566.82,null,0,382540.72,null,0.99135883495682664,null,"No Base Rate",null,1113000,585000,31000,31000,1760000,null,517000,154000,8000,40000,719000]
[null,312,"Hillingdon",null,6.3793582376722844,6.301140565311492,10.720820370260839,6.2520194758492353,null,5.6500000013669931,0.25000000136699324,0.27000000136699326,2.5051753681483734E-2,0,0,0.10228688404137889,8.2019595848441457E-2,null,5.650000001366994,5.65,5.65,5.6500000028061566,null,23033539.400000002,null,300000,146924,6934,146142,null,0,1216712.8500000001,null,0.94963257583828109,null,8.7981792199032932E-2,null,9.0458186251855928,0,0,8.9081601950816598,null,8.15,0.27999999999999997,0.37,0,0,0,0,0.24581862518559305,null,8.15,0,0,8.15,null,2684906.4,null,75000,33000,9000,33000,null,0,145071.5,null,0.9511901814075282,null,7.3863636363636367E-2,null,9.0377131209732369,9.0766770464472195,8.9218568869701009,9.0566770464472217,null,8.15,0.31600001469704792,0.38800000734852397,0,0,0,0.18371309892766663,null,8.15,8.15,8.15,8.15,null,4819471.2699999996,null,100000,45000,10000,45000,null,0,258827.6,null,0.95033786761022476,null,7.9512087225286021E-2,null,12.301298021313396,0,12.337556836723593,12.208634623907177,null,12.120000000000001,0,0,0,0,0,0.1812980213133954,null,12.120000000000001,0,12.12,12.120000000000001,null,3342562.68,null,50000,22000,6000,22000,null,0,178573.25,null,0.94990718311300359,null,0,null,167246,92924,0,4648,264818,null,153790,40950,0,11830,206570]
[null,313,"Hounslow",null,6.6759257860318213,6.6749715127034515,0,6.6765643524487537,null,6.2000000013064041,5.1344456697861564E-2,0,0,0,0,0,0.42458132802755599,null,6.2000000013064041,6.2000000032586939,0,6.1999999999999993,null,19140615.140000001,null,1300000,520000,0,780000,null,0,527385.94000000006,null,0.98756298609938187,null,8.2133462717959432E-3,null,9.8287382945063104,0,0,9.8287382945063104,null,9.8199999956175468,8.738298888763223E-3,0,0,0,0,0,0,null,9.8199999956175468,0,0,9.8199999956175468,null,3139847.16,null,0,0,0,0,null,0,79469.91,null,1.0008898466910703,null,8.8905601379654414E-4,null,9.81999999575015,0,0,9.81999999575015,null,9.81999999575015,0,0,0,0,0,0,null,9.81999999575015,0,0,9.81999999575015,null,3697071.7,null,0,0,0,0,null,0,93573.33,null,0.99999999956722507,null,0,null,12.719999984921174,0,0,12.719999984921174,null,12.719999984921174,0,0,0,0,0,0,null,12.719999984921174,0,0,12.719999984921174,null,3036841.23,null,0,0,0,0,null,0,76862.820000000007,null,0.9499626575743968,null,0,null,147462,82842,1,4970,235275,null,117389,36400,1,7280,161070]
[null,921,"Isle of Wight",null,5.4146070884922901,5.497000356063845,0,5.3975625816530952,null,5.0999999991251084,0.19000016631697086,1.7044514881611232E-2,0,0,0,0,0.10756240816860073,null,5.0999999991251084,5.0999999897917467,0,5.1000000010558786,null,6065942.5699999994,null,122943.64,21073.62,0,101870.02,null,0,257624.79,null,0.96003671781778199,null,3.9013178458100699E-2,null,7.8165929967196917,7.8165932294331695,0,7.8165929688383402,null,7.5500000299340639,0.20000005321611239,0,0,0,0,0,6.6592913569516646E-2,null,7.5500000299340639,7.5500002176071535,0,7.5500000074489906,null,1165060.69,null,10010.94,1071.08,0,8939.86,null,0,48914.73,null,0.96980061994040834,null,2.5806458202619467E-2,null,7.6853240669794145,7.6853240535627956,0,7.6853240685868567,null,7.5500000067588067,0,0,0,0,0,0.13532406022060656,null,7.5500000067588076,7.5499999157711741,0,7.5500000176600155,null,1675591.6600000001,null,30032.83,3213.25,0,26819.58,null,0,71000.02,null,0.95351415223069647,null,0,null,10.510253311721261,10.510253252024526,0,10.510253318873513,null,10.419999975957646,0,0,0,0,0,9.0253335763614384E-2,null,10.419999975957646,10.419999915732467,0,10.419999983173211,null,1386885.95,null,12012.58,1285.24,0,10727.34,null,0,48960.46,null,0.95809054801470006,null,0,null,103718,21951.82,31863.18,3229,160762,null,61880,7424.01,10775.99,7280,87360]
[null,420,"Isles of Scilly",null,5.7527877615872844,0,0,5.7527877615872844,null,5.7200002098403306,0,0,0,0,0,0,3.2787551746953546E-2,null,5.7200002098403306,0,0,5.7200002098403306,null,87228.23,null,500,0,0,500,null,0,94755.62,null,"-",null,"N/A",null,7.8400002547868066,0,0,7.8400002547868066,null,7.8400002547868066,0,0,0,0,0,0,0,null,7.8400002547868066,0,0,7.8400002547868066,null,12308.33,null,0,0,0,0,null,0,0,null,"-",null,"N/A",null,7.840000904734671,0,0,7.840000904734671,null,7.840000904734671,0,0,0,0,0,0,null,7.840000904734671,0,0,7.840000904734671,null,24263.47,null,0,0,0,0,null,0,0,null,"-",null,"N/A",null,10.73,0,0,10.73,null,10.73,0,0,0,0,0,0,null,10.73,0,0,10.73,null,35001.26,null,0,0,0,0,null,0,0,null,"-",null,"N/A",null,353,0,0,0,353,null,828,0,0,0,828]
[null,206,"Islington",null,8.5708516438422304,7.5267224390743088,18.505672454692096,8.2612015053823473,null,6.42,0.58436022379212871,8.7348610418242378E-2,1.2894546273796688E-2,0,0,0.30960074668898152,1.1566475166690806,null,6.42,6.419999999999999,6.4200000000000008,6.42,null,13821781.76,null,2156257,345258.25,534614.6,1276384.1499999999,null,147076.03,783188,null,0.99975966262062899,null,9.6360534687231617E-2,null,10.711025664499985,11.043606673407481,11.049837023370234,10.580620277318408,null,9.24,0,1.0014281790716837,1.3254600384509749E-2,0,0,0,0.45634288504379139,null,9.24,9.24,9.24,9.24,null,3360357,null,149539,26917.02,14953.9,107668.08,null,0,183524,null,0.9504015673913031,null,9.8948236749845334E-2,null,10.40155840942271,9.6703574940590258,11.030357393248048,10.497025446065669,null,8.7099999999999991,0,0.96035970273591831,5.1198871650211565E-2,0,0,0.67999983503658068,null,8.7099999999999991,8.7100000366585384,8.7100000824817094,8.7099999793795728,null,2357264.08,null,164885,0,32977,131908,null,74791,135788,null,0.95031081516058902,null,0.10405312755624732,null,14.21000307182844,0,0,14.03400245470775,null,13.329999986224985,0,0,0,0,0,0.88000308560345586,null,13.329999986224985,0,0,13.329999986224985,null,1935388.03,null,127768,0,25553.599999999999,102214.39999999999,null,63884,111797,null,0.9500651501057179,null,0,null,176940,96757,0,5807,279504,null,142870,20020,0,5460,168350]
[null,207,"Kensington and Chelsea",null,8.4573353401112268,7.9300501868382813,12.324085789539696,7.9300494381449225,null,7.47,0.33749971779685889,0,0,0,0,0.52728565730755628,0.12254996500681051,null,7.4700000000000015,7.4700000000000006,7.47,7.4700000000000006,null,11075512.850000001,null,162848.07,47225.94,19541.77,96080.36,null,325696.15000000002,571396.75,null,0.95059879306310568,null,4.3227631123385485E-2,null,10.612853566134079,10.591259280933397,10.591241934058162,10.628783461487092,null,9.9799999999999986,0.46319661780047217,0,0,0,0,0,0.16965694833360787,null,9.9799999999999986,9.98,9.98,9.98,null,951009.7,null,15449.81,4480.4399999999996,1853.98,9115.39,null,30899.61,54209.85,null,0.95236237852083672,null,4.4353911426981238E-2,null,10.610470143912709,10.591416422236493,10.591412795828452,10.62442593910958,null,9.9799999273404048,0.46149223087275076,0,0,0,0,0.16897798569955363,null,9.9799999273404048,9.98,9.9799995973411075,9.9799999604390468,null,1005929.7,null,16279.28,4720.99,1953.51,9604.7800000000007,null,32558.57,57120.3,null,0.95203706253141207,null,4.4197919596170587E-2,null,14.439378824307322,14.439378897902781,14.439377984409873,14.439378958959837,null,13.5999998807892,0.61608141779789449,0,0,0,0,0.22329752572022699,null,13.5999998807892,13.599999725952127,13.599999668858821,13.600000000000001,null,715509.73,null,11238.79,3259.25,1348.65,6630.89,null,22477.58,39434.35,null,0.94996642474459325,null,"No Base Rate",null,77908,18774,19781,1927,118390,null,30940,4431,4669,2730,42770]
[null,886,"Kent",null,5.7254660290697306,6.5053385032248139,8.6215421853119931,5.640546410221793,null,5.1600000000943913,6.0582327493423536E-2,0.36137773795500544,0,0,0,7.8174851965374503E-3,0.13568847833037359,null,5.1600000000943913,5.1600000011090152,5.1599999813476538,5.1600000000777015,null,94750037.179999992,null,2300000,216199.97999999998,9200.01,2074600.01,null,0,4298056,null,0.99334527964826724,null,7.5593529959694414E-2,null,7.6172736761846949,7.6176117759569637,7.6039369799605998,7.6172821216657622,null,7.5500000022108713,0,0,0,0,0,0,6.7273673973823639E-2,null,7.5500000022108713,7.5499999746058952,7.5500022789310295,7.55,null,11952298.02,null,106500,2662.5,106.5,103731,null,126898,634845.76,null,0.950300285392222,null,0,null,7.6184389800051058,7.6179987503698641,7.6179980601903274,7.6184508103588255,null,7.5499999998231555,0,0,0,0,0,6.8438980181949438E-2,null,7.5499999998231564,7.5500000351414549,7.5499992971704089,7.5499999996368068,null,21346387.630000003,null,193500,4837.5,193.5,188469,null,230560.24,1152445.24,null,0.95061552960544426,null,0,null,10.35263539185847,0,0,10.35263539185847,null,10.26,0,0,0,0,0,9.2635391858471069E-2,null,10.26,0,0,10.26,null,17482075.559999999,null,157842,0,0,157842,null,182095,938001,null,0.9500004132728096,null,0,null,894306,175540,318937,24726,1413509,null,1005550,92393,167867,50050,1315860]
[null,810,"Kingston upon Hull, City of",null,5.3020996136497729,5.2195510507480032,10.417829639798653,5.2195510507480032,null,4.8499999999999996,0.16999999999999998,0,0,0,0,8.2099613649772557E-2,0.2,null,4.8499999999999996,4.8500000000000005,4.8500000000000005,4.8500000000000005,null,14744379.100000001,null,577973,283759,10455,283759,null,90000,629845,null,0.95998962597744886,null,3.386454183266932E-2,null,7.54,7.5066666666666668,7.74,7.5324299056576987,null,7.17,0.16999999999999998,0,0,0,0,0,0.2,null,7.17,7.17,7.17,7.17,null,4282119.3,null,116679,5000,10000,101679,null,0,173380,null,0.95443037974683542,null,2.316076294277929E-2,null,7.5400004535466207,7.5066666666666668,7.74,7.5296369915718619,null,7.17,0.16999999999999998,0,0,0,0,0.20000045354662119,null,7.17,7.17,7.17,7.17,null,3236712.46,null,88194,5000,10000,73194,null,50000,121763,null,0.96878317833473226,null,2.316076294277929E-2,null,10.3,0,0,10.3,null,10.1,0,0,0,0,0,0.2,null,10.1,0,0,10.1,null,2665491,null,52782,0,0,52782,null,15000,107177,null,0.95985519539003694,null,0,null,520353,307351,0,15368,843072,null,177450,39140,10000,20020,246610]
[null,314,"Kingston upon Thames",null,6.7546397964891733,6.2972417982989066,10.553794871794871,6.7033833399751108,null,6.2500000027036728,3.9960272238178399E-2,1.952051451966692E-2,0,0,0,0.15159426096873121,0.29356474605892435,null,6.250000002703672,6.25,6.25,6.2500000038281129,null,11948701.92,null,542900,0,0,542900,null,0,308300,null,0.96677092640901141,null,9.4272078389070896E-3,null,9.3487595518159186,9.1979695290858743,9.5399999999999991,9.3845152040145763,null,9,0.13411200309092469,0,0,0,0,0,0.21464754872499356,null,9,9,9,9,null,1276620.03,null,30000,0,0,30000,null,0,45000,null,0.96578094543552884,null,1.4682544186620664E-2,null,9.2172236499847653,9.2159999999999993,9.2159999999999993,9.2172925789509907,null,9,1.9197610963968926E-2,0,0,0,0,0.19802603902079707,null,9,9,9,9,null,2892140.1,null,63500,0,0,63500,null,0,74800,null,0.95219252582487246,null,2.1285275910388987E-3,null,12.776040933825987,0,0,12.776040933825987,null,12.6,5.4170105824502317E-2,0,0,0,0,0.1218708280014846,null,12.6,0,0,12.6,null,2055886.32,null,19800,0,0,19800,null,0,25000,null,0.97156204819969483,null,"No Base Rate",null,67869,12000,23943,1799,105611,null,70070,3650,10000,1820,85540]
[null,382,"Kirklees",null,5.5743591206786265,5.5475571111894961,9.3756143855190395,5.5408330509118811,null,5.22,6.2585445020058916E-2,0,0,0,0,3.1961310549824901E-2,0.2598123651087425,null,5.2199999999999989,5.220000003240604,5.220000004655537,5.2199999992253252,null,27101414.260000002,null,1324907.44,240518.7,11161.2,1073227.54,null,230536.78,603690.75999999989,null,1.0215001329960121,null,1.1847502642680162E-2,null,7.4563701513552134,7.4563702834311849,7.4563697655639158,7.4563701492038623,null,7.2000000000000011,0,0,0,0,0,0,0.25637015135521268,null,7.2,7.2000000439251126,7.2,7.1999999971295159,null,5428665.3599999994,null,193298.3,11673.06,3000.18,178625.06,null,44514.080000000002,88075.890000000014,null,0.98240638653033519,null,0,null,7.4566568421052644,7.4566566427309766,7.4566572114419545,7.4566568489308978,null,7.2,0,0,0,0,0,0.25665684210526318,null,7.2,7.1999999340675132,7.200000128264409,7.2000000021543276,null,7233300,null,257843.88,15570.88,4002,238271,null,61483.05,117485.91,null,0.98272638458892336,null,0,null,10.275113857195356,0,0,10.275113857195356,null,9.8999999999999986,0,0,0,0,0,0.37511385719535595,null,9.8999999999999986,0,0,9.8999999999999986,null,5910496.0199999996,null,223950.4,0,0,223950.4,null,50096.57,102042.44,null,0.99510325905969954,null,0,null,537020,129835.81,173190.19,18183,858229,null,217490,30802.3,41087.699999999997,27300,316680]
[null,340,"Knowsley",null,5.437129874490747,5.5974296737766771,0,5.2621830555433053,null,4.860000003271657,5.8807010654133678E-2,0.36743639916901438,0.13284423207152812,0,0,0,1.8042229324413486E-2,null,4.860000003271657,4.860000004609855,0,4.8600000018111853,null,11263341.300000001,null,37500,18750,0,18750,null,35142,589849,null,0.9809420159056188,null,0.10317006819281949,null,7.7301730781246736,8.3231836902197021,0,7.6715236769284632,null,7.6,0,0,0,0,0,0,0.13017307812467457,null,7.6,7.5999999228603983,0,7.600000007629192,null,2189392.7999999998,null,37500,18750,0,18750,null,93539,70608,null,0.98590860868014429,null,0,null,7.5232261890415293,7.9023676678961943,0,7.4857286770954392,null,7.4399999955612701,0,0,0,0,0,8.3226193480259752E-2,null,7.4399999955612692,7.4399999605446219,0,7.4399999990244545,null,3352309.9899999998,null,37500,18750,0,18750,null,181133,147249,null,0.97003995819736355,null,0,null,10.836524487031994,0,0,10.768262243515998,null,10.700000000000001,0,0,0,0,0,0.13652448703199405,null,10.700000000000001,0,0,10.700000000000001,null,2939033.2,null,37500,18750,0,18750,null,36987,34863,null,0.98308076335854755,null,0,null,187986,54452,54452,6535,303425,null,142870,18200,18200,13650,192920]
[null,208,"Lambeth",null,7.7112297228478486,7.266942113253732,13.811401679754312,7.1931073929215232,null,6.5799999985822417,0.33999999929112024,0.25,0,0,0,0.41646688071055843,0.124762844263929,null,6.5799999985822417,6.5799999963279499,6.58,6.58,null,21404099.57,null,352000,105600,211200,35200,null,0,1050000,null,0.95148280031498111,null,8.2287308154269961E-2,null,10.649218344784718,11.007803014019498,11.007663349700858,10.495601484990594,null,9.6200000103683259,0.4799999896316729,0.36999999740791822,0,0,0,0,0.17921834737680026,null,9.6200000103683259,9.6200000881550007,9.6199999585260461,9.6200000140706852,null,4039224.44,null,69140.7,20742.21,41484.42,6914.07,null,102965.25,103041.94,null,0.97639648401368107,null,8.1184334980900441E-2,null,10.649447477311595,11.007523894845775,11.007523999187802,10.495928001307217,null,9.6199999874756372,0.48012726004730455,0.37009806367093662,0,0,0,0.17922216611771691,null,9.6199999874756372,9.6199999040053363,9.6200000083473629,9.6199999934388742,null,5015932.0999999996,null,85859.299999999988,25757.79,51515.58,8585.93,null,127862.83,127958.06,null,0.97641749100083186,null,8.1204109601084928E-2,null,14.54430743444634,15.031894568157849,15.031894393897254,14.335268715364215,null,13.139999986055752,0.66016107002592939,0.50012201218309082,0,0,0,0.24402436618156947,null,13.13999998605575,13.139999916354913,13.139999916354913,13.140000015937952,null,4102130.5799999996,null,70000,21000,42000,7000,null,209137.36,0,null,1.0002209113388818,null,"No Base Rate",null,234000,60665.38,75334.62,8000,378000,null,93000,11151.73,13848.27,10000,128000]
[null,888,"Lancashire",null,5.9719748701369673,5.8678392731987472,10.358769711568174,5.5443077333470399,null,5.4100000001868729,9.6037680978366624E-2,5.2375112227328359E-3,0,0,0,0.33265670651677459,0.1280429712322195,null,5.4100000001868729,5.4099999980414273,5.4100000022548791,5.4100000003434596,null,84434732.410000011,null,1850000,616668,616666,616666,null,0,0,null,1.0278230338951349,null,1.8375999866778216E-2,null,7.6135654956935754,8.3788844191432243,8.1234686387100012,7.4769602560990682,null,7.1000000005553527,0.37472728913643405,0,0,0,0,0,0.13883820600178792,null,7.1000000005553527,7.1000000000000005,7.1,7.1000000006835258,null,13459420.690000001,null,250000,83334,83333,83333,null,0,0,null,1.0097566970415881,null,5.013257000736486E-2,null,7.5472529187304627,7.890382968531255,7.6646831411631666,7.5019302385382671,null,7.0999999972188954,0.37000000052531989,0,0,0,0,7.7252920986247003E-2,null,7.0999999972188954,7.0999999899108897,7.0999999906551716,7.0999999988505067,null,24173843.210000001,null,250000,83334,83333,83333,null,0,0,null,1.0009619255610693,null,4.9531459255294806E-2,null,10.26297153212983,0,0,10.14099050908353,null,9.5099999981702847,0.56999999939009482,0,0,0,0,0.18297153456945242,null,9.5099999981702847,0,0,9.5099999981702847,null,16527160.939999999,null,300000,100000,100000,100000,null,0,0,null,0.99931563117135647,null,"No Base Rate",null,1135758,322239.5,322239.5,32226,1812463,null,618800,90090,90090,64610,863590]
[null,383,"Leeds",null,5.3999975336655934,5.4400965376499233,0,5.3732022955007839,null,5.1199999991164615,0.18996076160621045,0,0,0,0,0,9.0036772942921464E-2,null,5.1199999991164615,5.1199999988446061,0,5.1199999992981224,null,50483000.030000001,null,856000,392000,0,464000,null,203000,1888000,null,0.96465297371810477,null,3.5774419090124743E-2,null,7.9704195762006504,7.9724031157121296,0,7.9701490935469614,null,7.7799999950694927,0.10031031506016309,0,0,0,0,0,9.0109266070993968E-2,null,7.7799999950694927,7.7799999929159371,0,7.7799999953631591,null,9269999.9600000009,null,106000,13000,0,93000,null,28000,255000,null,0.97371766429257534,null,1.2729234143383965E-2,null,7.969514767976646,7.9684999556974336,0,7.9696531514692666,null,7.7799999961944826,9.9704558648447628E-2,0,0,0,0,8.9810213133716177E-2,null,7.7799999961944826,7.7799999885834472,0,7.779999997232351,null,10353000.01,null,118000,14000,0,104000,null,31000,285000,null,0.97358209214516123,null,1.2653337184725841E-2,null,10.858647750921778,10.855883650631261,0,10.859024673679787,null,10.669999996475811,9.9506507839630581E-2,0,0,0,0,8.9141246606335725E-2,null,10.669999996475811,10.669999961994041,0,10.67000000117787,null,5195000.04,null,43000,5000,0,38000,null,15000,139000,null,0.9740378832398624,null,"No Base Rate",null,686000,184000,205000,23000,1098000,null,367000,54000,61000,29000,511000]
[null,856,"Leicester",null,5.3395199985770576,5.3952925212894094,0,5.3043265674228026,null,4.8299999994177814,0.10190111785134437,9.9103837971290659E-2,0,0,0,0,0.30851504333664176,null,4.8299999994177814,4.83,0,4.8299999990503917,null,20738633.949999999,null,1271750,492022,0,779728,null,367967,312777.2,null,0.98526051968229444,null,3.9953241471818356E-2,null,7.7281308193630203,0,0,7.7281308193630203,null,7.3200000032930079,0.11845765701804271,4.7982818400144629E-2,0,0,0,0,0.24169034065182463,null,7.3200000032930079,0,0,7.3200000032930079,null,4546870.16,null,146790,0,0,146790,null,99054,46110,null,0.99011588946766849,null,2.2232257892316854E-2,null,7.72812998322651,0,0,7.72812998322651,null,7.3199999962571711,0.11845774467203551,4.7982774001782712E-2,0,0,0,0.2416894682955211,null,7.3199999962571711,0,0,7.3199999962571711,null,4000417.67,null,129148,0,0,129148,null,87150,40569,null,0.99011590666241556,null,2.223226356261945E-2,null,10.558465456502763,0,0,10.558465456502763,null,10.15000001251186,0.11855473363748835,4.8022024879585845E-2,0,0,0,0.24188868547382919,null,10.15000001251186,0,0,10.15000001251186,null,3298174.9299999997,null,77331,0,0,77331,null,83839.08,20554,null,0.99455066088773458,null,"No Base Rate",null,561982,171666,151035,19361,904044,null,148330,25173,22147,15470,211120]
[null,855,"Leicestershire",null,5.1220508052440143,0,9.7899999999999991,5.091502222740905,null,5.0199999999999996,2.9241845218936417E-2,0,0,0,0,3.1013473975683357E-2,4.179548604939512E-2,null,5.0199999999999996,0,5.0199999999999996,5.0199999999999996,null,37857094.849999994,null,311452,0,0,311452,null,1117771.5,1761527,null,0.95814209766639924,null,5.7913338507691323E-3,null,7.0517961312113657,0,0,7.0517961312113657,null,7.0099999966074575,0,0,0,0,0,0,4.1796134603908686E-2,null,7.0099999966074575,0,0,7.0099999966074575,null,4132592.68,null,24640,0,0,24640,null,0,132459,null,0.96998571268381928,null,0,null,7.0517957228787331,0,0,7.0517957228787331,null,7.0099999970776317,0,0,0,0,0,4.1795725801101795E-2,null,7.0099999970776317,0,0,7.0099999970776317,null,9594954.3200000003,null,57208,0,0,57208,null,0,307541,null,0.96998565651701973,null,0,null,9.5501087629984234,0,0,9.5501087629984234,null,9.490000002440274,2.4743094086460363E-2,0,0,0,0,3.5365666471688803E-2,null,9.490000002440274,0,0,9.490000002440274,null,7798095.0499999998,null,28985,0,0,28985,null,0,211786,null,0.96857086845825802,null,"No Base Rate",null,409546,68196.350000000006,158336.65,26390,662469,null,340340,26573.13,61696.87,26390,455000]
[null,209,"Lewisham",null,6.9058876385928354,6.7941880433659616,10.786067197024968,6.7377560318581304,null,6.1799999994094437,0.25999999881888758,0.12587372863216348,0,0,0,0.14546255447031997,0.19455135726202083,null,6.1799999994094437,6.1799999961623273,6.1799999888353447,6.1800000016614138,null,22728865.809999999,null,658875,212919.57,24395.91,421559.52,null,425568,1200924,null,0.95111685000246449,null,5.8769593127030562E-2,null,9.9500127453892055,9.9500131851798574,9.950012590018634,9.9500127467289836,null,9.2200000107897466,0,0,0,0,0,0,0.73001273459945626,null,9.2200000107897484,9.2200007191916296,9.2199998168724555,9.220000009351109,null,3418059.6100000003,null,270632,4872.22,15945.45,249814.33,null,59324,196475,null,0.95019130546775166,null,0,null,9.9499046477451039,9.9499046286004411,9.9499044278501572,9.9499046621542089,null,9.2199999934120562,0,0,0,0,0,0.7299046543330473,null,9.2199999934120562,9.2200000914833566,9.2199998770057174,9.2199999989294597,null,5598104.6299999999,null,443175.99,7978.55,26111.62,409085.82,null,97550,321722,null,0.95024136586129715,null,0,null,13.576071041326623,13.576070598624636,13.576071109285245,13.576071045623063,null,12.579999994498804,0,0,0,0,0,0.99607104682781855,null,12.579999994498804,12.580000213898188,12.580000046684143,12.579999986888829,null,4573552.09,null,362129,6519.45,21336.39,334273.15999999997,null,79711,262887,null,0.95009117782956864,null,0,null,100443,57509,0,3450,161402,null,141960,28210,0,10920,181090]
[null,925,"Lincolnshire",null,5.3877393061149865,5.2761909000002083,10.303130908092944,5.2015812140793356,null,5,0.16738726973190032,0,0,0,0,0.11447940961760124,0.10587262676548462,null,5,5,5,5,null,39911103.299999997,null,800000,0,0,800000,null,196496,1290126.47,null,0.96878689782148508,null,3.2393018172331582E-2,null,7.3120570715797681,0,0,7.292048812236386,null,7.08,0.18000000000000002,0,0,0,0,0,5.2057071579768473E-2,null,7.08,0,0,7.08,null,6012390.7800000003,null,43111.22,0,0,43111.22,null,48169.88,196713,null,0.9684917880675058,null,2.4793388429752067E-2,null,7.218042788908873,0,0,7.218042788908873,null,7.0799999999999992,0,0,0,0,0,0.13804278890887248,null,7.0799999999999992,0,0,7.0799999999999992,null,10611004.859999999,null,206888.8,0,0,206888.8,null,233300.1,355997,null,0.9689498078021449,null,0,null,9.7935525156690719,0,0,9.7935525156690719,null,9.7100000014621681,0,0,0,0,0,8.3552514206903974E-2,null,9.7100000014621681,0,0,9.7100000014621681,null,9297146.9199999999,null,80000,0,0,80000,null,213120,290193.02,null,0.96680853412319157,null,0,null,759724,416973,0,25020,1201717,null,340340,89180,0,30030,459550]
[null,341,"Liverpool",null,5.7837602245855049,5.3560287853217901,12.627718899715889,5.4028796336063571,null,5.0900000016485718,0.11207631597988149,0,0,0,2.3541037720120502E-2,0.38591425590537415,0.17222861333155703,null,5.0900000016485718,5.0900000024633156,5.0900000157751348,5.0899999998536218,null,32336801.349999998,null,992478.14000000013,149128.20000000001,88532.27,754817.67,null,984703.37,992478.14,null,0.99264267304198905,null,2.5952408008059299E-2,null,7.8170541953170822,7.8170542272556967,7.8170543346116075,7.81705417266922,null,7.58000000944139,0,0,0,0,0,0,0.23705418587569332,null,7.58000000944139,7.58000001285248,7.580000052920667,7.5800000036677986,null,7065061.3499999996,null,220950.18,33199.629999999997,19709.48,168041.07,null,0,149972.32999999999,null,0.9521381480288772,null,0,null,7.8950002320252413,7.8950002191140971,7.8950002513697086,7.8950002323071731,null,7.5800000018341906,0,0,0,0,0,0.31500023019105122,null,7.5800000018341906,7.5800000219724444,7.5799999773818678,7.5800000007235102,null,8265221.3899999997,null,343475.81,51610.13,30639.16,261226.52,null,0,343475.81,null,0.96163218416872598,null,0,null,9.9248164628880016,9.976599992723937,9.973587629247449,9.911890131462183,null,9.639999993873543,0,0,0,0,0,0.28481646901445701,null,9.6399999938735448,9.6399999807256638,9.6399999034716419,9.6400000046138956,null,6294014.8000000007,null,185958.41,27941.82,16588.09,141428.5,null,659679.39,185958.41,null,0.97461591153274763,null,0,null,699456,197602.5,197602.5,23714,1118375,null,352170,50960,50960,31850,485940]
[null,821,"Luton",null,6.1477470244818182,5.8602808217574607,8.5608619863589261,5.730621909068347,null,5.43,0.13748135697378963,4.0604602284445929E-2,0,0,0,0.39058700803807317,0.14907405718550987,null,5.43,5.43,5.43,5.43,null,17101808.719999999,null,425000,70046,59428,295526,null,785902,220532,null,0.98139894458280386,null,3.1755212126204718E-2,null,8.3287808077641952,8.3288124156545216,8.3287803499362436,8.3287802335159302,null,8.15,0,0,0,0,0,0,0.17878080776419508,null,8.15,8.15,8.15,8.15,null,3510164.25,null,77000,1325,13600,62075,null,0,44106,null,0.99507536532427665,null,0,null,8.1491254170540941,8.1842743601971062,7.9852050043354392,8.1842883796665369,null,7.9700000000000006,0,0,0,0,0,0.17912541705409396,null,7.9700000000000006,7.97,7.97,7.9700000000000006,null,2914310.2,null,65499,1348,982,63169,null,0,88212.5,null,0.97361116093836264,null,0,null,11.105049999760654,11.104957507082153,11.105041110109536,11.105053862836421,null,11.049999999999999,0,0,0,0,0,5.5049999760652175E-2,null,11.05,11.05,11.05,11.05,null,2308356.0500000003,null,11500,194,2015,9291,null,382742,88213,null,1.1338491941137754,null,0,null,242859,77505,65802,7167,393333,null,151060,14273,12117,13650,191100]
[null,352,"Manchester",null,5.6614074444893561,5.5900000039887221,10.612719298245613,5.6035484768614756,null,5.1500000003317776,0.25654225073223036,0.10830366387964883,0,0,0,6.5431398968162982E-2,8.1130130577535348E-2,null,5.1500000003317776,5.1500000013295741,5.15,5.1499999986287133,null,33638638.870000005,null,489063,0,0,489063,null,370938,1206680.08,null,0.96709582016757678,null,6.6157045951773741E-2,null,8.379999999999999,8.3800000000000008,0,8.379999999999999,null,8.379999999999999,0,0,0,0,0,0,0,null,8.379999999999999,8.3800000000000008,0,8.379999999999999,null,9889154.1999999993,null,0,0,0,0,null,0,54494.8,null,0.98704358068315656,null,0,null,8.3799999974231838,0,0,8.3799999974231838,null,8.3799999974231838,0,0,0,0,0,0,null,8.3799999974231838,0,0,8.3799999974231838,null,6504152.9199999999,null,0,0,0,0,null,0,85377.08,null,0.98704358037964468,null,0,null,11.610000000000001,0,0,11.610000000000001,null,11.610000000000001,0,0,0,0,0,0,null,11.610000000000001,0,0,11.610000000000001,null,5094967.2300000004,null,0,0,0,0,null,0,0,null,1.0000000000000002,null,0,null,966287,284944.5,284944.5,28493,1564669,null,326690,50960,50960,32760,461370]
[null,887,"Medway",null,5.2984980554577756,5.2399999999999984,0,5.3235686471548798,null,4.8,0.33999999999999997,0.05,0.05,0,0,0,5.8498055457775637E-2,null,4.8,4.8,0,4.8,null,17878130.68,null,199587,0,0,199587,null,0,950459,null,0.94955162284189543,null,8.3969465648854949E-2,null,7.5777653273031031,7.5200000000000005,0,7.6025220287770354,null,7.3,0.13999999999999999,0.04,0.04,0,0,0,5.776532730310343E-2,null,7.3,7.3,0,7.3,null,2673675.84,null,20538,0,0,20538,null,0,189674,null,0.94959465254424857,null,2.9255319148936164E-2,null,7.5773672545863624,7.52,0,7.6019531221784815,null,7.3,0.13999999999999999,0.04,0.04,0,0,5.736725458636352E-2,null,7.3,7.3,0,7.3,null,4461879.1999999993,null,34038,0,0,34038,null,0,189674,null,0.94954476874515847,null,2.925531914893616E-2,null,10.321571786205201,10.219999999999999,0,10.365102689370584,null,9.2000000000000011,0.82,9.9999999999999992E-2,9.9999999999999992E-2,0,0,0.1015717862052021,null,9.2000000000000011,9.1999999999999993,0,9.1999999999999993,null,3078120.92,null,30592,0,0,30592,null,0,163643,null,0.94954662246598009,null,"No Base Rate",null,182490,51051,51051,5105,289697,null,141960,15015,15015,16380,188370]
[null,315,"Merton",null,6.2498506205626265,6.4110374429836181,0,6.0745563949827437,null,5.7200000008500496,0.19601620264940448,0.14063453916447818,0,0,0,0,0.19319987789869464,null,5.7200000008500496,5.7200000032633813,0,5.7199999982255001,null,14250090.289999999,null,454560.75,185535,0,269025.75,null,516791.15,801128.54,null,0.95000000013730623,null,5.5583647814206237E-2,null,9.3110793609559686,0,0,9.3110793609559686,null,9,0.27860761137810103,0,0,0,0,0,3.2471749577867255E-2,null,9,0,0,9,null,1628740.8,null,5700,0,0,5700,null,16486.57,86890.91,null,0.95000000230173653,null,3.0026877204770704E-2,null,9.3115740525459199,0,0,9.3115740525459199,null,9,0.17207161125319692,0,0,0,0,0.13950244129272263,null,9,0,0,9,null,3372896.34,null,51300,0,0,51300,null,34356.04,182029.07,null,0.95000000068670343,null,1.8760386807499693E-2,null,12.411675166325818,0,0,12.411675166325818,null,12.3,3.0583240570555798E-2,0,0,0,0,8.1091925755261599E-2,null,12.3,0,0,12.3,null,2715013.17,null,17855.25,0,0,17855.25,null,86824.53,148404.89000000001,null,0.94999999939355084,null,"No Base Rate",null,108141,37792,20000,3470,169403,null,64610,10200,8000,4550,87360]
[null,806,"Middlesbrough",null,5.5038048828815009,0,0,4.9974284757282996,null,4.8099999994409091,0.12859074993063088,0,0.39748706838305126,0,0,0,0.16772706512690982,null,4.8099999994409091,0,0,4.8099999994409091,null,9544216.0399999991,null,300000,200000,0,100000,null,0,281163.58,null,0.97240368955503542,null,9.8588858011642425E-2,null,7.9300454975613306,7.9300303317075533,0,7.9300909951226615,null,7.9300000000000006,0,0,0,0,0,0,4.5497561330712674E-5,null,7.9300000000000006,7.93,0,7.9300000000000006,null,3485901.12,null,20,10,0,10,null,0,107873.94,null,0.96944321486079843,null,0,null,7.930074660278942,7.9300497735192943,0,7.9301493205578817,null,7.9300000373114834,0,0,0,0,0,7.462296745692389E-5,null,7.9300000373114843,7.9300000248743228,0,7.930000074622968,null,2125351.0300000003,null,20,10,0,10,null,0,65770.600000000006,null,0.96944677998520057,null,0,null,10.860147251171306,10.86009815272144,0,10.860294546506429,null,10.859999966124439,0,0,0,0,0,1.4728504686352444E-4,null,10.859999966124441,10.859999962687787,0,10.859999976434395,null,1474691.4500000002,null,20,10,0,10,null,0,45626.49,null,0.96965600456886647,null,0,null,225195.6,126380.86,3158.94,3158.94,357894.34,null,103740,31850,5460,5460,146510]
[null,826,"Milton Keynes",null,5.8331364931364931,6.0224763567304187,9.7924546662295757,5.6640710591142751,null,5.5,8.5506042098161372E-2,8.274768658155239E-2,0,0,0,5.8965725632392302E-2,0.10591703882438706,null,5.5,5.5,5.5,5.5,null,20763913.859999999,null,384000,110427,6138.8,267434.2,null,737828,479714,null,0.97834408488741809,null,2.9683521016075708E-2,null,8.3383493821261094,8.3148826783115002,8.4708499999999987,8.3322466737896779,null,7.8000000000000007,0.42999922210121577,0,0,0,0,0,0.10835016002489276,null,7.8000000000000007,7.8,7.8,7.8000000000000007,null,2962338.8400000003,null,38999.99,1860.91,1950.3,35188.78,null,46552,47627,null,0.98461402458470293,null,5.2247784051604317E-2,null,8.0289452267187897,9.136282051282052,9.1361754385964904,8.0273396680683433,null,7.8000000000000007,0.12035187263206157,0,0,0,0,0.10859335408672989,null,7.8000000000000007,7.8,7.8,7.8000000000000007,null,5251383.379999999,null,72000,42.35,61.9,71895.75,null,290893,87730,null,0.98461418422820435,null,1.5195268413253804E-2,null,11.224457329974813,0,11.085943859649122,11.226475031944801,null,10.96,0.13851274559193955,0,0,0,0,0.12594458438287154,null,10.96,0,10.96,10.96,null,4406109.5600000005,null,50000,0,717.88,49282.12,null,162843,25929,null,0.99441377855282154,null,"No Base Rate",null,110025,20910,38517,3566,173018,null,136500,9606,17694,11830,175630]
[null,391,"Newcastle upon Tyne",null,5.5443902281618866,5.4512558289378488,8.9240753253182206,5.290242677153608,null,5,0.29839884565463642,0,0,0,0,0.16623032850333463,7.9761054003915741E-2,null,5,5,5,5,null,17128124.879999999,null,250000,112500,12500,125000,null,33647.120000000003,661680,null,0.96230264562315992,null,5.6318683124310584E-2,null,7.5562520325147631,7.5561246267008526,7.5554873174315098,7.556379475682526,null,7.1899999931581835,0.18620422513884477,0,0,0,0,0,0.18004781421773491,null,7.1899999931581826,7.1900000240063768,7.1899999639904353,7.1899999908775767,null,4096802.98,null,100000,15000,10000,75000,null,195310.55,40000,null,0.99096546475268166,null,2.5243908605045978E-2,null,7.5692282112842282,7.5687501270413131,7.5694331634967762,7.5692965011728965,null,7.1900000102276298,0.18625405397676006,0,0,0,0,0.19297414707983898,null,7.1900000102276298,7.190000028302876,7.1900000405245725,7.1900000025729893,null,3822405.32,null,100000,15000,10000,75000,null,172849.88,40000,null,0.99032378357678619,null,2.5250493320263585E-2,null,10.251713125482196,10.251713155080122,10.251713262508169,10.251713101292484,null,10.010000025460446,0,0,0,0,0,0.24171310002175095,null,10.010000025460446,10.01000004726834,10.010000154696389,10.010000003867411,null,3105954.96,null,75000,11250,7500,56250,null,111411.04,86640,null,0.97435934161764559,null,0,null,408155,109733.5,109733.5,13167,640789,null,163800,29575,29575,20020,242970]
[null,316,"Newham",null,6.9342190946808291,6.3522368702980563,8.9764167660520382,6.3593002045211513,null,5.7500000006095302,6.3674498999988144E-2,0.18223430862473919,0,0,0,0.62410259257358514,0.3142076938729858,null,5.7500000006095311,5.7500000024393785,5.7500000000000009,5.7499999978171186,null,27152085.130000003,null,1288728,695913,231971,360844,null,0,902110,null,0.97831259818526772,null,4.1012766452854926E-2,null,9.161889113441875,9.0272153668768258,9.0587287117996258,9.9586378587628985,null,8.4699999999999989,0.21717918836389383,0,0,0,0,0,0.47470992507797888,null,8.4700000000000006,8.4700000000000006,8.4700000000000006,8.4700000000000006,null,5300056.7100000009,null,289621,156395,52132,81094,null,0,202734,null,0.9947762338156213,null,2.4999966462623001E-2,null,8.9328423817672515,8.93812836844684,9.1011599947152853,8.857895317199846,null,8.4700000000000006,0,0,0,0,0,0.46284238176725123,null,8.4700000000000006,8.4699999999999989,8.4700000000000006,8.4700000000000006,null,3885485.45,null,212322,114654,38218,59450,null,0,136014,null,0.96990688184226392,null,0,null,12.20223852122086,0,0,11.74702678594184,null,11.57,0,0,0,0,0,0.63223852122085933,null,11.57,0,0,11.57,null,3177804.63,null,173650,93771,31257,48622,null,0,121555,null,0.96997126559784252,null,0,null,126532,30165,45247,4523,206467,null,187460,20020,30030,16380,253890]
[null,926,"Norfolk",null,5.2915092669843444,5.237769624110129,9.2890015789079499,5.237769305522348,null,5.0299999996378713,4.336926124025256E-2,0,0,0,0,5.3739947253010525E-2,0.16440005885320907,null,5.0299999996378713,5.0300000008694292,5.0299999790704373,5.0299999997203511,null,42474716.410000011,null,1361946,226908,18066,1116972,null,190795.19,1815927.4,null,0.96000002647506788,null,8.5484140834538799E-3,null,7.3643691420331647,7.3643691426542874,7.3643692541530363,7.3643691394391322,null,7.0899999933427473,4.3369275843956646E-2,0,0,0,0,0,0.23099987284646178,null,7.0899999933427456,7.0899999108795955,7.0900000129247225,7.0899999994132532,null,5357591.8899999997,null,173494.88,12441.59,3574.54,157478.75,null,20752.59,231326.64,null,0.96000002489985659,null,6.0797743965526271E-3,null,7.3643691330754519,7.3643691502726636,7.364369032790095,7.3643691339931205,null,7.0900000057110315,4.3369257147605457E-2,0,0,0,0,0.23099987021681501,null,7.0900000057110315,7.0900000398194587,7.09000012127155,7.0900000003932409,null,9992407.9700000007,null,323584.11,23204.720000000001,6666.85,293712.53999999998,null,38706.15,431445.76000000001,null,0.96000008273578374,null,6.0797717809754313E-3,null,9.9993992367839244,0,0,9.9993992367839244,null,9.6900000047689083,4.3369262288045871E-2,0,0,0,0,0.26602996972697046,null,9.6900000047689083,0,0,9.6900000047689083,null,8164023.0999999996,null,223137,0,0,223137,null,105595.55,297516.36,null,0.96615392261669519,null,"No Base Rate",null,601645,115392,215216,19838,952091,null,400400,37161,69309,27300,534170]
[null,812,"North East Lincolnshire",null,5.4312093756645359,5.3323990273922499,9.7059093918471575,5.2975765637433812,null,5.0599999999999996,5.7235803256733588E-2,0,0,0,0,0.13302193476578936,0.18095163764201266,null,5.0599999999999996,5.0600000000000005,5.0600000000000005,5.0599999999999996,null,9283253.7200000007,null,319950,16928,9491,293531,null,53753,430099,null,0.97414773451731906,null,1.1184906355166852E-2,null,7.6132508401344223,0,0,7.6132508401344223,null,7.2200000000000006,0.13322923667786846,0,0,0,0,0,0.26002160345655306,null,7.2200000000000006,0,0,7.2200000000000006,null,2450684.2400000002,null,86660,0,0,86660,null,131053,0,null,1.0264708661078081,null,1.8118466375741656E-2,null,7.5561220457365179,0,0,7.5561220457365179,null,7.2200000000000006,7.8055355583806885E-2,0,0,0,0,0.25806669015271033,null,7.2200000000000006,0,0,7.2200000000000006,null,2382340.7000000002,null,84242,0,0,84242,null,127398,0,null,1.0187682944694296,null,1.0695363597658386E-2,null,10.153053832042744,0,0,10.153053832042744,null,9.85,1.1120873880273273E-2,0,0,0,0,0.29193295816247095,null,9.85,0,0,9.85,null,1968522.31,null,58277,0,0,58277,null,88132,0,null,0.99479272359476945,null,"No Base Rate",null,164002,94354,1,5663,264020,null,84630,27300,1,9100,121031]
[null,813,"North Lincolnshire",null,5.3953280179509306,5.627397339534622,0,5.3350916366848589,null,5.1800000012266922,2.3043883522823629E-2,0,0,4.6307694657280754E-2,0,0,0.14597643854413403,null,5.1800000012266922,5.1800000071432439,0,5.1799999996909811,null,8558543.3399999999,null,238000,78000,0,160000,null,440975,374980,null,1.0357949612549129,null,1.3211456144825693E-2,null,7.7433808881536184,7.5200000000000005,0,7.7464616493929244,null,7.459999982129526,5.9999982129526085E-2,0,0,0,0,0,0.22338092389456599,null,7.459999982129526,7.46,0,7.4599999818830653,null,1683223.4,null,50000,0,0,50000,null,16741,52330,null,1.0341499059645498,null,7.9787210657836626E-3,null,7.6709229795800979,0,0,7.6709229795800979,null,7.46,9.6000000000000009E-3,0,0,0,0,0.20132297958009779,null,7.46,0,0,7.46,null,2597179.92,null,70000,0,0,70000,null,0,71968,null,1.0146723517963092,null,1.285209382028489E-3,null,9.7707827716881948,0,0,9.7707827716881948,null,9.75,5.5022207733996173E-3,0,0,0,0,1.5280550914795648E-2,null,9.75,0,0,9.75,null,1915278.24,null,3000,0,0,3000,null,0.5,84613,null,0.94954181909102831,null,"No Base Rate",null,212901,76000,18950,5465,313316,null,69160,42770,0,7280,119210]
[null,940,"North Northamptonshire",null,5.4988732925861763,5.3504041212757576,10.642225821201025,5.1404638987039899,null,4.8499999999999996,0.19793255721588168,7.42838295988376E-2,0,0,0,0.30237307617261977,7.42838295988376E-2,null,4.8499999999999996,4.8499999999999996,4.8499999999999996,4.8499999999999996,null,21907551.719999999,null,300000,61824.73,19503.73,218671.54,null,0,1104547.3,null,0.95000004046906994,null,5.3144257535749813E-2,null,7.4482375496416671,7.78620256204964,7.4446735395189005,7.4177485449643505,null,6.8599999999999994,0.31,0.05,0,0,0,0,0.22823754964166704,null,6.8599999999999994,6.8599999999999994,6.86,6.8599999999999994,null,2372528.1,null,75000,5701.38,6907.38,62391.24,null,0,128813.2,null,0.95003029969919217,null,4.9861495844875356E-2,null,7.4480005886525538,7.4235583698999372,7.6632886908442037,7.4353617285524631,null,6.8600000024858634,0.30451831851696348,5.0000006214659561E-2,0,0,0,0.23348226143506678,null,6.8600000024858625,6.8599999739942783,6.8600000449647354,6.8600000068730811,null,5804435.6699999999,null,187847.99,14279.89,17300.5,156267.6,null,0,315383.34999999998,null,0.95000007508323392,null,4.9139569497545998E-2,null,10.136500015703453,10.099761378104402,10.349601649597245,10.127880149783723,null,9.600000012454819,0.2557389788487881,4.2307966233902483E-2,0,0,0,0.23845305816594176,null,9.600000012454819,9.6000000000000014,9.6000001277173457,9.6000000056956747,null,4768296.92,null,114872.66,8732.43,10579.59,95560.639999999999,null,0,217470.5,null,0.9500000014717388,null,"No Base Rate",null,211501.94,117052,0,7024,335577.94,null,156520,50050,0,15470,222040]
[null,802,"North Somerset",null,5.5256819357387092,0,0,5.5256819357387092,null,5.1200000008839623,0.13949968374052377,0,0,0,0,0,0.26618225111422295,null,5.1200000008839623,0,0,5.1200000008839623,null,11899833.15,null,602248.23,0,0,602248.23,null,36522,220937,null,0.99315841655477211,null,2.6523375245811744E-2,null,7.8161822535190222,0,0,7.8161822535190222,null,7.5500000287161741,0,0,0,0,0,0,0.26618222480284914,null,7.5500000287161741,0,0,7.5500000287161741,null,1314590.1499999999,null,46347.090000000004,0,0,46347.090000000004,null,8375,17194,null,0.99547871465908566,null,0,null,7.8161821971133003,0,0,7.8161821971133003,null,7.550000011065749,0,0,0,0,0,0.26618218604755128,null,7.550000011065749,0,0,7.550000011065749,null,3411427.49,null,120273.01,0,0,120273.01,null,21733,44620,null,0.99547855460240975,null,0,null,10.61618222018198,0,0,10.61618222018198,null,10.35,0,0,0,0,0,0.26618222018198068,null,10.35,0,0,10.35,null,2800256.67,null,72017.25,0,0,72017.25,null,11377,36288,null,0.99331152221508423,null,0,null,112978,17346,44898,3741,178963,null,94640,9872,25618,5460,135590]
[null,392,"North Tyneside",null,5.2717701223630904,5.213093281928983,7.9590608808144454,5.2130935259768307,null,4.8799999997041903,8.695353181486476E-2,0.17218755027486393,0,0,0,5.8676725147874212E-2,7.3952315421297404E-2,null,4.8799999997041912,4.8799999991543297,4.8799999377049135,4.880000003258222,null,14057214.51,null,200000,104937.76,4273.67,90788.57,null,0,593621.97,null,0.95303352782727924,null,5.0424979187236159E-2,null,7.3875920585275745,7.5062641763989442,7.5525062316444131,7.3516538814438332,null,7.3000000292705201,0,0,0,0,0,0,8.7592029257054949E-2,null,7.3000000292705192,7.2999999835790641,7.3000024679779854,7.3000000190124261,null,1995181.5499999998,null,23940,12561.05,511.56,10867.39,null,0,85015.64,null,0.97978674516280839,null,0,null,6.9827924717396259,7.0329905724840049,6.9801957347034032,6.9577048484953048,null,6.9000000145932594,0,0,0,0,0,8.2792457146366932E-2,null,6.9000000145932594,6.9000000248203577,6.900000367507892,6.8999999975103963,null,4255389.33,null,51060.020000000004,26790.62,1091.07,23178.33,null,115331.05,181324.18,null,0.95090168242716355,null,0,null,9.1949612752318224,9.3131687183193659,9.1888457482221657,9.1358844865858728,null,9,0,0,0,0,0,0.19496127523182324,null,9,9,9,9,null,3462226.02,null,75000,39351.660000000003,1602.63,34045.71,null,255922.81,0,null,0.96103591038453329,null,0,null,124186.73,20172.849999999999,43025.33,3791,191175.90999999997,null,119210,15395.01,32834.99,15470,182910]
[null,815,"North Yorkshire",null,5.3809328128772531,5.3067974436542,8.8095938387916863,5.3087664858313479,null,5.13,7.9991339300039835E-2,0,0,0,0,7.0941535406233658E-2,9.9999938170980116E-2,null,5.129999999999999,5.13,5.13,5.13,null,34164752.309999995,null,646945,67230,13410,566305,null,0,1035112,null,0.97074794834936373,null,1.5353449572295575E-2,null,7.2300002212393837,7.22993965461899,7.2300031456432832,7.2300021606278539,null,7.0100000000000007,8.0001950929104851E-2,0,0,0,0,0,0.13999827031027817,null,7.0100000000000007,7.0100000000000007,7.01,7.01,null,3525141.8800000004,null,69607,2180,1335,66092,null,0,109384,null,0.97046982835427964,null,1.1283769945736197E-2,null,7.2299996563325379,7.2225722903416161,7.3190739695087519,7.2298528927227252,null,7.01,7.9999556096195384E-2,0,0,0,0,0.14000010023634299,null,7.01,7.01,7.01,7.0100000000000007,null,9902595.2899999991,null,195538,2135,496,192907,null,0,307274,null,0.9704697525278575,null,1.1283435980952827E-2,null,9.8099999043415771,0,0,9.8099999043415771,null,9.5500000000000007,5.999966519551983E-2,0,0,0,0,0.20000023914605725,null,9.5500000000000007,0,0,9.5500000000000007,null,8036929.21,null,167262,0,0,167262,null,0,250893,null,0.97032640003378612,null,"No Base Rate",null,283662,124293,31073,9322,448350,null,205660,16380,46410,22750,291200]
[null,929,"Northumberland",null,5.3384999582918438,5.2372368513384044,0,5.4008415157582865,null,5.2000000011982523,0.10125828502136056,0,0,0,0,0,3.7241672072231065E-2,null,5.2000000011982523,5.2000000031446056,0,5.2,null,17696639.100000001,null,124320,47366,0,76954,null,0,482894,null,0.9759597729966808,null,1.9100802027431297E-2,null,7.4104696127596545,7.4104732785350844,0,7.4104690160055071,null,7.2699999955339765,0,0,0,0,0,0,0.14046961722567858,null,7.2699999955339765,7.2699999099289112,0,7.2700000094696842,null,2767337.93,null,53470,7486,0,45984,null,0,75145,null,0.98806261503462056,null,0,null,7.2699999982109036,7.270000023428647,0,7.2699999941056888,null,7.2699999982109036,0,0,0,0,0,0,null,7.2699999982109036,7.270000023428647,0,7.2699999941056888,null,4876203.9000000004,null,0,0,0,0,null,0,133591,null,0.9693333330947872,null,0,null,9.9390501514305871,0,0,9.9390501514305871,null,9.8700000104395453,0,0,0,0,0,6.9050140991042022E-2,null,9.8700000104395453,0,0,9.8700000104395453,null,3970862.28,null,27780,0,0,27780,null,0,108440,null,0.9744166815128027,null,0,null,261413,50009.49,88119.51,8288,407830,null,180180,19000.8,33779.199999999997,21840,254800]
[null,892,"Nottingham",null,5.5039065847170097,5.5408450373302296,10.033265479219677,5.2962243385265078,null,5.2,0.15054082538085162,0,9.6800648412500212E-4,0,0,6.3840660312020445E-2,8.8557092540012164E-2,null,5.2,5.2,5.2,5.1999999999999993,null,17118655.420000002,null,279941,136500.84,14169.8,129270.36,null,0,716351,null,0.95106047629457868,null,2.8311423306046656E-2,null,8.0183304555129187,0,0,8.0160290668232719,null,8,0,0,0,0,0,0,1.8330455512919321E-2,null,8,0,0,8,null,4364321.4400000004,null,10000,418.5,837,8744.5,null,0,45000,null,0.95913043726231095,null,0,null,8.0191489960210109,0,0,8.0167448395705723,null,8,0,0,0,0,0,1.9148996021010965E-2,null,8,0,0,8,null,4177764.72,null,10000,418.5,837,8744.5,null,0,0,null,0.95922834880634111,null,0,null,10.892478937247644,0,0,10.888401206839312,null,10.860000001299158,0,0,0,0,0,3.2478935948485291E-2,null,10.860000001299158,0,0,10.860000001299158,null,3343705.6,null,10000,418.5,837,8744.5,null,0,0,null,0.95297278541099251,null,0,null,452500,0,252235,15136,719871,null,166530,50050,0,20020,236600]
[null,891,"Nottinghamshire",null,5.4536771253844654,5.4372787426893847,0,5.4658090361315077,null,5.3399999999589225,2.4491896008533118E-2,8.918522941700964E-2,0,0,0,0,0,null,5.3399999999589225,5.3399999992272056,0,5.3400000005002646,null,53107101.030000001,null,0,0,0,0,null,0,1615362,null,0.99701592785822035,null,2.0844124580904469E-2,null,7.5800000037574904,7.5800000087965032,0,7.5800000033466794,null,7.5800000037574895,0,0,0,0,0,0,0,null,7.5800000037574904,7.5800000087965032,0,7.5800000033466794,null,6858833.2700000005,null,0,0,0,0,null,0,0,null,0.99344692054488726,null,0,null,7.5799999994233289,7.5799999910748639,0,7.5800000001039471,null,7.579999999423328,0,0,0,0,0,0,null,7.5799999994233289,7.5799999910748639,0,7.5800000001039471,null,15773283.700000001,null,0,0,0,0,null,0,0,null,0.99344691997684509,null,0,null,10.200000003175413,10.200000021062499,0,10.200000001717147,null,10.200000003175413,0,0,0,0,0,0,null,10.200000003175413,10.200000021062499,0,10.200000001717147,null,12848723.050000001,null,0,0,0,0,null,0,0,null,0.98265895984348861,null,0,null,828589,324178.62,140965.38,27908,1321641,null,348530,79277.210000000006,34472.79,40950,503230]
[null,353,"Oldham",null,5.45224998704452,5.4522499634493613,0,5.4522500083116467,null,5.29,0.10788465775435582,0,0,0,0,0,5.4365329290163661E-2,null,5.29,5.29,0,5.2899999999999991,null,16978436.23,null,171000,80370,0,90630,null,0,622000,null,0.96499999770699463,null,1.9986469625536296E-2,null,7.9709880129840762,0,0,7.9709880129840762,null,7.8900000000000006,0,0,0,0,0,0,8.0988012984075708E-2,null,7.8900000000000006,0,0,7.8900000000000006,null,4953704.9400000004,null,50848,0,0,50848,null,0,154780,null,0.98650841744852424,null,0,null,7.6752265906990358,0,0,7.6752265906990358,null,7.6,0,0,0,0,0,7.5226590699036588E-2,null,7.6,0,0,7.6,null,3996368.8,null,39557,0,0,39557,null,0,124822,null,0.94990428102710833,null,0,null,10.703519920312262,0,0,10.703519920312262,null,10.65,0,0,0,0,0,5.3519920312261722E-2,null,10.65,0,0,10.65,null,3282361.95,null,16495,0,0,16495,null,0,102047,null,0.97040071807001471,null,0,null,264956,85020,66141,9070,425187,null,171080,18938,14732,10920,215670]
[null,931,"Oxfordshire",null,5.6663152014173379,5.7526710197927793,6.0135783465518626,5.5179844911231104,null,5.3,5.1642362975922583E-2,7.0000018820794457E-2,0,0,0,0.14091577523718657,0.10375704438343432,null,5.3,5.2999999956859023,5.3000000005096268,5.3000000005843813,null,44628630.490000002,null,832446.99,120057.93,89467.23,622921.82999999996,null,599461,2219222,null,0.96553738938577172,null,2.2436445126874101E-2,null,8.1310807800487197,8.7156121525018104,8.0562657923602519,8.1293891717526794,null,7.8300000261562364,0.1505400608917184,0,0,0,0,0,0.15054069300076553,null,7.8300000261562364,7.8300003173246724,7.8300000367264193,7.8300000118084592,null,3661324.9499999997,null,69065.3,9960.7999999999993,7422.79,51681.71,null,0,0,null,0.99767862331886126,null,1.8863392608733077E-2,null,7.8973934421684646,7.9820571671210834,7.8865567951161806,7.8971485750419745,null,7.83,4.5588652313736669E-2,0,0,0,0,2.1804789854728071E-2,null,7.83,7.83,7.83,7.83,null,11931138.779999999,null,33033.21,4764.1499999999996,3550.24,24718.82,null,0,0,null,0.96900533032741898,null,5.7886025192978264E-3,null,10.813407890575297,10.97526143041946,10.792691664245075,10.812939596476253,null,10.729999996692811,4.1722103402313547E-2,0,0,0,0,4.1685790480171694E-2,null,10.729999996692811,10.730000171686763,10.729999983489142,10.729999993590773,null,9771191.7699999996,null,37813.81,5453.62,4064.04,28296.15,null,0,0,null,0.97770414923827276,null,"No Base Rate",null,365061.06,47463.01,156728.54,12252.04,581504.65,null,276640,21363.89,70546.11,33670,402220]
[null,874,"Peterborough",null,5.8552029814256876,5.7551515272481932,22.430401230064891,5.7551514840811677,null,5.4099999985708003,0.33550000064314006,0,0,0,0,0.10005149765160991,9.6514845601372388E-3,null,5.4099999985708003,5.4099999408606845,5.4099999940449992,5.4100000003332331,null,16360344.809999999,null,27012.27,783.36,162.07,26066.84,null,160000,364294.05,null,0.96871991265872526,null,5.8393525487606103E-2,null,8.1439596105301124,8.3594143508135677,8.2287930423633,8.1369573433655162,null,8.02,7.7620538905865455E-2,0,0,0,0,0,4.6339071624246338E-2,null,8.0200000000000014,8.0200001396231233,8.0200006748435193,8.019999991608147,null,3199795.0000000005,null,18311,3000,311,15000,null,20000,57019,null,0.96180434053020425,null,9.5855984524008571E-3,null,8.1269202910910359,8.2945035835275149,8.1931899453437183,8.121472071425142,null,8.0199999846463914,7.0875013377815752E-2,0,0,0,0,3.6045293066828014E-2,null,8.0199999846463914,8.0199997420701852,8.0199990814070237,8.0199999975522349,null,4110357.79,null,18311.87,3000,311.87,15000,null,100000,150000,null,0.97696730373634277,null,8.759870025815927E-3,null,11.073936978598049,0,0,11.073936978598049,null,10.959999986850406,9.7499999178150359E-2,0,0,0,0,1.6436992569493138E-2,null,10.959999986850406,0,0,10.959999986850406,null,3363601.93,null,5000,0,0,5000,null,70000,100000,null,0.97197376393559354,null,"No Base Rate",null,437319,202478.11,47506,12374,699677.11,null,171080,31870,20000,14560,237510]
[null,879,"Plymouth",null,5.6588404444275442,5.4591910379979192,6.5492566266395373,5.4206262410938537,null,5.0899999978756263,0.14112688269992643,5.9999998583750651E-2,0,0,0,0.18933518918648301,0.17837837608175783,null,5.0899999978756263,5.0900000036077175,5.0899999952729447,5.0899999983028099,null,15478805.52,null,503805,24989.75,24634.25,454181,null,0,525991.16,null,0.96805402747629388,null,3.8012107038271167E-2,null,7.8893691884434212,7.8652283057933641,7.7465063660064413,7.9306030004323445,null,7.7,0,0,0,0,0,0,0.18936918844342127,null,7.7,7.6999998860493655,7.6999999518899171,7.7000000220922171,null,2357990.25,null,57991,2900,2900,52191,null,0,57030.8,null,0.97640707777765112,null,0,null,7.890495581197432,7.8237102472376616,7.8421462575418994,7.9089960394510017,null,7.5600000036385229,0.14112690108205994,0,0,0,0,0.18936867647684866,null,7.5600000036385229,7.5600001269676014,7.5599999785576522,7.5600000009846369,null,4233107.6900000004,null,104091,5205,5205,93681,null,0,102367.76,null,0.97654648282146439,null,1.8325487013537325E-2,null,10.814418353652036,10.748375181214126,10.770644677042531,10.831600569686898,null,10.489999992459506,0.14112687102582228,0,0,0,0,0.18329149016670923,null,10.489999992459506,10.489999862170761,10.489999941808353,10.490000016518859,null,2960729.3899999997,null,51046,2552,2552,45942,null,0,51865.39,null,0.98312894124109429,null,"No Base Rate",null,167630,37186,55780,4648,265244,null,149240,13832,20748,12740,196560]
[null,851,"Portsmouth",null,5.7700000000000005,5.7700000000000005,0,5.7700000000000005,null,5.5,0.2,0.03,0,0,0,0,0.04,null,5.5,5.5,0,5.5,null,13658601.000000002,null,95348,13348.72,0,81999.28,null,143000,715100,null,0.95105885328722173,null,4.0139616055846421E-2,null,8.5299999905292907,0,0,8.5299999905292907,null,8.4900000031569043,0,0,0,0,0,0,3.9999987372386123E-2,null,8.4900000031569043,0,0,8.4900000031569043,null,2689344.19,null,12670.64,0,0,12670.64,null,0,142200,null,0.94988864037074505,null,0,null,8.5300000066853272,0,0,8.5300000066853272,null,8.489999997771557,0,0,0,0,0,4.0000008913770188E-2,null,8.489999997771557,0,0,8.489999997771557,null,3809835.71,null,17949.759999999998,0,0,17949.759999999998,null,0,201500,null,0.94988864216985824,null,0,null,11.630000013195172,0,0,11.630000013195172,null,11.589999995601609,0,0,0,0,0,4.0000017593561463E-2,null,11.589999995601609,0,0,11.589999995601609,null,2635054.88,null,9094.24,0,0,9094.24,null,0,139100,null,0.95016339977084741,null,0,null,185463,46949,66509,5674,304595,null,134680,19957,28273,11830,194740]
[null,870,"Reading",null,6.8646331216299723,6.4500906207010615,9.9555487714595206,6.3618215082546161,null,6.2,0.11817600587800525,0,0,0,0,0.45878918237876615,8.7667933373200627E-2,null,6.1999999999999993,6.2,6.2,6.1999999999999993,null,13064150.970000001,null,169000,70000,29000,70000,null,0,575851,null,0.95609604220230715,null,1.8704133244794426E-2,null,10.092690671031097,0,10.494768915596831,9.9856549718233047,null,9.4,0.47446917621385709,0,0,0,0,0,0.21822149481723949,null,9.4,0,9.4,9.4,null,1719490.69,null,38000,0,13000,25000,null,0,163275,null,1.0383426616287135,null,4.8050094414875844E-2,null,9.6875399613321367,0,9.8329317139746362,9.6460602520857677,null,9.4,0.1581932304005664,0,0,0,0,0.12934673093156876,null,9.4,0,9.4,9.4,null,2808044.24,null,38000,0,13000,25000,null,0,131621,null,0.99666048984898514,null,1.6550536967323563E-2,null,13.072876314834966,0,0,13.072876314834966,null,13,4.1059376769817177E-2,0,0,0,0,3.1816938065148362E-2,null,13,0,0,13,null,2049389.44,null,5000,0,0,5000,null,0,76553,null,0.98737736516880403,null,"No Base Rate",null,159703,57921,32580,4524,254728,null,71890,6224,11066,5460,94640]
[null,317,"Redbridge",null,5.8615938518822572,5.8975126322895628,0,5.8423074720621617,null,5.5199999986902188,0.14153846001942516,0,0,0,0,0,0.20005539317261251,null,5.5199999986902197,5.5199999974044651,0,5.5199999993805964,null,22477033.830000002,null,794245.57000000007,306654.09000000003,0,487591.48,null,238272.44,1231074.28,null,0.95049922307680434,null,2.4999999744183328E-2,null,8.6812389918808979,0,0,8.6812389918808979,null,8.3800000128547687,0.12761421651450577,0,0,0,0,0,0.17362476251162415,null,8.3800000128547687,0,0,8.3800000128547687,null,3044397.26,null,62130.55,0,0,62130.55,null,32359.66,97078.99,null,0.97031731765638307,null,1.5000000361319469E-2,null,8.6812388693354947,0,0,8.6812388693354947,null,8.3799999914528467,0.12761420484243982,0,0,0,0,0.17362467304020801,null,8.3799999914528467,0,0,8.3799999914528467,null,4777794.97,null,97505.96,0,0,97505.96,null,50784.39,152353.16,null,0.97031730645473602,null,1.4999999047677846E-2,null,11.767431192144523,0,0,11.767431192144523,null,11.52000000236829,9.8076338633033611E-2,0,0,0,0,0.14935485114320024,null,11.52000000236829,0,0,11.52000000236829,null,3924545.06,null,50451.54,0,0,50451.54,null,58406.25,107218.75,null,0.96997033867670446,null,"No Base Rate",null,149570.96,33095.839999999997,51939.72,5100.82,239707.34,null,114660,14521.05,22788.95,10920,162890]
[null,807,"Redcar and Cleveland",null,5.3275138468401906,5.291742575837783,0,5.4095905632754944,null,5.1300000021854517,8.8241256972774892E-2,0,0,0,0,0,0.10927258768196345,null,5.1300000021854526,5.1300000031379307,0,5.13,null,7163152.3100000005,null,150000,50000,0,100000,null,0,0,null,0.97040325079056289,null,1.6910152787188187E-2,null,7.7471787373129191,7.7473765697574404,0,7.7471567559301944,null,7.5,8.8267675898847417E-2,0,0,0,0,0,0.15891106141407191,null,7.5,7.5,0,7.5,null,1764424,null,36950,3700,0,33250,null,0,0,null,0.99578132870346003,null,1.16321247047195E-2,null,7.7471700723804249,0,0,7.7471700723804249,null,7.5,8.8270393206444198E-2,0,0,0,0,0.1588996791739811,null,7.5,0,0,7.5,null,1755000,null,36750,0,0,36750,null,0,0,null,0.99578021495892344,null,1.1632478632478632E-2,null,10.558253601647788,0,0,10.558253601647788,null,10.329999985555855,1.1952530758808763E-2,0,0,0,0,0.21630108533312534,null,10.329999985555855,0,0,10.329999985555855,null,1431992.25,null,29950,0,0,29950,null,0,0,null,0.9951228653767944,null,"No Base Rate",null,150777,42520,42520,5101,240918,null,108290,19565,19565,8190,155610]
[null,318,"Richmond upon Thames",null,6.6807987356388514,6.9371233506889993,10.875660818713451,6.5097263147015445,null,6.35,4.8473393984239929E-2,0,0,0,0,5.7852764713803365E-2,0.22447257694080844,null,6.35,6.35,6.35,6.35,null,14757887.119999999,null,513100,250000,50000,213100,null,0,378500,null,0.96826695481360348,null,7.5757748762093754E-3,null,9.344410001444599,11.297735247208932,10.34919298245614,9.1394814368909021,null,9.0399999598722331,0.15393091603666073,0,0,0,0,0,0.15047912553570567,null,9.0399999598722331,9.0400000000000009,9.0399999999999991,9.0399999543959968,null,916465.74,null,15000,8000,5000,2000,null,0,22620,null,0.96833264263674601,null,1.6742666234310078E-2,null,9.1800163579890715,9.0399999999999991,9.0399999999999991,9.1879133426273913,null,9.0399999999999991,2.0593002192773383E-2,0,0,0,0,0.11942335579629787,null,9.0399999999999991,9.0399999999999991,9.0399999999999991,9.0400000000000009,null,2708541.96,null,35700,0,0,35700,null,0,52780,null,0.95129703191596593,null,2.2728095377189577E-3,null,12.739314197578549,0,0,12.739314197578549,null,12.6,5.4140214862926014E-2,0,0,0,0,8.5173982715623875E-2,null,12.6,0,0,12.6,null,1916529.01,null,12900,0,0,12900,null,0,18500,null,0.97320964076230321,null,"No Base Rate",null,54431,7467,22390,1493,85781,null,53690,3869,11601,2730,71890]
[null,354,"Rochdale",null,5.3898339832058157,5.4783393039585233,9.1316963741629635,5.1888298890759383,null,4.950000001675404,0.15843058467547438,9.4868264151040743E-2,0,0,0,0.10728349415034345,7.9251638553553966E-2,null,4.950000001675404,4.9500000022822617,4.9500000569509162,4.9499999990100161,null,15848661.379999999,null,236515,70954,11826,153735,null,83413,834127,null,0.95000010463932405,null,4.8680434490531235E-2,null,7.744802046614752,9.0591358276783982,7.8264572387013347,7.6975409938309474,null,7.2999999812361125,0.28999999249444497,0,0,0,0,0,0.15480207288419343,null,7.2999999812361125,7.2999998812819653,7.2999997707076769,7.2999999919782939,null,4045003.9600000004,null,82500,24750,4125,53625,null,21425,176474,null,0.96828403928427687,null,3.8208167786317818E-2,null,7.4530424562034225,0,0,7.3994775965322246,null,7.3,0,0,0,0,0,0.15304245620342294,null,7.3,0,0,7.3,null,3935182.53,null,82500,24750,4125,53625,null,99362,176472,null,0.94992101186501876,null,0,null,10.376866257966737,0,0,10.376866257966737,null,10.160000012392358,0,0,0,0,0,0.21686624557437956,null,10.160000012392358,0,0,10.160000012392358,null,3279440.74,null,70000,0,0,70000,null,17474,177206,null,0.95000020665214457,null,0,null,307708,89426,89425,10568,497127,null,165620,29120,29120,17290,241150]
[null,372,"Rotherham",null,5.6872034111778689,5.3409378316939042,8.9793786330497269,5.3001647157885392,null,5.14,5.4680851029050105E-2,0,0,0,0,0.36596831893891901,0.12655424120989908,null,5.14,5.1399999987449778,5.1399999947691217,5.1400000025783887,null,17008732.960000001,null,387100,193550,38709.93,154840.07,null,0,836280.05,null,0.97280349035446978,null,1.0526315782848912E-2,null,7.7689380771358874,7.7689381247056462,7.7689380111423576,7.768938072972273,null,7.6699999917215074,0,0,0,0,0,0,9.8938085414379859E-2,null,7.6699999917215074,7.6700000454308439,7.6699999111583494,7.6699999878851246,null,3798638.29,null,49000,9799.98,4900.04,34299.980000000003,null,0,117483.66,null,0.98216663427760897,null,0,null,7.7543282096032922,7.7543282182438924,7.7543282822294204,7.7543281967593023,null,7.6700000056792463,0,0,0,0,0,8.4328203924046038E-2,null,7.6700000056792463,7.6700000180703656,7.6700000705597651,7.6699999928702063,null,4456753.29,null,49000,9799.98,4900.04,34299.980000000003,null,0,137837.73000000001,null,0.98031962194731881,null,0,null,10.474092818456066,0,10.47409367405341,10.474092809813676,null,10.460000018982138,0,0,0,0,0,1.4092799473930174E-2,null,10.460000018982136,0,10.460000862825177,10.460000010458478,null,3636892.7399999998,null,4900,0,49,4851,null,0,112481.22,null,0.97162271043191728,null,0,null,351573,197239,0,11834,560646,null,205660,59150,0,20930,285740]
[null,857,"Rutland",null,5.2017834727846921,0,0,5.2017834727846921,null,5.2,1.7834727846917074E-3,0,0,0,0,0,0,null,5.2,0,0,5.2,null,1604162.92,null,0,0,0,0,null,19484.25,66246.44,null,0.96251638345910262,null,3.4285794363081277E-4,null,6.6499999999999995,0,0,6.6499999999999995,null,6.6499999999999995,0,0,0,0,0,0,0,null,6.6499999999999995,0,0,6.6499999999999995,null,113184.33,null,0,0,0,0,null,1297.5,4411.51,null,0.96364368864382244,null,0,null,6.9800000304237564,0,0,6.9800000304237564,null,6.9800000304237564,0,0,0,0,0,0,null,6.9800000304237564,0,0,6.9800000304237564,null,458851.94,null,0,0,0,0,null,5011.42,17038.84,null,1.0109216537732044,null,0,null,9.4499999999999993,0,0,9.4499999999999993,null,9.4499999999999993,0,0,0,0,0,0,null,9.4499999999999993,0,0,9.4499999999999993,null,314787.06,null,0,0,0,0,null,0,0,null,1,null,0,null,1740.32,0,0,0,1740.32,null,17290,0,0,0,17290]
[null,355,"Salford",null,5.4418462200390447,5.6307339637666267,0,5.2934893916734556,null,4.83,0.18681614040790478,0.3198335554294951,0,0,0,0,0.10519652420164385,null,4.830000000000001,4.830000000000001,0,4.830000000000001,null,20292114.160000004,null,400000,300000,0,100000,null,220000,783152,null,0.96996548648147229,null,9.4937783949467003E-2,null,7.8500000000000005,0,0,7.8500000000000005,null,7.3500000000000005,0.5,0,0,0,0,0,0,null,7.3500000000000005,0,0,7.3500000000000005,null,4685696.4000000004,null,0,0,0,0,null,15000,150615,null,0.96984355530696043,null,6.3694267515923567E-2,null,7.5878552963489216,0,0,7.5878552963489216,null,7.3500000000000005,0,0,0,0,0,0.23785529634892119,null,7.3500000000000005,0,0,7.3500000000000005,null,4696973.4000000004,null,152000,0,0,152000,null,185000,150615,null,0.97011702332576055,null,0,null,10.290328987757755,0,0,10.290328987757755,null,10,0,0,0,0,0,0.29032898775775523,null,10,0,0,10,null,2215280,null,64316,0,0,64316,null,102632,73814,null,0.9696681974614938,null,0,null,419798,119234,119234,11923,670189,null,197470,26845,26845,13650,264810]
[null,333,"Sandwell",null,5.4484991688318933,5.188290450497302,0,5.6793776855522822,null,5.0600000000000005,9.8749920232800409E-2,0,0.17239061013533652,0,0,0,0.11735863846375587,null,5.0599999999999996,5.0599999999999996,0,5.0599999999999996,null,21804508.710000001,null,480000,0,0,480000,null,100000,773869.63,null,0.95513942149712205,null,5.0859760462816664E-2,null,8.4800000035991374,0,0,8.4800000035991374,null,8.4800000035991374,0,0,0,0,0,0,0,null,8.4800000035991374,0,0,8.4800000035991374,null,5654689.7400000002,null,0,0,0,0,null,0,187625.35,null,0.99764705924695729,null,0,null,8.4799999948616946,0,0,8.4799999948616946,null,8.4799999948616946,0,0,0,0,0,0,null,8.4799999948616946,0,0,8.4799999948616946,null,4620977.6500000004,null,0,0,0,0,null,0,243209.35,null,0.99764705821902289,null,0,null,11.609999994470341,0,0,11.609999994470341,null,11.609999994470341,0,0,0,0,0,0,null,11.609999994470341,0,0,11.609999994470341,null,3779256.78,null,0,0,0,0,null,0,198908.25,null,0.99999999952371588,null,0,null,383802,110910,110910,13311,618933,null,167440,30030,30030,18200,245700]
[null,343,"Sefton",null,5.5591453947728704,5.4972166276162753,10.418623919052388,5.2723365294488698,null,5.0899999987367703,0.20000011053260103,0,0,0,0,0.16914517812897109,0.10000010737452672,null,5.0899999987367703,5.0900000026317249,5.0899999763144868,5.0899999978946147,null,17286310.400000002,null,316649,63329,126660,126660,null,46020,207300,null,0.98803174692737061,null,3.7807203478531504E-2,null,7.4000001972439122,7.4000104605636743,7.3999919273373091,7.4000005105284474,null,7.3000000000000016,0,0,0,0,0,0,0.10000019724391085,null,7.3000000000000016,7.3,7.3000000000000007,7.3,null,2960801.16,null,40559,2677,4583,33299,null,0,81118,null,0.97368423647946223,null,0,null,7.4000004756689393,7.4000060814508979,7.3999988161150423,7.4000002534768878,null,7.3,0,0,0,0,0,0.10000047566893919,null,7.3,7.2999999999999989,7.3,7.3,null,4910978.6399999997,null,67274,4440,7602,55232,null,0,134548,null,0.97368427311433414,null,0,null,10.339998858047908,0,0,10.339998858047908,null,10,0,0,0,0,0,0.33999885804790736,null,10,0,0,10,null,4028190,null,136958,0,0,136958,null,0,0,null,0.99999988955975905,null,0,null,228894,127598,0,7655,364147,null,181090,59150,0,16380,256620]
[null,373,"Sheffield",null,5.4319049382974427,5.4514038742957815,10.669977862553441,5.2572167111552153,null,5.0600000015772393,0.19948206270384572,0,0,0,0,6.8916511199288238E-2,0.10350636281706821,null,5.0600000015772393,5.0600000011785626,5.0600000255776392,5.0600000010629209,null,32431736.670000002,null,630000,210000,210000,210000,null,0,1718014.85,null,0.96456626445756666,null,3.7928081180958029E-2,null,7.9655720133260601,8.0129665860927037,11.686124321991102,7.8677161999069627,null,7.5800000031587444,0.20333679244124275,0,0,0,0,0,0.18223521772607307,null,7.5800000031587444,7.579999988059261,7.5800001717219265,7.5800000050627903,null,6406558.1500000004,null,150000,50000,50000,50000,null,0,0,null,1.0019587438145987,null,2.6124629806099548E-2,null,7.9441088848050558,7.9827515306143848,10.977476241963188,7.8643234102128527,null,7.5799999992075531,0.21552500292314025,0,0,0,0,0.14858388267436248,null,7.5799999992075531,7.5799999895153141,7.5800002927394887,7.5799999964224831,null,7869822.2800000003,null,150000,50000,50000,50000,null,0,0,null,0.99925897922076168,null,2.7647272360005568E-2,null,10.636298700182383,10.627718606918146,13.492084337349398,10.577702688034318,null,10.31,0.17001426876858808,0,0,0,0,0.15628443141379586,null,10.31,10.309999999999999,10.31,10.31,null,6705731.4499999993,null,100000,25000,30000,45000,null,0,0,null,0.98030402766657931,null,"No Base Rate",null,899411,256021.5,256021.5,30722,1442176,null,316680,52325,52325,39130,460460]
[null,893,"Shropshire",null,5.3161193182858293,5.3312719231355805,0,5.3060130605934228,null,4.95,9.1529829571457333E-2,0,0,9.1529829571457333E-2,0,0,0.18305965914291467,null,4.95,4.95,0,4.95,null,16824219,null,600000,200000,0,400000,null,0,504362,null,0.97186824831550811,null,3.5662873860593469E-2,null,7.293699237404577,7.8842519685039374,0,7.1460617811920208,null,6.8999999999999995,0,0,0,0,0,0,0.39369923740457713,null,6.8999999999999995,6.9,0,6.8999999999999995,null,1752606.9,null,100000,50000,0,50000,null,0,14402,null,1.004641768237545,null,0,null,7.308099968168202,7.9944591183037348,0,7.150810955422533,null,6.8999999999999995,0,0,0,0,0,0.40809996816820249,null,6.8999999999999995,6.8999999999999995,0,6.9,null,5072286.5999999996,null,300000,150000,0,150000,null,0,41680,null,1.006625339968072,null,0,null,9.6322519235823592,0,0,9.3911259617911806,null,9.15,0,0,0,0,0,0.48225192358236019,null,9.15,0,0,9.15,null,3794697.15,null,200000,100000,0,100000,null,0,90304,null,0.97789359630277761,null,0,null,163936,81713,9079,5446,260174,null,114660,19110,19110,12740,165620]
[null,871,"Slough",null,7.0227073688599404,6.3890772019008013,11.619218090905367,6.426753675758845,null,6.2700000016500095,0.11907720696013503,0,0,0,0,0.60962999376881333,2.4000166480981407E-2,null,6.2700000016500095,6.2700000024347604,6.2699999935655573,6.2700000028257312,null,13997331.890000001,null,48000.05,0,0,48000.05,null,343,674995.78,null,0.95011092979282019,null,1.8637622159216109E-2,null,9.3375069729008704,9.1500016820857866,9.1499999414804272,9.4036010669946268,null,9.1499999941045012,0.17571598176498726,0,0,0,0,0,1.1790997031380677E-2,null,9.1499999941045012,9.1500016820857866,9.1499999414804272,9.1499999920264052,null,1581836.7100000002,null,2000,0,0,2000,null,198,83283.710000000006,null,0.9509851610597736,null,1.8842090218022564E-2,null,9.3369253210047223,0,0,9.3369253210047223,null,9.1500000198132714,0.17899999247095671,0,0,0,0,7.925308720494571E-3,null,9.1500000198132714,0,0,9.1500000198132714,null,2354230.06,null,2000,0,0,2000,null,0,123906.85,null,0.95080705916545027,null,1.9187479069059207E-2,null,12.705236156141609,0,0,12.705236156141609,null,12.500000000000002,0.19200000264723072,0,0,0,0,1.3236153494377614E-2,null,12.500000000000002,0,0,12.500000000000002,null,1917777.7,null,2000,0,0,2000,null,56,100935.67,null,0.95101847069157575,null,"No Base Rate",null,139300,78442,1,4705.46,222448.46,null,71890,15469,1,5460,92820]
[null,334,"Solihull",null,5.3886829755650814,5.5702172492888762,0,5.21716929165453,null,5.0199999993263553,9.7576906019433141E-2,0.12883139523741149,0,0,0,0,0.14227467498188148,null,5.0199999993263544,5.0199999998613354,0,5.0199999988209045,null,15576161.810000001,null,422402,246998,0,175404,null,57068,616247,null,0.97089852530591003,null,4.315491442625171E-2,null,7.9339989193644023,7.9339958040999354,0,7.9339993842124015,null,7.5000000000000009,0.25000003504006485,0,0,0,0,0,0.18399888432433645,null,7.5000000000000009,7.5,0,7.5,null,2211753.91,null,52511,6818,0,45693,null,0,24544,null,0.98927667323745672,null,3.2258068891579353E-2,null,7.6892318742219885,7.6892316458981593,0,7.6892319082916085,null,7.5000000161475775,0,0,0,0,0,0.18923185807441095,null,7.5000000161475775,7.5000000621817762,0,7.5000000092785299,null,4644659.26,null,117189,15216,0,101973,null,61929,142912,null,0.97122596176074039,null,0,null,10.593397501800149,0,0,10.560497141700314,null,10.340000007011552,0,0,0,0,0,0.25339749478859647,null,10.340000007011552,0,0,10.340000007011552,null,3834243.75,null,93964,12200,0,81764,null,0,117401,null,0.97098052262146184,null,0,null,234517,132195,10,7810,374532,null,116480,14560,31850,10755,173645]
[null,933,"Somerset",null,5.2987457744888546,5.2987456318495347,0,5.2987457852251483,null,5.229999999817041,6.8745774671813753E-2,0,0,0,0,0,0,null,5.229999999817041,5.23,0,5.2299999998032698,null,28961353.190000001,null,0,0,0,0,null,0,942647,null,0.96869209771277054,null,1.2973971124033656E-2,null,7.2339211970224957,7.2339213367167003,0,7.2339211865078914,null,7.16,7.392119702249686E-2,0,0,0,0,0,0,null,7.16,7.16,0,7.16,null,4805602.3599999994,null,0,0,0,0,null,0,113552,null,0.96710176430782047,null,1.0218689837666885E-2,null,7.2573187024990693,7.2573191489361708,0,7.2573186688961639,null,7.16,9.731870249906914E-2,0,0,0,0,0,null,7.16,7.16,0,7.16,null,8283685,null,0,0,0,0,null,0,256857,null,0.97022977306137281,null,1.3409732504314204E-2,null,9.9118151805200636,9.9119124423963143,0,9.9118078596940027,null,9.7799999999999994,0.13181518052006311,0,0,0,0,0,null,9.7800000000000011,9.7800000000000011,0,9.7800000000000011,null,3932988.4400000004,null,0,0,0,0,null,0,120944,null,0.97557236028740779,null,"No Base Rate",null,157854,27770,62700,5427,253751,null,210210,21180,47980,19110,298480]
[null,803,"South Gloucestershire",null,5.5450182707793312,0,0,5.5450182707793312,null,5.2199999990456387,4.7317892169983146E-2,0,0,0,0,0,0.27770037956370858,null,5.2199999990456387,0,0,5.2199999990456387,null,18765309.690000001,null,989333.41999999993,0,0,989333.41999999993,null,0,1008214.92,null,0.97968520685147187,null,8.9832991186835024E-3,null,8.0296422556601055,0,0,8.0296422556601055,null,7.780000015465121,3.9074261278412223E-2,0,0,0,0,0,0.21056797891657203,null,7.780000015465121,0,0,7.780000015465121,null,1820138.81,null,49016.41,0,0,49016.41,null,0,37145.69,null,1.0062208340426197,null,4.9973001784407861E-3,null,8.0296468815584134,0,0,8.0296468815584134,null,7.7799999999999994,3.9080113544637571E-2,0,0,0,0,0.21056676801377602,null,7.7799999999999994,0,0,7.7799999999999994,null,5812078.6299999999,null,156518.49,0,0,156518.49,null,0,118613.84,null,1.0062214137291245,null,4.9980449077303693E-3,null,10.440859383495011,0,0,10.440859383495011,null,10.270000011006138,4.3484576458998891E-3,0,0,0,0,0.16651091484297395,null,10.270000011006138,0,0,10.270000011006138,null,4574202.92,null,74131.679999999993,0,0,74131.679999999993,null,0,240746.55,null,0.96495927758733924,null,"No Base Rate",null,140719,18096.18,57784.82,4555,221155,null,132860,9548.7800000000007,30491.22,15470,188370]
[null,393,"South Tyneside",null,5.5307456388220144,5.2154434577427731,8.1295934691366156,5.1912259597579924,null,4.54,0.25242381164590744,0.19774705043207219,0.17715614100167054,0,0,0.33416569364327342,2.9252942099091541E-2,null,4.5400000000000009,4.54,4.54,4.54,null,8839116.2799999993,null,47000,17000,0,30000,null,0,439239,null,0.95001472899118189,null,0.12140261351870564,null,7.5600000000000005,7.56,7.56,7.56,null,7.5600000000000005,0,0,0,0,0,0,0,null,7.5600000000000005,7.56,7.56,7.56,null,2109436.56,null,0,0,0,0,null,0,65000,null,0.97047496790757393,null,0,null,7.5600000000000005,7.56,7.56,7.56,null,7.5600000000000005,0,0,0,0,0,0,null,7.5600000000000005,7.56,7.56,7.56,null,2109436.56,null,0,0,0,0,null,0,65418,null,0.97047496790757393,null,0,null,10.31,10.31,10.309999999999999,10.31,null,10.31,0,0,0,0,0,0,null,10.31,10.31,10.309999999999999,10.31,null,1550036.33,null,0,0,0,0,null,0,47943,null,0.96989651928504228,null,0,null,155130,41000,41459,4125,241714,null,112840,19000,20130,9100,161070]
[null,852,"Southampton",null,6.2524797722387788,6.0878563617839552,6.2858744743156896,6.1761959708975906,null,5.82,4.8578079707020806E-2,0.17884049189400197,7.7180478975827027E-2,0,0,8.8687229662888931E-2,3.9193491999040542E-2,null,5.8199999999999994,5.82,5.8199999999999994,5.82,null,15852851.999999998,null,100000,8660,88053,3287,null,280342,742900,null,0.9714471104341571,null,4.9733712862095186E-2,null,8.8231470796457483,8.8231508632239795,8.8231456017713796,8.8231767022873964,null,8.7899999953594072,0,0,0,0,0,0,3.3147084286339626E-2,null,8.7899999953594072,8.7900000000000009,8.7900000056466094,8.7899997075584047,null,2651816.9500000002,null,10000,866,8805,329,null,17000,124200,null,0.96516273075353542,null,0,null,8.8119101246686089,8.8119124010019991,8.8119091436149954,8.8119304092787623,null,8.7899999999999991,0,0,0,0,0,2.1910124668609365E-2,null,8.7899999999999991,8.7900000000000009,8.7899999999999991,8.7899999999999991,null,4011843.9,null,10000,866,8805,329,null,17000,188000,null,0.9618649278918745,null,0,null,11.966605900871221,11.966694915254237,11.966596009975062,11.966636971046769,null,11.93,0,0,0,0,0,3.660590087122044E-2,null,11.93,11.93,11.93,11.93,null,3259037.4,null,10000,866,8805,329,null,17000,152800,null,0.95847298265755321,null,0,null,294150,86437,86437,8644,475668,null,175630,26390,26390,14560,242970]
[null,882,"Southend-on-Sea",null,5.4765533418706598,5.4765533526719334,0,5.4765533391703416,null,5.3000000000000007,9.8000003888458295E-2,0,0,0,0,0,7.8553337982201238E-2,null,5.3000000000000007,5.3000000108012735,0,5.2999999972996825,null,9995118.1799999997,null,145452,29090.400000000001,0,116361.60000000001,null,0,311266,null,0.97970542788383896,null,1.8154872882153356E-2,null,7.9300022919135476,7.9300022919135476,0,7.9300022919135476,null,7.8199999714106418,0,0,0,0,0,0,0.11000232050290586,null,7.8199999714106418,7.8199999714106418,0,7.8199999714106418,null,1641170.1,null,23086,4617.2,0,18468.8,null,0,11726,null,0.99249090011433638,null,0,null,7.5899990575483249,7.5899990923251393,0,7.5899990488541205,null,7.479999993044637,0,0,0,0,0,0.1099990645036879,null,7.479999993044637,7.4800000278214513,0,7.4799999843504326,null,2150858.29,null,31630,6326,0,25304,null,0,114875,null,0.94993730382331976,null,0,null,10.350000087118181,10.35000020327576,0,10.350000058078788,null,10.199999999999999,0,0,0,0,0,0.15000008711818277,null,10.199999999999999,10.200000116157575,0,10.199999970960604,null,1756234.98,null,25827,5165.3999999999996,0,20661.599999999999,null,0,93752,null,0.95041323114032872,null,0,null,218115,111057.3,12339.7,7404,348916,null,115570,22932,2548,7280,148330]
[null,210,"Southwark",null,7.6004313955480995,7.3432880515275718,13.453823468288178,6.8319426709889264,null,6.2100000000000009,0.51456999702326778,0.2047065719079505,0,0,0,0.52923672542430855,0.14191810119257328,null,6.2100000000000009,6.2100000000000009,6.21,6.2099999999999991,null,21022021.099999998,null,400000,133000,135000,132000,null,676077,810509.98,null,0.96198205004917381,null,0.10380254876190639,null,9.9941557110996939,10.040275583536259,10.019736651422461,9.981725331647695,null,9.02,0.67273532320283658,0,0,0,0,0,0.30142038789685782,null,9.02,9.02,9.02,9.02,null,3263921.9999999995,null,101500,5075,25375,71050,null,217964,110826.42,null,0.97004872051782032,null,6.940613776922365E-2,null,9.7116403605230168,9.7116504201680662,9.7116370393845983,9.7116408281141737,null,9.02,0.44794639212880483,0,0,0,0,0.24369396839421281,null,9.02,9.02,9.02,9.02,null,3943456.48,null,101500,5075,25375,71050,null,387089,137073.60000000001,null,0.97001023941231013,null,4.7311885130782522E-2,null,13.016907549681621,0,13.016902441958379,13.016908117211484,null,12.379999999999999,0.57676030923701227,0,0,0,0,6.0147240444608403E-2,null,12.379999999999999,0,12.38,12.38,null,3231260.54,null,15000,0,1500,13500,null,377639.45,112079.4,null,0.9700382022507521,null,"No Base Rate",null,324809,92625,92625,11117,521176,null,127400,11830,11830,7280,158340]
[null,342,"St Helens",null,5.2588587605165102,5.3970480365056011,7.6154207420900484,5.0942491248764412,null,4.92,2.4340530006540132E-2,0.12130074402325297,0,0,0,5.3434612366819269E-2,0.13978287411989745,null,4.92,4.92,4.92,4.92,null,10817149.970000001,null,295376.03000000003,101792,7060,186524.03,null,150000,584273,null,0.9499991980643443,null,2.8750806887265688E-2,null,7.71401362915904,7.7140419460693392,7.7137755666113872,7.7140137438339851,null,7.58,0,0,0,0,0,0,0.13401362915904019,null,7.58,7.58,7.58,7.58,null,2348109.66,null,41514.339999999997,1879,242,39393.339999999997,null,0,125773,null,0.95000167846786221,null,0,null,7.7139931384146605,7.7139621694847227,7.7140847260007774,7.7139940514788758,null,7.58,0,0,0,0,0,0.13399313841466046,null,7.58,7.580000000000001,7.58,7.58,null,3338406.34,null,59013.66,2670,345,55998.66,null,0,178806,null,0.94999915497717502,null,0,null,10.52593072903632,10.549631305513659,10.686896103896103,10.523809881555604,null,10.299999999999999,0,0,0,0,0,0.22593072903631911,null,10.3,10.299999999999999,10.3,10.3,null,2716295.4000000004,null,59582,2979.1,595.82000000000005,56007.08,null,0,146098,null,0.94999374810797099,null,0,null,176242,88232,9804,5884,280162,null,106470,15925,15925,9100,147420]
[null,860,"Staffordshire",null,5.3692649172328473,0,38.693917120076648,5.2572442185816213,null,5.0800000002751471,0.10230398739527626,0,0,0,0,2.1845827089566651E-2,0.16511510247285768,null,5.0800000002751471,0,5.08,5.0800000002760717,null,45394095.620000005,null,1440245,0,0,1440245,null,203710,1871000,null,0.98185562007140237,null,1.9741023999880116E-2,null,7.5747531283155913,0,0,7.5747531283155913,null,7.5600000000000005,0,0,0,0,0,0,1.4753128315591047E-2,null,7.5600000000000005,0,0,7.5600000000000005,null,6605270.2800000003,null,12890,0,0,12890,null,87370,0,null,1.0019258016204717,null,0,null,7.5747491715583664,0,0,7.5747491715583664,null,7.5599999998188068,0,0,0,0,0,1.4749171739559579E-2,null,7.5599999998188068,0,0,7.5599999998188068,null,16689316.82,null,32560,0,0,32560,null,220760,0,null,1.0019255881857216,null,0,null,9.8723022280395618,0,0,9.8723022280395618,null,9.48,0,0,0,0,0,0.39230222803956222,null,9.48,0,0,9.48,null,12718206.84,null,526306,0,0,526306,null,184940,350000,null,0.96251483680673666,null,0,null,613591,102212,258198,21625,995626,null,362180,34324,86706,42770,525980]
[null,356,"Stockport",null,5.4999845284264381,5.2937757388682307,0,5.2800812365966561,null,5,0.1660386583051407,0.19502811256725236,0,0,0,4.4913259961082135E-2,9.4004497592962616E-2,null,5,5,0,5,null,20702762.75,null,360000,50000,20000,290000,null,0,1418000,null,0.96768430080609003,null,6.7349799266469029E-2,null,7.648371150168674,9.1904908315565041,7.3796967895362666,7.6483225384460276,null,7.2,0.31,0,0,0,0,0,0.13837115016867443,null,7.2,7.2,7.2,7.1999999999999993,null,2713715.9699999997,null,50000,0,0,50000,null,0,0,null,1.0130292914130694,null,4.1278295605858863E-2,null,7.2596616309904469,7.2299367295305474,7.2203817916384567,7.2945781512213319,null,7.1999999999999993,3.0999893378336082E-2,0,0,0,0,2.8661737612110386E-2,null,7.1999999999999993,7.1999999999999993,7.2,7.2,null,6307189.04,null,25000,0,0,25000,null,163000,0,null,0.98629618016177567,null,4.2870825384361717E-3,null,9.7685701484634322,0,0,9.7685701484634322,null,9.65,6.1999719410671894E-2,0,0,0,0,5.6570429052762106E-2,null,9.65,0,0,9.65,null,4291994.8999999994,null,25000,0,0,25000,null,0,0,null,0.95117528222623493,null,"No Base Rate",null,370000,1000,1000,1000,373000,null,207000,1000,1000,1000,210000]
[null,808,"Stockton-on-Tees",null,5.3204143850082248,5.3457948652650789,0,5.2718085588114336,null,4.9700000011297405,0.14473786971735228,0.14641055881262202,0,9.0552816128609027E-3,0,0,5.02106737356489E-2,null,4.9700000011297405,4.9700000020381108,0,4.9699999993901312,null,12595418.43,null,120000,75644,0,44356,null,291098.57,402263,null,0.99492075186497708,null,5.6962449003768421E-2,null,7.385008892710478,7.380000016159121,0,7.3861922266280988,null,7.3800000092640436,0,0,0,0,0,0,5.0088834464344463E-3,null,7.3800000092640436,7.380000016159121,0,7.3800000076350996,null,2389884.96,null,1622.04,0,0,1622.04,null,0,125869,null,0.95167640369980389,null,0,null,7.3719948004614384,7.2500000273396417,0,7.4008157459344526,null,7.25,0,0,0,0,0,0.12199480046143815,null,7.25,7.2500000273396417,0,7.2499999935410813,null,3469154,null,58375,0,0,58375,null,0,185659,null,0.94999932995637093,null,0,null,10.024897585848111,0,0,10.024897585848111,null,9.9199999832163837,0,0,0,0,0,0.104897602631727,null,9.9199999832163837,0,0,9.9199999832163837,null,2837052.44,null,30000,0,0,30000,null,10000.56,151424,null,0.95173750345133423,null,0,null,171320,47774,47774,5733,272601,null,162890,20930,20930,14560,219310]
[null,861,"Stoke-on-Trent",null,5.4500306638814386,5.4185075435015131,9.4468644338118022,5.4147196422789712,null,5.1500000004873234,0.2250000023553988,0,0,0,0,3.279592347973926E-2,4.2234737558977518E-2,null,5.1500000004873234,5.1500000025044406,5.15,5.1499999966871792,null,16645385.079999998,null,130000,86860.78,1175.3599999999999,41963.86,null,152000,564455.9,null,0.96754281328956482,null,4.1860465532353695E-2,null,7.8094431819375183,7.7500000619199794,7.75,7.8153221720831043,null,7.750000009907196,0,0,0,0,0,0,5.9443172030323156E-2,null,7.7500000099071951,7.7500000619199794,7.75,7.7500000054435141,null,3911298.6799999997,null,30000,0,0,30000,null,20000,76171.320000000007,null,0.98113399541138357,null,0,null,7.8063676215035649,7.7499999412837219,7.7500000000000009,7.8119424457223126,null,7.7499999953026979,0,0,0,0,0,5.6367626200867653E-2,null,7.7499999953026979,7.7499999412837219,7.7500000000000009,7.75,null,4124708.02,null,30000,0,0,30000,null,20000,83055.899999999994,null,0.98049325487135131,null,0,null,10.662758592989297,10.599999873214866,10.599974896447847,10.666061695558316,null,10.599999968620688,0,0,0,0,0,6.2758624368609017E-2,null,10.599999968620688,10.599999873214866,10.599974896447847,10.59999998678766,null,3378021.77,null,20000,0,0,20000,null,15000,53985.22,null,0.97985613552294193,null,0,null,510702,217679,72560,17415,818356,null,164710,42998,14332,13650,235690]
[null,935,"Suffolk",null,5.2625190726918358,5.2494031432736845,9.3331202348518456,5.2315663483280659,null,5.2099999999014264,2.5331096528465744E-2,0,0,0,0,2.7187976261942772E-2,0,null,5.2099999999014264,5.2099999988155838,5.21,5.2100000001779776,null,37370924.93,null,0,0,0,0,null,0,1618288,null,0.95187838116907142,null,4.8384898799886163E-3,null,7.3800000060231383,7.38,7.3800000000000008,7.3800000063053988,null,7.3800000060231374,0,0,0,0,0,0,0,null,7.3800000060231383,7.38,7.3800000000000008,7.3800000063053988,null,5146154.5200000005,null,0,0,0,0,null,0,0,null,0.95348837287120636,null,0,null,7.3799999983883433,0,0,7.3799999983883433,null,7.3799999983883433,0,0,0,0,0,0,null,7.3799999983883433,0,0,7.3799999983883433,null,9158272.9900000002,null,0,0,0,0,null,0,0,null,0.95348837188479885,null,0,null,10.080000005383162,0,0,10.080000005383162,null,10.080000005383162,0,0,0,0,0,0,null,10.080000005383162,0,0,10.080000005383162,null,7490021.6200000001,null,0,0,0,0,null,0,0,null,0.95817490545467332,null,0,null,437566,238522,0,14311,690399,null,348530,110110,0,29120,487760]
[null,394,"Sunderland",null,5.8653530484821559,5.5120060528037733,8.3048110770798189,5.3507027595154435,null,4.7000000010385623,0.21895653488883476,0.23027627236340173,9.0022237038967945E-2,8.9399445825214998E-3,0,0.44406433601485168,0.17309372255501665,null,4.7000000010385623,4.7000000023980428,4.6999999927212714,4.7000000024739563,null,16442708.729999999,null,500000,288725,71342,139933,null,0,700000,null,0.9874842840420861,null,0.10445400560143589,null,7.8950585109054261,7.8383076624129666,7.9895193953639758,7.8947461309552418,null,7.7500000052117084,0,0,0,0,0,0,0.14505850569371784,null,7.7500000052117084,7.7500000162091869,7.750000026758352,7.7499999892253877,null,3717591.38,null,69583,13620,22378,33585,null,0,0,null,1.007022769248141,null,0,null,7.6424236136824479,7.6431515346384407,7.6400390863564187,7.6420158157602662,null,7.5,0,0,0,0,0,0.14242361368244807,null,7.5,7.4999999999999991,7.5,7.5,null,4312364.25,null,81891,49953,11465,20473,null,0,62792,null,0.97479893031663878,null,0,null,10.440669926933449,10.332322972857266,10.911065235342692,10.440565231764561,null,10.300000008696571,0,0,0,0,0,0.1406699182368783,null,10.300000008696571,10.3,10.3,10.300000034761817,null,3553124.98,null,48526,6795,29600,12131,null,0,37208,null,0.97667632618647793,null,0,null,374073,96065,113057,12547,595742,null,227500,33024,38866,24570,323960]
[null,936,"Surrey",null,6.7751789966510696,7.067158575723365,13.821953433064825,6.601129789113271,null,6.05000000023208,0.16799010380441359,0.119258361448279,0,0,0,8.723771589112779E-2,0.35069281527516893,null,6.05000000023208,6.05,6.05,6.0500000002525773,null,83046346.379999995,null,4533243,181723.82,613407,3738112.18,null,16089,4541543,null,0.98599830290543322,null,4.5327000640288016E-2,null,9.3705832445967268,9.3706526832601185,9.370679367292329,9.3705759940883731,null,8.5399999906372788,0.56607077062243183,0,0,0,0,0,0.26451248333701671,null,8.5399999906372788,8.5399999395355728,8.5399999839381682,8.5399999935079212,null,6419081.3599999994,null,186461.01,8749.36,6587.36,171124.29,null,0,320949,null,0.97508670599341596,null,6.2164108479223275E-2,null,8.9839648860581072,8.9839648985944294,8.9839649503077865,8.9839648829438783,null,8.5400000017253248,0.14479390233121489,0,0,0,0,0.29917098200156611,null,8.5400000017253248,8.5400000183845446,8.5400000569763694,8.5399999987466959,null,18121366.670000002,null,624239,29291.33,22053.32,572894.35,null,322270,1030278.62,null,0.95092768745070766,null,1.6672117258140551E-2,null,12.380399732685921,13.1,13.1,12.380398611709341,null,12.100000000000001,0.15000000000000002,0,0,0,0,0.13039973268592231,null,12.1,12.1,12.1,12.1,null,15727566.749999998,null,167418,0,0,167418,null,9770,837092,null,0.95000072548800618,null,"No Base Rate",null,416600,127503,96538,13442,654083,null,531500,33942,108957.79,34600,708999.79]
[null,319,"Sutton",null,6.8118598344535135,6.6335690141937205,10.750715616459082,6.6127778677722455,null,6.0800000005247679,3.4517616152897251E-2,0.16042513271567554,0.25000000218653134,0,0,0.19884359953685068,8.8073483336789951E-2,null,6.0800000005247679,6.08,6.08,6.080000000902368,null,15375462.850000001,null,201400,0,0,201400,null,211500,865746,null,0.96760555723066022,null,6.8191058219992967E-2,null,9.8976442207463453,0,0,9.8976442207463453,null,9.220000010449926,0.30167554126702228,0,0.25000002612481709,0,0,0,0.12596864290457807,null,9.220000010449926,0,0,9.220000010449926,null,1870190.24,null,24109,0,0,24109,null,34600,109936,null,0.98808117204002421,null,5.6456598768262208E-2,null,9.7284890733315752,0,0,9.7284890733315752,null,9.2200000045904105,0.13251906340022249,0,0.25000001147602574,0,0,0.12596999386491661,null,9.2200000045904105,0,0,9.2200000045904105,null,4183730.18,null,54883.98,0,0,54883.98,null,34600,233614,null,0.96155913448245622,null,3.9835284023980719E-2,null,13.095469041677687,0,0,13.095469041677687,null,12.659999999999998,4.0529662722369797E-2,0,0.25,0,0,0.14493937895531714,null,12.659999999999998,0,0,12.659999999999998,null,3378573.03,null,37812.22,0,0,37812.22,null,103800,164904,null,0.97284416372624105,null,"No Base Rate",null,66000,17950,17950,1800,103700,null,106500,14100,14100,10900,145600]
[null,866,"Swindon",null,5.3741801265658049,5.2460561995266533,0,5.4539955041049248,null,5.2000000000000011,4.6145132369175758E-2,0,0,0,0,0,0.12803499419662842,null,5.2000000000000011,5.2000000036990706,0,5.1999999976956479,null,14779432.460000001,null,360700,0,0,360700,null,0,785700,null,0.94950178914590189,null,8.7960075836362658E-3,null,7.660000017702294,7.660000035228447,0,7.6600000132933372,null,7.660000017702294,0,0,0,0,0,0,0,null,7.660000017702294,7.660000035228447,0,7.6600000132933372,null,2163561.2599999998,null,0,0,0,0,null,0,113900,null,0.95037221063303889,null,0,null,7.6600000038322511,7.6600000095329657,0,7.6600000023981547,null,7.660000003832252,0,0,0,0,0,0,null,7.6600000038322511,7.6600000095329657,0,7.6600000023981547,null,3997649.0599999996,null,0,0,0,0,null,0,210400,null,0.95037220891218999,null,0,null,10.409999979211751,10.409999960221645,0,10.40999998398901,null,10.409999979211751,0,0,0,0,0,0,null,10.409999979211751,10.409999960221645,0,10.40999998398901,null,3254963.92,null,0,0,0,0,null,0,171300,null,0.94981751635143707,null,0,null,216200,1,114999,6900,338100,null,99200,1,26399,6400,132000]
[null,357,"Tameside",null,5.4527499743445524,5.4472143681025615,0,5.4571969340367836,null,5,9.9994225289513225E-2,0.10245870009300324,0,0,0,0,0.25029704896203603,null,5,5,0,5,null,14549580.439999999,null,700000,147000,0,553000,null,0,807965,null,0.97024020895810559,null,3.8914898084855008E-2,null,7.5665342775922309,0,0,7.5665342775922309,null,7.37,0.10840545585197973,0,0,0,0,0,8.8128821740250468E-2,null,7.37,0,0,7.37,null,3309448.68,null,39000,0,0,39000,null,0,169308,null,0.95056963286334561,null,1.4495798133965926E-2,null,7.5585715110143781,0,0,7.5585715110143781,null,7.3699999999999992,8.7991112650046166E-2,0,0,0,0,0.10058039836433189,null,7.3699999999999992,0,0,7.3699999999999992,null,4523122.45,null,61000,0,0,61000,null,0,241388,null,0.94956928530331386,null,1.179823243564852E-2,null,10.316430430149275,0,0,10.316430430149275,null,10.119999999999999,8.7991287418801439E-2,0,0,0,0,0.10843914273047449,null,10.119999999999999,0,0,10.119999999999999,null,3707062.6599999997,null,39380,0,0,39380,null,0,197192,null,0.94994755342074355,null,"No Base Rate",null,256561,133222,7012,8415,405210,null,168350,32305,32305,7280,240240]
[null,894,"Telford and Wrekin",null,5.539760056639591,5.5595216928501383,9.4738602815910671,5.2922022724391926,null,4.8,0.16458137050362912,6.8631888817703601E-2,0.26130727528255221,0,0,0.16080333706103364,8.4436184974671827E-2,null,4.8000000000000007,4.8,4.8,4.8,null,12883287.4,null,199404.41,64490.400000000001,7682.23,127231.78,null,0,210939.26,null,0.98335589023373982,null,9.3402326305432493E-2,null,7.6668571113777144,7.6668566812831749,7.6668618589113766,7.6668570365396898,null,7.5500000000000007,0,0,0,0,0,0,0.11685711137771466,null,7.5500000000000007,7.5500000000000007,7.55,7.55,null,2466917.2000000002,null,38182.36,8101.44,1189.42,28891.5,null,0,40390.31,null,0.98419218374553463,null,0,null,7.6668570354088459,7.6668566404361007,7.6668557906141297,7.6668572368282097,null,7.55,0,0,0,0,0,0.1168570354088454,null,7.5500000000000007,7.55,7.5500000000000007,7.5500000000000007,null,3493241.5500000003,null,54067.53,13290.69,2049.3000000000002,38727.54,null,0,57194.07,null,0.98419217399343328,null,0,null,10.339537057271093,10.503997310600294,10.374398551917064,10.304757280544514,null,10.120000000000001,0.11225604733648238,0,0,0,0,0.10728100993460976,null,10.120000000000001,10.119999999999999,10.119999999999999,10.120000000000001,null,2434826.7200000002,null,25528.160000000003,4228.37,651.98,20647.810000000001,null,0,27004.36,null,0.97450867646287398,null,"No Base Rate",null,218774,55532,68094,7419,349819,null,113750,16759,20551,14560,165620]
[null,883,"Thurrock",null,5.7876276678835961,5.7876289435281256,0,5.7876269809980805,null,5.4,0.16950668287288936,0,0,0,0,0,0.21812098501070665,null,5.4,5.4,0,5.3999999999999995,null,12692682.949999999,null,497089,173982,0,323107,null,0,500517,null,0.98429041970809472,null,3.0434775021304688E-2,null,8.1539705597408023,8.1009561029859185,0,8.1851201810899799,null,7.5,0.26566884775738286,0,0,0,0,0,0.38830171198341795,null,7.5,7.5,0,7.4999999999999991,null,1999905.9000000001,null,100000,33333.33,0,66666.67,null,35003,15284,null,0.98105181159601851,null,3.4210684612711026E-2,null,7.9803187748596889,7.9694466516619364,0,7.9861729774161931,null,7.5,0.2519863776891848,0,0,0,0,0.22833239717050494,null,7.5,7.5,0,7.5,null,3395044.4499999997,null,100000,33333.33,0,66666.67,null,25000,56548,null,0.95117181942630968,null,3.250603979573817E-2,null,11.307414104449945,0,0,11.307414104449945,null,11.14,0,0,0,0,0,0.16741410444994559,null,11.14,0,0,11.14,null,2794546.98,null,41997,0,0,41997,null,0,62651,null,0.98154636323350219,null,0,null,79331,31750,13626,2721,127428,null,91000,20930,10920,6370,129220]
[null,880,"Torbay",null,5.58852703852655,5.5990201390022891,0,5.5829408906651175,null,5.23,0.1650736375823279,0,0,0,0,0,0.193453400944221,null,5.23,5.23,0,5.23,null,6942245.8800000008,null,248931,67211,0,181720,null,0,258607,null,0.9736109823216984,null,3.0597105558007116E-2,null,7.9823243510831183,7.9824447879858651,0,7.9822797914760093,null,7.4700000000000006,0.23602771018226928,0,0,0,0,0,0.27629664090084932,null,7.4700000000000006,7.47,0,7.47,null,1292023.43,null,46325,12508,0,33817,null,0,48118,null,0.97345418915647808,null,3.0628972417319083E-2,null,7.9820612847103085,7.9828669865327413,0,7.9817631867098759,null,7.47,0.23573110132443115,0,0,0,0,0.27633018338587734,null,7.47,7.47,0,7.47,null,1908933.06,null,68455,18483,0,49972,null,0,71131,null,0.97342210789150097,null,3.0591659405804415E-2,null,10.752010620996382,10.887063197026022,0,10.748547852313809,null,10.17,0.26837259782933387,0,0,0,0,0.31363802316704836,null,10.17,10.17,0,10.17,null,1572488.64,null,47248,1417,0,45831,null,0,49099,null,0.9625792856755937,null,"No Base Rate",null,104335,21032,31081,3128,159576,null,90090,12120,17910,2730,122850]
[null,211,"Tower Hamlets",null,8.4629895896528726,8.254545457057894,11.403692074222255,8.2081159416066054,null,7.75,0.29450295778989383,2.7486928983592267E-2,3.1051823332345112E-2,0,0,0.19633520702565904,0.16361267252138254,null,7.75,7.75,7.75,7.75,null,25362879.260000002,null,500000,296005,35578,168417,null,115776,1326300,null,0.95000006604824938,null,4.3569035275423787E-2,null,10.65483281952068,10.35,10.35,10.719455398112821,null,10.35,0,0,0,0,0,0,0.30483281952068086,null,10.35,10.35,10.35,10.35,null,5092955.55,null,150000,0,0,150000,null,16100,276792,null,0.95000458152437628,null,0,null,10.583528366139488,10.35,10.350000233314512,10.636616815572532,null,10.350000013736961,0,0,0,0,0,0.23352835240252595,null,10.350000013736963,10.35,10.350000233314512,10.35,null,3767208.5300000003,null,85000,0,0,85000,null,37843,204738,null,0.94999981653524201,null,0,null,14.541766187096572,0,0,14.541766187096572,null,14.45,0,0,0,0,0,9.1766187096572902E-2,null,14.45,0,0,14.45,null,3149308.14,null,20000,0,0,20000,null,19232,167818,null,0.95000055536419725,null,0,null,293279,101525,75000,10594,480398,null,179270,29140,20000,27300,255710]
[null,358,"Trafford",null,5.3025549067386324,5.4383415613617316,0,5.1951368727474803,null,4.88,9.1523395735602336E-2,0.14277569111930438,0,0,0,0,0.188255819883726,null,4.88,4.88,0,4.88,null,16746808.16,null,616445,271705,0,344740,null,0,913855,null,0.96938846558293101,null,4.5812550825804647E-2,null,7.6546684623170744,7.6546664356264085,0,7.6546685678702611,null,7.4799999999999995,0,0,0,0,0,0,0.17466846231707525,null,7.4799999999999995,7.48,0,7.4799999999999995,null,1744006.88,null,40725,2016,0,38709,null,0,93933,null,0.99411278731390573,null,0,null,7.3711071263836123,7.3639453398738617,0,7.3714890813253007,null,7.05,0,0,0,0,0,0.32110712638361227,null,7.05,7.0500000000000007,0,7.05,null,5364775.05,null,244350,12096,0,232254,null,0,295217,null,0.95728663979007955,null,0,null,9.99866441380731,0,0,9.99866441380731,null,9.84,0,0,0,0,0,0.15866441380731039,null,9.84,0,0,9.84,null,4490080.5599999996,null,72400,0,0,72400,null,0,240130,null,0.95589525944620546,null,0,null,103877,26318,26318,3159,159672,null,86450,17290,17290,5460,126490]
[null,384,"Wakefield",null,5.4327511750477866,5.2891144319892689,8.6805591540880567,5.3343661042706927,null,5.1600000004701263,4.5979048761252486E-2,0,0,0,0,0.12334439081598854,0.10342773500041919,null,5.1600000004701272,5.1599999993674022,5.1600000150672738,5.160000000766459,null,22671890.800000001,null,440000,193600,26400,220000,null,0,699998.24,null,0.9706410940094693,null,8.8319696115644053E-3,null,7.8471168685763288,7.9218540457906768,7.8418838849190493,7.8406451081334456,null,7.6700000106560298,0.16092780359013836,0,0,0,0,0,1.6189054330161615E-2,null,7.6700000106560289,7.6700000471914294,7.6700000392459673,7.6700000041770924,null,3600923.1799999997,null,7444.27,3275.48,446.66,3722.13,null,0,70884.759999999995,null,0.99330593273118095,null,2.0550285663133751E-2,null,7.6861890427127317,7.7609260684455608,7.6809558726647156,7.6797173153255596,null,7.6700000012893748,0,0,0,0,0,1.6189041423356275E-2,null,7.6700000012893748,7.6699999802496315,7.6700000261774539,7.6700000006191473,null,5948619.5999999996,null,12555.73,5524.52,753.34,6277.87,null,0,119556.47,null,0.97293532186237108,null,0,null,10.602720053143404,0,0,10.602720053143404,null,10.589999990332752,0,0,0,0,0,1.2720062810652554E-2,null,10.589999990332752,0,0,10.589999990332752,null,4162715.29,null,5000,0,0,5000,null,0,60574.73,null,0.98538290456723088,null,0,null,426938,93367.48,157476.51999999999,12543,690325,null,215670,21338.99,35991.01,17290,290290]
[null,335,"Walsall",null,6.0351931264663623,5.4416432271309274,9.886314941184116,5.4357938827851138,null,5.4,4.0075865355546976E-2,0,0,0,0,0.56898082718328524,2.613643392753064E-2,null,5.4,5.3999999999999995,5.4,5.4,null,20692000.439999998,null,90000,0,90000,0,null,490000,528934,null,1.0033113801990412,null,7.3667842779114876E-3,null,8.0098824934385888,7.9499999999999993,8.1980686086894892,7.9499999999999993,null,7.9499999999999993,0,0,0,0,0,0,5.9882493438589646E-2,null,7.9499999999999993,7.9499999999999993,7.95,7.9499999999999993,null,4646600.0999999996,null,35000,0,35000,0,null,0,105801,null,0.98765505467800119,null,0,null,7.979470648216731,0,0,7.95,null,7.95,0,0,0,0,0,2.9470648216731076E-2,null,7.95,0,0,7.95,null,4046398.95,null,15000,0,15000,0,null,0,82702,null,0.98390513541513336,null,0,null,10.88817741042625,0,0,10.85,null,10.85,0,0,0,0,0,3.8177410426250787E-2,null,10.85,0,0,10.85,null,2841994.75,null,10000,0,10000,0,null,0,60234,null,0.98268749191572657,null,0,null,315701,127581,54677,10935,508894,null,168350,41405,17745,17290,244790]
[null,320,"Waltham Forest",null,6.1715049771742052,6.0539543430635616,9.587270514603615,5.95876587547823,null,5.3900000000000006,0.16999999999999998,0.13139010700403275,0,0,0,0.16120754920691682,0.31890732096325625,null,5.3899999999999988,5.39,5.39,5.39,null,20490430.159999996,null,1116521,318320.14,95797.5,702403.36,null,171344.52,1116521,null,0.95874016841739862,null,5.2955446971229586E-2,null,8.8122843180177721,8.9574439418859644,8.6796425438596501,8.7893101355090959,null,8.1,0.26,0,0,0,0,0,0.45228431801777286,null,8.1,8.1,8.1,8.1,null,2826047.84,null,152892,43589.51,13118.13,96184.36,null,14343.08,64556,null,0.98385710472929888,null,3.1100478468899524E-2,null,8.549999824956048,8.5499998726953077,8.5500004773922917,8.5499998189781152,null,8.1000000159130874,0,0,0,0,0,0.44999980904296155,null,8.1000000159130874,8.100000063652347,8.1000009547845853,8.100000008419622,null,5090150.17,null,282786,14139.3,1413.93,267232.77,null,0,282786.01,null,0.94999998055067203,null,0,null,11.653500932019206,11.653500932019204,11.653502710747317,11.653500922607941,null,11.040000021260775,0,0,0,0,0,0.61350091075843027,null,11.040000021260775,11.040000021260774,11.040002126076326,11.04000001012418,null,4154129,null,230848,11542.4,1154.24,218151.36,null,1129.02,230848,null,0.95000011507589155,null,0,null,200479,106557.3,11839.7,7105,325981,null,126490,15470,15470,10010,167440]
[null,212,"Wandsworth",null,7.2543614285260025,7.3118419098296208,14.875050472492827,6.8776963672293725,null,6.3799999993245535,0.26930181249687207,0,0,0,0,0.2190596137387493,0.38600000296582881,null,6.3799999993245535,6.3799999990420551,6.3800000330797699,6.3799999979210602,null,22370937.869999997,null,1257240.49,402945.58,37340.04,816954.87,null,760243,1257240.48,null,0.95108782822251348,null,4.0500765361273762E-2,null,10.566799973743771,10.566800070557324,10.566799480390923,10.5667999893152,null,10.119999991896227,0,0,0,0,0,0,0.44679998184754699,null,10.119999991896226,10.120000061892391,10.119999897242767,10.119999988531521,null,2497601.8299999996,null,110269.60999999999,11550.37,5217.7299999999996,93501.51,null,11032,137837.01999999999,null,0.95000003486001139,null,0,null,9.3285000098881969,9.3285000845676489,9.3284998551698006,9.3285000092968069,null,8.7700000054934435,0,0,0,0,0,0.55850000439475445,null,8.7700000054934435,8.7700001180013718,8.7699997736121116,8.7700000045350279,null,3192897.41,null,203333.31999999998,21298.48,9621.32,172413.52,null,467721,203333.32,null,0.9501521345357633,null,0,null,13.990499939219207,13.990499859860559,13.990499411060432,13.990499978495722,null,13.229999977063851,0,0,0,0,0,0.76049996215535565,null,13.229999977063851,13.229999912412849,13.229999563748466,13.230000008114819,null,2884093.69,null,165786.33000000002,17365.560000000001,7844.67,140576.1,null,99471.8,165786.34,null,0.94982248032129379,null,0,null,288814,0,0,0,288814,null,161980,0,0,0,161980]
[null,877,"Warrington",null,5.7047541920051819,5.5970729249990319,9.2139612331448433,5.6217306624624364,null,5.5,3.0000137059338652E-2,0,0,0,0,7.9888603606608891E-2,9.4865451339233992E-2,null,5.5,5.5,5.4999999999999991,5.5000000000000009,null,14857722.449999999,null,251250,69093.75,6281.25,175875,null,38444,198520,null,1.0234811326282756,null,5.4249794422774967E-3,null,7.5694863830305259,7.5694867883148156,7.5694863196773099,7.569486226076771,null,7.5300000024299294,0,0,0,0,0,0,3.9486380600596352E-2,null,7.5300000024299294,7.5299999602370402,7.5300004859794916,7.5300000017356572,null,3098853.28,null,16250,4468.75,406.25,11375,null,0,0,null,0.97796981692900853,null,0,null,7.5694863830305259,7.5694867883148156,7.5694863196773099,7.569486226076771,null,7.5300000024299294,0,0,0,0,0,3.9486380600596352E-2,null,7.5300000024299294,7.5299999602370402,7.5300004859794916,7.5300000017356572,null,3098853.28,null,16250,4468.75,406.25,11375,null,0,0,null,0.97796981692900853,null,0,null,10.046406077739746,0,0,10.032484254417822,null,10,0,0,0,0,0,4.6406077739747004E-2,null,10,0,0,10,null,3501696.5,null,16250,4468.75,406.25,11375,null,0,0,null,0.95498156632507103,null,0,null,188374,55062.5,55062.5,6609,305108,null,82810,15925,15925,9100,123760]
[null,937,"Warwickshire",null,5.5558847313430135,5.5197641532897421,8.4276154567204618,5.39764032691496,null,5.2400000001702125,0.10154914547932986,0,0,0,0,0.14842824526431647,6.5907340429153763E-2,null,5.2400000001702125,5.2400000060248351,5.2399999888109106,5.2400000005601433,null,38704278.130000003,null,464646,19425,26756,418465,null,0,1439405,null,0.96389602323250356,null,1.9011178725564508E-2,null,7.573663565721791,0,0,7.573663565721791,null,7.38,9.8006546807685044E-2,0,0,0,0,0,9.5657018914105482E-2,null,7.38,0,0,7.38,null,3757960.02,null,48071,0,0,48071,null,0,148918,null,0.96234606934203193,null,1.310597231952457E-2,null,7.5751716973234169,0,0,7.5751716973234169,null,7.3800000000000008,0.10000021688539559,0,0,0,0,9.5171480438021747E-2,null,7.3800000000000008,0,0,7.3800000000000008,null,10346478.42,null,131643,0,0,131643,null,0,407813,null,0.96253769978696524,null,1.3369012564953478E-2,null,10.350959396985653,0,0,10.350959396985653,null,10.06,0.18152238665409381,0,0,0,0,0.10943701033155889,null,10.06,0,0,10.06,null,8482428.2599999998,null,90640,0,0,90640,null,0,280792,null,0.96828432151409294,null,"No Base Rate",null,276324,40597.910000000003,111745.09,9140,437807,null,306670,23523.08,64746.92,22750,417690]
[null,869,"West Berkshire",null,6.1188825878088702,6.1038250032864472,9.5970657642030606,5.7814539191544219,null,5.3900000005073014,6.5861389688720268E-2,0.38435027878954847,0,0,0,0.23339707239310026,4.5273846430199764E-2,null,5.3900000005073023,5.39,5.3899999839685524,5.3900000022852863,null,10775144.869999999,null,80320,5650,17220,57450,null,0,369760,null,0.94964673560716106,null,7.7088245083498722E-2,null,8.4370622900664891,8.5710598474740181,8.4091456309716843,8.4144786433033101,null,8.2999999999999989,9.172356277616768E-2,0,0,0,0,0,4.5338727290319902E-2,null,8.3000000000000007,8.2999999999999989,8.3000000000000007,8.3000000000000007,null,910640.47000000009,null,4920,0,0,4920,null,0,31480,null,0.97425661548111864,null,1.0930241218029768E-2,null,8.3596929779689475,8.3444642637334923,8.3179040426510369,8.3748521245183767,null,8.2999999939534277,1.4041353242523473E-2,0,0,0,0,4.5651630772996395E-2,null,8.2999999939534259,8.2999999799196669,8.2999999837328993,8.2999999999999989,null,2750000.87,null,15100,0,0,15100,null,0,95950,null,0.9653225147770147,null,1.6888721929749788E-3,null,11.213708928658914,0,0,11.213708928658914,null,11.159999976101339,7.9430184246720211E-3,0,0,0,0,4.5765934132902843E-2,null,11.159999976101339,0,0,11.159999976101339,null,1869216.5899999999,null,7660,0,0,7660,null,0,65938,null,0.95435820669437565,null,"No Base Rate",null,69450.41,8680.8799999999992,4340.4399999999996,4340.4399999999996,86812.170000000013,null,72090,9000,8098,902,90090]
[null,941,"West Northamptonshire",null,5.4144127316091391,5.440852726364402,9.8066536562165716,5.1778733105557357,null,4.9300000003755198,7.5103932428659953E-2,0,0,0,0,0.18904766587087396,0.22026113293408489,null,4.9300000003755198,4.9300000014562295,4.9300000129844808,4.929999999510839,null,26280615.990000002,null,1114445.3799999999,268378.25,64698.73,781368.4,null,0,1391502.7,null,0.95006637558877527,null,1.5005469104531047E-2,null,15.180361624271923,9.0755365627374527,13.661419749428093,16.388338306876207,null,7.3699999880023519,0,0,0,0,0,2473766,0,null,7.3699999880023519,7.3699999429002974,7.370000266691954,7.3699999816366306,null,4808056.8099999996,null,0,0,0,0,null,139559.79999999999,0,null,2.0001268130151515,null,0,null,7.3699999963493497,7.3699999980173443,7.3699999768493321,7.3699999970696348,null,7.3699999963493497,0,0,0,0,0,0,null,7.3699999963493497,7.3699999980173443,7.3699999768493321,7.3699999970696348,null,7469627.7300000004,null,0,0,0,0,null,446585.2,0,null,1.0000805085981774,null,0,null,10.619999997925216,10.620000057905388,10.619999910749819,10.619999991441585,null,10.619999997925216,0,0,0,0,0,0,null,10.619999997925216,10.620000057905388,10.619999910749819,10.619999991441585,null,6142329.3300000001,null,0,0,0,0,null,308170,0,null,1.0501715199858543,null,0,null,199863,27479.24,87979.76,6927,322249,null,182910,13427.96,42992.04,11830,251160]
[null,938,"West Sussex",null,6.0628870342575345,5.8711505058644464,9.4516684418035375,5.9447217467318527,null,5.8200000003171173,3.8218897467559146E-2,0,0,0,0,0.12010356812955283,8.4564568343305641E-2,null,5.8200000003171173,5.82,5.8199999999999994,5.8200000003323202,null,56556286.709999993,null,800000,0,0,800000,null,0,2342503.3199999998,null,0.96006194929369648,null,6.5239790684523359E-3,null,8.4403372266765881,0,8.27,8.44750985749784,null,8.2700000012919705,7.5779621283004278E-2,0,0,0,0,0,9.4557604101614276E-2,null,8.2700000012919705,0,8.27,8.2700000013463733,null,7105705.8499999996,null,80507.58,0,0,80507.58,null,0,299425.56,null,0.96022038983806468,null,9.0799930875269767E-3,null,8.4403372288122807,0,8.27,8.442699068202705,null,8.2700000008926189,7.5779622434623911E-2,0,0,0,0,9.4557605485037166E-2,null,8.2700000008926189,0,8.27,8.2700000009049965,null,14959625.699999999,null,169492.42,0,0,169492.42,null,0,630379.92000000004,null,0.96022039008103321,null,9.0799932246967904E-3,null,11.44551605931543,0,0,11.44551605931543,null,11.390000004624913,9.266928220893228E-3,0,0,0,0,4.6249126469623807E-2,null,11.390000004624913,0,0,11.390000004624913,null,12323764.58,null,50000,0,0,50000,null,0,433476.48,null,0.95938944336256748,null,"No Base Rate",null,501756,89537.63,188503.37,16683,796480,null,377650,38975.33,82054.67,34580,533260]
[null,213,"Westminster",null,8.7626177083601426,7.7767415529742383,15.693866248199077,7.7834833223377622,null,7.2900000036912438,0.33964935048679634,0,0,0,0,0.98362459551921066,0.14934375866289135,null,7.2900000036912438,7.2899999999999991,7.2899999999999991,7.2900000063137966,null,10267105.58,null,178019.20000000001,51625.57,21362.3,105031.33,null,296698.68,520524,null,0.95004726490706226,null,4.4517032791395891E-2,null,11.029497939303109,11.059837117148675,11.059893121693122,11.014751182962334,null,10.39,0.47749030409202758,0,0,0,0,0,0.16200763521108219,null,10.39,10.39,10.39,10.39,null,2146394.54,null,31997.48,9279.27,3839.7,18878.509999999998,null,53329.11,93559.85,null,0.95113725139015504,null,4.3937495293852172E-2,null,10.991913626794094,11.05956615098177,11.007044314758533,10.96072315373328,null,10.390000072568013,0.41929247288734989,0,0,0,0,0.18262108133873103,null,10.390000072568013,10.390000063424099,10.39000016478847,10.39000005904983,null,1176736.23,null,19880.75,5765.42,2385.69,11729.64,null,33134.58,58130.85,null,0.9508654936929769,null,3.879000139224064E-2,null,14.934876817963092,14.93487794395617,14.934942488554853,14.934862907779797,null,14.029999794289893,0.62768607991958758,0,0,0,0,0.27719094375361253,null,14.029999794289893,14.029999735734167,14.029999394970185,14.029999904289081,null,726791.68000000005,null,13744.33,3985.86,1649.32,8109.15,null,22907.22,40188.1,null,0.94983724808418502,null,"No Base Rate",null,133722,44739,27797,3628,209886,null,75530,11787,7323,1820,96460]
[null,943,"Westmorland and Furness",null,5.3946003252845314,5.3545742852547358,7.9146287506042459,5.1667632457911168,null,5.0799999982679669,2.844919402640736E-2,9.2454885834534609E-2,0,0,0,0.12565028435874692,6.8045962796875401E-2,null,5.0799999982679669,5.0799999996765033,5.0799999588679059,5.0800000008281909,null,12301274.08,null,157147,84138.21,7279.04,65729.75,null,484700.5,267953.43,null,0.99935655584918437,null,2.3246742882525678E-2,null,7.180048120852903,7.1800482570244695,7.1800475745283565,7.1800481409283128,null,7.0399999887712399,4.1033989177159239E-2,0,0,0,0,0,9.9014142904504179E-2,null,7.0399999887712399,7.0400000863203953,7.0399998329462257,7.0399999673854223,null,1261231.6399999999,null,17635.810000000001,5047.04,1659.58,10929.19,null,0,6588.81,null,0.99722890567401423,null,5.7949148817738189E-3,null,7.1800481282846205,7.1800481046710267,7.1800482971894173,7.1800481135412646,null,7.0400000037158961,4.1034007508339403E-2,0,0,0,0,9.9014117060384432E-2,null,7.0400000037158961,7.0399999922093492,7.0400000710775412,7.0399999988007735,null,3811212.19,null,53292.19,15251.22,5014.96,33026.01,null,0,19910.189999999999,null,0.99722890670619724,null,5.7949174433134885E-3,null,9.7462771582298515,9.7462771834296706,9.7462771215675374,9.7462771521598466,null,9.6199999999999992,4.1033983082928403E-2,0,0,0,0,8.5243175146922839E-2,null,9.6199999999999992,9.6200000216849428,9.6199999736211623,9.6199999939916108,null,3113538.71,null,27472,7861.97,2585.1999999999998,17024.830000000002,null,67639.899999999994,10299,null,1.0180120407166413,null,"No Base Rate",null,107432,14315.67,43259.33,3454,168461,null,70980,5430.38,16409.62,8190,101010]
[null,359,"Wigan",null,5.43295302998997,5.376953284500031,7.9361207465652095,5.3313716483516327,null,5.2400000009156056,7.3558451787866755E-2,0,0,0,0,8.7043148065082759E-2,3.2351429221414707E-2,null,5.2400000009156056,5.24,5.2400000116958285,5.2400000007017118,null,21234193.98,null,127200,25440,19080,82680,null,0,809645.81,null,0.96322700575223208,null,1.3843538646016234E-2,null,7.7826580641958039,7.7437647709466306,7.8740383230082127,7.7871697877021191,null,7.5300000084452705,0.16231329641728626,0,0,0,0,0,9.0344759333247038E-2,null,7.5300000084452705,7.5299999999999994,7.53,7.5300000115310342,null,3916623.55,null,46000,9200,6900,29900,null,0,112383,null,0.99142140945169477,null,2.1100713138488891E-2,null,7.6099300074816831,7.7176715182267319,7.839958368465429,7.5940491632841258,null,7.53,4.1152989023822771E-2,0,0,0,0,3.8777018457860787E-2,null,7.53,7.5299999999999994,7.53,7.5299999999999994,null,6638447.5099999998,null,34000,6800,5100,22100,null,0,112383,null,0.9694178353479852,null,5.4354982766143768E-3,null,10.398973780032522,0,0,10.398973780032522,null,10.369999989587544,0,0,0,0,0,2.8973790444978116E-2,null,10.369999989587544,0,0,10.369999989587544,null,4581243.87,null,12800,0,0,12800,null,0,141369.12,null,0.97277584471772893,null,0,null,235611,110000,15571,6280,367462,null,158340,29120,29120,14560,231140]
[null,865,"Wiltshire",null,5.3651025979886526,5.3671360879815238,0,5.3648766541166557,null,5.2100000002111448,3.3273024264676723E-2,0,0,4.8725982287257602E-3,0,0,0.11695697528410443,null,5.2100000002111457,5.2100000053598468,0,5.2099999996390665,null,32312200.040000003,null,720090,72009,0,648081,null,0,155330,null,0.98082314405642634,null,7.2684001618355913E-3,null,7.6454182099347605,7.6867727866830888,0,7.6418221591699051,null,7.4800000028944575,0,0,0,0,0,0,0.16541820704030311,null,7.4800000028944575,7.4800000603011751,0,7.479999997902568,null,3101099.99,null,68580,6858,0,61722,null,0,30,null,1.0221147339484973,null,0,null,7.3270265903124105,7.3270265214037593,0,7.3270265979689322,null,7.1700000020203101,0,0,0,0,0,0.15702658829210048,null,7.1700000020203101,7.1700000282843259,0,7.1699999991020844,null,8872399.9900000002,null,194310,19431,0,174879,null,0,383620,null,0.97954900940005485,null,0,null,9.8442201485864764,9.8977752171259645,0,9.8395631857998413,null,9.6300000061580597,0,0,0,0,0,0.21422014242841572,null,9.6300000061580597,9.6300000552217249,0,9.6300000018916538,null,7193500.0300000003,null,160020,16002,0,144018,null,0,319720,null,0.97083038940695032,null,0,null,262900,35700,107100,8600,414300,null,245700,16835,50505,14560,327600]
[null,868,"Windsor and Maidenhead",null,6.5984635319589611,6.7631895188615321,9.9238779608955046,6.2052111615346899,null,5.71,0.21430206245085306,0.24968770102370841,0,0,0,0.32666901025496864,9.7804758229432076E-2,null,5.71,5.71,5.71,5.71,null,11631492.229999999,null,175000,60000,25000,90000,null,62046,480930,null,0.96576900733499038,null,7.515233766980528E-2,null,8.9057424275242543,0,9.2506265664160399,8.798437207091844,null,8.08,0.33793180496813685,0.35101015743453529,0,0,0,0,0.13680046512158142,null,8.08,0,8.08,8.08,null,769202.82000000007,null,12000,4000,3000,5000,null,8898,30000,null,0.97585915194061823,null,7.8566144622298703E-2,null,8.9020808283233137,9.2412244897959184,9.2222222222222214,8.7510370009737084,null,8.08,0.34532732130928523,0.34315297261189043,0,0,0,0.13360053440213762,null,8.08,8.08,8.08,8.08,null,2625283,null,40000,12000,10000,18000,null,4267,100000,null,0.96601654012249838,null,7.8517630289763052E-2,null,12.059236095264067,0,0,11.964617658026702,null,10.959999999999999,0.43773099421714379,0.4833998074236513,0,0,0,0.1781052936232739,null,10.959999999999999,0,0,10.959999999999999,null,2134670.8899999997,null,32000,12000,5000,15000,null,0,80000,null,0.96319777118722583,null,"No Base Rate",null,43443,11109,11210,1338,67100,null,50960,5005,5005,1820,62790]
[null,344,"Wirral",null,5.5615239321816921,5.3868971526551999,9.6710686072864931,5.3887101604932806,null,4.7699999999999996,0.1139999978769293,0.12710000220268586,0.25500000132691919,0,0,0.17358703143498083,0.12183689934017616,null,4.7699999999999996,4.7700000000000005,4.7699999999999996,4.7699999999999996,null,20497431.580000002,null,459096.91,172319.79,18390.96,268386.15999999997,null,80346.22,476772.3,null,0.98350172428322657,null,9.4206338898621345E-2,null,7.8818368827629932,7.8818368707559339,7.8818367457781449,7.8818369046511876,null,7.76,0,0,0,0,0,0,0.121836882762993,null,7.76,7.76,7.7599999047901163,7.7600000125600861,null,3941292.36,null,61880.77,13568.82,5630.53,42681.42,null,0,93860.18,null,1.0002331069496184,null,0,null,7.8418368840043327,7.8418368412182646,7.8418369211981807,7.8418368926998081,null,7.7200000075881201,0,0,0,0,0,0.12183687641621194,null,7.7200000075881201,7.7199999907718109,7.7200000444773753,7.7200000080677507,null,6104278.8899999997,null,96337.600000000006,21124.29,8765.76,66447.55,null,0,145378.57,null,0.99515696497516914,null,0,null,10.446710351512529,0,0,10.446710351512529,null,10.31999998945631,0,0,0,0,0,0.12671036205621614,null,10.31999998945631,0,0,10.31999998945631,null,4698165.96,null,57684.72,0,0,57684.72,null,100000,113988.95,null,0.992220514925646,null,0,null,261890,56310.05,87664.95,8640,414505,null,222950,23134.15,36015.85,19110,301210]
[null,872,"Wokingham",null,6.1056852774275914,5.8532521216797901,7.9607946210449274,6.0438981917278021,null,5.7300000013220318,2.9999999853107508E-2,0.1889999550068307,0,0,0,8.813549320066251E-2,6.8549828044959724E-2,null,5.7300000013220318,5.7299999968787843,5.7299999920576026,5.7300000023700735,null,12329702.159999998,null,140000,21000,14000,105000,null,477169.8,396508.56,null,0.9799380242635749,null,3.6812902416037498E-2,null,9.8188037996225148,9.2988304093567251,0,9.8078196176311856,null,8.68,0.51997277143475973,0,0,0,0,0,0.61883102818775337,null,8.68,8.6799993811689706,0,8.6800000687590035,null,594667.84000000008,null,40000,4000,4000,32000,null,0,0,null,1.0849506960908852,null,5.6518946778759724E-2,null,8.7482534222265897,8.7482535314320682,0,8.7406696965119171,null,8.68,0,0,0,0,0,6.8253422226590435E-2,null,8.68,8.6800001092054764,0,8.6799999878660579,null,3179327.76,null,25000,2500,2500,20000,null,156111.73000000001,114596.3,null,1.0137524657585777,null,0,null,11.410385096407369,11.359999889096523,0,11.412649766423458,null,11.359999987907573,0,0,0,0,0,5.0385108499796487E-2,null,11.359999987907573,11.359999889096523,0,11.359999997783166,null,2254634.42,null,10000,0,500,9500,null,96902.05,46858.3,null,0.96973326216117672,null,0,null,60136.14,4693.0600000000004,26594.02,1565.9,92989.119999999995,null,60060,1911,10829,4550,77350]
[null,336,"Wolverhampton",null,6.0324003938882083,8.0371565630247233,6.0906446073921856,5.3689731417006943,null,4.9800000000000004,0.34658900354642103,0.14669787326871148,0,0,0,0.4691135170730763,9.0000000000000011E-2,null,4.9799999999999995,4.9800000000000004,4.9800000014002146,4.9799999982894221,null,17488288.259999998,null,264867.02999999997,128551.64,31087.8,105227.59,null,19760.23,500304.39,null,0.97038347238870371,null,9.0126260128022495E-2,null,7.8300000097233609,7.830000000000001,7.83,7.8300000144239581,null,7.8300000097233609,0,0,0,0,0,0,0,null,7.8300000097233609,7.830000000000001,7.83,7.8300000144239581,null,4026385.67,null,0,0,0,0,null,0,210832.46,null,0.95024271962662143,null,0,null,7.8300000105153797,7.8300000185872562,7.8300000143490527,7.8299999960682651,null,7.8300000105153797,0,0,0,0,0,0,null,7.8300000105153797,7.8300000185872562,7.8300000143490527,7.8299999960682651,null,2978494.42,null,0,0,0,0,null,0,155962,null,0.95024271972274021,null,0,null,10.709999968828479,10.709999966507294,10.709999938378491,10.70999998424095,null,10.709999968828479,0,0,0,0,0,0,null,10.709999968828479,10.709999966507294,10.709999938378491,10.70999998424095,null,2439438.2200000002,null,0,0,0,0,null,0,127552.32000000001,null,0.95031055624032645,null,0,null,381286,126131,93305,13167,613889,null,151060,21446,15864,18200,206570]
[null,885,"Worcestershire",null,5.3046607544962541,5.3634434162817906,9.1757067060807618,5.2319221720642579,null,5.09,0,0,0,0,0,2.5731919742022907E-2,0.18892883475423133,null,5.09,5.0900000000000007,5.09,5.09,null,34913806.280000001,null,1289400,599400,40000,650000,null,364945,1943541,null,0.97484501998031048,null,0,null,7.4715772432518541,7.5746204371137482,10.292696160267111,7.380302805096572,null,7.0500000000000007,0,0,0,0,0,0,0.42157724325185381,null,7.0500000000000007,7.05,7.05,7.05,null,3938898.45,null,235539,100000,15539,120000,null,40936,163744,null,1.0140922250348379,null,0,null,7.2043773631712522,7.2936991582631077,112.43,7.1583349599843844,null,7.05,0,0,0,0,0,0.15437736317125214,null,7.05,7.05,7.05,7.05,null,10117046.1,null,221538,100000,10538,111000,null,104300,417199,null,0.97809921542440936,null,0,null,10.046465857197886,10,10,10.046465858477381,null,9.5900000112898667,0,0,0,0,0,0.45646584590801936,null,9.5900000112898667,10,10,9.59,null,6965361.0499999998,null,331538,0,0,331538,null,71808,287232,null,1.0034947625020039,null,0,null,358546,181735,10000,9586,559867,null,287560,50000,30990,32760,401310]
[null,816,"York",null,5.303802738604471,6.022727730722,7.0377990430622006,5.197184319437925,null,5.0900000000000007,6.5582755877335253E-2,0,0,0,0,8.3127664613367236E-2,6.5092318113769268E-2,null,5.09,5.09,5.09,5.09,null,11082266.629999999,null,137700,21460,4010,112230,null,0,510980,null,0.95441957476985462,null,1.2720726052272417E-2,null,7.2394300979519146,12.38,9.9600000000000009,7.2134967124925282,null,7.06,9.0264173345206297E-2,0,0,0,0,0,8.9165924606708219E-2,null,7.06,7.06,7.06,7.06,null,1204462,null,15020,1520,1500,12000,null,0,56760,null,0.95381160710828916,null,1.2623893489375339E-2,null,7.2492584487991412,15.097818181818182,10.216127588136542,7.2131418312387794,null,7.0600000000000005,9.4330625142057478E-2,0,0,0,0,9.4927823657083271E-2,null,7.0600000000000005,7.06,7.06,7.06,null,3210591.72,null,42600,7100,4500,31000,null,0,156860,null,0.95510651499329924,null,1.3185108444744882E-2,null,9.8376868953386101,16.635000000000002,14.753333333333334,9.8191883546537273,null,9.58,0.12897097625329815,0,0,0,0,0.12871591908531221,null,9.58,9.58,9.58,9.58,null,2207820,null,29270,2770,1500,25000,null,0,127460,null,0.95511523255714659,null,"No Base Rate",null,112295,15931,47787,3822,179835,null,69160,6140,18430,10920,104650]
[]
[null,null,"England",null,5.8298734461968014,5.8018671176311347,8.8230647347845537,5.6321393616508937,null,5.3509416349564969,0.13166282031218932,6.1898921326654102E-2,1.1934525324507924E-2,1.3788612939351905E-3,7.6970243365487355E-4,0.13234185683183267,0.13894512371752779,null,5.350941634956496,5.3496187935738417,5.488624971307134,5.341858760554107,null,3554262592.980001,null,86778013.660000011,21147782.279999997,6987351.7100000009,58642879.669999994,null,30617803.320000004,137637447.67999998,null,0.97252905440316328,null,4.0890587161230438E-2,null,8.1780878169002467,8.1698692973319211,8.5924725064292868,8.1452992485265607,null,7.8567590939782308,0.12285141524597341,1.3033479970093418E-2,2.2030619417341929E-3,2.0148638698120903E-4,4.4735734663742152E-4,null,0.12107583358704437,null,7.856759093978229,7.8246375885787334,8.1020612845133435,7.8404533126185951,null,558030145.5799998,null,10212856.6,1410175.9400000004,978520.28000000026,7824160.3800000008,null,2987134.62,15060989.680000003,null,0.98825066269064044,null,1.7952628122187644E-2,null,7.9557968514892723,7.88384512255245,8.3906756706768046,7.9386504066886259,null,875246239.53999972,7.2342589240883159E-2,9.0184350845324852E-3,2.6726612977229563E-3,1.4150170496142776E-4,4.7866798780806576E-4,0.1305907989241015,null,7.7405521972492561,7.6235543795771266,8.0262668315541337,7.7365769423983757,null,884818291.59000003,null,14766272.839999996,1771384.41,957702.64999999991,12037185.779999999,null,6509564.5900000008,25652806.180000011,null,0.97191502831967325,null,1.2354801096342963E-2,null,10.834905875058727,10.704444943537512,11.735972533426963,10.821060166321605,null,10.584257819520854,7.8658685106439447E-2,7.0725773119389356E-3,3.4239034617363751E-3,3.0597532063738632E-4,1.3699586018558018E-4,0.16104991847693756,null,10.584257819520857,10.352053180879871,11.300880823757263,10.580540500100613,null,697693914.28999972,null,10526987.48,35566995.079999998,482574.2,9103085.540000001,null,5987592.1399999987,19102937.250000004,null,0.97231395378959984,null,0,null,44196992.159999996,14168648.810000002,14624088.289999995,1467351.1899999997,74457080.450000003,null,28226195,4386632.209999999,3974926.5800000005,2457379,39045132.789999999]
[null,null,null,null,null,null,null,null,null,null,null,null,null,null,null,null,null,null,null,null,null,null,null,null,null,null,null,null,null,null,null,null,null,null,null,null,null,null,null,null,null,null,null,null,null,null,null,null,null,null,null,null,null,null,null,null,null,null,null,null,null,null,null,null,null,null,null,null,null,null,null,null,null,null,null,null,null,null,null,null,null,null,null,null,null,null,null,null," "]
[null,null,"Median",null,5.5711338990071591,5.5797174461479386,9.6710686072864931,5.4357938827851138,null,5.2000000000000011,0.1139999978769293,0,0,0,0,7.9888603606608891E-2,0.10604228966511844,null,5.2000000000000011,5.1800000071432439,5.0600000000000005,5.2,null,18317947.039999999,null,412619.56,110213.5,26756,244364.495,null,0,697000,null,0.96935240850595372,null,3.5662873860593469E-2,null,7.9143217665615149,7.9320130679037444,8.0562657923602519,7.9174396519265366,null,7.660000017702294,3.9074261278412223E-2,0,0,0,0,null,0.13401362915904019,null,7.660000017702294,7.5,7.17,7.6600000132933372,null,3139847.16,null,43111.22,6605.17,5217.7299999999996,35746.61,null,0,79469.91,null,0.97639648401368107,null,6.0000097099764211E-3,null,7.82309110381434,7.8932623604178893,7.9852050043354392,7.8230910965907832,null,4255389.33,0,0,0,0,0,0.11942335579629787,null,7.5800000009170958,7.3499987719341329,7.09000012127155,7.5800000007235102,null,4283876.79,null,68455,11500,6531.2,55615.33,null,0,129349,null,0.97007849076156205,null,0,null,10.61618222018198,10.668859286712721,10.770644677042531,10.602720053143404,null,10.410000026105639,0,0,0,0,0,0.12671036205621614,null,10.410000026105639,0,0,10.410000009061099,null,3462226.02,null,47248,0,2704.4749999999999,33670.58,null,0,99195.15,null,0.96989651928504228,null,0,null,208316,64775,51051,6785,322303,null,151060,21363.89,19110,12740,206570]
[null,null,"Min",null,5.1220508052440143,5.0910890030743046,6.0135783465518626,4.9974284757282996,null,4.54,1.7834727846917074E-3,5.2375112227328359E-3,9.6800648412500212E-4,4.8725982287257602E-3,2.0078600607316689E-2,7.8174851965374503E-3,1.0287349749485606E-3,null,4.5400000000000009,4.54,4.54,4.54,null,87228.23,null,500,783.36,162.07,500,null,343,66246.44,null,0.94950178914590189,null,0,null,6.6499999999999995,7.11,7.1099999999999994,6.6499999999999995,null,6.5700000178577511,8.738298888763223E-3,0.04,1.3254600384509749E-2,3.4879934545311402E-2,0.12184325275544729,null,4.5497561330712674E-5,null,6.5700000178577511,6.5699999999999994,6.5700003010869246,6.5700000052974916,null,12308.33,null,20,10,106.5,10,null,0,30,null,0.94959465254424857,null,0,null,6.9709925976744707,7.0329905724840049,6.9801957347034032,6.9577048484953048,null,0,9.6000000000000009E-3,1.0000000180425465E-2,0.04,1.8007092093220912E-2,0.10199795907406413,7.462296745692389E-5,null,6.57000000840842,6.5700004090344866,6.5700001565123678,6.5699999891298742,null,24263.47,null,20,10,61.9,10,null,0,6197,null,0.92394045693333648,null,0,null,9.1949612752318224,9.3131687183193659,9.1888457482221657,9.1358844865858728,null,9,4.3484576458998891E-3,9.9999965383197539E-3,9.9999999999999992E-2,3.7190619142361263E-2,2.7476458207305855E-2,1.4728504686352444E-4,null,9,9,9,9,null,32175,null,20,0,49,10,null,0,10000,null,0.94954181909102831,null,0,null,0,0,0,0,0,null,0,0,0,0,0]
[null,null,"Max",null,8.8702235744324316,8.575691302161891,38.693917120076648,8.541706100289792,null,8.4500000000000011,0.86754095904303807,0.38435027878954847,0.39748706838305126,0.17827412295713246,9.4646925642585492E-2,0.98362459551921066,1.1566475166690806,null,8.4500000000000011,8.4499999999999993,7.75,8.4500000000000011,null,94750037.179999992,null,4533243,1164954,761321,3738112.18,null,10336305,4882573,null,1.0890939376199531,null,0.12140261351870564,null,15.180361624271923,19.014957650027032,13.661419749428093,16.388338306876207,null,11,1.0563367764062199,1.0014281790716837,0.38000000263083894,3.4879934545311402E-2,0.12184325275544729,null,2.442598925256473,null,11,11,10.67999924120989,11,null,18967737,null,289621,156395,103335.13,249814.33,null,484932,736641.69,null,2.0001268130151515,null,0.10006660442732079,null,12.22100122100122,17.690573034231754,112.43,12.282051282051283,null,24981665.969999999,1.0514686248331109,0.96035970273591831,0.38100001074129564,1.8007092093220912E-2,0.10199795907406413,1.2210012210012211,null,11,11,10.459998957770507,11,null,24981665.969999999,null,624239,150000,83333,572894.35,null,467721,1378974,null,1.0187682944694296,null,0.10405312755624732,null,15.668853333333333,26.375731174964383,15.725224791927186,15.668853333333333,null,14.45,1.4088533333333333,0.51999998380859824,0.51999998380859824,3.7190619142361263E-2,2.7476458207305855E-2,1.7094017094017093,null,14.45,14.300000458057925,14.300000458057925,14.45,null,20322720,null,567648,2479667.84,100000,542104,null,659679.39,938001,null,1.1338491941137754,null,0,null,1455787,585000,4349000,72459,4761706.7300000004,null,1005550,154000,167867,90090,1315860]
[]
[null,null,"East Midlands",null,5.4320451129047145,5.5011843072203286,10.050765704166126,5.2239953717966916,null,5.0620287546967413,0.10681793576471593,5.5505566722867626E-2,5.8164909734488642E-5,0,1.1757950966194916E-3,0.1201469524963525,8.6311943217684609E-2,null,5.0620287546967404,5.120626474000856,5.0206170782737018,5.0429085098382878,null,281233884.37999994,null,4540788.379999999,1009675.82,135779.26,3395333.3,null,1767758.75,10352175.109999999,null,0.96776656561714136,null,2.9825914814067434E-2,null,8.0106866593894779,8.0079765464079813,8.5264215825622873,7.9988874652632731,null,7.3513108401494929,0.10535390358987545,8.5764911266518421E-3,0,0,0,null,7.9896314777356842E-2,null,7.3513108401494929,7.3926538136829123,7.3547323205263062,7.3491239260703907,null,42141460.690000013,null,299541.21999999997,6119.88,7744.38,285676.95999999996,null,292158.18,853066.92999999993,null,1.0776150601154966,null,1.3938382173985719E-2,null,4.2536558468142411,2.9645359312695998,4.835910293170798,4.3364710574204031,null,73458150.070000008,3.0634680342144605E-2,6.5450334232795317E-3,0,0,0,6.6187606166936447E-2,null,7.2993120171513564,7.2824756784738574,7.2996068591216243,7.3005550548882292,null,42141460.690000013,null,666092.79,27435.39,27489.5,611167.9,null,793750.72,1620750.97,null,0.97678164503685994,null,7.1371833060165455E-3,null,7.0060692703198564,4.9709750546280294,8.072206437313266,7.1310401939399979,null,10.017722895797561,4.4888477558076637E-2,5.8972684380540694E-3,0,0,0,5.1356260244756993E-2,null,10.017722895797563,10.108078182720719,10.225500991247642,10.006670160151684,null,42141460.690000013,null,311188.66000000003,4069744.56,11416.59,290621.14,null,614142.08000000007,1150169.52,null,0.98076848393062599,null,0,null,4328918.26,1528278.71,883285.29,155038,6895520.2599999998,null,2245500,472491.3,194068.7,206450,3118510]
[null,null,"East of England",null,5.7123922485270571,5.7520172720975227,9.4101718986065794,5.5375497827939251,null,5.3459589018390519,9.4382227982886951E-2,3.0573728108901171E-2,0,0,0,0.11853771496617076,0.12293967563004722,null,5.345958901839051,5.4013239122248304,5.5017220032399106,5.3232754669816442,null,381369192.04999995,null,8388192.6099999994,1755865.0699999998,315450.99,6316876.5499999989,null,11494616.189999999,14252682.699999999,null,0.99032624571565608,null,2.8005169670932032E-2,null,8.0666821059044302,7.9617633177581988,8.273800671895307,8.0665649315250718,null,7.8110314046263785,7.5184094262662579E-2,0,0,0,0,null,0.18046660701538825,null,7.8110314046263793,7.6391276604991809,8.0579182400036036,7.8151590496223182,null,48972547.010000005,null,842520.15,97914.52,46422.36,698183.27,null,573298.59,747235.47,null,0.9967093311476436,null,7.2813420704440626E-3,null,3.9106963193586237,4.2519042096455362,5.6249470541732176,3.8284956019799008,null,100827780.95999998,3.4432158257804199E-2,0,0,0,0,0.11735152160551569,null,7.8099784823424869,7.5819559730093289,8.04150267821068,7.8209142100069657,null,48972547.010000005,null,1515022.55,123652.95000000001,22665.059999999998,1368704.54,null,198063.15,1596875.4600000002,null,0.97304374077905775,null,5.2496740145991528E-3,null,6.8200551455220335,11.631787043706085,27.827124144548954,6.364110231252349,null,10.661052754840505,2.613358315284945E-2,0,0,0,0,0.16134914906367187,null,10.661052754840505,10.413371932875521,10.660720162519729,10.672951779027782,null,48972547.010000005,null,1186668.82,3474222.65,5974.16,1143852.52,null,590469.55000000005,1259197.08,null,0.98908127445534122,null,0,null,4778568,1847379.8299999998,721126.28,205546,7552620.1100000003,null,2896408,514836.26999999996,296235.73,238380,3945860]
[]
[null,null,"Inner London",null,7.6559199335285593,7.3185627275079854,12.298720383118201,7.1574642604908529,null,6.5032086304317209,0.30910076861764502,0.13228190866003778,1.9644669787128699E-2,0,0,0.40009525655738198,0.29158869947464466,null,6.5032086304317209,6.538317893207199,6.4062678826307025,6.4936136105074738,null,245677897.18000001,null,9727549.7599999998,3227637.33,1540512.43,4959400,null,2893984.86,11908726.27,null,0.9575076761208694,null,6.8265307717742918E-2,null,10.333657167280036,9.9097228773379538,10.351068519538892,10.440089539864797,null,9.613902121550705,0.23285778952579816,0.10627418620025997,9.8023125599361674E-4,0,0,null,0.37964283874727994,null,9.6139021215507032,9.0870356689002083,9.2756352450659243,9.8138989148673161,null,44106189.810000002,null,1489749.6,305674.42000000004,238513.63,945561.54999999993,null,509713.97,1797638.46,null,0.96372921770020525,null,4.2286611954109959E-2,null,11.053533814655079,14.591022363094725,13.927762551433787,10.080941826962928,null,39201053.590000011,0.18427873151936228,9.9134102065167248E-2,3.0005056310960913E-3,0,0,0.39343434378223296,null,9.4745688174967064,9.0516899586715365,9.2537054046752569,9.5744559408741807,null,44106189.810000002,null,1627835.6400000001,244613.12,240569.16999999998,1142653.3500000001,null,1280249.98,2023195.83,null,0.95856553926888877,null,3.8618285536762456E-2,null,16.798578212881043,85.533127185514445,44.110710474782032,12.848054029485292,null,13.112606015281873,0.19735160893300674,5.3157004940008502E-2,0,0,0,0.45605054472393808,null,13.11260601528187,13.353572605981062,13.0025232374491,13.109744631397314,null,44106189.810000002,null,1230816.45,1199361.94,157101.08000000002,879451.36,null,902710.40999999992,1506051.83,null,0.95970914252295425,null,0,null,2386570,790421.88,4787440.12,77528.73,8041960.7300000004,null,1518060,209153.69,161616.31,126480,2015310]
[null,null,"Outer London",null,6.4874180300837319,6.4685639063276144,9.1230369809885072,6.3069241084852905,null,5.8516307966248355,0.17250077565110017,8.3567356737139845E-2,2.8235387748060451E-2,0,4.517161634649141E-3,0.10670794095682187,0.24025861073112345,null,5.8516307966248347,5.8369179806521769,6.1220733489818091,5.8393600057104331,null,391664486.08000004,null,15062968.460000001,5090603.1000000006,1281658.6400000001,8690706.7200000007,null,2910448.67,17225729.949999999,null,0.96688605983180931,null,4.7667763970068507E-2,null,9.4335353971069438,9.4565097344409512,9.8540410231020079,9.4036050080298637,null,9.0028193588351133,0.15022043110456698,3.1296799592662038E-2,2.1096117613212922E-2,0,4.875057020280113E-3,null,0.22322763294111031,null,9.0028193588351151,9.0016644404093835,9.4335415912844862,8.9738310450073939,null,58726124.709999971,null,1145771.81,127408.17000000001,78660.710000000006,939702.92999999993,null,310025.36,1616626.78,null,0.98232603590604706,null,2.668130045576431E-2,null,6.3001950019823321,4.8577268510830152,6.4502600215059767,6.4160247431919313,null,85826957.099999979,6.4962472830660561E-2,3.8157583335167999E-2,2.756226664226295E-2,0,5.6070220579053399E-3,0.21645124110077474,null,8.8912595093076465,8.5928920114486473,9.2763121221543816,8.8905130192205721,null,58726124.709999971,null,2089394.8,83535.38,118612.18999999999,1887247.23,null,700159.57000000007,2930812.52,null,0.96677956116322261,null,1.6369002408731709E-2,null,10.75266277407777,21.472734095591477,16.037476175222647,10.180648648632628,null,12.212201965737568,3.0007780677606934E-2,2.297112449946952E-2,3.4633557801002135E-2,0,1.6012326059610495E-3,0.25156438916405743,null,12.212201965737568,12.019562619756869,13.198182280543088,12.174545350480164,null,58726124.709999971,null,1406843.47,1967933.66,61064.350000000006,1294168.74,null,778715.95000000019,2151927.9,null,0.96667782869932417,null,0,null,2833278.96,1047371.9700000001,634842.59000000008,82435.820000000007,4597929.3400000008,null,2327849,433550.00999999995,281830.99,154720,3197950]
[null,null,"London",null,6.8932448379899434,6.8023652676841051,10.695770082223005,6.5683510187870704,null,6.0779271780143223,0.21994266594002013,0.10048617479568868,2.5251786576826165E-2,0,2.9483278299444185E-3,0.20860288645869621,0.25808581837444355,null,6.0779271780143223,6.1123633575540683,6.262818534714043,6.0404551545433049,null,637342383.26000023,null,24790518.220000003,8318240.4300000006,2822171.0700000003,13650106.719999999,null,5804433.5300000012,29134456.220000003,null,0.96307609144923989,null,5.6035516117561246E-2,null,9.8025914570277042,9.7628851524535367,10.153843354054496,9.7692947362069056,null,9.253367455955285,0.18410231121433721,6.203803905766709E-2,1.2848467121011833E-2,0,2.8762504194269696E-3,null,0.28735893325997536,null,9.253367455955285,9.0593760187805099,9.3382939621132781,9.270221566567308,null,102832314.52000001,null,2635521.41,433082.59,317174.33999999997,1885264.4800000002,null,819739.33000000007,3414265.2399999998,null,0.97477107850992373,null,3.3020958251967235E-2,null,7.7263222383096961,8.9507084634822061,9.6048730103071644,7.4282848952484724,null,125028010.69,0.10076050300662431,5.645215007327533E-2,2.0193089369058531E-2,0,3.924767292024082E-3,0.26955084814558117,null,9.0662677139392773,8.7858227161079636,9.2667747874215145,9.0794199303583039,null,102832314.52000001,null,3717230.44,328148.49999999994,359181.36,3029900.58,null,1980409.5500000003,4954008.3500000006,null,0.96359993978477099,null,2.5407773679494195E-2,null,12.720653052506758,44.165641010451196,26.270519233220146,11.041459475150369,null,12.505290156284943,8.4479436871809976E-2,3.2796852274543896E-2,2.3360078085700047E-2,0,1.0800195268283054E-3,0.31812614813811585,null,12.505290156284941,12.492125508941529,13.126862125861132,12.476347870540968,null,102832314.52000001,null,2637659.92,3167295.6,218165.43000000002,2173620.1,null,1681426.36,3657979.7300000004,null,0.96384679994017408,null,0,null,5219848.96,1837793.8499999999,5422282.71,159964.54999999999,12639890.07,null,3845909,642703.69999999995,443447.3,281200,5213260]
[]
[null,null,"North East",null,5.4754385692073475,5.4078965514257478,8.2466762659703168,5.235495253687974,null,4.914367409152681,0.16387641202668068,8.8686224233934255E-2,5.0760184220308105E-2,1.6128613551887863E-3,0,0.16151210673408489,9.4623371484468907E-2,null,4.9143674091526819,4.9229070233633276,4.8448698606911984,4.9142585434703232,null,158353989.41000003,null,2784706,1349486.26,173352.66999999998,1261867.07,null,499840.69,5588196.2300000004,null,0.96970544183474472,null,6.031751273264549E-2,null,7.5612142099067485,7.6576966047957304,7.7325184396473379,7.5130221658216678,null,7.3901179843151086,5.3787107729785261E-2,2.8595714140618445E-2,0,0,0,null,8.8713403721237677E-2,null,7.3901179843151068,7.5726001689049571,7.4303862661599629,7.3244295559798669,null,34308126.5,null,356344.5,58270.01,46140.13,251934.36,null,246354.55,988369.60000000009,null,0.97722624872341279,null,1.1238166045370481E-2,null,6.2315763975822005,5.703993666270379,6.6755704104203089,6.4006220284919095,null,40675121.450000003,4.4966215031390228E-2,0,0,0,0,0.12481532113136791,null,7.2400703212625261,7.3187825652908503,7.2600098936327342,7.2072002334999175,null,34308126.5,null,701219.48,232593.58000000002,61594.64,407031.26,null,362748.52999999997,1225196.78,null,0.96737875440223764,null,7.0889329544573942E-3,null,10.910261351375558,11.385058635786649,12.739011341606505,10.614684095576036,null,9.9242062850887844,7.4218153404527415E-3,0,0,0,0,0.14600095991949261,null,9.9242062850887844,9.9739483304574748,9.9839171062707788,9.9034178159049073,null,34308126.5,null,465338,7373146.8499999996,52495.63,296712.70999999996,null,466246.41,894648.94,null,0.97152573996810832,null,0,null,2970874.33,918249.2,724917.78,92034.94,4706076.2500000009,null,1796340,308923.81,276206.19,173810,2555280]
[null,null,"North West",null,5.5807788300480778,5.4784412650763157,10.466400926124583,5.3836114765810654,null,5.1113967085125598,0.12544532593021199,7.549230801051364E-2,1.390882610827588E-2,7.4052436699781994E-4,1.5253441598021636E-3,0.14396511210576984,0.1083046808539454,null,5.1113967085125598,5.0725031957964966,5.2035122629954289,5.1276281223133582,null,486695267.51999998,null,9632092.2100000009,2788968.0100000002,1025318.04,5817806.1600000001,null,2954499.35,14176563.710000001,null,0.97853452003674368,null,4.3193228579839781E-2,null,7.7517910250055246,7.8366253628476636,7.7970315409652571,7.7385457655795014,null,7.4921069989850348,0.1347483568575315,0,0,1.1654683835495545E-3,0,null,0.12377020077940913,null,7.4921069989850348,7.4721126815967418,7.3005852491233805,7.5078115301201258,null,91630363.419999987,null,1440872.02,288477.25,152247.9,1000146.87,null,145427.57,2029247.3500000003,null,0.98135033519249737,null,1.4064595305008193E-2,null,5.2503027766673336,5.3022926741146374,5.2149169349576283,5.2465699939202723,null,131520012.04000001,9.4584008597175986E-2,0,0,8.9421647165519318E-4,0,0.12921650954761629,null,7.3504600699035825,7.3340004944278041,7.2520902547265642,7.3593461311362898,null,91630363.419999987,null,2312039.8899999997,412322.4,189806.4,1709911.0899999999,null,733223.62,3181873.7499999995,null,0.97235489404332942,null,7.0056493150922093E-3,null,9.1705563684231084,26.298132573681858,56.116115317037767,8.0766533309652999,null,9.9969095084498125,0.11648982713353931,0,0,1.9688233534053269E-3,0,0.1503563993074479,null,9.9969095084498107,9.8940089316483153,9.7380674200749411,10.003249634103048,null,91630363.419999987,null,1527373.18,3502696.8299999996,121550.98,1223111.72,null,1050277.6200000001,2169534.36,null,0.97212919591951996,null,0,null,7233544,2229126.09,1670720.4100000001,216448.5,11349839,null,4337490,682315.87000000011,623259.13,371825,6014890]
[null,null,"South East",null,6.0000911373954944,6.0975105398311866,7.5052260061825518,5.8803449583197454,null,5.5582413569648192,9.6681754326810102E-2,0.11612235334535592,3.6574192320474402E-3,0,0,8.5001392612096729E-2,0.1403868609143647,null,5.5582413569648184,5.5090804952610215,5.6476441326009761,5.5578865525996548,null,588810379.09000003,null,14106725.68,1029830.8500000001,993048.95000000007,12083845.879999999,null,2792151.8,27975129.449999999,null,0.96694438364807833,null,4.0691159732776469E-2,null,8.3164479337159225,8.1804410130011878,8.7583250313425438,8.2856448063271415,null,8.0752785813027614,0.12751179515432121,7.1838860225683001E-3,1.7525047861173012E-3,0,0,null,0.10472116645015458,null,8.0752785813027614,7.9303276707691976,8.5394249971565852,8.0430375695907479,null,66638648.440000013,null,798318.46,37337.15,41323.449999999997,719657.86,null,213190,2913020.7600000002,null,0.975383147481099,null,2.4543495167956831E-2,null,3.8076388086908972,3.6343537975396991,4.8789604671697644,3.7427923233038509,null,145031221.75,6.6390545827781464E-2,9.7606723261690672E-3,1.3209318234912763E-3,0,0,9.8725993887990665E-2,null,8.072014806534046,7.9994958330503962,8.3991729849224743,8.0532992428892776,null,66638648.440000013,null,1773826.22,70485.840000000011,78891.7,1624448.68,null,1163349.97,6312694.9500000002,null,0.9642035798720805,null,1.3619292172314876E-2,null,6.3709322882469275,15.902581185857183,11.705054994895102,5.9333935478441067,null,11.059032862759452,8.1582150903222392E-2,1.4618582772866928E-2,2.8472617540662546E-3,0,0,7.1247872441448257E-2,null,11.059032862759453,10.200152634268186,11.359928541030301,11.062407926104269,null,66638648.440000013,null,753666.63,2033023.4300000002,19866.920000000002,713024.85,null,557636.05000000005,4400217.91,null,0.96138217878436405,null,0,null,5138965.6100000003,1260126.4000000001,1572128.55,163152.84,8134373.4000000004,null,4381910,426087.43000000005,745380.36,344942,5898319.79]
[null,null,"South West",null,5.4851750415502432,5.4877094136667948,8.5973130486078908,5.3827398942556481,null,5.168102251797543,8.0157499047503869E-2,2.044110709285726E-2,1.4819050570318703E-3,5.0792796227697591E-4,0,7.4032938894706801E-2,0.1404514116983229,null,5.1681022517975439,5.1941586114340073,5.09821874466164,5.1669555710544,null,315678050.44,null,8295551.0700000003,1005012.56,643802.91,6646735.5999999996,null,2536811,10636290.34,null,0.97620467797837152,null,1.9629900472137553E-2,null,7.5917707160713963,7.603085078119574,7.7267448117257533,7.5885462089940177,null,7.3825886639820535,6.8697789715540608E-2,0,0,0,0,null,0.14048426237380157,null,7.3825886639820535,7.4072277378485083,7.5473199004483016,7.3778249077854561,null,41819662.460000001,null,639146.4,37916.550000000003,14182.289999999999,587047.56000000006,null,189099,951008.03999999992,null,0.98598649970664021,null,7.81106513286077E-3,null,3.8496707042532448,3.6998151677973943,4.1254087394055734,3.8571208868999931,null,82732441.010000005,6.7356940221309461E-2,0,0,0,0,0.13046976211779207,null,7.3577488303227607,7.3536441087730884,7.4271046503135247,7.3569156505870472,null,41819662.460000001,null,1467035.93,125551.94999999998,30944.239999999998,1310539.74,null,511563,2125073.9300000002,null,0.98324533970470174,null,9.3453468372295158E-3,null,6.4583593747773156,8.8224818908613276,8.8195155331835622,6.3000667800568344,null,10.006057684638231,6.3017001697716749E-2,0,0,0,0,0.14469251155503968,null,10.006057684638233,10.018891776224372,10.332447624750902,10.001250012031011,null,41819662.460000001,null,958395.83000000019,3382269.86,10903.51,899004.41000000015,null,399903,1887586.0399999998,null,0.97609156469147762,null,0,null,3202563,667878.12999999989,1087832.8700000001,104461,5062735,null,2612628,285329.71999999997,500712.27999999997,234997,3633666.9999999995]
[null,null,"West Midlands",null,5.6262190845658635,5.5215787947513695,7.3766047916042332,5.3743011480961256,null,5.1388697640967251,0.15243875731605494,2.6762848278634663E-2,1.9650015010678978E-2,9.546340001894256E-3,0,0.1761554731596521,0.10279588670222277,null,5.1388697640967251,5.1384595962655331,5.2675810827201834,5.1167876054087591,null,371653084.12000006,null,6916799.0499999989,1856514.08,468390.68999999994,4591894.2799999993,null,1749427.23,13821743.020000001,null,0.97217549655345381,null,4.3050558604033402E-2,null,7.9354921858334144,7.7611642166471677,8.2852637198917947,7.8746995985795563,null,7.6820308358254374,0.16002665734864907,0,0,0,0,null,9.343469265933145E-2,null,7.6820308358254366,7.4445952095096759,7.8284645689439225,7.6730739823990426,null,66955121.279999986,null,531742.5,73184,139903.08000000002,318655.42000000004,null,198566,1881900.98,null,0.98667708937183662,null,1.1093146950681768E-2,null,5.5297005320088015,4.6573577088932092,11.351624121985784,5.0238737397586517,null,92607648.479999989,0.10719669328251323,0,0,0,0,8.9552365375103957E-2,null,7.5244330749232589,7.3347298385745239,7.810615319234838,7.5155080153579306,null,66955121.279999986,null,1102173.9300000002,289343.92000000004,92478.37,720351.64000000013,null,457249,2665703.88,null,0.97818707389105863,null,9.6277501687087735E-3,null,9.6295862478388283,14.179876512721451,333.20448500095773,7.6869628467259723,null,10.121685126306399,0.15354806357702555,0,0,0,0,0.21205065081431779,null,10.121685126306399,10.490836745161502,10.608344126159128,10.09990599318574,null,66955121.279999986,null,1507600.0400000003,3671593.43,10651.98,1380519.6900000002,null,340699,2378649.2799999998,null,0.97698026745485045,null,0,null,5684377,1867301.03,1357148.97,190505.36,9099332.3599999994,null,3172260,487165.82,508374.18,337445,4505245]
[null,null,"Yorkshire and The Humber",null,5.4511163514204082,5.3722145142533275,9.2907520155450012,5.3445043865107866,null,5.0963410985746656,0.13382604841385187,0,8.2782160210623512E-3,1.2088731713191547E-3,0,9.4215289228184479E-2,0.11724682601132276,null,5.0963410985746664,5.09301854265878,5.056406265216034,5.0993035499236701,null,333126362.70999998,null,7322640.4399999995,2034189.2000000002,410037.12999999995,4878414.1099999994,null,1018264.78,11700210.899999999,null,0.97944256092004212,null,2.42613353577243E-2,null,7.7214535625649097,7.8822610887595888,7.9296895758442485,7.6913132602409027,null,7.4679300021236923,0.10473590063354947,0,0,0,0,null,0.14872465704729079,null,7.4679300021236914,7.6414325144064916,7.5333348550920283,7.4414439394407772,null,62731901.260000005,null,868778.42,110143.49,89681.790000000008,668953.14,null,309301.40000000002,1282875.3100000003,null,0.99096861544330472,null,1.5420262709814886E-2,null,5.6959958864191051,6.4352245996046813,9.629742927348337,5.5185798513227011,null,83365853.089999989,7.297575400826109E-2,0,0,0,0,0.13402512358347965,null,7.391429690352572,7.6166020265480094,7.4979989191845986,7.361745392963928,null,62731901.260000005,null,1511631.61,161849.88,94651.38,1255130.3500000001,null,309207.05,1970628.11,null,0.98129161319386204,null,8.8973647409368688E-3,null,10.647450062481115,16.530337169349806,76.509992162863583,9.828888015563825,null,10.102266769914388,6.6274154128108553E-2,0,0,0,0,0.19643520673295112,null,10.102266769914388,10.504511259713258,10.168465685176351,10.067938031430922,null,62731901.260000005,null,1179096.3999999999,4893001.8699999992,31549,982618.39999999991,null,286792.07,1304954.3899999999,null,0.97933692914611781,null,0,null,5639333,2012515.57,1184645.43,180200,9016694,null,2937750,566778.29,387242.71,268330,4160101]

{"sheet":"Options","index":9,"n_rows":50,"n_cols":7,"rows_kept":50,"cut":false,"hidden":true,"merged":[]}
["ChartOptions_3yrs",null,"ChartOptions_2yrsD",null,"ChartOptions_2yrsW",null,"ChartOptions_9mth"]
["3-4 yrs per hour",null,"2 yrs (D) per hour",null,"2 yrs(W) per hour",null,"9mth - 2 yrs per hour"]
["% Pass through rate",null,"% Pass through rate",null,"% Pass through rate",null,"% Pass through rate"]
["% Funding provided through supplements",null,"% Funding provided through supplements",null,"% Funding provided through supplements",null,"% Funding provided through supplements"]
["SEN Inclusion Fund",null,"SEN Inclusion Fund",null,"SEN Inclusion Fund",null,"SEN Inclusion Fund"]
[]
["AllAges_SortChoice"]
["Original",1]
["All provider rate",2]
["PVI rate",3]
["Nursery school rate",4]
["Primary nursery place rate",5]
["Pass-through rate",6]
["Funding paid through supplements",7]
["SEN Inclusion Fund - All providers",8]
["SEN Inclusion Fund - PVI",9]
["SEN Inclusion Fund - Nursery school",10]
["SEN Inclusion Fund - Primary nursery places",11]
[]
["SortOptions_NonEYFF"]
["Original",1]
["3-4 yr olds Total other spend",2]
["3-4 yr olds SEN Inclusion Fund ",3]
["3-4 yr olds Contingency funding",4]
["3-4 yr olds Central spend",5]
["2 yr olds (W) Total other spend",6]
["2 yr olds (W) SEN Inclusion Fund ",7]
["2 yr olds (W) Contingency funding",8]
["2 yr olds (W) Central spend",9]
["2 yr olds (D) Total other spend",10]
["2 yr olds (D)  SEN Inclusion Fund ",11]
["2 yr olds (D)  Contingency funding",12]
["2 yr olds (D)  Central spend",13]
["9mth - 2yr olds Total other spend",14]
["9mth - 2yr olds SEN Inclusion Fund ",15]
["9mth - 2yr olds Contingency funding",16]
["9mth - 2yr olds Central spend",17]
[]
["Named range - assigned via control properties"]
[1,null,"LA option - number for button 11"]
[{"$f":"INDEX(LAs,A40)","v":"Choice"},null,"LA Choice - look up based on cell above"]
[1,null,"SortChoice_3yrs - sorthing option chosen on sheet"]
[1,null,"SortChoice_2yrsD - sorthing option chosen on sheet"]
[1,null,"SortChoice_2yrsW - sorthing option chosen on sheet"]
[1,null,"SortChoice_9mth - sorthing option chosen on sheet"]
[1,null,"SortChoice_Non - sorthing option chosen on sheet"]
[1,null,"ChartChoice_3yrs - chart chosen on named sheet"]
[1,null,"ChartChoice_2yrsD - chart chosen on named sheet"]
[0,null,"ChartChoice_2yrsW - chart chosen on named sheet"]
[0,null,"ChartChoice_9mth - chart chosen on named sheet"]

{"sheet":"Stat Neighbours","index":10,"n_rows":154,"n_cols":13,"rows_kept":154,"cut":false,"hidden":true,"merged":[]}
["Statistical Neighbours"]
[]
["LA No","Region","Choice","LA No","LA No","LA No","LA No","LA No","LA No","LA No","LA No","LA No","LA No"]
[301,"London (Outer)","Barking and Dagenham",203,308,352,821,330,320,871,892,331,316]
[302,"London (Outer)","Barnet",315,314,870,319,312,317,313,826,307,305]
[370,"Yorkshire and The Humber","Barnsley",807,371,359,372,812,384,342,840,394,357]
[800,"South West","Bath and North East Somerset",916,873,931,865,938,850,802,803,885,878]
[822,"East of England","Bedford Borough",941,886,866,826,937,940,887,919,881,831]
[303,"London (Outer)","Bexley",311,883,887,826,882,941,886,866,822,881]
[330,"West Midlands","Birmingham",821,333,336,892,352,335,308,831,320,380]
[889,"North West","Blackburn with Darwen",380,335,350,874,354,831,382,353,331,894]
[890,"North West","Blackpool",805,806,876,807,861,393,810,812,340,357]
[350,"North West","Bolton",382,831,332,357,354,894,381,383,372,331]
[839,"South West","Bournemouth, Christchurch & Poole",882,845,866,935,886,921,938,916,878,800]
[867,"South East","Bracknell Forest",919,850,823,869,931,938,358,803,825,816]
[380,"Yorkshire and The Humber","Bradford",354,353,889,382,335,874,831,350,332,894]
[304,"London (Outer)","Brent",307,320,306,309,316,308,313,871,317,203]
[846,"South East","Brighton and Hove",870,801,800,839,882,851,383,373,816,845]
[801,"South West","Bristol, City of",851,852,870,373,846,831,331,879,383,874]
[305,"London (Outer)","Bromley",358,919,867,319,356,822,931,334,850,823]
[825,"South East","Buckinghamshire",936,869,868,919,931,850,867,873,823,358]
[351,"North West","Bury",381,888,808,343,356,877,334,891,886,896]
[381,"Yorkshire and The Humber","Calderdale",888,808,351,841,891,830,343,382,359,383]
[873,"East of England","Cambridgeshire",931,916,850,800,865,938,869,919,885,937]
[202,"Inner London","Camden",213,205,207,206,212,352,203,870,309,302]
[823,"East of England","Central Bedfordshire",850,855,937,803,881,895,938,867,869,919]
[895,"North West","Cheshire East",896,937,823,815,850,877,802,811,885,855]
[896,"North West","Cheshire West and Chester",877,937,811,895,885,356,860,891,334,881]
[908,"South West","Cornwall",933,926,878,884,935,838,893,925,845,921]
[331,"West Midlands","Coventry",831,350,874,383,373,851,887,335,357,852]
[306,"London (Outer)","Croydon",308,320,209,309,304,203,208,330,315,307]
[942,"North West","Cumberland"]
[841,"North East","Darlington",808,344,342,392,840,381,390,359,343,807]
[831,"East Midlands","Derby",874,373,350,894,331,335,332,887,382,383]
[830,"East Midlands","Derbyshire",891,888,860,925,885,940,896,359,886,"No LA selected"]
[878,"South West","Devon",933,893,838,884,908,916,935,865,885,926]
[371,"Yorkshire and The Humber","Doncaster",372,370,812,359,384,357,813,807,332,894]
[838,"South West","Dorset",878,933,893,916,885,845,935,908,865,926]
[332,"West Midlands","Dudley",372,894,887,359,371,888,813,830,357,891]
[840,"North East","Durham",342,390,394,841,370,384,359,807,808,392]
[307,"London (Outer)","Ealing",313,315,317,312,310,304,302,871,320,870]
[811,"Yorkshire and The Humber","East Riding of Yorkshire",896,860,877,815,937,895,830,891,885,929]
[845,"South East","East Sussex",886,885,838,881,935,878,802,933,839,926]
[308,"London (Outer)","Enfield",320,306,203,309,330,301,821,870,312,307]
[881,"East of England","Essex",886,885,860,938,937,803,823,855,850,802]
[390,"North East","Gateshead",394,840,342,841,393,384,392,357,370,359]
[916,"South West","Gloucestershire",865,800,938,873,878,838,893,850,803,885]
[203,"London (Outer)","Greenwich",308,301,309,320,352,870,210,205,307,315]
[204,"Inner London","Hackney",210,208,309,209,206,320,205,306,203,308]
[876,"North West","Halton",805,340,394,806,393,807,370,812,840,841]
[205,"Inner London","Hammersmith and Fulham",212,213,202,207,206,309,203,315,870,210]
[850,"South East","Hampshire",938,803,823,873,802,916,855,885,937,919]
[309,"Inner London","Haringey",320,204,210,308,208,209,306,203,205,206]
[310,"London (Outer)","Harrow",317,307,313,312,302,315,314,871,319,304]
[805,"North East","Hartlepool",876,890,806,340,393,394,807,355,370,812]
[311,"London (Outer)","Havering",303,887,881,351,886,883,941,866,888,882]
[884,"West Midlands","Herefordshire",893,878,908,933,838,865,935,926,916,"No LA selected"]
[919,"East of England","Hertfordshire",867,931,850,358,823,825,869,938,873,868]
[312,"London (Outer)","Hillingdon",313,317,871,319,302,870,307,331,826,315]
[313,"London (Outer)","Hounslow",307,312,871,317,302,310,315,870,856,319]
[921,"South East","Isle of Wight",880,926,845,908,925,879,882,839,935,830]
[206,"Inner London","Islington",205,202,213,210,309,204,352,208,212,203]
[207,"Inner London","Kensington and Chelsea",213,205,212,202,302,201,315,870,846,206]
[886,"South East","Kent",881,845,866,885,888,941,891,937,935,860]
[810,"Yorkshire and The Humber","Kingston Upon Hull, City of",861,806,890,812,355,805,851,393,879,852]
[314,"London (Outer)","Kingston upon Thames",302,319,315,318,868,870,936,919,867,305]
[382,"Yorkshire and The Humber","Kirklees",350,381,332,351,831,354,808,383,888,894]
[340,"North West","Knowsley",876,805,393,806,394,890,341,355,357,807]
[208,"Inner London","Lambeth",204,209,210,309,306,206,320,205,308,203]
[888,"North West","Lancashire",891,381,830,343,351,808,886,860,359,896]
[383,"Yorkshire and The Humber","Leeds",373,841,381,351,808,350,831,392,382,344]
[856,"East Midlands","Leicester",871,313,333,336,312,889,331,335,852,874]
[855,"East Midlands","Leicestershire",803,937,823,885,850,881,938,802,860,895]
[209,"Inner London","Lewisham",208,306,309,320,204,210,308,304,203,205]
[925,"East Midlands","Lincolnshire",926,830,891,935,813,940,908,860,885,"No LA selected"]
[341,"North West","Liverpool",355,393,391,340,806,805,394,876,390,841]
[821,"East of England","Luton",330,871,333,380,308,335,312,831,317,874]
[352,"North West","Manchester",892,801,852,330,355,851,373,341,336,391]
[887,"South East","Medway",866,894,332,882,886,883,941,372,311,940]
[315,"London (Outer)","Merton",302,307,870,314,319,317,312,212,313,308]
[806,"North East","Middlesbrough",805,355,876,861,357,354,890,393,810,340]
[826,"South East","Milton Keynes",822,383,941,303,870,883,866,919,886,831]
[391,"North East","Newcastle upon Tyne",355,341,806,373,383,805,876,393,394,390]
[316,"Inner London","Newham",304,320,301,203,309,307,871,308,821,204]
[926,"East of England","Norfolk",925,935,908,933,878,921,838,845,893,"No LA selected"]
[812,"Yorkshire and The Humber","North East Lincolnshire",807,371,370,357,372,359,342,384,894,813]
[813,"Yorkshire and The Humber","North Lincolnshire",371,894,372,925,830,359,332,926,940,891]
[940,"East Midlands","North Northamptonshire",941,891,860,925,830,886,885,935,937,"No LA selected"]
[802,"South West","North Somerset",885,803,938,850,916,855,881,937,865,845]
[392,"North East","North Tyneside",841,808,343,342,344,390,840,929,381,359]
[815,"Yorkshire and The Humber","North Yorkshire",895,811,937,896,857,823,885,860,877,869]
[929,"North East","Northumberland",811,877,392,896,808,381,860,830,891,888]
[892,"East Midlands","Nottingham",352,336,852,333,801,330,851,355,331,810]
[891,"East Midlands","Nottinghamshire",830,860,888,885,925,940,881,886,896,"No LA selected"]
[353,"North West","Oldham",354,380,335,357,382,350,831,332,889,372]
[931,"South East","Oxfordshire",873,919,800,850,869,865,916,825,867,938]
[874,"East of England","Peterborough",831,894,887,335,879,852,851,373,350,372]
[879,"South West","Plymouth",880,851,894,921,882,372,839,887,874,357]
[851,"South East","Portsmouth",852,879,373,831,874,801,894,882,331,355]
[870,"South East","Reading",319,826,801,822,846,302,312,831,373,852]
[317,"London (Outer)","Redbridge",312,307,302,313,871,310,315,821,319,870]
[807,"North East","Redcar and Cleveland",370,812,359,342,357,371,372,840,344,841]
[318,"London (Outer)","Richmond upon Thames",868,936,872,931,314,825,919,305,873,869]
[354,"North West","Rochdale",353,357,350,335,382,806,372,371,831,861]
[372,"Yorkshire and The Humber","Rotherham",371,359,332,357,370,894,813,807,812,384]
[857,"East Midlands","Rutland",815,869,895,865,823,825,931,850,937,873]
[355,"North West","Salford",341,806,393,391,805,373,394,357,390,876]
[333,"West Midlands","Sandwell",336,335,330,831,331,892,874,861,821,889]
[343,"North West","Sefton",344,888,808,392,891,351,359,830,841,381]
[373,"Yorkshire and The Humber","Sheffield",831,383,851,350,894,879,852,874,357,381]
[893,"West Midlands","Shropshire",878,884,838,865,933,916,935,885,908,"No LA selected"]
[871,"South East","Slough",312,313,317,821,307,856,870,302,889,330]
[334,"West Midlands","Solihull",356,877,896,937,358,895,351,881,823,811]
[933,"South West","Somerset",878,908,935,838,893,926,884,916,845,865]
[803,"South West","South Gloucestershire",938,855,850,802,885,916,823,881,937,865]
[393,"North East","South Tyneside",394,390,355,805,876,807,357,342,341,840]
[852,"South East","Southampton",851,373,874,879,831,801,331,861,810,355]
[882,"East of England","Southend-on-Sea",839,866,887,886,845,879,921,894,935,881]
[210,"Inner London","Southwark",204,208,309,206,203,209,205,320,308,306]
[342,"North West","St. Helens",359,807,841,840,370,808,384,390,357,392]
[860,"West Midlands","Staffordshire",891,830,885,937,881,811,896,940,888,"No LA selected"]
[356,"North West","Stockport",896,334,877,937,881,885,351,888,886,802]
[808,"North East","Stockton-on-Tees",841,381,888,351,359,342,343,344,392,840]
[861,"West Midlands","Stoke-on-Trent",810,806,357,371,812,335,370,354,372,890]
[935,"East of England","Suffolk",933,926,878,908,838,893,925,845,885,916]
[394,"North East","Sunderland",390,393,840,370,342,876,357,807,384,841]
[936,"South East","Surrey",868,825,869,872,919,931,867,850,873,823]
[319,"London (Outer)","Sutton",305,870,919,822,867,302,314,303,826,866]
[866,"South West","Swindon",886,887,882,941,894,881,839,891,888,940]
[357,"North West","Tameside",372,807,371,812,359,342,370,394,841,390]
[894,"West Midlands","Telford and Wrekin",887,372,813,332,371,866,359,874,888,879]
[883,"East of England","Thurrock",887,303,311,866,332,882,941,894,826,874]
[880,"South West","Torbay",921,879,807,372,882,894,359,839,812,926]
[211,"Inner London","Tower Hamlets",202,316,213,206,352,204,330,821,205,309]
[358,"North West","Trafford",919,305,334,356,867,823,816,895,850,825]
[384,"Yorkshire and The Humber","Wakefield",359,371,370,342,372,390,840,394,807,812]
[335,"West Midlands","Walsall",831,354,874,861,350,357,332,333,382,894]
[320,"London (Outer)","Waltham Forest",308,309,306,304,203,330,821,307,209,315]
[212,"Inner London","Wandsworth",205,207,315,213,202,870,302,846,309,318]
[877,"North West","Warrington",896,937,334,811,356,860,895,891,351,881]
[937,"West Midlands","Warwickshire",896,885,860,855,823,895,881,877,850,802]
[869,"South East","West Berkshire",825,850,823,931,936,919,873,895,867,857]
[943,"North West","Westmorland and Furness"]
[941,"East Midlands","West Northamptonshire",940,886,866,881,937,822,860,891,885,887]
[938,"South East","West Sussex",850,803,916,802,885,881,855,823,865,800]
[213,"Inner London","Westminster",202,205,207,206,212,352,203,870,302,315]
[359,"North West","Wigan",342,372,807,371,370,384,808,332,357,812]
[865,"South West","Wiltshire",916,893,878,873,938,800,885,850,802,838]
[868,"South East","Windsor and Maidenhead",936,825,869,919,872,931,867,873,850,358]
[344,"North West","Wirral",343,841,808,342,392,807,359,888,381,840]
[872,"South East","Wokingham",936,868,825,869,867,919,895,931,857,850]
[336,"West Midlands","Wolverhampton",333,892,335,331,330,831,852,373,874,861]
[885,"West Midlands","Worcestershire",937,802,881,860,838,845,938,803,855,886]
[816,"Yorkshire and The Humber","York",937,896,877,356,895,919,850,823,867,885]

{"sheet":"Select LAs","index":11,"n_rows":41,"n_cols":18,"rows_kept":41,"cut":false,"hidden":true,"merged":[]}
["LAs to benchmark",null,null,null,6,null,null,null,null,1,null,null,null,null,3]
["LA","Name","Symbol","Result","values","order","LA name","LA code",null,"value_2yrsD","order_2yrsD","LA name","LA code",null,"value_2yrsW","order_2yrsW","LA name","LA code"]
[{"$f":"INDEX('Stat Neighbours'!A3:A155,MATCH(LAchoice,LAs,0))","v":"LA No"},{"$f":"IF('Select LAs'!A3 = \"LA No\", \"No LA selected\", VLOOKUP('Select LAs'!A3,'Stat Neighbours'!$A$4:$C$155,3,0))","v":"No LA selected"},null,{"$f":"CONCATENATE(B3,C3)","v":"No LA selected"},{"$f":"IF(D3=\"No LA selected\", \"No LA selected\", VLOOKUP(D3,'3-4 year olds '!$B$21:$N$31,$E$1+2,0))","v":"No LA selected"},null,{"$f":"IFERROR(IF($A$3=\"LA No\", \"No LA selected\", INDEX($D$3:$D$13,MATCH(H3,$A$3:$A$13,0))), \"No LA selected\")","v":"No LA selected"},301,null,{"$f":"IF(D3=\"No LA selected\", \"No LA selected\", VLOOKUP(D3,'2 year olds  (D)'!$B$29:$M$39,$J$1+2,0))","v":"No LA selected"},null,{"$f":"IFERROR(IF($A$3=\"LA No\", \"No LA selected\", INDEX($D$3:$D$13,MATCH(M3,$A$3:$A$13,0))), \"No LA selected\")","v":"No LA selected"},301,null,{"$f":"IF(D3=\"No LA selected\", \"No LA selected\", VLOOKUP(D3,'2 year olds (W)'!$B$29:$N$39,$O$1+2,0))","v":"No LA selected"},null,{"$f":"IFERROR(IF($A$3=\"LA No\", \"No LA selected\", INDEX($D$3:$D$13,MATCH(R3,$A$3:$A$13,0))), \"No LA selected\")","v":"No LA selected"},301]
[{"$f":"IF(OR(ISBLANK(D16),D16=1), 0, INDEX(OFFSET(LAs,0,-2),D16))","v":0},{"$f":"IF(OR(ISBLANK(D16),D16=1),\"No LA selected\",INDEX(LAs,D16))","v":"No LA selected"},null,{"$f":"CONCATENATE(B4,C4)","v":"No LA selected"},{"$f":"IF(D4=\"No LA selected\", \"No LA selected\", VLOOKUP(D4,'3-4 year olds '!$B$21:$N$31,$E$1+2,0))","v":"No LA selected"},null,{"$f":"IFERROR(IF($A$3=\"LA No\", \"No LA selected\", INDEX($D$3:$D$13,MATCH(H4,$A$3:$A$13,0))), \"No LA selected\")","v":"No LA selected"},203,null,{"$f":"IF(D4=\"No LA selected\", \"No LA selected\", VLOOKUP(D4,'2 year olds  (D)'!$B$29:$M$39,$J$1+2,0))","v":"No LA selected"},null,{"$f":"IFERROR(IF($A$3=\"LA No\", \"No LA selected\", INDEX($D$3:$D$13,MATCH(M4,$A$3:$A$13,0))), \"No LA selected\")","v":"No LA selected"},203,null,{"$f":"IF(D4=\"No LA selected\", \"No LA selected\", VLOOKUP(D4,'2 year olds (W)'!$B$29:$N$39,$O$1+2,0))","v":"No LA selected"},null,{"$f":"IFERROR(IF($A$3=\"LA No\", \"No LA selected\", INDEX($D$3:$D$13,MATCH(R4,$A$3:$A$13,0))), \"No LA selected\")","v":"No LA selected"},203]
[0,"No LA selected",null,{"$f":"CONCATENATE(B5,C5)","v":"No LA selected"},{"$f":"IF(D5=\"No LA selected\", \"No LA selected\", VLOOKUP(D5,'3-4 year olds '!$B$21:$N$31,$E$1+2,0))","v":"No LA selected"},null,"No LA selected",308,null,{"$f":"IF(D5=\"No LA selected\", \"No LA selected\", VLOOKUP(D5,'2 year olds  (D)'!$B$29:$M$39,$J$1+2,0))","v":"No LA selected"},null,"No LA selected",308,null,{"$f":"IF(D5=\"No LA selected\", \"No LA selected\", VLOOKUP(D5,'2 year olds (W)'!$B$29:$N$39,$O$1+2,0))","v":"No LA selected"},null,"No LA selected",308]
[0,"No LA selected",null,"No LA selected",{"$f":"IF(D6=\"No LA selected\", \"No LA selected\", VLOOKUP(D6,'3-4 year olds '!$B$21:$N$31,$E$1+2,0))","v":"No LA selected"},null,"No LA selected",352,null,{"$f":"IF(D6=\"No LA selected\", \"No LA selected\", VLOOKUP(D6,'2 year olds  (D)'!$B$29:$M$39,$J$1+2,0))","v":"No LA selected"},null,"No LA selected",352,null,{"$f":"IF(D6=\"No LA selected\", \"No LA selected\", VLOOKUP(D6,'2 year olds (W)'!$B$29:$N$39,$O$1+2,0))","v":"No LA selected"},null,"No LA selected",352]
[0,"No LA selected",null,"No LA selected",{"$f":"IF(D7=\"No LA selected\", \"No LA selected\", VLOOKUP(D7,'3-4 year olds '!$B$21:$N$31,$E$1+2,0))","v":"No LA selected"},null,"No LA selected",821,null,{"$f":"IF(D7=\"No LA selected\", \"No LA selected\", VLOOKUP(D7,'2 year olds  (D)'!$B$29:$M$39,$J$1+2,0))","v":"No LA selected"},null,"No LA selected",821,null,{"$f":"IF(D7=\"No LA selected\", \"No LA selected\", VLOOKUP(D7,'2 year olds (W)'!$B$29:$N$39,$O$1+2,0))","v":"No LA selected"},null,"No LA selected",821]
[0,"No LA selected",null,"No LA selected",{"$f":"IF(D8=\"No LA selected\", \"No LA selected\", VLOOKUP(D8,'3-4 year olds '!$B$21:$N$31,$E$1+2,0))","v":"No LA selected"},null,"No LA selected",330,null,{"$f":"IF(D8=\"No LA selected\", \"No LA selected\", VLOOKUP(D8,'2 year olds  (D)'!$B$29:$M$39,$J$1+2,0))","v":"No LA selected"},null,"No LA selected",330,null,{"$f":"IF(D8=\"No LA selected\", \"No LA selected\", VLOOKUP(D8,'2 year olds (W)'!$B$29:$N$39,$O$1+2,0))","v":"No LA selected"},null,"No LA selected",330]
[0,"No LA selected",null,"No LA selected",{"$f":"IF(D9=\"No LA selected\", \"No LA selected\", VLOOKUP(D9,'3-4 year olds '!$B$21:$N$31,$E$1+2,0))","v":"No LA selected"},null,"No LA selected",320,null,{"$f":"IF(D9=\"No LA selected\", \"No LA selected\", VLOOKUP(D9,'2 year olds  (D)'!$B$29:$M$39,$J$1+2,0))","v":"No LA selected"},null,"No LA selected",320,null,{"$f":"IF(D9=\"No LA selected\", \"No LA selected\", VLOOKUP(D9,'2 year olds (W)'!$B$29:$N$39,$O$1+2,0))","v":"No LA selected"},null,"No LA selected",320]
[0,"No LA selected",null,"No LA selected",{"$f":"IF(D10=\"No LA selected\", \"No LA selected\", VLOOKUP(D10,'3-4 year olds '!$B$21:$N$31,$E$1+2,0))","v":"No LA selected"},null,"No LA selected",871,null,{"$f":"IF(D10=\"No LA selected\", \"No LA selected\", VLOOKUP(D10,'2 year olds  (D)'!$B$29:$M$39,$J$1+2,0))","v":"No LA selected"},null,"No LA selected",871,null,{"$f":"IF(D10=\"No LA selected\", \"No LA selected\", VLOOKUP(D10,'2 year olds (W)'!$B$29:$N$39,$O$1+2,0))","v":"No LA selected"},null,"No LA selected",871]
[0,"No LA selected",null,"No LA selected",{"$f":"IF(D11=\"No LA selected\", \"No LA selected\", VLOOKUP(D11,'3-4 year olds '!$B$21:$N$31,$E$1+2,0))","v":"No LA selected"},null,"No LA selected",892,null,{"$f":"IF(D11=\"No LA selected\", \"No LA selected\", VLOOKUP(D11,'2 year olds  (D)'!$B$29:$M$39,$J$1+2,0))","v":"No LA selected"},null,"No LA selected",892,null,{"$f":"IF(D11=\"No LA selected\", \"No LA selected\", VLOOKUP(D11,'2 year olds (W)'!$B$29:$N$39,$O$1+2,0))","v":"No LA selected"},null,"No LA selected",892]
[0,"No LA selected",null,"No LA selected",{"$f":"IF(D12=\"No LA selected\", \"No LA selected\", VLOOKUP(D12,'3-4 year olds '!$B$21:$N$31,$E$1+2,0))","v":"No LA selected"},null,"No LA selected",331,null,{"$f":"IF(D12=\"No LA selected\", \"No LA selected\", VLOOKUP(D12,'2 year olds  (D)'!$B$29:$M$39,$J$1+2,0))","v":"No LA selected"},null,"No LA selected",331,null,{"$f":"IF(D12=\"No LA selected\", \"No LA selected\", VLOOKUP(D12,'2 year olds (W)'!$B$29:$N$39,$O$1+2,0))","v":"No LA selected"},null,"No LA selected",331]
[0,"No LA selected",null,"No LA selected",{"$f":"IF(D13=\"No LA selected\", \"No LA selected\", VLOOKUP(D13,'3-4 year olds '!$B$21:$N$31,$E$1+2,0))","v":"No LA selected"},null,"No LA selected",350,null,{"$f":"IF(D13=\"No LA selected\", \"No LA selected\", VLOOKUP(D13,'2 year olds  (D)'!$B$29:$M$39,$J$1+2,0))","v":"No LA selected"},null,"No LA selected",350,null,{"$f":"IF(D13=\"No LA selected\", \"No LA selected\", VLOOKUP(D13,'2 year olds (W)'!$B$29:$N$39,$O$1+2,0))","v":"No LA selected"},null,"No LA selected",350]
[]
["Stat neighbours",null,null,null,null,null,null,"RangeRanking","RangeValues","Order",null,null,null,null,6]
[{"$f":"IF('Select LAs'!$A$3=\"LA No\", \"No LA selected\", VLOOKUP('Select LAs'!$A$3,'Stat Neighbours'!$A$4:$M$155,ROW(A4),0))","v":"No LA selected"},{"$f":"IF('Select LAs'!A16=\"No LA selected\", \"No LA selected\", VLOOKUP('Select LAs'!A16,'Stat Neighbours'!$A$4:$C$155,3,0))","v":"No LA selected"},{"$f":"IF(B16=\"No LA selected\", 0, MATCH(B16,LAs,0))","v":0},null,{"$f":"IF(C16=0, 0, IF(C16=D16,1,0))","v":0},null,null,null,null,null,null,null,null,null,"value_9mth",null,"LA name","LA code"]
[{"$f":"IF('Select LAs'!$A$3=\"LA No\", \"No LA selected\", VLOOKUP('Select LAs'!$A$3,'Stat Neighbours'!$A$4:$M$155,ROW(A5),0))","v":"No LA selected"},{"$f":"IF('Select LAs'!A17=\"No LA selected\", \"No LA selected\", VLOOKUP('Select LAs'!A17,'Stat Neighbours'!$A$4:$C$155,3,0))","v":"No LA selected"},0,null,{"$f":"IF(C17=0, 0, IF(C17=D17,1,0))","v":0},null,null,null,null,null,null,"Output or Input for macro, and named ranges",null,null,{"$f":"IF(D3=\"No LA selected\", \"No LA selected\", VLOOKUP(D3,'9mth - 2 year'!$B$29:$N$39,$O$15+2,0))","v":"No LA selected"},null,{"$f":"IFERROR(IF($A$3=\"LA No\", \"No LA selected\", INDEX($D$3:$D$13,MATCH(R17,$A$3:$A$13,0))), \"No LA selected\")","v":"No LA selected"},301]
[{"$f":"IF('Select LAs'!$A$3=\"LA No\", \"No LA selected\", VLOOKUP('Select LAs'!$A$3,'Stat Neighbours'!$A$4:$M$155,ROW(A6),0))","v":"No LA selected"},{"$f":"IF('Select LAs'!A18=\"No LA selected\", \"No LA selected\", VLOOKUP('Select LAs'!A18,'Stat Neighbours'!$A$4:$C$155,3,0))","v":"No LA selected"},0,null,0,null,null,null,null,null,null,null,null,null,{"$f":"IF(D4=\"No LA selected\", \"No LA selected\", VLOOKUP(D4,'9mth - 2 year'!$B$29:$N$39,$O$15+2,0))","v":"No LA selected"},null,{"$f":"IFERROR(IF($A$3=\"LA No\", \"No LA selected\", INDEX($D$3:$D$13,MATCH(R18,$A$3:$A$13,0))), \"No LA selected\")","v":"No LA selected"},203]
[{"$f":"IF('Select LAs'!$A$3=\"LA No\", \"No LA selected\", VLOOKUP('Select LAs'!$A$3,'Stat Neighbours'!$A$4:$M$155,ROW(A7),0))","v":"No LA selected"},{"$f":"IF('Select LAs'!A19=\"No LA selected\", \"No LA selected\", VLOOKUP('Select LAs'!A19,'Stat Neighbours'!$A$4:$C$155,3,0))","v":"No LA selected"},0,null,0,null,null,null,null,null,null,null,null,null,{"$f":"IF(D5=\"No LA selected\", \"No LA selected\", VLOOKUP(D5,'9mth - 2 year'!$B$29:$N$39,$O$15+2,0))","v":"No LA selected"},null,"No LA selected",308]
[{"$f":"IF('Select LAs'!$A$3=\"LA No\", \"No LA selected\", VLOOKUP('Select LAs'!$A$3,'Stat Neighbours'!$A$4:$M$155,ROW(A8),0))","v":"No LA selected"},{"$f":"IF('Select LAs'!A20=\"No LA selected\", \"No LA selected\", VLOOKUP('Select LAs'!A20,'Stat Neighbours'!$A$4:$C$155,3,0))","v":"No LA selected"},0,null,0,null,null,null,null,null,null,"Formula based cells",null,null,{"$f":"IF(D6=\"No LA selected\", \"No LA selected\", VLOOKUP(D6,'9mth - 2 year'!$B$29:$N$39,$O$15+2,0))","v":"No LA selected"},null,"No LA selected",352]
[{"$f":"IF('Select LAs'!$A$3=\"LA No\", \"No LA selected\", VLOOKUP('Select LAs'!$A$3,'Stat Neighbours'!$A$4:$M$155,ROW(A9),0))","v":"No LA selected"},{"$f":"IF('Select LAs'!A21=\"No LA selected\", \"No LA selected\", VLOOKUP('Select LAs'!A21,'Stat Neighbours'!$A$4:$C$155,3,0))","v":"No LA selected"},0,null,0,null,null,null,null,null,null,null,null,null,{"$f":"IF(D7=\"No LA selected\", \"No LA selected\", VLOOKUP(D7,'9mth - 2 year'!$B$29:$N$39,$O$15+2,0))","v":"No LA selected"},null,"No LA selected",821]
[{"$f":"IF('Select LAs'!$A$3=\"LA No\", \"No LA selected\", VLOOKUP('Select LAs'!$A$3,'Stat Neighbours'!$A$4:$M$155,ROW(A10),0))","v":"No LA selected"},{"$f":"IF('Select LAs'!A22=\"No LA selected\", \"No LA selected\", VLOOKUP('Select LAs'!A22,'Stat Neighbours'!$A$4:$C$155,3,0))","v":"No LA selected"},0,null,0,null,null,null,null,null,null,null,null,null,{"$f":"IF(D8=\"No LA selected\", \"No LA selected\", VLOOKUP(D8,'9mth - 2 year'!$B$29:$N$39,$O$15+2,0))","v":"No LA selected"},null,"No LA selected",330]
[{"$f":"IF('Select LAs'!$A$3=\"LA No\", \"No LA selected\", VLOOKUP('Select LAs'!$A$3,'Stat Neighbours'!$A$4:$M$155,ROW(A11),0))","v":"No LA selected"},{"$f":"IF('Select LAs'!A23=\"No LA selected\", \"No LA selected\", VLOOKUP('Select LAs'!A23,'Stat Neighbours'!$A$4:$C$155,3,0))","v":"No LA selected"},0,null,0,null,null,null,null,null,null,null,null,null,{"$f":"IF(D9=\"No LA selected\", \"No LA selected\", VLOOKUP(D9,'9mth - 2 year'!$B$29:$N$39,$O$15+2,0))","v":"No LA selected"},null,"No LA selected",320]
[{"$f":"IF('Select LAs'!$A$3=\"LA No\", \"No LA selected\", VLOOKUP('Select LAs'!$A$3,'Stat Neighbours'!$A$4:$M$155,ROW(A12),0))","v":"No LA selected"},{"$f":"IF('Select LAs'!A24=\"No LA selected\", \"No LA selected\", VLOOKUP('Select LAs'!A24,'Stat Neighbours'!$A$4:$C$155,3,0))","v":"No LA selected"},0,null,0,null,null,null,null,null,null,null,null,null,{"$f":"IF(D10=\"No LA selected\", \"No LA selected\", VLOOKUP(D10,'9mth - 2 year'!$B$29:$N$39,$O$15+2,0))","v":"No LA selected"},null,"No LA selected",871]
[{"$f":"IF(OR('Select LAs'!$A$3=\"LA No\",'Select LAs'!$A$13=0), \"No LA selected\", VLOOKUP('Select LAs'!$A$3,'Stat Neighbours'!$A$4:$M$155,ROW(A13),0))","v":"No LA selected"},{"$f":"IF('Select LAs'!A25=\"No LA selected\", \"No LA selected\", VLOOKUP('Select LAs'!A25,'Stat Neighbours'!$A$4:$C$155,3,0))","v":"No LA selected"},0,null,0,null,null,null,null,null,null,null,null,null,{"$f":"IF(D11=\"No LA selected\", \"No LA selected\", VLOOKUP(D11,'9mth - 2 year'!$B$29:$N$39,$O$15+2,0))","v":"No LA selected"},null,"No LA selected",892]
[null,null,null,null,null,null,null,null,null,null,null,null,null,null,{"$f":"IF(D12=\"No LA selected\", \"No LA selected\", VLOOKUP(D12,'9mth - 2 year'!$B$29:$N$39,$O$15+2,0))","v":"No LA selected"},null,"No LA selected",331]
[null,null,null,{"$f":"COUNT(Rightindices)","v":0},{"$f":"IF(AND(E16:E25),1,0)","v":0},null,null,null,null,null,null,null,null,null,{"$f":"IF(D13=\"No LA selected\", \"No LA selected\", VLOOKUP(D13,'9mth - 2 year'!$B$29:$N$39,$O$15+2,0))","v":"No LA selected"},null,"No LA selected",350]
[]
[null,null,null,"Check for duplicates",{"$f":"MAX(COUNTIFS(E31:E41,E31:E41))","v":1},null,null,null,null,null,null,null,null,null,9]
[null,null,null,null,null,null,null,null,null,null,null,null,null,null,"value_NonEYFF",null,"LA name","LA code"]
[null,null,null,null,{"$f":"A3","v":"LA No"},null,null,null,null,null,null,null,null,null,13,null,{"$f":"IFERROR(IF($A$3=\"LA No\", \"No LA selected\", INDEX($D$3:$D$13,MATCH(R31,$A$3:$A$13,0))), \"No LA selected\")","v":"No LA selected"},301]
[null,null,null,null,{"$f":"IF(A4=0, \"zero1\", A4)","v":"zero1"},null,null,null,null,null,null,null,null,null,{"$f":"IF(D4=\"No LA selected\", \"No LA selected\", VLOOKUP(D4,'Other EYFF funds'!$B$16:$S$26,$O$29+2,0))","v":"No LA selected"},null,{"$f":"IFERROR(IF($A$3=\"LA No\", \"No LA selected\", INDEX($D$3:$D$13,MATCH(R32,$A$3:$A$13,0))), \"No LA selected\")","v":"No LA selected"},203]
[null,null,null,null,{"$f":"IF(A5=0, \"zero2\", A5)","v":"zero2"},null,null,null,null,null,null,null,null,null,{"$f":"IF(D5=\"No LA selected\", \"No LA selected\", VLOOKUP(D5,'Other EYFF funds'!$B$16:$S$26,$O$29+2,0))","v":"No LA selected"},null,"No LA selected",308]
[null,null,null,null,{"$f":"IF(A6=0, \"zero3\", A6)","v":"zero3"},null,null,null,null,null,null,null,null,null,{"$f":"IF(D6=\"No LA selected\", \"No LA selected\", VLOOKUP(D6,'Other EYFF funds'!$B$16:$S$26,$O$29+2,0))","v":"No LA selected"},null,"No LA selected",352]
[null,null,null,null,{"$f":"IF(A7=0, \"zero4\", A7)","v":"zero4"},null,null,null,null,null,null,null,null,null,{"$f":"IF(D7=\"No LA selected\", \"No LA selected\", VLOOKUP(D7,'Other EYFF funds'!$B$16:$S$26,$O$29+2,0))","v":"No LA selected"},null,"No LA selected",821]
[null,null,null,null,{"$f":"IF(A8=0, \"zero5\", A8)","v":"zero5"},null,null,null,null,null,null,null,null,null,{"$f":"IF(D8=\"No LA selected\", \"No LA selected\", VLOOKUP(D8,'Other EYFF funds'!$B$16:$S$26,$O$29+2,0))","v":"No LA selected"},null,"No LA selected",330]
[null,null,null,null,{"$f":"IF(A9=0, \"zero6\", A9)","v":"zero6"},null,null,null,null,null,null,null,null,null,{"$f":"IF(D9=\"No LA selected\", \"No LA selected\", VLOOKUP(D9,'Other EYFF funds'!$B$16:$S$26,$O$29+2,0))","v":"No LA selected"},null,"No LA selected",320]
[null,null,null,null,{"$f":"IF(A10=0, \"zero7\", A10)","v":"zero7"},null,null,null,null,null,null,null,null,null,{"$f":"IF(D10=\"No LA selected\", \"No LA selected\", VLOOKUP(D10,'Other EYFF funds'!$B$16:$S$26,$O$29+2,0))","v":"No LA selected"},null,"No LA selected",871]
[null,null,null,null,{"$f":"IF(A11=0, \"zero8\", A11)","v":"zero8"},null,null,null,null,null,null,null,null,null,{"$f":"IF(D11=\"No LA selected\", \"No LA selected\", VLOOKUP(D11,'Other EYFF funds'!$B$16:$S$26,$O$29+2,0))","v":"No LA selected"},null,"No LA selected",892]
[null,null,null,null,{"$f":"IF(A12=0, \"zero9\", A12)","v":"zero9"},null,null,null,null,null,null,null,null,null,{"$f":"IF(D12=\"No LA selected\", \"No LA selected\", VLOOKUP(D12,'Other EYFF funds'!$B$16:$S$26,$O$29+2,0))","v":"No LA selected"},null,"No LA selected",331]
[null,null,null,null,{"$f":"IF(A13=0, \"zero10\", A13)","v":"zero10"},null,null,null,null,null,null,null,null,null,{"$f":"IF(D13=\"No LA selected\", \"No LA selected\", VLOOKUP(D13,'Other EYFF funds'!$B$16:$S$26,$O$29+2,0))","v":"No LA selected"},null,"No LA selected",350]