{"text_format":"1","workbook":"xlsx","n_sheets":7,"sheets":["Guidance Notes","How to complete this form","First time request form Part 1","First time request form Part 2","Bursary additional info Part 3","Provider list","Reasons"],"not_rendered":{"charts":0,"images":2,"macros":1,"external_links":2,"defined_names":16,"comments":0,"pivot_tables":0},"unopened":[],"bounds":{"document_bytes":16777216,"sheet_cells":100000,"rows_first":2000,"rows_last":500,"rows_between":2000,"halvings":0,"cell_chars":16384,"cell_head_chars":4096},"cells_cut":0,"cells_raw":0,"read":"whole","date_system":"1900"}

{"sheet":"Guidance Notes","index":0,"n_rows":72,"n_cols":1,"rows_kept":72,"cut":false,"hidden":false,"merged":[]}
[]
["Guidance notes"]
[]
["We will consider all the information you provide to assess your request for a new loans facility to deliver high quality provision. Please ensure you read this guidance and provide all the information requested for a full assessment to be undertaken."]
[]
["You can request a loans facility for the first time at the 2 performance management points in the funding year. Please refer to advanced learner loans funding and performance management rules 2024 to 2025, Annex 3. "]
[]
["The dates when requests can be made for this review are:  "]
[]
["·         between 6 January 2025 to 20 January 2025"]
[]
["NOTES: We will not accept any forms that are sent outside of the above dates or to a different email .\n              We will disregard any forms used to request growth on existing allocations. This form is for new requests only."]
["  "]
["General information"]
[]
["We will consider your request for a new loan facility and bursary allocation (if applicable) if you have fully completed the request form, funds are available; and if:"]
[]
["·       you currently hold an adult education budget or apprenticeship funding contract/agreement, and have held it since at least the 2022 to 2023 funding year"]
[]
["·       you have been inspected by Ofsted and received an overall grade of good or outstanding"]
[]
["·       you have a good track record"]
[]
["·       you can provide evidence of demand from employers or learners"]
[]
["·       you are not in formal intervention with ESFA and not under additional conditions of funding or additional contractual obligations"]
[]
["·       we are confident that awarding you a new facility is a good use of public funds"]
[]
["New loan facility request form"]
[]
["You must provide information on the form about your loans delivery model, quality assurance arrangements and the qualifications and sector subject areas that you propose to offer. You must also give details of any innovative approaches and describe how the provision will enhance learner choice.  "]
[]
["·       provide details of the organisation submitting the form and amount of loan facility being requested"]
[]
["·       provide a rationale and context for request for a new loan facility"]
[]
["·       provide a monthly profile reflecting when learners will start and when payments will commence; broken down by learner groups 19 to 23 or 24+ (this can be attached separately if it is more convenient)"]
[]
["Additional information in support of your request to enable us to understand the volumes and range of new loan request together with any distinctive or particular sector areas that are being considered will enable us to understand the volume and range of growth required"]
[]
["Delivery Model"]
[]
["·       provide a description of your direct delivery model"]
[]
["·       describe your marketing and recruitment model"]
[]
["Capacity and Capability"]
[]
["·        include details of any resources or infrastructure, staffing resources, premises to support your request"]
[]
["·        confirmation of how your request compliments your organisation’s longer term goals and business strategy"]
[]
["·        evidence of any learner demand; details of learners that you have engaged and believe are committed to start on the programme in 2024 to 2025"]
[]
["Quality Assurance"]
[]
["·       arrangements that demonstrate how the provision will enhance the choice and quality of provision"]
[]
["·       provide details of the delivery patterns to be undertaken, particularly in relation to the intake of starts at set points in the year; roll on roll off programmes"]
[]
["·       what is the planned average length of stay of learners? Please provide a comprehensive and detailed outline for any deviation from the recommended qualification Guided Learning Hours (GLH)"]
[]
["·       declaration that you have received direct centre approval and, where appropriate, direct qualification approval, from the appropriate awarding organisation(s) for the regulated qualifications you propose to offer, using the loans facility. These qualifications must be designated for loans and must be delivered in line with the qualification specification and guidance set out by the awarding organisation"]
[]
["Additional Information "]
[]
["·       any additional information you may wish to present as part of your application"]
[]
["Bursary additional Information"]
[]
["If you are requesting a bursary allocation in addition to a new loan facility, you must set out a rationale and separately must identify the number of learners and the funding required for area costs, learner support and learning support.  "]

{"sheet":"How to complete this form","index":1,"n_rows":30,"n_cols":2,"rows_kept":30,"cut":false,"hidden":false,"merged":[[25,0,27,0],[1,0,1,1],[6,0,6,1],[23,0,23,1],[3,0,3,1]]}
[]
["Please read the advanced learner loans funding and performance management rules 2024 to 2025 for information about requesting a loan facility and bursary for the first time."]
[]
["HOW TO COMPLETE THIS FORM"]
["Macro security","The form contains macros. You must enable macros every time you open the spreadsheet for correct functionality."]
[]
["Advanced Learner Loan First Time Request Form 2024 to 2025"]
["Field","Description"]
["Completion status","This box stays INCOMPLETE until all the yellow boxes are complete. Once all the required yellow boxes are complete, it will change to COMPLETE."]
["Provider name","Use the drop-down box to select your provider name from a list. If your provider name is not listed, please email AllFacility.REQUESTS@education.gov.uk for advice (please quote your UKPRN). NOTE: To request a loan facility for the first time, you must currently hold an adult skills fund or apprenticeship funding contract/agreement, and have held it since at least the 2022 to 2023 funding year."]
["UK Provider Registration Number (UKPRN)","This box will be completed automatically with your UKPRN as it appears on the UK Register of Learning Providers (UKRLP) once provider name is selected."]
["Do you currently hold a facility and bursary contract with the agency?   ","If you already hold a facility and bursary contract with the agency, you do not need to complete this form. This is not a growth request form. Any forms completed for existing contracts will be disregarded."]
["Authority tick box","Please tick to confirm that you have the authority to act on behalf of the applicant organisation named in this form"]
["Total requested loan facility for 2024 to 2025 funding year","Please enter the value of the TOTAL loan facility you wish to request for the full funding year. NOTE –  The maximum loan facility you can apply for is £50,000 for the entire 2024 to 2025 funding year.\nYour request will be automatically split into financial year values, showing you the amount of loan facility available to you for August to March and April to July, if your request is approved."]
["Propose an alternative financial year split","If our financial year split means you may not be able to meet learner demand in either August to March or April to July, please use these boxes to propose an alternative financial year split. The total value of these two boxes must match the total loan facility you have requested."]
["Total requested loan bursary for 2024 to 2025 funding year","Please enter the value of the TOTAL loan bursary funding you wish to request for the full funding year. NOTE – The minimum loan bursary you can apply for is £500. Your request will be automatically split into financial year values, showing you the amount of loan bursary available to you for August to March and April to July, if your request is approved."]
["Propose an alternative financial year split","If our financial year split means you may not be able to meet learner demand in either August to March or April to July, please use these boxes to propose an alternative financial year split. The total value of these two boxes must match the total loan bursary you have requested."]
["Request completed by","Please ensure you enter your:\nName\nPosition in organisation\nEmail address\nDate of request"]
["Submit the completed form ","Once the form shows the completed status, please submit the form via the customer help portal, creating a new enquiry, in which you can attach the form.\n\n"]
[]
[null,"Ensure to title the enquiry - advanced learner loans - first time request\n\nIf you have questions after reading this information, or if there’s anything else you need help with, you can find more support in our customer help centre"]
[null,"Customer help centre (education.gov.uk)"]
[]
["BURSARY ADDITIONAL INFO"]
["Field","Description"]
["Completion status","You must complete this form if you have requested a loan bursary allocation on the first time request form Part 1 (the Completion status will say INCOMPLETE until you complete the required yellow cells).  If you have not requested a loan bursary allocation the Completion status will say NOT REQUIRED and you do not need to complete this tab. "]
[]
[null,"Once all the required yellow boxes are complete, the Completion status will change to COMPLETE. "]
["Total bursary requested for 2024 to 2025","This box is filled in automatically from the total value that you entered on the first time request form Part 1.  "]
["Rationale for bursary increase","Please read the guidance notes and ensure you provide all the information requested"]

{"sheet":"First time request form Part 1","index":2,"n_rows":88,"n_cols":9,"rows_kept":88,"cut":false,"hidden":false,"merged":[[51,0,52,2],[84,0,84,6],[16,3,16,6],[1,6,1,8],[9,3,9,5],[20,2,20,5],[7,0,7,8],[17,3,17,6],[2,6,3,8],[19,1,19,5],[14,3,14,6],[15,3,15,6],[87,0,87,4],[83,0,83,5],[24,3,24,4],[31,1,31,2],[36,0,36,4],[50,0,50,4],[37,0,38,2],[29,1,29,2],[30,1,30,2],[44,1,44,2],[57,1,63,6],[56,1,56,5],[86,0,86,7],[45,1,45,2],[46,1,46,3],[72,1,78,6]]}
[]
[null,null,null,null,null,null,"Completion status"]
[null,null,null,null,null,null,{"$f":"IF(AND(H10=\"✔\",H25=\"✔\",H24=\"✔\",H31=\"✔\",H46=\"✔\",H15=\"✔\",H16=\"✔\",H17=\"✔\",H18=\"✔\",H20=\"✔\",H58=\"✔\",H73=\"✔\",OR('Bursary additional info Part 3'!H3=\"Complete\",'Bursary additional info Part 3'!H3=\"Not required\"),OR('First time request form Part 2'!H3:H4=\"Complete\",'First time request form Part 2'!H3:H4=\"Not Required\")),\"Complete\",\"Incomplete\")","v":"Incomplete"},{"$f":"IF(AND(I8=\"✔\",I15=\"✔\",I21=\"✔\",I38=\"✔\",I46=\"✔\",I51=\"✔\",I52=\"✔\",I53=\"✔\",#REF!=\"✔\",#REF!=\"✔\",OR('Bursary additional info Part 3'!I1=\"Complete\",'Bursary additional info Part 3'!I1=\"Not required\")),\"Complete\",\"Incomplete\")","v":{"$error":"#REF!"}},{"$f":"IF(AND(J8=\"✔\",J15=\"✔\",J21=\"✔\",J38=\"✔\",J46=\"✔\",J51=\"✔\",J52=\"✔\",J53=\"✔\",#REF!=\"✔\",#REF!=\"✔\",OR('Bursary additional info Part 3'!J1=\"Complete\",'Bursary additional info Part 3'!J1=\"Not required\")),\"Complete\",\"Incomplete\")","v":{"$error":"#REF!"}}]
[null,null,null,null,null,null,{"$f":"IF(AND(H9=\"✔\",H24=\"✔\",H30=\"✔\",H45=\"✔\",H14=\"✔\",H15=\"✔\",H16=\"✔\",H17=\"✔\",H19=\"✔\",#REF!=\"✔\",OR('Bursary additional info Part 3'!H2=\"Complete\",'Bursary additional info Part 3'!H2=\"Not required\")),\"Complete\",\"Incomplete\")","v":{"$error":"#REF!"}},{"$f":"IF(AND(I9=\"✔\",I16=\"✔\",I22=\"✔\",I39=\"✔\",I51=\"✔\",I52=\"✔\",I53=\"✔\",I54=\"✔\",#REF!=\"✔\",#REF!=\"✔\",OR('Bursary additional info Part 3'!I2=\"Complete\",'Bursary additional info Part 3'!I2=\"Not required\")),\"Complete\",\"Incomplete\")","v":{"$error":"#REF!"}},{"$f":"IF(AND(J9=\"✔\",J16=\"✔\",J22=\"✔\",J39=\"✔\",J51=\"✔\",J52=\"✔\",J53=\"✔\",J54=\"✔\",#REF!=\"✔\",#REF!=\"✔\",OR('Bursary additional info Part 3'!J2=\"Complete\",'Bursary additional info Part 3'!J2=\"Not required\")),\"Complete\",\"Incomplete\")","v":{"$error":"#REF!"}}]
[]
["Advanced learner loan facility and bursary: First time request form Part 1 for 2024 to 2025 funding year"]
[]
["Please read How to complete this form and Guidance Notes and then complete the appropriate yellow cells."]
[]
[null,null,"Provider name",null,null,null,null,{"$f":"IF(ISBLANK(D10), \"✖\", \"✔\")","v":"✖"}]
[]
[null,null,"UK Provider Registration Number (UKPRN)",{"$f":"IFERROR(VLOOKUP(D10,'Provider list'!A:B,2,FALSE),\"\")","v":""},{"$f":"IFERROR(VLOOKUP(D10,'Provider list'!A2:B990,3,FALSE),\"\")","v":""}]
[]
["Request completed by"]
[null,null,"Name",null,null,null,null,{"$f":"IF(ISBLANK(D15), \"✖\", \"✔\")","v":"✖"}]
[null,null,"Position in organisation",null,null,null,null,{"$f":"IF(ISBLANK(D16), \"✖\", \"✔\")","v":"✖"}]
[null,null,"Email address",null,null,null,null,{"$f":"IF(ISBLANK(D17), \"✖\", \"✔\")","v":"✖"}]
[null,null,"Date of request",null,null,null,null,{"$f":"IF(ISBLANK(D18), \"✖\", \"✔\")","v":"✖"}]
[]
[null,"Please tick to confirm that you have the authority to act on behalf of the applicant organisation named in this form",null,null,null,null,true,{"$f":"IF(G20=FALSE, \"✖\", \"✔\")","v":"✔"}]
[]
[]
["Growth Request",null,null,null,{"$f":"IF(OR(E24=\"No\",E24=\"\"),\"\",\"This form is for new requests only\")","v":""}]
[null,null,null,"Do you currently hold a facility and bursary contract with the agency?      ",null,null,null,{"$f":"IF(OR(E24=\"\",E24=\"Yes\"),\"✖\",\"✔\")","v":"✖"}]
[null,null,"Please use the drop down box  ",null,null,null,null,{"$f":"IF(ISBLANK(D25), \"✖\", \"✔\")","v":"✖"}]
[]
["Total requested loan facility for 2024 to 2025 funding year"]
["Please complete this section if you would like to request a loan facility for the first time. "]
[]
[null,"TOTAL",null,"August to March ","April to July"]
["Value £",null,null,{"$f":"IF(B31=\"\",\"\",ROUND(B31*63.17%,0))","v":""},{"$f":"IF(B31<>\"\",ROUND(B31-D31,0),\"\")","v":""},null,null,{"$f":"IF(AND(B31>0,OR(D25=\"New facility\",D25=\"New facility and bursary\")),\"✔\",(IF(AND(D25=\"New Bursary\",OR(B31=\"\",B31=0)),\"✔\",\"✖\")))","v":"✖"}]
["Volume of starts"]
[]
["To note: "]
["The maximum loan facility you can apply for is £50,000 for the entire 2024 to 2025 funding year"]
[]
["The ESFA will consider proposals for an alternative financial year split in line with the budget, which you can enter below.  We cannot guarantee that proposals will be accepted."]
["Proposed alternative financial year split  ",null,null,"August to March ","April to July"]
[null,null,null,null,null,{"$f":"IF(AND(D39=\"\",E39=\"\"),\"\",IF(D39+E39<>B31,\"Your proposed split does not match the facility you've requested.\",\"\"))","v":""}]
[]
[]
["Total requested loan bursary for 2024 to 2025 funding year"]
["Please complete this section if you would like to request a loan bursary for the first time."]
[]
[null,"TOTAL",null,"August to March ","April to July"]
[null,null,null,{"$f":"IF(B46=\"\",\"\",ROUND(B46*63.17%,0))","v":""},{"$f":"IF(B46<>\"\",ROUND(B46-D46,0),\"\")","v":""},null,null,{"$f":"IF(AND(B46>0,OR(D25=\"New Bursary\",D25=\"New facility and bursary\")),\"✔\",(IF(D25=\"New facility\",\"✔\",\"✖\")))","v":"✖"}]
[null,{"$f":"IF(OR(D25=\"Change facility only\",B46=\"\",B46=0,'Bursary additional info Part 3'!H3=\"Complete\"),\"\",\"Please complete the bursary additional info tab\")","v":""}]
["To note: "]
["The minimum loan bursary you can apply for is £500. Your bursary allocation should be proportionate to the size \nof your loan facility. "]
[]
["The ESFA will consider proposals for an alternative financial year split in line with the budget, which you can enter below.  We cannot guarantee that proposals will be accepted."]
["Proposed alternative financial year split  ",null,null,"August to March ","April to July"]
[null,null,null,null,null,{"$f":"IF(AND(D53=\"\",E53=\"\"),\"\",IF(D53+E53<>B46,\"Your proposed split does not match the bursary you've requested.\",\"\"))","v":""}]
[]
["Supporting information"]
[]
[null,"Please provide the context and rationale for your request."]
[null,null,null,null,null,null,null,{"$f":"IF(AND(OR($D$25=\"New facility\",$D$25=\"New facility and bursary\"),ISBLANK(B58)), \"✖\", \"✔\")","v":"✔"}]
[]
[]
[]
[]
[]
[]
[]
[]
[null,"Please provide the following information"]
[]
[null,"l qualifications to be delivered including  sector subject areas and levels"]
[null,"l   learner groups targeted:  to include proportion(%) of starts 19-23, or 24+, and  details of learners’ employment status"]
[]
[]
[null,null,null,null,null,null,null,{"$f":"IF(AND(OR($D$25=\"New facility\",$D$25=\"New facility and bursary\"),ISBLANK(B73)), \"✖\", \"✔\")","v":"✔"}]
[]
[]
[]
[]
[]
[]
[]
{"$rows_left_out":9}
{"sheet":"First time request form Part 2","index":3,"n_rows":53,"n_cols":8,"rows_kept":53,"cut":false,"hidden":false,"merged":[[53,1,62,7],[15,1,24,7],[27,1,36,7],[2,1,2,6],[2,7,3,7],[7,4,7,7],[40,1,49,7]]}
[]
[null,null,null,null,null,null,null,"Completion status"]
[null,null,null,null,null,null,null,{"$f":"IFERROR(IF((D10-_xlfn.IFNA(VLOOKUP('First time request form Part 1'!D12,'Provider list'!A:B,1,FALSE),0))<1,\"NOT REQUIRED\",IF(OR(ISBLANK(B16),ISBLANK(B28),ISBLANK(B41),ISBLANK(B28)),\"INCOMPLETE\",\"COMPLETE\")),\"NOT REQUIRED\")","v":"NOT REQUIRED"}]
[]
[]
[null,"Advanced learner loan facility: First time request form Part 2 for 2024 to 2025 funding year"]
[]
[null,"Please complete ALL of the yellow cells below. "]
[]
[null,"Total facility requested for 2024 to 2025",null,{"$f":"IF('First time request form Part 1'!B31=\"\",\"\",'First time request form Part 1'!B31)","v":""},"  (This is the value you entered on Part 1 of your change request form.)"]
[]
[null,"Supporting Information "]
[null,"To include evidence of: "]
[]
[null,"Delivery model"]
[]
[]
[]
[]
[]
[]
[]
[]
[]
[]
[]
[null,"Capacity and capability"]
[]
[]
[]
[]
[]
[]
["Total bursary requested for 2016 to 2017"]
[]
[]
[]
[]
[]
[null,"Quality assurance"]
[]
[]
[]
[]
[]
[]
[]
[]
[]
[]
[]
[]
[null,"Additional information"]

{"sheet":"Bursary additional info Part 3","index":4,"n_rows":26,"n_cols":8,"rows_kept":26,"cut":false,"hidden":false,"merged":[[26,1,35,7],[2,7,3,7],[2,1,2,6],[7,4,7,7],[12,1,13,7],[14,3,14,4]]}
[]
[null,null,null,null,null,null,null,"Completion status"]
[null,null,null,null,null,null,null,{"$f":"IF(OR(D10=0,D10=\"\"),\"NOT REQUIRED\",IF(OR(,ISBLANK(E23),ISBLANK(D23),ISBLANK(E21),ISBLANK(D21),ISBLANK(E19),ISBLANK(D19),ISBLANK(B27)),\"INCOMPLETE\",\"COMPLETE\"))","v":"NOT REQUIRED"}]
[]
[]
[null,"Advanced learner loans bursary first time request"]
[]
[null,"Please complete ALL of the yellow cells below. "]
[]
[null,"Total bursary requested for 2024 to 2025",null,{"$f":"IF('First time request form Part 1'!B46=\"\",\"\",'First time request form Part 1'!B46)","v":""},"  (This is the value you entered on Part 1 of your change request form.)"]
[]
[]
[null,"You must separately identify the number of learners and the funding required for area cost uplift, learner support and learning support."]
[]
[null,null,null,"2024 to 2025"]
[]
[null,null,null,"Number of learners","Bursary earnings (£)"]
[]
[null,"Area cost uplift"]
[]
[null,"Learner support"]
[]
[null,"Learning support"]
[]
[null,"Rationale for bursary request"]
[null,"Please explain the rationale for your request in the box below."]

{"sheet":"Provider list","index":5,"n_rows":1026,"n_cols":2,"rows_kept":1026,"cut":false,"hidden":true,"merged":[]}
["Provider Name","UKPRN"]
["100% EFFECTIVE LIMITED",10029265]
["1ST2 ACHIEVE TRAINING LIMITED",10031126]
["2 START LIMITED",10028172]
["8POINT8 TRAINING LIMITED",10057068]
["A S TRAINING (INTERNATIONAL) LIMITED",10037198]
["ABBEYDALE VETLINK VETERINARY TRAINING LIMITED",10028269]
["ABM TRAINING (UK) LTD",10029426]
["ACADEMY FOR PROJECT MANAGEMENT LTD",10053076]
["ACADEMY OF PLAY AND CHILD PSYCHOTHERAPY LIMITED",10067447]
["ACADEMY TRAINING LTD",10046146]
["ACCESS TRAINING (EAST MIDLANDS) LTD",10010584]
["ACCESS TRAINING LIMITED",10009059]
["ACCIPIO LIMITED",10058012]
["ACCOUNTANCY LEARNING LTD",10042735]
["ACE TRAINING AND CONSULTANCY LIMITED",10034055]
["ACHIEVEMENT TRAINING & SKILLS LTD",10053951]
["ACHIEVING EXCELLENCE UK LTD",10023357]
["ACHIEVING FOR CHILDREN COMMUNITY INTEREST COMPANY",10047071]
["ACTIV FIRST LIMITED",10034423]
["ADA NATIONAL COLLEGE FOR DIGITAL SKILLS",10057981]
["ADALTA DEVELOPMENT LTD",10043865]
["AGINCARE GROUP LIMITED",10048865]
["AIRE VOCATIONAL TRAINING LIMITED",10033950]
["AJ BELL BUSINESS SOLUTIONS LIMITED",10084400]
["AJ'S TRAINING LTD",10042644]
["AKR GROWTH VENTURES LTD",10089078]
["ALAN HESTER ASSOCIATES LIMITED",10015933]
["ALDRIDGE EDUCATION",10058195]
["ALL DIMENSION LIMITED",10032555]
["ALLIANCE LEARNING",10000238]
["ALPHABET TRAINING GROUP LTD.",10049431]
["ALTHAUS DIGITAL LIMITED",10031131]
["ALTRAD BABCOCK LIMITED",10004399]
["ALWAYS CONSULT LTD",10034128]
["ANDERSON STOCKLEY ACCREDITED TRAINING LTD",10023918]
["ANGLIA RUSKIN UNIVERSITY HIGHER EDUCATION CORPORATION",10000291]
["ANGLO AMERICAN TECHNICAL & SUSTAINABILITY SERVICES LTD",10088633]
["ANS ACADEMY LIMITED",10042795]
["APA PROCUREMENT TRAINING LIMITED",10064562]
["APPRENTICE TEAM LTD",10043793]
["APPRENTICESHIP LEARNING SOLUTIONS LIMITED",10000105]
["APPRENTIFY LIMITED",10063272]
["APPRIS CHARITY LIMITED",10000848]
["APPROVED TRAINING LIMITED",10056863]
["ARDEN UNIVERSITY LIMITED",10005451]
["ARK SCHOOLS",10044534]
["ARMONIA LIMITED",10019236]
["ART PROVIDERS LTD",10068438]
["ASPENS-SERVICES LIMITED",10065752]
["ASPIRATION TRAINING LIMITED",10000421]
["ASPIRATIONS ACADEMIES TRUST",10059468]
["ASPIRE DEVELOPMENT (UK) LTD",10054055]
["ASPIRE PROCUREMENT TRAINING LTD",10063268]
["ASPIRE TRAINING SOLUTIONS (UK) LIMITED",10044252]
["ASSIST KNOWLEDGE DEVELOPMENT LIMITED",10049099]
["ASSOCIATED NEIGHBOUR TRAINING LIMITED",10057050]
["ASTON UNIVERSITY",10007759]
["AURELIA TRAINING LIMITED",10000452]
["AUTO-ASSESS LIMITED",10065596]
["AVANT PARTNERSHIP LIMITED",10022513]
["AVEREE LTD",10036194]
["AWC TRAINING LTD",10033536]
["AWE PLC",10008081]
["AXIA SOLUTIONS LIMITED",10000470]
["AZESTA LIMITED",10003979]
["BABCOCK TRAINING LIMITED",10003161]
["BABINGTON BUSINESS COLLEGE LIMITED",10000494]
["BACK 2 WORK COMPLETE TRAINING LIMITED",10033156]
["BAE SYSTEMS PLC",10000501]
["BALTIC TRAINING SERVICES LIMITED",10019026]
["BANHAM ACADEMY LIMITED",10046413]
["BARKING, HAVERING AND REDBRIDGE UNIVERSITY HOSPITALS NHS TRUST",10063578]
["BARNARDO'S",10000532]
["BASEGREEN ACADEMY LTD",10085759]
["BASINGSTOKE ITEC LIMITED",10000561]
["BAUER RADIO LIMITED",10002230]
["BELLEVUE EDUCATION INTERNATIONAL LIMITED",10053301]
["BENSON-SMITH LIMITED",10056494]
["BESPOKE PROFESSIONAL DEVELOPMENT AND TRAINING LIMITED",10045955]
{"$rows_left_out":947}
{"sheet":"Reasons","index":6,"n_rows":23,"n_cols":1,"rows_kept":23,"cut":false,"hidden":true,"merged":[]}
["New facility"]
["New bursary"]
["New facility and bursary"]
[]
["We only have a loans funding agreement with the ESFA. We understand we are not allowed to subcontract loans delivery"]
["We have other funding agreements with the ESFA. We did not subcontract loans delivery in 2015 to 2016 and we understand we must not begin any subcontracted loans delivery in 2016 to 2017"]
["We have other funding agreements with the ESFA. We did subcontract some/all loans delivery in 2015 to 2016 and we understand we must not enter into any new loans subcontracting relationships in 2016 to 2017."]
[]
["Yes"]
["No"]
[]
[]
[]
[]
[]
[]
[]
[]
[]
[]
[]
[]
["Total bursary requested for 2019 to 2020"]