{"text_format":"1","workbook":"xlsx","n_sheets":8,"sheets":["COMPLETE ME FIRST","Exception Guidance","Exceptional case","Request Guidance","First time request","Top Up","Providers","Summary"],"not_rendered":{"charts":0,"images":1,"macros":1,"external_links":1,"defined_names":17,"comments":0,"pivot_tables":0},"unopened":[],"bounds":{"document_bytes":16777216,"sheet_cells":100000,"rows_first":2000,"rows_last":500,"rows_between":2000,"halvings":0,"cell_chars":16384,"cell_head_chars":4096},"cells_cut":0,"cells_raw":0,"read":"whole","date_system":"1900"}

{"sheet":"COMPLETE ME FIRST","index":0,"n_rows":26,"n_cols":19,"rows_kept":26,"cut":false,"hidden":false,"merged":[[25,3,25,9],[2,3,2,10],[3,12,4,12],[19,3,19,9],[23,3,23,9],[7,1,7,8],[9,1,9,12],[10,1,10,12],[11,1,11,12],[12,1,12,12],[13,1,13,12],[14,1,14,12],[15,1,15,12],[16,1,16,12],[3,1,3,11]]}
[]
[]
[]
[null,"ASF peformance management requests form - 2024 to 2025",null,null,null,null,null,null,null,null,null,null,{"$f":"IF(COUNTIFS(M18:M62,\"✔\")=COUNTA(M18:M62),\"Complete\",\"Incomplete\")","v":"Incomplete"}]
[null,null,null,null,null,null,null,null,null,null,null,null,{"$error":"#REF!"}]
[null,"Request"]
[null,"Please read the guidance page(s) before completing this form. Please complete ALL of the cells highlighted yellow."]
[null,"Adult skills fund: funding and performance management rules 2024 to 2025 - GOV.UK (www.gov.uk)"]
[null,"General Information"]
[null,"Please read ESFA funded adult skills fund (ASF): funding and performance management rules before completing this form (link above)."]
[null,"You must complete details in this sheet first, all sheets will be blank until completed."]
[null,"To use this form you will need to enable the macros. This will enable you to send the completed form with ease. "]
[null,"This form is to be completed and returned by 5pm on 4 December 2024.  This form allows you to submit an exceptional case for growth, exemption from an auto reduction, a first time request (for providers with an ASF grant allocation) or top up request if below £45,000 to the moderation panel for consideration. We explain how to return the template within the guidance sheets."]
[null,"You must complete ALL relevant sections of the form. We will not accept if incomplete. "]
[null,"Only information within this sheet will be considered.  We will not accept any information outside of this form. We will contact you if we require further information. "]
[null,"Complete the information below first, this will help us to understand the reason for your request, it will also enable the necessary boxes and information you need to complete."]
[null,"If a request option is not available to you once you select your provider name, it will be because you are not eligible for that request. "]
[null,"A new form will need completing for each separate request."]
[null,null,null,null,null,null,null,null,null,null,null,null,null,null,null,"Grant",null,"CfS"]
[null,null,"Provider Name:",null,null,null,null,null,null,null,null,null,{"$f":"IF(ISBLANK(D20), \"✖\", \"✔\")","v":"✖"},null,null,"ESFA funded level 3 free courses for jobs",null,"ESFA funded ASF","ESFA funded level 3 free courses for jobs"]
[null,null,"Legal Name",null,null,null,null,null,null,null,null,null,null,null,null,"New request",null,"Exception for growth","Exception for growth"]
[null,null,"UK Provider Registration Number (UKPRN):",{"$f":"IFERROR(VLOOKUP(D20,Providers!A:B,2,FALSE),\"\")","v":""},null,{"$f":"IFERROR(VLOOKUP(D20,Providers!$J$1:$L$595,3,FALSE),\"\")","v":""},null,null,null,null,null,null,null,null,null,"Top Up if below £45,000",null,"Exemption from auto reduction","Exemption from auto reduction"]
[null,null,null,null,null,null,null,null,null,null,null,null,null,null,null,"Exception for growth"]
[null,null,"Funding stream",null,null,null,null,null,null,null,null,null,{"$f":"IF(ISBLANK(D24), \"✖\", \"✔\")","v":"✖"}]
[]
[null,null,"Request",null,null,null,null,null,null,null,null,null,{"$f":"IF(ISBLANK(D26), \"✖\", \"✔\")","v":"✖"}]

{"sheet":"Exception Guidance","index":1,"n_rows":51,"n_cols":3,"rows_kept":51,"cut":false,"hidden":false,"merged":[[11,1,11,2],[12,1,12,2],[26,1,26,2],[28,1,28,2],[30,1,30,2],[20,1,20,2],[22,1,22,2],[23,1,23,2],[24,1,24,2],[25,1,25,2],[16,1,16,2],[17,1,17,2],[18,1,18,2],[37,1,37,2],[39,1,39,2],[34,1,34,2],[36,1,36,2],[14,1,14,2],[32,1,32,2],[35,1,35,7]]}
[]
[]
[]
[]
[]
[]
[]
[]
[]
[]
[]
[null,"Post 19 - Exceptional request guidance"]
[null,"Funding year 2024 to 2025"]
[]
[null,"When to submit a case"]
[]
[null,"You need to complete this form if there have been exceptional circumstances at the performance management review for "]
[null,"   - why you do not meet the criteria for increases or"]
[null,"   - why you should not receive an automated reduction"]
[]
[null,"Exceptional requests are to review whether you are in scope for an increase or reduction and if accepted you will be subject to the formulaic calculation. We will not accept requests for additional funding outside of the formulaic approach.  We will not accept any requests received after the 5pm on 4 December 2024 deadline or requests submitted to a different email address.  "]
[]
[null,"You must only complete the request form for an exception if one of the following criteria puts you out of scope for an increase:"]
[null,"   - you are outside of the tolerance for an increase at the review point"]
[null,"   - you do not have a good track record (as detailed in the funding and performance management rules 2024 to 2025)"]
[null,"   - you are in formal intervention with the ESFA or under additional conditions of funding or additional contractual obligation"]
[null,"   - if you have experienced a significant data error that has affected your ILR"]
[]
[null,"You must complete the form as fully as possible, detailing errors, supporting information, mitigation plans."]
[]
{"$rows_left_out":22}
{"sheet":"Exceptional case","index":2,"n_rows":67,"n_cols":10,"rows_kept":67,"cut":false,"hidden":false,"merged":[[62,1,62,6],[63,1,63,7],[65,1,65,8],[66,1,66,5],[60,2,60,4],[58,2,58,7],[24,1,24,8],[2,9,3,9],[7,2,7,7],[9,2,9,3],[56,2,56,7],[19,1,19,2],[31,1,49,7],[2,1,2,7],[13,1,13,2],[13,3,13,7],[15,1,15,2],[15,3,15,7],[18,1,18,2]]}
[]
[null,null,null,null,null,null,null,null,null,"Completion status"]
[null,"Exception case - Adult skills fund and ESFA funded level 3 free courses for jobs ",null,null,null,null,null,null,null,{"$f":"IF(OR('COMPLETE ME FIRST'!D26:D26=\"Exemption from auto reduction\",'COMPLETE ME FIRST'!D26:D26=\"Exception for growth\"),IF(COUNTIFS(J5:J61,\"✔\")=COUNTA(J5:J61),\"Complete\",\"Incomplete\"),\"NOT REQUIRED\")","v":"NOT REQUIRED"}]
[null,"Please read the guidance page before completing this form. Please complete ALL of the cells highlighted yellow."]
[]
[null,"Section 1. provider details"]
[]
[null,"Provider name",{"$f":"'COMPLETE ME FIRST'!D20:D20","v":0},null,null,null,null,null,null,{"$f":"IF(C8=0, \"✖\", \"✔\")","v":"✖"}]
[]
[null,"UKPRN",{"$f":"IFERROR(VLOOKUP(C8,Providers!A:B,2,FALSE),\"\")","v":""}]
[]
[null,"Section 2. exceptional request"]
[]
[null,"Reason for request",null,null,null,null,null,null,null,{"$f":"IF(ISBLANK(D14), \"✖\", \"✔\")","v":"✖"}]
[]
[null,"Funding stream",null,{"$f":"'COMPLETE ME FIRST'!D24:D24","v":0},null,null,null,null,null,{"$f":"IF(D16=0, \"✖\", \"✔\")","v":"✖"}]
[]
[]
[null,null,null,"Current 2020/21 allocation","Increase requested","Revised 2020/21 allocation requested"]
[null,"2020 to 2021 allocation",null,null,null,{"$f":"D20+E20","v":0}]
[null,"We may take your increase request into consideration, however we will use your data to calculate any increases. We will use the information within section 3 to accept or reject your exception request"]
[]
[null,"Section 3. supporting information"]
[]
[null,"Please briefly describe the reason for your request.  We will not accept any information outside of this form.\n We will contact you if we require further information. Please include evidence of:"]
[null,null,"•  the reason for not hitting the performance management requirements"]
[null,null,"•  what mitigating actions you will take"]
[]
[]
[null,"Please limit this to a maximum of 250 words.  We will contact you if we require further information."]
{"$rows_left_out":38}
{"sheet":"Request Guidance","index":3,"n_rows":48,"n_cols":3,"rows_kept":48,"cut":false,"hidden":false,"merged":[[29,1,29,2],[6,1,6,2],[7,1,7,2],[9,1,9,2],[11,1,11,2],[13,1,13,2],[15,1,15,2],[17,1,17,2],[18,1,18,2],[19,1,19,2],[21,1,21,2],[23,1,23,2],[25,1,25,2],[27,1,27,2],[28,1,28,2],[26,1,26,7]]}
[]
[]
[]
[]
[]
[]
[null,"Post 19 - First time request / Top up guidance"]
[null,"Funding year 2024 to 2025"]
[]
[null,"At the review point set out in the funding and performance management rules, you have the ability to :-"]
[]
[null,"- request a ESFA Funded Level 3 free courses for jobs allocation if you have a 2024 to 2025 ESFA funded ASF grant agreement and have not been issued level 3 free courses for jobs allocation for 24-year-olds and above because you have not delivered these courses historically OR your Level 3 free courses for jobs contract value is below £45,000. "]
[]
[null,"You must complete the 'First time request' or 'Top up' sheet by 5pm on 4 December 2024. We will not accept any requests received after the deadline or submitted to a different email address. "]
[]
[null,"The maximum allocation you can apply for is £45,000 (including existing contract value)  This is not guaranteed, and the value we award may be lower. We will assess your request and the information you provide in line with the timetable set out in the performance management review."]
[]
[null,"You will only be considered if:"]
[null,"   - you have a 2024 to 2025 ESFA funded ASF funding agreement (grant only)"]
[null,"   - you have a good track record (as detailed in the funding and performance management rules 2024 to 2025)"]
[]
[null,"Please do not include any personal or sensitive data about your students when submitting your case. Personal data is information relating to a living individual who is, or can be, identified from the data provided. Personal data can be information about the individual, their families or circumstances. This may include names, contact details, gender or date of birth."]
[]
[null,"Returning the form"]
[]
[null,"Once the form shows the completed status, please submit the form via the Customer Help Portal, creating a new enquiry, in which you can attach the form."]
[null,"Customer help portal (education.gov.uk)"]
[null,"Ensure to title the enquiry Post 19 Allocations - First time or Top up request"]
[null,"If you have questions after reading this information, or if there’s anything else you need help with, you can find more support in our customer help centre."]
[null,"Customer help centre (education.gov.uk)"]
{"$rows_left_out":19}
{"sheet":"First time request","index":4,"n_rows":258,"n_cols":10,"rows_kept":258,"cut":false,"hidden":false,"merged":[[253,1,253,6],[254,1,254,7],[256,1,256,8],[257,1,257,5],[21,1,21,2],[22,1,22,2],[50,2,50,7],[52,2,52,7],[54,2,54,4],[23,1,23,2],[34,1,34,7],[38,1,38,7],[42,1,42,7],[36,1,36,9],[2,1,2,7],[8,2,8,7],[10,2,10,3],[15,1,15,2],[15,3,15,7],[3,0,3,7]]}
[]
[null,null,null,null,null,null,null,null,null,"Completion status"]
[null,"First time request -  ESFA funded level 3 free courses for jobs (providers must hold an ASF grant allocation)",null,null,null,null,null,null,null,{"$f":"IF('COMPLETE ME FIRST'!D26:D26<>\"New request\",\"NOT REQUIRED\",IF(COUNTIFS(J6:J60,\"✔\")=COUNTA(J6:J60),\"Complete\",\"Incomplete\"))","v":"NOT REQUIRED"}]
[]
[null,"Please read the guidance page before completing this form. Please complete ALL of the cells highlighted yellow."]
[]
[null,"Section 1. provider details"]
[]
[null,"Provider name",{"$f":"'COMPLETE ME FIRST'!D20:D20","v":0},null,null,null,null,null,null,{"$f":"IF(C9=0, \"✖\", \"✔\")","v":"✖"}]
[]
[null,"UKPRN",{"$f":"IFERROR(VLOOKUP(C9,Providers!A:B,2,FALSE),\"\")","v":""}]
[]
[]
[null,"Section 2. request"]
[]
[null,"Funding stream",null,{"$f":"'COMPLETE ME FIRST'!D24:D24","v":0},null,null,null,null,null,{"$f":"IF(D16=0, \"✖\", \"✔\")","v":"✖"}]
[null,"Do you currently hold a ESFA funded ASF allocation?",null,null,null,null,null,null,null,{"$f":"IF(ISBLANK(H17),\"✖\",IF(H17=\"No\",\"✖\",\"✔\"))","v":"✖"}]
[null,"Is this request for direct delivery or subcontracted?",null,null,null,null,null,null,null,{"$f":"IF(ISBLANK(H18), \"✖\", \"✔\")","v":"✖"}]
[]
[null,"Total requested for 2024 to 2025 funding year"]
[]
[null,null,null,"2024/25 request","August to March ","April to July"]
[null,"Enter allocation value request £",null,null,{"$f":"IF(D23=\"\",\"\",ROUNDUP(D23*66.67%,0))","v":""},{"$f":"IF(D23=\"\",\"\",ROUNDDOWN(D23*33.33%,0))","v":""},null,null,null,{"$f":"IF(AND(ISBLANK(D23),ISBLANK(D23)),\"✖\", \"✔\")","v":"✖"}]
[null,"Volume of starts",null,null,null,null,null,null,null,{"$f":"IF(AND(ISBLANK(D24),ISBLANK(D24)),\"✖\", \"✔\")","v":"✖"}]
[null,"We will take your request into consideration, however we will use your data to calculate any allocations. The maximum you can request is £45,000"]
[]
[null,"Section 3. supporting information"]
[]
[null,"Please provide details for each of the following questions.  We will not accept any information outside of this form. We will contact you if we require further information."]
[]
{"$rows_left_out":229}
{"sheet":"Top Up","index":5,"n_rows":258,"n_cols":10,"rows_kept":258,"cut":false,"hidden":false,"merged":[[253,1,253,6],[254,1,254,7],[256,1,256,8],[257,1,257,5],[56,2,56,4],[21,1,21,2],[36,1,36,7],[38,1,38,9],[40,1,40,7],[44,1,44,7],[52,2,52,7],[54,2,54,7],[22,1,22,2],[23,1,23,2],[24,1,24,2],[25,1,25,2],[26,1,26,10],[8,2,8,7],[10,2,10,3],[15,1,15,2],[15,3,15,7],[2,1,2,7]]}
[]
[null,null,null,null,null,null,null,null,null,"Completion status"]
[null,"Top up request if contract value is below £45,000 - ESFA funded level 3 free courses for jobs (grant)",null,null,null,null,null,null,null,{"$f":"IF('COMPLETE ME FIRST'!D26:D26<>\"Top up if below £45,000\",\"NOT REQUIRED\",IF(COUNTIFS(J6:J62,\"✔\")=COUNTA(J6:J62),\"Complete\",\"Incomplete\"))","v":"NOT REQUIRED"}]
[]
[null,"Please read the guidance page before completing this form. Please complete ALL of the cells highlighted yellow."]
[]
[null,"Section 1. provider details"]
[]
[null,"Provider name",{"$f":"'COMPLETE ME FIRST'!D20:D20","v":0},null,null,null,null,null,null,{"$f":"IF(C9=0, \"✖\", \"✔\")","v":"✖"}]
[]
[null,"UKPRN",{"$f":"IFERROR(VLOOKUP(C9,Providers!A:B,2,FALSE),\"\")","v":""}]
[]
[]
[null,"Section 2. request"]
[]
[null,"Funding stream",null,{"$f":"'COMPLETE ME FIRST'!D24:D24","v":0},null,null,null,null,null,{"$f":"IF(D16=0, \"✖\", \"✔\")","v":"✖"}]
[null,"Do you currently hold a ESFA funded ASF allocation?",null,null,null,null,null,null,null,{"$f":"IF(ISBLANK(H17), \"✖\", \"✔\")","v":"✖"}]
[null,"Is this request for direct delivery or subcontracted?",null,null,null,null,null,null,null,{"$f":"IF(ISBLANK(H18), \"✖\", \"✔\")","v":"✖"}]
[]
[null,"Total requested for 2024 to 2025 funding year"]
[]
[null,null,null,"2024/25 request","August to March ","April to July"]
[null,"Enter current allocation value £",null,null,{"$f":"IF(D23=\"\",\"\",ROUNDUP(D23*66.67%,0))","v":""},{"$f":"IF(D23=\"\",\"\",ROUNDDOWN(D23*33.33%,0))","v":""},null,null,null,{"$f":"IF(AND(ISBLANK(D23),ISBLANK(D23)),\"✖\", \"✔\")","v":"✖"}]
[null,"Enter the top up value requested £",null,null,{"$f":"IF(D24=\"\",\"\",ROUNDUP(D24*66.67%,0))","v":""},{"$f":"IF(D24=\"\",\"\",ROUNDDOWN(D24*33.33%,0))","v":""},null,null,null,{"$f":"IF(AND(ISBLANK(D24),ISBLANK(D24)),\"✖\", \"✔\")","v":"✖"}]
[null,"New Value",null,{"$f":"SUM(D23:D24)","v":0},{"$f":"SUM(E23:E24)","v":0},{"$f":"SUM(F23:F24)","v":0},null,null,null,{"$f":"IF(D25>=45001,\"✖\",\"✔\")","v":"✔"}]
[null,"Volume of starts",null,null,null,null,null,null,null,{"$f":"IF(AND(ISBLANK(D26),ISBLANK(D26)),\"✖\", \"✔\")","v":"✖"}]
[null,"We will take your request into consideration, however we will use your data to calculate any allocations. The maximum you can request is £45,000 in total, including current allocation value"]
[]
[null,"Section 3. supporting information"]
[]
{"$rows_left_out":229}
{"sheet":"Providers","index":6,"n_rows":377,"n_cols":12,"rows_kept":377,"cut":false,"hidden":true,"merged":[]}
["ABINGDON AND WITNEY COLLEGE",10000055,null,null,null,null,null,null,"UKPRN","Name","UKPRN2","Type"]
["ACADEMY TRANSFORMATION TRUST (Grant)",10039859,null,null,"ESFA Funded Adult Education Budget (AEB)",null,null,null,10000055,"ABINGDON AND WITNEY COLLEGE",10000055,"Grant"]
["ACADEMY TRANSFORMATION TRUST (Contract for Services)",10039859,null,null,"16-18 Traineeships ",null,null,null,10039859,"ACADEMY TRANSFORMATION TRUST (Grant)",10039859,"Grant"]
["ACCESS TRAINING (EAST MIDLANDS) LTD",10010584,null,null,"19-24 traineeships",null,null,null,10039859,"ACADEMY TRANSFORMATION TRUST (Contract for Services)",10039859,"Contract for Services"]
["ACORN TRAINING LTD",10023489,null,null,null,null,null,null,10010584,"ACCESS TRAINING (EAST MIDLANDS) LTD",10010584,"Contract for Services"]
["ACTIVATE LEARNING",10004927,null,null,"Do not meet the track record criteria",null,null,null,10023489,"ACORN TRAINING LTD",10023489,"Contract for Services"]
["AGINCARE GROUP LIMITED",10048865,null,null,"Data error",null,null,null,10004927,"ACTIVATE LEARNING",10004927,"Grant"]
["ARTS UNIVERSITY PLYMOUTH",10005127,null,null,"Technical error",null,null,null,10048865,"AGINCARE GROUP LIMITED",10048865,"Contract for Services"]
["ASKHAM BRYAN COLLEGE",10000415,null,null,"Have not met the threshold for growth",null,null,null,10005127,"ARTS UNIVERSITY PLYMOUTH",10005127,"Grant"]
["ASPIRE SPORTING ACADEMY LTD",10032029,null,null,"More than one of the above (please detail below)",null,null,null,10000415,"ASKHAM BRYAN COLLEGE",10000415,"Grant"]
["AYLESBURY COLLEGE",10000473,null,null,"Exemption from auto reduction in Performance Review",null,null,null,10032029,"ASPIRE SPORTING ACADEMY LTD",10032029,"Contract for Services"]
["BACK 2 WORK COMPLETE TRAINING LIMITED",10033156,null,null,null,null,null,null,10000473,"AYLESBURY COLLEGE",10000473,"Grant"]
["BARKING & DAGENHAM LONDON BOROUGH COUNCIL",10000143,null,null,"I confirm I have authority",null,null,null,10033156,"BACK 2 WORK COMPLETE TRAINING LIMITED",10033156,"Contract for Services"]
["BARKING AND DAGENHAM COLLEGE",10000528,null,null,"I do not have authority",null,null,null,10000143,"BARKING & DAGENHAM LONDON BOROUGH COUNCIL",10000143,"Grant"]
["BARNET & SOUTHGATE COLLEGE (Grant)",10000533,null,null,null,null,null,null,10000528,"BARKING AND DAGENHAM COLLEGE",10000528,"Grant"]
["BARNET & SOUTHGATE COLLEGE (Contract for Services)",10000533,null,null,null,null,null,null,10000533,"BARNET & SOUTHGATE COLLEGE (Grant)",10000533,"Grant"]
["BASINGSTOKE COLLEGE OF TECHNOLOGY",10000560,null,null,null,null,null,null,10000533,"BARNET & SOUTHGATE COLLEGE (Contract for Services)",10000533,"Contract for Services"]
["BATH COLLEGE",10001465,null,null,null,null,null,null,10000560,"BASINGSTOKE COLLEGE OF TECHNOLOGY",10000560,"Grant"]
["BEACON EDUCATION PARTNERSHIP LIMITED",10033608,null,null,null,null,null,null,10001465,"BATH COLLEGE",10001465,"Grant"]
["BEDFORD COLLEGE",10000610,null,null,null,null,null,null,10033608,"BEACON EDUCATION PARTNERSHIP LIMITED",10033608,"Contract for Services"]
["BEXHILL COLLEGE",10000670,null,null,null,null,null,null,10000610,"BEDFORD COLLEGE",10000610,"Grant"]
["BEXLEY LONDON BOROUGH COUNCIL",10000146,null,null,null,null,null,null,10000670,"BEXHILL COLLEGE",10000670,"Grant"]
["BIRMINGHAM CITY COUNCIL",10000703,null,null,null,null,null,null,10000146,"BEXLEY LONDON BOROUGH COUNCIL",10000146,"Grant"]
["BIRMINGHAM METROPOLITAN COLLEGE",10006442,null,null,null,null,null,null,10000703,"BIRMINGHAM CITY COUNCIL",10000703,"Grant"]
["BISHOP AUCKLAND COLLEGE",10000720,null,null,null,null,null,null,10006442,"BIRMINGHAM METROPOLITAN COLLEGE",10006442,"Grant"]
["BISHOP BURTON COLLEGE",10000721,null,null,null,null,null,null,10000720,"BISHOP AUCKLAND COLLEGE",10000720,"Grant"]
["BLACKBURN COLLEGE",10000747,null,null,null,null,null,null,10000721,"BISHOP BURTON COLLEGE",10000721,"Grant"]
["BLACKBURN WITH DARWEN BOROUGH COUNCIL",10000748,null,null,null,null,null,null,10000747,"BLACKBURN COLLEGE",10000747,"Grant"]
["BLACKPOOL AND THE FYLDE COLLEGE",10000754,null,null,null,null,null,null,10000748,"BLACKBURN WITH DARWEN BOROUGH COUNCIL",10000748,"Grant"]
["BLACKPOOL BOROUGH COUNCIL",10000755,null,null,null,null,null,null,10000754,"BLACKPOOL AND THE FYLDE COLLEGE",10000754,"Grant"]
{"$rows_left_out":348}
{"sheet":"Summary","index":7,"n_rows":10,"n_cols":18,"rows_kept":10,"cut":false,"hidden":true,"merged":[]}
["First time"]
["Provider Name","UKPRN","Request type","Funding stream","Do you currently hold an ESFA funded AEB allocation?","Is this request for direct delivery or subcontracted?","Value","Volume","Q1","Q2","Q3","Q4","Name","Position in Organisation","Date of Request","Authority"]
[{"$f":"'COMPLETE ME FIRST'!D20:D20","v":0},{"$f":"'COMPLETE ME FIRST'!D22","v":""},{"$f":"'COMPLETE ME FIRST'!D24:D24","v":0},{"$f":"'COMPLETE ME FIRST'!D26:D26","v":0},{"$f":"'First time request'!H17","v":0},{"$f":"'First time request'!H18","v":0},{"$f":"'First time request'!D23","v":0},{"$f":"'First time request'!D24","v":0},{"$f":"'First time request'!B35","v":0},{"$f":"'First time request'!B39","v":0},{"$f":"'First time request'!#REF!","v":{"$error":"#REF!"}},{"$f":"'First time request'!B43","v":0},{"$f":"'First time request'!C51","v":0},{"$f":"'First time request'!C53","v":0},{"$f":"'First time request'!C55","v":"00:00:00"},{"$f":"'First time request'!J49","v":"✖"}]
[]
[]
[]
[]
["Top Up"]
["Provider Name","UKPRN","Request type","Funding stream","Do you currently hold an ESFA funded AEB allocation?","Is this request for direct delivery or subcontracted?","Current Value £","Request £","New Value £","Volume","Q1","Q2","Q3","Q4","Name","Position in Organisation","Date of Request","Authority"]
[{"$f":"'COMPLETE ME FIRST'!D20:D20","v":0},{"$f":"'COMPLETE ME FIRST'!D22","v":""},{"$f":"'COMPLETE ME FIRST'!D24:D24","v":0},{"$f":"'COMPLETE ME FIRST'!D26:D26","v":0},{"$f":"'Top Up'!H17","v":0},{"$f":"'Top Up'!H18","v":0},{"$f":"'Top Up'!D23","v":0},{"$f":"'Top Up'!D24","v":0},{"$f":"'Top Up'!D25","v":0},{"$f":"'Top Up'!D26","v":0},{"$f":"'Top Up'!B37","v":0},{"$f":"'Top Up'!B41","v":0},{"$f":"'Top Up'!#REF!","v":{"$error":"#REF!"}},{"$f":"'Top Up'!B45","v":0},{"$f":"'Top Up'!C53","v":0},{"$f":"'Top Up'!C55","v":0},{"$f":"'Top Up'!C57","v":"00:00:00"},{"$f":"'Top Up'!J51","v":"✖"}]