{"text_format":"1","workbook":"xlsx","n_sheets":9,"sheets":["Guidance","Organisation user","BFR 2024","Summary declaration","Preparer declaration ","Approver declaration","Min Max table","Trust validations table","2022-23 CoA to BFR mapping "],"not_rendered":{"charts":0,"images":0,"macros":1,"external_links":0,"defined_names":0,"comments":1,"pivot_tables":0},"unopened":[],"bounds":{"document_bytes":16777216,"sheet_cells":100000,"rows_first":2000,"rows_last":500,"rows_between":2000,"halvings":0,"cell_chars":16384,"cell_head_chars":4096},"cells_cut":0,"cells_raw":0,"read":"whole","date_system":"1900"}

{"sheet":"Guidance","index":0,"n_rows":336,"n_cols":2,"rows_kept":336,"cut":false,"hidden":false,"merged":[[3,1,4,1]]}
[null,"Budget forecast return (BFR) 2024"]
[]
[]
[null,"This document is designed to help you prepare for the online BFR return. To actually submit your return you'll need to use the online form  published on the GOV.UK website."]
[]
[null,"Use the workbook to process and validate information before completing the online form."]
[null,"Most numbers (especially income and expenditure) are positive figures. A few numbers are negative, but this will be clear when inputting the figures either on the workbook or the online form."]
[null,"Enter all figures in the online form in thousands, except for line 999 for pupil numbers and line 3900 and 3950 around % for pay awards."]
[]
[null,"As with the online form, enter all monetary balances in round £000s, not pounds and pence. For example, for £10,471.23 enter 10, but for £10,891.25 enter 11. Enter a six-figure amount like £453,678 as 454."]
[]
[]
[null,"The main features in the 2024 version of the spreadsheet are:"]
[null,"• New lines to collect data on how much trusts spend in key areas of technology (ICT)."]
[null,"• A new line to understand how much trusts spend on buildings repairs/maintenance and/or improvements that is not capitalised and that is funded through capital grants and inlcuded in the revenue section of the return."]
[null,"• Updated the question about reserves to better understand trust's plans for reserves."]
[null,"• Updated the three-year forecast section to ask for specific assumptions around pay awards or teaching and support staff."]
[null,"• Removal of Line 299, included guidance on RAAC income/expenditure and updated a number of help texts following user feedback. We have also created a BFR lines quick reference guide. "]
[null,"• When BFR 2024 goes live, it'll be on a new authentification system called DfE Sign In (DSI) and IDAMS will no longer be operational."]
[]
{"$rows_left_out":317}
{"sheet":"Organisation user","index":1,"n_rows":131,"n_cols":24,"rows_kept":131,"cut":false,"hidden":false,"merged":[[5,2,5,10],[5,12,5,17],[7,12,7,17],[9,12,9,17],[11,12,11,17],[27,2,27,10],[28,2,28,10],[28,12,28,17],[29,2,29,10],[29,12,29,17],[30,2,30,10],[30,12,30,17],[17,12,17,17],[22,4,22,10],[22,12,22,17],[23,4,23,10],[23,12,23,17],[34,2,34,10],[34,12,34,17],[35,2,35,10],[35,12,35,17],[36,2,36,10],[36,12,36,17],[31,2,31,10],[31,12,31,17],[32,2,32,10],[32,12,32,17],[33,2,33,10],[33,12,33,17],[40,2,40,10],[40,12,40,17],[41,2,41,10],[41,12,41,17],[42,2,42,10],[42,12,42,17],[37,2,37,10],[37,12,37,17],[38,2,38,10],[38,12,38,17],[39,2,39,10],[39,12,39,17],[46,2,46,10],[46,12,46,17],[47,2,47,10],[47,12,47,17],[48,2,48,10],[48,12,48,17],[43,2,43,10],[43,12,43,17],[44,2,44,10],[44,12,44,17],[45,2,45,10],[45,12,45,17],[52,2,52,10],[52,12,52,17],[53,2,53,10],[53,12,53,17],[54,2,54,10],[54,12,54,17],[49,2,49,10],[49,12,49,17],[50,2,50,10],[50,12,50,17],[51,2,51,10],[51,12,51,17],[58,2,58,10],[58,12,58,17],[59,2,59,10],[59,12,59,17],[60,2,60,10],[60,12,60,17],[55,2,55,10],[55,12,55,17],[56,2,56,10],[56,12,56,17],[57,2,57,10],[57,12,57,17],[64,2,64,10],[64,12,64,17],[65,2,65,10],[65,12,65,17],[66,2,66,10],[66,12,66,17],[61,2,61,10],[61,12,61,17],[62,2,62,10],[62,12,62,17],[63,2,63,10],[63,12,63,17],[70,2,70,10],[70,12,70,17],[71,2,71,10],[71,12,71,17],[72,2,72,10],[72,12,72,17],[67,2,67,10],[67,12,67,17],[68,2,68,10],[68,12,68,17],[69,2,69,10],[69,12,69,17],[76,2,76,10],[76,12,76,17],[77,2,77,10],[77,12,77,17],[78,2,78,10],[78,12,78,17],[73,2,73,10],[73,12,73,17],[74,2,74,10],[74,12,74,17],[75,2,75,10],[75,12,75,17],[82,2,82,10],[82,12,82,17],[83,2,83,10],[83,12,83,17],[84,2,84,10],[84,12,84,17],[79,2,79,10],[79,12,79,17],[80,2,80,10],[80,12,80,17],[81,2,81,10],[81,12,81,17],[88,2,88,10],[88,12,88,17],[89,2,89,10],[89,12,89,17],[90,2,90,10],[90,12,90,17],[85,2,85,10],[85,12,85,17],[86,2,86,10],[86,12,86,17],[87,2,87,10],[87,12,87,17],[94,2,94,10],[94,12,94,17],[95,2,95,10],[95,12,95,17],[96,2,96,10],[96,12,96,17],[91,2,91,10],[91,12,91,17],[92,2,92,10],[92,12,92,17],[93,2,93,10],[93,12,93,17],[100,2,100,10],[100,12,100,17],[101,2,101,10],[101,12,101,17],[102,2,102,10],[102,12,102,17],[97,2,97,10],[97,12,97,17],[98,2,98,10],[98,12,98,17],[99,2,99,10],[99,12,99,17],[106,2,106,10],[106,12,106,17],[107,2,107,10],[107,12,107,17],[108,2,108,10],[108,12,108,17],[103,2,103,10],[103,12,103,17],[104,2,104,10],[104,12,104,17],[105,2,105,10],[105,12,105,17],[112,2,112,10],[112,12,112,17],[113,2,113,10],[113,12,113,17],[114,2,114,10],[114,12,114,17],[109,2,109,10],[109,12,109,17],[110,2,110,10],[110,12,110,17],[111,2,111,10],[111,12,111,17],[118,12,118,17],[119,2,119,10],[119,12,119,17],[120,2,120,10],[120,12,120,17],[115,2,115,10],[115,12,115,17],[116,2,116,10],[116,12,116,17],[117,2,117,10],[117,12,117,17],[2,1,3,10],[130,2,130,10],[130,12,130,17],[15,12,15,17],[19,12,19,17],[127,2,127,10],[127,12,127,17],[128,2,128,10],[128,12,128,17],[129,2,129,10],[129,12,129,17],[124,2,124,10],[124,12,124,17],[125,2,125,10],[125,12,125,17],[126,2,126,10],[126,12,126,17],[121,2,121,10],[121,12,121,17],[122,2,122,10],[122,12,122,17],[123,2,123,10],[123,12,123,17],[118,2,118,10]]}
[null,"Budget Forecast Return 2024"]
[]
[null,"This workbook is to be used to help prepare for the online form. It should be completed on an accruals and prepayments basis at trust level.\nEnter all figures in the online form in round thousands, except line 999 for pupil numbers. Do not enter whole numbers."]
[]
[null,null,null,null,null,null,null,null,null,null,null,null,null,null,null,null,null,null,"Initial validation","Outstanding validation"]
[null,"Trust name:",null,null,null,null,null,null,null,null,null,null,{"$f":"IF(S6=1,V6,\"\")","v":"Please enter the name of your trust."},null,null,null,null,null,{"$f":"IF(C6=\"\",1,0)","v":1},{"$f":"S6","v":1},null,"Please enter the name of your trust."]
[]
[null,"Trust type ",null,null,null,null,null,null,null,null,null,null,{"$f":"IF(S8=1,V8,\"\")","v":"Please state whether your trust is a MAT or a SAT."},null,null,null,null,null,{"$f":"IF(C8=\"\",1,0)","v":1},{"$f":"S8","v":1},null,"Please state whether your trust is a MAT or a SAT."]
[]
[null,"Trust UPIN",null,null,null,null,null,null,null,null,null,null,{"$f":"IF(S10=1,V10,\"\")","v":"Please enter your trust UPIN."},null,null,null,null,null,{"$f":"IF(C10=\"\",1,0)","v":1},{"$f":"S10","v":1},null,"Please enter your trust UPIN."]
[]
[null,"Company House Number ",null,null,null,null,null,null,null,null,null,null,{"$f":"IF(S12=1,V12,\"\")","v":"Please enter your trust companies house number, this cell allows a leading zero."},null,null,null,null,null,{"$f":"IF(C12=\"\",1,0)","v":1},{"$f":"S12","v":1},null,"Please enter your trust companies house number, this cell allows a leading zero."]
[]
[null,"What are the contact details for this trust as we may need to contact you?"]
[]
[null,"Full name",null,null,null,null,null,null,null,null,null,null,{"$f":"IF(S16=1,V16,\"\")","v":"Please enter your full name."},null,null,null,null,null,{"$f":"IF(C16=\"\",1,0)","v":1},{"$f":"S16","v":1},null,"Please enter your full name."]
[]
[null,"UK telephone number",null,null,null,null,null,null,null,null,null,null,{"$f":"IF(S18=1,V18,\"\")","v":"Please enter a full UK telephone number."},null,null,null,null,null,{"$f":"IF(C18=\"\",1,0)","v":1},{"$f":"S18","v":1},null,"Please enter a full UK telephone number."]
[]
[null,"Email Address",null,null,null,null,null,null,null,null,null,null,{"$f":"IF(S20=1,V20,\"\")","v":"Please enter your email address."},null,null,null,null,null,{"$f":"IF(C20=\"\",1,0)","v":1},{"$f":"S20","v":1},null,"Please enter your email address."]
{"$rows_left_out":112}
{"sheet":"BFR 2024","index":2,"n_rows":396,"n_cols":37,"rows_kept":396,"cut":false,"hidden":false,"merged":[[10,0,10,2],[9,0,9,2],[11,0,11,2],[2,0,2,11],[8,0,8,2],[4,0,4,2],[5,0,6,2],[395,9,396,9],[395,1,396,1],[395,2,396,2],[395,7,396,7],[395,8,396,8],[395,6,396,6],[156,1,157,4],[188,6,188,8],[203,6,203,8],[125,14,125,16],[228,6,228,8],[228,14,228,16],[154,14,154,16],[203,14,203,16],[27,6,27,8],[188,10,188,12],[228,10,228,12],[154,10,154,12],[62,6,62,8],[97,6,97,8],[125,6,125,8],[154,6,154,8],[62,10,62,12],[203,10,203,12],[15,10,15,16],[16,10,16,16],[17,10,17,16],[18,10,18,16],[27,10,27,12],[27,14,27,16],[62,14,62,16],[97,10,97,12],[97,14,97,16],[125,10,125,12],[188,14,188,16]]}
["Budget Forecast Return",null,null,null,null,null,null,null,null,null,null,null,null,null,null,null,null,null,null,null,null,null,null,null,null,null,"hidden from here"]
[]
["This workbook is to be used to help prepare for the online form. It should be completed on an accruals and prepayments basis at whole trust level.\nEnter all figures in the online form in round thousands, except for line 999 pupil numbers. Lines 3900 and 3950 around pay award % increase should be entered as a percentage % up to a maximum of 3 decimal places. QU379 if triggered is a % input to the nearest whole number."]
[]
["Protected sheets"]
["The worksheets are protected with the password 'BFR'. You can remove the protection to inspect how the workbook is structured. If you remove the password protection, there's a risk that formulas and validations could be accidentally overwritten. For that reason it's safer to do this on a separate, saved version."]
[]
[]
["Queries"]
[]
["If you have a query about completing your BFR return please contact the ESFA using the Customer Help Portal."]
[]
[]
[]
["Finance Questions",null,null,null,null,null,null,null,null,null,null,null,null,null,null,null,null,null,null,null,null,null,null,"Query No",null,"Query",null,"Test  No","Formula","Text for test","Formula"]
["FQ1","Have you had any provisions during this period, excluding pension liability?","Yes",null,{"$f":"IF(C16=\"No\",\"\",\"Link to the provisions section\")","v":"Link to the provisions section"}]
["FQ2","Have you had any loans during the period?","Yes",null,{"$f":"IF(C17=\"No\",\"\",\"Link to the loans section\")","v":"Link to the loans section"}]
["FQ3","Have you had any investments during the period?","Yes",null,{"$f":"IF(C18=\"No\",\"\",\"Link to the investments section\")","v":"Link to the investments section"}]
["FQ4","Have you had any overdrafts during the period?","Yes",null,{"$f":"IF(C19=\"No\",\"\",\"Link to the overdrafts section\")","v":"Link to the overdrafts section"}]
[]
{"$rows_left_out":377}
{"sheet":"Summary declaration","index":3,"n_rows":39,"n_cols":16,"rows_kept":39,"cut":false,"hidden":false,"merged":[[25,7,26,7],[25,6,26,6],[25,5,26,5],[5,1,5,16]]}
["Summary Declaration"]
[]
[null,"To ensure that figures input into the form have been rounded to the nearest £000, please review and confirm that the information in the table below is a true picture of your trust."]
[null,"Tick the box to confirm that the reported as figures are a true reflection of your trusts figures and show the unrounded position (in the orange cells)."]
[null,"If these figures are incorrect, please go to the relevant section to amend data input."]
[null,"As with the online form, enter all monetary balances in round £000s, not pounds and pence. For example, for £10,471.23 enter 10, but for £10,891.25 enter 11. Enter a six-figure amount like £453,678 as 454."]
[]
[null,null,null,null,null,"Actuals","Actuals","TOTAL",null,"Actuals","Forecast","TOTAL",null,"Forecast","Forecast","TOTAL"]
[null,"Section of workbook",null,"line no.",null,"Sep 22 - Mar 23","Apr 23 - Aug 23","2022/2023",null,"Sep 23- Mar 24","Apr 24 - Aug 24","2023/24",null,"Sep 24 - Mar 25","Apr 25- Aug 25","2024/25"]
[]
[null,"Revenue totals","Net revenue income/(expenditure) for the period",400,"calculated from input as (£000)",{"$f":"'BFR 2024'!G102","v":0},{"$f":"'BFR 2024'!H102","v":0},{"$f":"'BFR 2024'!I102","v":0},null,{"$f":"'BFR 2024'!K102","v":0},{"$f":"'BFR 2024'!L102","v":0},{"$f":"'BFR 2024'!M102","v":0},null,{"$f":"'BFR 2024'!O102","v":0},{"$f":"'BFR 2024'!P102","v":0},{"$f":"'BFR 2024'!Q102","v":0}]
[null,null,null,null,"reported as (£)",{"$f":"F11*1000","v":0},{"$f":"G11*1000","v":0},{"$f":"H11*1000","v":0},null,{"$f":"J11*1000","v":0},{"$f":"K11*1000","v":0},{"$f":"L11*1000","v":0},null,{"$f":"N11*1000","v":0},{"$f":"O11*1000","v":0},{"$f":"P11*1000","v":0}]
[]
[null,"Capital totals","Net capital income/(expenditure) for the period",660,"calculated from input as (£000)",{"$f":"'BFR 2024'!G175","v":0},{"$f":"'BFR 2024'!H175","v":0},{"$f":"'BFR 2024'!I175","v":0},null,{"$f":"'BFR 2024'!K175","v":0},{"$f":"'BFR 2024'!L175","v":0},{"$f":"'BFR 2024'!M175","v":0},null,{"$f":"'BFR 2024'!O175","v":0},{"$f":"'BFR 2024'!P175","v":0},{"$f":"'BFR 2024'!Q175","v":0}]
[null,null,null,null,"reported as (£)",{"$f":"F14*1000","v":0},{"$f":"G14*1000","v":0},{"$f":"H14*1000","v":0},null,{"$f":"J14*1000","v":0},{"$f":"K14*1000","v":0},{"$f":"L14*1000","v":0},null,{"$f":"N14*1000","v":0},{"$f":"O14*1000","v":0},{"$f":"P14*1000","v":0}]
[]
[null,null,null,null,null,"Balance at \n31 Aug 22","Balance at \n31 Mar 23",null,null,"Balance at \n31 Aug 23","Balance at \n31 Mar 24","Balance at \n31 Aug 24",null,"Balance at \n31 Mar 25","Balance at \n31 Aug 25"]
[]
[null,"Reserves total","Total trust reserves",1001,"calculated from input as (£000)",{"$f":"'BFR 2024'!G249","v":0},{"$f":"'BFR 2024'!H249","v":0},null,null,{"$f":"'BFR 2024'!K249","v":0},{"$f":"'BFR 2024'!L249","v":0},{"$f":"'BFR 2024'!M249","v":0},null,{"$f":"'BFR 2024'!O249","v":0},{"$f":"'BFR 2024'!P249","v":0}]
[null,null,null,null,"reported as (£)",{"$f":"F19*1000","v":0},{"$f":"G19*1000","v":0},null,null,{"$f":"J19*1000","v":0},{"$f":"K19*1000","v":0},{"$f":"L19*1000","v":0},null,{"$f":"N19*1000","v":0},{"$f":"O19*1000","v":0}]
{"$rows_left_out":20}
{"sheet":"Preparer declaration ","index":4,"n_rows":43,"n_cols":7,"rows_kept":43,"cut":false,"hidden":false,"merged":[[36,6,36,7],[26,4,26,6],[28,2,31,11],[9,2,9,7],[13,2,13,9],[17,2,17,7],[21,2,24,10],[33,2,33,3]]}
[]
[null,null,"Preparer Declaration"]
[]
[null,null,"Contact details of person completing the form\n"]
[]
[null,null,"Please enter these details, so DFE/ESFA can contact you if there are any questions."]
[]
[null,null,"Contact name:"]
[]
[]
[]
[null,null,"Contact email address:"]
[]
[]
[]
[null,null,"Contact phone number:"]
[]
[]
[]
[]
{"$rows_left_out":24}
{"sheet":"Approver declaration","index":5,"n_rows":55,"n_cols":21,"rows_kept":55,"cut":false,"hidden":false,"merged":[[8,2,8,7],[12,2,12,9],[16,2,16,7],[32,2,35,10],[36,2,36,10],[22,4,22,9],[26,4,26,11],[44,2,44,11],[40,2,42,10],[48,6,48,7],[40,12,42,16],[37,4,37,6]]}
[]
[null,null,"Academy Trust Declaration (approver)"]
[]
[null,null,"Contact details of person completing the form\n"]
[null,null,"Please enter these details, so DFE/ESFA can contact you if there are any questions."]
[]
[null,null,"Contact name:"]
[]
[]
[]
[null,null,"Contact email address:"]
[]
[]
[]
[null,null,"Contact phone number:"]
[]
[]
[]
[null,null,"Are you the Accounting Officer?",null,null,null,"No"]
[]
{"$rows_left_out":36}
{"sheet":"Min Max table","index":6,"n_rows":232,"n_cols":4,"rows_kept":232,"cut":false,"hidden":false,"merged":[]}
["Table of min and max values"]
["This table is for info only. The values are used in the 'BFR 2024' tab for the min/max tests."]
[]
["Line no.","Minimum value","Maximum value","Description"]
[101,{"$f":"-100000","v":-100000},{"$f":"100000","v":100000},"Rates reclaim"]
[102,0,{"$f":"800000","v":800000},"General Academy Grant (GAG) (excluding Student Service Grant)"]
[103,0,{"$f":"100000","v":100000},"Student Services Grant (Academy Post 16 Bursary Funding)"]
[105,0,100000,"Start Up Grants"]
[108,0,100000,"Pupil Premium & Service Premium"]
[132,{"$f":"-100000","v":-100000},100000,"Pupil Number Adjustment"]
[135,0,100000,"Other DfE/ESFA revenue grants"]
[136,0,100000,"Universal Infant Free School Meals"]
[137,0,100000,"Insurance"]
[138,0,{"$f":"300000","v":300000},"Sponsor Capacity Grant"]
[150,{"$f":"-100000","v":-100000},{"$f":"300000","v":300000},"Other DfE/ESFA family revenue Grants"]
[199,null,null,"Total DfE/ESFA revenue Income"]
[200,-400000,{"$f":"100000","v":100000},"Local authority revenue income"]
[205,-400000,{"$f":"100000","v":100000},"Other government grants"]
[210,-400000,{"$f":"100000","v":100000},"Income from trading activities"]
[211,-400000,{"$f":"100000","v":100000},"Income from trading activities"]
{"$rows_left_out":213}
{"sheet":"Trust validations table","index":7,"n_rows":145,"n_cols":6,"rows_kept":145,"cut":false,"hidden":false,"merged":[]}
["Validations table"]
["Trust responses to queries",null,"Please complete your answers in this table. You can then review your answers and paste into the online form."]
[]
[]
["No of 3Y forecast validations outstanding",null,{"$f":"COUNTIF('Trust validations table'!F134:F145,\"Response outstanding\")","v":4}]
["No of validations outstanding",null,{"$f":"COUNTIF('Trust validations table'!F15:F133,\"Response outstanding\")","v":9}]
[]
["Query reference",null,"Query","Section query relates to","Trust Response","STATUS"]
[]
[]
["FQ1",{"$f":"RIGHT(A11,2)","v":"Q1"}]
["FQ2","Q2"]
["FQ3","Q3"]
["FQ4","Q4"]
["QU1",1,{"$f":"IF(VLOOKUP($A15,'BFR 2024'!$X$32:$AA$397,3,FALSE)=0,\"\",VLOOKUP($A15,'BFR 2024'!$X$32:$AA$396,3,FALSE))","v":"You have forecast zero for GAG income for next year (102).  Briefly tell us why this value is zero?"},"Revenue Income: Line 102 - General Academy Grant (GAG) (excluding Student Service Grant)",null,{"$f":"IF(C15=\"\",\"OK\",IF(E15=\"\",\"Response Outstanding\",\"Response Provided\"))","v":"Response Outstanding"}]
["QU99",99,{"$f":"IF(VLOOKUP($A16,'BFR 2024'!$X$24:$AA$397,3,FALSE)=0,\"\",VLOOKUP($A16,'BFR 2024'!$X$24:$AA$396,3,FALSE))","v":"Please explain why your GAG per pupil is greater than £30k"},"GAG line 102 divided by pupil numbers line 999",null,"Response Outstanding"]
["QU2",2,{"$f":"IF(VLOOKUP($A17,'BFR 2024'!$X$32:$AA$397,3,FALSE)=0,\"\",VLOOKUP($A17,'BFR 2024'!$X$32:$AA$396,3,FALSE))","v":""},"Revenue Income: Line 132 - Pupil Number Adjustment",null,"OK"]
["QU3",3,{"$f":"IF(VLOOKUP($A18,'BFR 2024'!$X$32:$AA$385,3,FALSE)=0,\"\",VLOOKUP($A18,'BFR 2024'!$X$32:$AA$384,3,FALSE))","v":"Income totals are zero in any year - is this correct?"},"Revenue totals",null,"Response Outstanding"]
["QU4",4,{"$f":"IF(VLOOKUP($A19,'BFR 2024'!$X$32:$AA$385,3,FALSE)=0,\"\",VLOOKUP($A19,'BFR 2024'!$X$32:$AA$384,3,FALSE))","v":"Expenditure totals are zero for any year - is this correct?"},"Revenue totals",null,"Response Outstanding"]
["QU5",5,{"$f":"IF(VLOOKUP($A20,'BFR 2024'!$X$32:$AA$397,3,FALSE)=0,\"\",VLOOKUP($A20,'BFR 2024'!$X$32:$AA$396,3,FALSE))","v":""},"Revenue expenditure: Line 380 - Total revenue expenditure",null,"OK"]
{"$rows_left_out":126}
{"sheet":"2022-23 CoA to BFR mapping ","index":8,"n_rows":853,"n_cols":5,"rows_kept":853,"cut":false,"hidden":false,"merged":[]}
["CoA code","CoA account code description","BFR Line","BFR Line Description","Signage in BFR"]
[510150,"IN: DfE Revenue Grants: Rates reclaim",101,"Rates reclaim","Positive / Negative"]
[510100,"IN: DfE Revenue Grants: GAG (not stud supp and trust grants)",102,"General Academy Grant (GAG) (excluding Student Service Grant)","Positive"]
[510110,"IN: DfE Revenue Grants: GAG (student support)",103,"Student Services Grant (Academy Post 16 Bursary Funding)","Positive"]
[510120,"IN: DfE Revenue Grants: GAG (start up grants)",105,"Start Up Grants","Positive"]
[510200,"IN: DfE Revenue Grants: Pupil Premium",108,"Pupil Premium & Service Premium","Positive"]
[510140,"IN: DfE Revenue Grants: Pupil number adjustment",132,"Pupil Number Adjustment","Positive / Negative"]
[510130,"IN: DfE Revenue Grants: Trust level grants",135,"Other DfE/ESFA revenue grants","Positive"]
[510400,"IN: DfE Revenue Grants: PE & Sports grant",135,"Other DfE/ESFA revenue grants","Positive"]
[510450,"IN: DfE Revenue Grants: Year 7 catch up",135,"Other DfE/ESFA revenue grants","Positive"]
[510500,"IN: DfE Revenue Grants: Teachers Pay Grant",135,"Other DfE/ESFA revenue grants","Positive"]
[510510,"IN: DfE Revenue Grants: Teachers Pension Employer Contribution Grant",135,"Other DfE/ESFA revenue grants","Positive"]
[510550,"IN: DfE Revenue Grants: Teaching Schools grant",135,"Other DfE/ESFA revenue grants","Positive"]
[510600,"IN: DfE Revenue Grants: ITT Bursaries Grant",135,"Other DfE/ESFA revenue grants","Positive"]
[510700,"IN: DfE Revenue Grants: 16 to 19 ",135,"Other DfE/ESFA revenue grants","Positive"]
[510950,"IN: DfE Revenue Grants: Other DfE revenue grants",135,"Other DfE/ESFA revenue grants","Positive"]
[570200,"IN: Boarding Income: DfE grants",135,"Other DfE/ESFA revenue grants","Positive"]
[510250,"IN: DfE Revenue Grants: Universal Inf Free School Meals",136,"Universal Infant Free School Meals","Positive"]
[510300,"IN: DfE Revenue Grants: Insurance top up",137,"Insurance","Positive"]
[510350,"IN: DfE Revenue Grants: Sponsor capacity grant",138,"Sponsor Capacity Grant","Positive"]
{"$rows_left_out":833}