{"text_format":"1","workbook":"xlsx","n_sheets":15,"sheets":["Future Updates","Version History","User Guide","1a. Safety Policy & Objectives","1b. Safety Risk Management","1c. Safety Assurance","1d. Safety Promotion","2. Scoring and Evidence","Recommendations","Good Practices","3. Charts","4. Print Friendly Format","5. Evaluation Summary","6. How To Enable Macros","Chart Data"],"not_rendered":{"charts":5,"images":20,"macros":1,"external_links":0,"defined_names":7,"comments":5,"pivot_tables":0},"unopened":[],"bounds":{"document_bytes":16777216,"sheet_cells":100000,"rows_first":2000,"rows_last":500,"rows_between":2000,"halvings":0,"cell_chars":16384,"cell_head_chars":4096},"cells_cut":0,"cells_raw":0,"read":"whole","date_system":"1900"}

{"sheet":"Future Updates","index":0,"n_rows":55,"n_cols":6,"rows_kept":55,"cut":false,"hidden":true,"merged":[]}
[]
[]
[]
[]
[]
[]
[]
[null,null,"MAA Air Safety Management Performance Matrix (MAPM) Report Form"]
[null,null,"Please use this page to add comments on issues you have found or suggested improvements/changes."]
[]
[null,"Serial","Comment","Entered By","Response","Complete?"]
[null,1]
[null,2]
[null,3]
[null,4]
{"$rows_left_out":41}
{"sheet":"Version History","index":1,"n_rows":17,"n_cols":4,"rows_kept":17,"cut":false,"hidden":false,"merged":[]}
[]
[]
[null,null,null,"Air Safety Management Assessment Tool (ASMAT)"]
[]
[]
[]
[]
[null,"Version","Updated Date","Changes"]
[null,"Version 1.0","Published Sep 2022","• Initial Issue."]
[null,"Version 1.1","Updated Oct 2022","• \"Things to Consider\" columns unlocked to allow editing of questions. \n• Assurance rating box on tab \"3. Charts\" can now be edited by user."]
[null,"Version 1.2","Updated Dec 2022","• Correction to facet grouping - \"Safety Policy & Objectives\" and \"Safety Promotion\". \n• Correction to Safety Assurance Chart."]
[null,"Version 1.3","Updated Jan 2023","• \"Auditable Facets\" column renamed to \"Auditable Elements\"."]
[null,"Version 1.4","Updated Feb 2023","• Spell Check button added to pages 1a - 1d."]
[null,"Version 1.5","Updated Mar 2023","• Button added to fix formatting when hyperlinks are removed."]
[null,"Version 1.6","Updated Aug 2023","• JSP 815 cross references added."]
{"$rows_left_out":3}
{"sheet":"User Guide","index":2,"n_rows":32,"n_cols":6,"rows_kept":32,"cut":false,"hidden":false,"merged":[]}
[]
[]
[null,"Air Safety Management Assessment Tool (ASMAT)"]
[]
[]
[]
[null,"To use this workbook effectively, Macro's must be enabled."]
[null,"Click here to find out how to enable macros."]
[]
[null,"ASMAT Evaluation Tool - Reasons for use"]
[null,"This tool is designed to assist 1st, 2nd and 3rd party audits in evaluating the effectiveness of an Air Safety Management System (ASMS) in support of the Air System Safety Case (ASSC) by assessing the organisation against the 4 key pillars from RA 1200.\nThe tool is designed to allow the user to input evidence of where each of the 4 key pillars are / are not being demonstrated. The assessment that is made is used to display charts to show how the organisation is performing. This will provide the organisation risk holder with information about the effectiveness and maturity of their ASMS."]
[]
[null,"ASMAT Evaluation Tool - Instructions for use **Important Information for users**"]
[null,"1.   This tool includes Macro buttons which improve the functionality and usability of the tool. Ensure Macro’s are enabled (this will ensure a printable PDF is populated and will ensure no changes to cell sizes are required by the user). Use the guide linked at the top of this page to ensure this function is activated.",null,null," "]
[null,"2.   Save a copy of the tool to allow editing."]
{"$rows_left_out":18}
{"sheet":"1a. Safety Policy & Objectives","index":3,"n_rows":157,"n_cols":9,"rows_kept":157,"cut":false,"hidden":false,"merged":[[153,2,162,2],[156,8,158,8],[153,5,162,5],[153,6,162,6],[153,7,162,7],[153,4,162,4],[153,3,162,3],[143,5,152,5],[143,6,152,6],[143,7,152,7],[143,4,152,4],[143,3,152,3],[113,5,122,5],[113,6,122,6],[113,7,122,7],[113,4,122,4],[113,3,122,3],[133,7,142,7],[133,4,142,4],[133,3,142,3],[123,5,132,5],[123,6,132,6],[123,7,132,7],[123,4,132,4],[123,3,132,3],[133,5,142,5],[133,6,142,6],[103,7,112,7],[103,4,112,4],[103,3,112,3],[93,5,102,5],[93,6,102,6],[93,7,102,7],[93,4,102,4],[93,3,102,3],[103,5,112,5],[103,6,112,6],[43,1,52,1],[53,1,72,1],[83,5,92,5],[83,6,92,6],[83,3,92,3],[83,2,92,2],[73,1,112,1],[53,3,62,3],[53,2,62,2],[93,2,102,2],[103,2,112,2],[63,2,72,2],[43,3,52,3],[43,2,52,2],[73,3,82,3],[73,2,82,2],[53,4,62,4],[63,5,72,5],[63,6,72,6],[73,5,82,5],[73,6,82,6],[43,5,52,5],[43,6,52,6],[43,7,52,7],[53,5,62,5],[53,6,62,6],[53,7,62,7],[2,3,4,4],[15,4,32,4],[15,5,32,5],[15,6,32,6],[15,3,32,3],[12,1,13,3],[15,2,32,2],[15,1,42,1],[33,3,42,3],[33,4,42,4],[33,2,42,2],[14,5,14,7],[33,7,42,7],[33,5,42,5],[33,6,42,6],[113,2,122,2],[153,1,162,1],[133,2,142,2],[15,7,32,7],[123,2,132,2],[113,1,132,1],[143,2,152,2],[133,1,152,1],[63,7,72,7],[63,4,72,4],[63,3,72,3],[43,4,52,4],[83,7,92,7],[83,4,92,4],[73,7,82,7],[73,4,82,4]]}
[]
[]
[null,null,null,"Air Safety Management Assessment Tool (ASMAT):\nFindings"]
[]
[]
[]
[null,"Organisation Visited",null,"Enter Organisation Here"]
[null,"Date of Visit",null,"Date as DD-MMM-YY"]
[null,"Assurance Type",null,"1st Party"]
[null,"Assessing Organisation",null,"Enter Assessing Organisation"]
[null,"Lead Assessor",null,"Lead Assessor"]
[]
[null,"RA 1200 AMC (1a)\nSafety Policy and Objectives"]
[]
[null,"Auditable Facets","Sub Facets","Things to Consider","Evidence","How to hyperlink",null,null,"JSP 815 Equivalent"]
{"$rows_left_out":143}
{"sheet":"1b. Safety Risk Management","index":4,"n_rows":119,"n_cols":9,"rows_kept":119,"cut":false,"hidden":false,"merged":[[54,1,79,1],[41,2,53,2],[41,5,53,5],[41,4,53,4],[41,3,53,3],[41,1,53,1],[2,3,4,4],[15,3,27,3],[15,4,27,4],[15,5,27,5],[12,1,13,3],[14,5,14,7],[15,6,27,6],[15,7,27,7],[15,2,27,2],[15,1,40,1],[28,4,40,4],[28,3,40,3],[28,5,40,5],[28,6,40,6],[28,7,40,7],[41,6,53,6],[41,7,53,7],[28,2,40,2],[67,7,79,7],[67,4,79,4],[67,3,79,3],[54,4,66,4],[54,3,66,3],[67,5,79,5],[67,6,79,6],[54,5,66,5],[54,6,66,6],[54,7,66,7],[54,2,66,2],[67,2,79,2]]}
[]
[]
[null,null,null,"Air Safety Management Assessment Tool (ASMAT):\nFindings"]
[]
[]
[]
[null,"Organisation Visited",null,{"$f":"'1a. Safety Policy & Objectives'!D7","v":"Enter Organisation Here"}]
[null,"Date of Visit",null,{"$f":"'1a. Safety Policy & Objectives'!D8","v":"Date as DD-MMM-YY"}]
[null,"Assurance Type",null,{"$f":"IF('1a. Safety Policy & Objectives'!D9=\"\",\"\",'1a. Safety Policy & Objectives'!D9)","v":"1st Party"}]
[null,"Assessing Organisation",null,{"$f":"IF('1a. Safety Policy & Objectives'!D10=\"\",\"\",'1a. Safety Policy & Objectives'!D10)","v":"Enter Assessing Organisation"}]
[null,"Lead Assessor",null,{"$f":"IF('1a. Safety Policy & Objectives'!D11=\"\",\"\",'1a. Safety Policy & Objectives'!D11)","v":"Lead Assessor"}]
[]
[null,"RA 1200 AMC (1b)\nSafety Risk Management"]
[]
[null,"Auditable Facets","Sub Facets","Things to Consider","Evidence","How to hyperlink",null,null,"JSP 815 Equivalent"]
{"$rows_left_out":105}
{"sheet":"1c. Safety Assurance","index":5,"n_rows":87,"n_cols":9,"rows_kept":87,"cut":false,"hidden":false,"merged":[[2,3,4,4],[15,5,25,5],[15,6,25,6],[15,7,25,7],[12,1,13,3],[14,5,14,7],[15,2,25,2],[15,1,47,1],[26,6,36,6],[26,7,36,7],[15,4,25,4],[15,3,25,3],[26,4,36,4],[26,3,36,3],[37,3,47,3],[26,5,36,5],[48,7,64,7],[26,2,36,2],[48,1,64,1],[48,3,64,3],[48,4,64,4],[48,5,64,5],[48,2,64,2],[37,5,47,5],[37,2,47,2],[37,6,47,6],[37,4,47,4],[37,7,47,7],[48,6,64,6],[65,7,78,7],[79,5,94,5],[79,6,94,6],[79,7,94,7],[65,6,78,6],[79,3,94,3],[65,1,78,1],[65,3,78,3],[65,4,78,4],[65,5,78,5],[79,4,94,4],[79,2,94,2],[65,2,78,2],[79,1,94,1]]}
[]
[]
[null,null,null,"Air Safety Management Assessment Tool (ASMAT):\nFindings"]
[]
[]
[]
[null,"Organisation Visited",null,{"$f":"'1a. Safety Policy & Objectives'!D7","v":"Enter Organisation Here"}]
[null,"Date of Visit",null,{"$f":"'1a. Safety Policy & Objectives'!D8","v":"Date as DD-MMM-YY"}]
[null,"Assurance Type",null,{"$f":"IF('1a. Safety Policy & Objectives'!D9=\"\",\"\",'1a. Safety Policy & Objectives'!D9)","v":"1st Party"}]
[null,"Assessing Organisation",null,{"$f":"IF('1a. Safety Policy & Objectives'!D10=\"\",\"\",'1a. Safety Policy & Objectives'!D10)","v":"Enter Assessing Organisation"}]
[null,"Lead Assessor",null,{"$f":"IF('1a. Safety Policy & Objectives'!D11=\"\",\"\",'1a. Safety Policy & Objectives'!D11)","v":"Lead Assessor"}]
[]
[null,"RA 1200 AMC (1c)\nSafety Assurance"]
[]
[null,"Auditable Facets","Sub Facets","Things to Consider","Evidence","How to hyperlink",null,null,"JSP 815 Equivalent"]
{"$rows_left_out":73}
{"sheet":"1d. Safety Promotion","index":6,"n_rows":40,"n_cols":9,"rows_kept":40,"cut":false,"hidden":false,"merged":[[15,1,29,1],[2,3,4,4],[15,5,29,5],[15,6,29,6],[15,7,29,7],[15,4,29,4],[15,3,29,3],[12,1,13,3],[14,5,14,7],[15,2,29,2],[30,1,52,1],[30,5,52,5],[30,6,52,6],[30,7,52,7],[30,4,52,4],[30,3,52,3],[30,2,52,2]]}
[]
[]
[null,null,null,"Air Safety Management Assessment Tool (ASMAT):\nFindings"]
[]
[]
[]
[null,"Organisation Visited",null,{"$f":"'1a. Safety Policy & Objectives'!D7","v":"Enter Organisation Here"}]
[null,"Date of Visit",null,{"$f":"'1a. Safety Policy & Objectives'!D8","v":"Date as DD-MMM-YY"}]
[null,"Assurance Type",null,{"$f":"IF('1a. Safety Policy & Objectives'!D9=\"\",\"\",'1a. Safety Policy & Objectives'!D9)","v":"1st Party"}]
[null,"Assessing Organisation",null,{"$f":"IF('1a. Safety Policy & Objectives'!D10=\"\",\"\",'1a. Safety Policy & Objectives'!D10)","v":"Enter Assessing Organisation"}]
[null,"Lead Assessor",null,{"$f":"IF('1a. Safety Policy & Objectives'!D11=\"\",\"\",'1a. Safety Policy & Objectives'!D11)","v":"Lead Assessor"}]
[]
[null,"RA 1200 AMC (1d)\nSafety Promotion"]
[]
[null,"Auditable Facets","Sub Facets","Things to Consider","Evidence","How to hyperlink",null,null,"JSP 815 Equivalent"]
{"$rows_left_out":26}
{"sheet":"2. Scoring and Evidence","index":7,"n_rows":395,"n_cols":11,"rows_kept":395,"cut":false,"hidden":false,"merged":[[10,3,13,3],[2,2,4,5],[324,4,338,4],[343,4,356,4],[357,4,370,4],[15,2,29,2],[15,3,29,3],[15,5,29,5],[15,4,29,4],[153,3,163,3],[219,4,232,4],[233,4,247,4],[309,3,323,3],[309,5,323,5],[164,5,176,5],[153,5,163,5],[140,5,152,5],[128,5,139,5],[118,5,127,5],[140,3,152,3],[182,3,193,3],[47,2,59,2],[47,3,59,3],[47,5,59,5],[253,1,291,1],[341,1,341,2],[179,1,180,2],[182,1,204,1],[118,2,127,2],[128,2,139,2],[140,2,152,2],[140,1,163,1],[153,2,163,2],[118,1,139,1],[219,1,247,1],[292,1,308,1],[309,1,323,1],[309,2,323,2],[182,2,193,2],[47,1,59,1],[60,1,77,1],[15,8,29,8],[30,2,46,2],[30,3,46,3],[30,5,46,5],[30,6,46,6],[30,7,46,7],[30,8,46,8],[15,1,46,1],[47,4,59,4],[30,4,46,4],[60,2,68,2],[69,2,77,2],[69,3,77,3],[60,8,68,8],[69,8,77,8],[60,6,68,6],[60,7,68,7],[69,6,77,6],[69,7,77,7],[69,4,77,4],[60,4,68,4],[60,3,68,3],[69,5,77,5],[60,5,68,5],[47,6,59,6],[47,7,59,7],[47,8,59,8],[15,6,29,6],[15,7,29,7],[78,1,117,1],[78,2,87,2],[78,3,87,3],[78,6,87,6],[88,6,98,6],[88,2,98,2],[88,3,98,3],[99,2,107,2],[99,3,107,3],[99,6,107,6],[108,2,117,2],[108,3,117,3],[108,4,117,4],[99,4,107,4],[88,4,98,4],[78,4,87,4],[108,6,117,6],[99,5,107,5],[88,5,98,5],[78,5,87,5],[99,7,107,7],[99,8,107,8],[78,7,87,7],[78,8,87,8],[88,7,98,7],[88,8,98,8],[128,3,139,3],[128,6,139,6],[128,7,139,7],[128,8,139,8],[118,3,127,3],[118,6,127,6],[118,7,127,7],[118,8,127,8],[128,4,139,4],[118,4,127,4],[140,6,152,6],[140,7,152,7],[140,8,152,8],[153,4,163,4],[140,4,152,4],[108,7,117,7],[108,8,117,8],[164,7,176,7],[164,8,176,8],[153,6,163,6],[153,7,163,7],[153,8,163,8],[108,5,117,5],[182,6,193,6],[182,7,193,7],[182,8,193,8],[164,1,176,1],[164,2,176,2],[164,3,176,3],[164,6,176,6],[164,4,176,4],[182,4,193,4],[182,5,193,5],[194,8,204,8],[205,1,218,1],[205,2,218,2],[205,3,218,3],[205,6,218,6],[205,7,218,7],[205,8,218,8],[194,2,204,2],[194,3,204,3],[194,6,204,6],[194,7,204,7],[194,4,204,4],[205,4,218,4],[194,5,204,5],[205,5,218,5],[233,7,247,7],[233,8,247,8],[253,2,265,2],[253,3,265,3],[253,6,265,6],[253,7,265,7],[253,8,265,8],[219,2,232,2],[233,2,247,2],[233,3,247,3],[233,6,247,6],[219,7,232,7],[219,8,232,8],[219,6,232,6],[219,3,232,3],[253,4,265,4],[219,5,232,5],[233,5,247,5],[253,5,265,5],[266,8,278,8],[279,2,291,2],[279,3,291,3],[279,5,291,5],[279,6,291,6],[279,7,291,7],[279,8,291,8],[266,2,278,2],[266,3,278,3],[266,5,278,5],[266,6,278,6],[266,7,278,7],[266,4,278,4],[279,4,291,4],[309,6,323,6],[309,7,323,7],[309,8,323,8],[292,2,308,2],[292,3,308,3],[292,5,308,5],[292,6,308,6],[292,7,308,7],[292,4,308,4],[309,4,323,4],[357,7,370,7],[357,8,370,8],[250,1,251,2],[12,1,13,2],[357,1,370,1],[357,2,370,2],[357,3,370,3],[357,5,370,5],[357,6,370,6],[324,7,338,7],[324,8,338,8],[343,1,356,1],[343,2,356,2],[343,3,356,3],[343,5,356,5],[343,6,356,6],[343,7,356,7],[343,8,356,8],[324,1,338,1],[324,2,338,2],[324,3,338,3],[324,5,338,5],[324,6,338,6],[292,8,308,8]]}
[null,null,null,null,null,null,null,null,null,null,"NOT GRADED - 0"]
[null,null,null,null,null,null,null,null,null,null,"PRESENT - 1"]
[null,null,"Air Safety Management Assessment Tool (ASMAT):\nScoring and Evidence ",null,null,null,null,null,null,null,"PRESENT - 2"]
[null,null,null,null,null,null,null,null,null,null,"SUITABLE - 3"]
[null,null,null,null,null,null,null,null,null,null,"SUITABLE - 4"]
[null,null,null,null,null,null,null,null,null,null,"OPERATING - 5"]
[null,"Organisation Visited",{"$f":"'1a. Safety Policy & Objectives'!D7","v":"Enter Organisation Here"},null,null,null,null,null,null,null,"OPERATING - 6"]
[null,"Date of Visit",{"$f":"'1a. Safety Policy & Objectives'!D8","v":"Date as DD-MMM-YY"},null,null,null,null,null,null,null,"EFFECTIVE - 7"]
[null,"Assurance Type",{"$f":"IF('1a. Safety Policy & Objectives'!D9=\"\",\"\",'1a. Safety Policy & Objectives'!D9)","v":"1st Party"},null,null,null,null,null,null,null,"EFFECTIVE - 8"]
[null,"Assessing Organisation",{"$f":"IF('1a. Safety Policy & Objectives'!D10=\"\",\"\",'1a. Safety Policy & Objectives'!D10)","v":"Enter Assessing Organisation"}]
[null,"Lead Assessor",{"$f":"IF('1a. Safety Policy & Objectives'!D11=\"\",\"\",'1a. Safety Policy & Objectives'!D11)","v":"Lead Assessor"}]
[]
[null,"RA 1200 AMC (1a)  \nSafety Policy and Objectives"]
[]
[null,"Auditable Facets","Sub Facets","Assessment","Self Assessment Score","Evidence"]
{"$rows_left_out":381}
{"sheet":"Recommendations","index":8,"n_rows":45,"n_cols":5,"rows_kept":45,"cut":false,"hidden":false,"merged":[[10,1,10,2],[12,1,13,3],[2,3,4,3],[6,1,6,2],[7,1,7,2],[8,1,8,2],[9,1,9,2]]}
[]
[]
[null,null,null,"Air Safety Management Assessment Tool (ASMAT):\nRecommendations"]
[]
[]
[]
[null,"Organisation Visited",null,{"$f":"'1a. Safety Policy & Objectives'!D7","v":"Enter Organisation Here"}]
[null,"Date of Visit",null,{"$f":"'1a. Safety Policy & Objectives'!D8","v":"Date as DD-MMM-YY"}]
[null,"Assurance Type",null,{"$f":"IF('1a. Safety Policy & Objectives'!D9=\"\",\"\",'1a. Safety Policy & Objectives'!D9)","v":"1st Party"}]
[null,"Assessing Organisation",null,{"$f":"IF('1a. Safety Policy & Objectives'!D10=\"\",\"\",'1a. Safety Policy & Objectives'!D10)","v":"Enter Assessing Organisation"}]
[null,"Lead Assessor",null,{"$f":"IF('1a. Safety Policy & Objectives'!D11=\"\",\"\",'1a. Safety Policy & Objectives'!D11)","v":"Lead Assessor"}]
[]
[null,"Recommendations and Observations"]
[]
[null,"Serial Number","Reference","Recommendation Description","Facet"]
{"$rows_left_out":31}
{"sheet":"Good Practices","index":9,"n_rows":45,"n_cols":5,"rows_kept":45,"cut":false,"hidden":false,"merged":[[12,1,13,3],[2,3,4,3],[6,1,6,2],[7,1,7,2],[8,1,8,2],[9,1,9,2],[10,1,10,2]]}
[]
[]
[null,null,null,"Air Safety Management Assessment Tool (ASMAT):\nGood Practices and Positive Observations"]
[]
[]
[]
[null,"Organisation Visited",null,{"$f":"'1a. Safety Policy & Objectives'!D7","v":"Enter Organisation Here"}]
[null,"Date of Visit",null,{"$f":"'1a. Safety Policy & Objectives'!D8","v":"Date as DD-MMM-YY"}]
[null,"Assurance Type",null,{"$f":"IF('1a. Safety Policy & Objectives'!D9=\"\",\"\",'1a. Safety Policy & Objectives'!D9)","v":"1st Party"}]
[null,"Assessing Organisation",null,{"$f":"IF('1a. Safety Policy & Objectives'!D10=\"\",\"\",'1a. Safety Policy & Objectives'!D10)","v":"Enter Assessing Organisation"}]
[null,"Lead Assessor",null,{"$f":"IF('1a. Safety Policy & Objectives'!D11=\"\",\"\",'1a. Safety Policy & Objectives'!D11)","v":"Lead Assessor"}]
[]
[null,"Good Practices and Positive Observations"]
[]
[null,"Serial Number","Reference","Good Practices / Positive Observations","Facet"]
{"$rows_left_out":31}
{"sheet":"3. Charts","index":10,"n_rows":13,"n_cols":15,"rows_kept":13,"cut":false,"hidden":false,"merged":[[1,2,4,11],[7,14,9,14],[12,1,13,3],[12,4,13,12],[5,2,5,12],[6,2,6,12],[7,2,7,12],[8,2,8,12],[9,2,9,12]]}
[]
[null,null,"Air Safety Management Assessment Tool (ASMAT):  \nCharts"]
[]
[]
[]
[null,"Organisation Visited",{"$f":"'2. Scoring and Evidence'!C7","v":"Enter Organisation Here"}]
[null,"Date of Visit",{"$f":"'2. Scoring and Evidence'!C8","v":"Date as DD-MMM-YY"},null,null,null,null,null,null,null,null,null,null,null,"ASSURANCE RATING"]
[null,"Assurance Type",{"$f":"IF('1a. Safety Policy & Objectives'!D9=\"\",\"\",'1a. Safety Policy & Objectives'!D9)","v":"1st Party"}]
[null,"Assessing Organisation",{"$f":"IF('1a. Safety Policy & Objectives'!D10=\"\",\"\",'1a. Safety Policy & Objectives'!D10)","v":"Enter Assessing Organisation"}]
[null,"Lead Assessor",{"$f":"IF('1a. Safety Policy & Objectives'!D11=\"\",\"\",'1a. Safety Policy & Objectives'!D11)","v":"Lead Assessor"}]
[]
[]
[null,"Overall ASMS assessment\n\n(Based on assessment averages)",null,null,{"$f":"VLOOKUP('2. Scoring and Evidence'!C385,'2. Scoring and Evidence'!G378:H386,2,TRUE)","v":"NOT GRADED - 0"}]

{"sheet":"4. Print Friendly Format","index":11,"n_rows":55,"n_cols":5,"rows_kept":55,"cut":false,"hidden":false,"merged":[[13,1,13,2],[31,1,32,2],[41,1,41,2],[51,1,51,2],[1,2,1,4],[6,2,6,3],[7,2,7,3],[8,2,8,3],[9,2,9,3],[10,2,10,3]]}
[]
[null,null,"Air Safety Management Assessment Tool (ASMAT)"]
[]
[]
[]
[]
[null,"Organisation Visited",{"$f":"IF('1a. Safety Policy & Objectives'!D7=\"\",\"\",'1a. Safety Policy & Objectives'!D7)","v":"Enter Organisation Here"}]
[null,"Date of Visit",{"$f":"IF('1a. Safety Policy & Objectives'!D8=\"\",\"\",'1a. Safety Policy & Objectives'!D8)","v":"Date as DD-MMM-YY"}]
[null,"Assurance Type",{"$f":"IF('1a. Safety Policy & Objectives'!D9=\"\",\"\",'1a. Safety Policy & Objectives'!D9)","v":"1st Party"}]
[null,"Assessing Organisation",{"$f":"IF('1a. Safety Policy & Objectives'!D10=\"\",\"\",'1a. Safety Policy & Objectives'!D10)","v":"Enter Assessing Organisation"}]
[null,"Lead Assessor",{"$f":"IF('1a. Safety Policy & Objectives'!D11=\"\",\"\",'1a. Safety Policy & Objectives'!D11)","v":"Lead Assessor"}]
[]
[]
[null,"RA 1200 AMC (1a)  \nSafety Policy and Objectives"]
[null,"Auditable Facets","Sub Facets","Assessment","Evidence"]
{"$rows_left_out":41}
{"sheet":"5. Evaluation Summary","index":12,"n_rows":3,"n_cols":3,"rows_kept":3,"cut":false,"hidden":false,"merged":[[174,6,176,6],[227,6,229,6],[2,2,4,4],[77,6,80,6],[14,6,16,6],[127,6,129,6]]}
[]
[]
[null,null,"Air Safety Management Assessment Tool (ASMAT):\nASMS Evaluation Summary"]

{"sheet":"6. How To Enable Macros","index":13,"n_rows":134,"n_cols":8,"rows_kept":134,"cut":false,"hidden":false,"merged":[[130,2,132,13],[124,2,126,13],[133,2,133,6]]}
[]
[]
[null,null,null,null,null,null,null,"Air Safety Management Assessment Tool (ASMAT)"]
[]
[]
[]
[null,"How to Enable Macros"]
[]
[null,"Step 1.","Click File"]
[]
[]
[null,"Step 2.","Click Options at the bottom"]
[]
[]
[null,"Step 3.","Click Trust centre at the bottom"]
{"$rows_left_out":120}
{"sheet":"Chart Data","index":14,"n_rows":41,"n_cols":5,"rows_kept":41,"cut":false,"hidden":true,"merged":[[24,0,25,0],[30,0,32,0],[3,0,4,0],[6,0,7,0],[8,0,11,0],[12,0,13,0],[14,0,15,0],[21,0,22,0]]}
[]
[null,"ELEMENTS","Self Assessment",null,"Score"]
[null,null,null,null,"NOT GRADED - 0"]
["A1",{"$f":"'2. Scoring and Evidence'!C16","v":"Leadership Commitment & Execution \n"},{"$f":"'2. Scoring and Evidence'!E16","v":0},null,"PRESENT - 1"]
[null,{"$f":"'2. Scoring and Evidence'!C31","v":"Accountability & Responsibility \n"},{"$f":"'2. Scoring and Evidence'!E31","v":0},null,"PRESENT - 2"]
["A2",{"$f":"'2. Scoring and Evidence'!C48","v":"Safety Culture\n"},{"$f":"'2. Scoring and Evidence'!E48","v":0},null,"SUITABLE - 3"]
["A3",{"$f":"'2. Scoring and Evidence'!C61","v":"Driving Improvement\n"},{"$f":"'2. Scoring and Evidence'!E61","v":0},null,"SUITABLE - 4"]
[null,{"$f":"'2. Scoring and Evidence'!C70","v":"Providing Direction\n"},{"$f":"'2. Scoring and Evidence'!E70","v":0},null,"OPERATING - 5"]
["A4",{"$f":"'2. Scoring and Evidence'!C79","v":"Organizational Structure"},{"$f":"'2. Scoring and Evidence'!E79","v":0},null,"OPERATING - 6"]
[null,{"$f":"'2. Scoring and Evidence'!C89","v":"Resource Allocation"},{"$f":"'2. Scoring and Evidence'!E89","v":0},null,"EFFECTIVE - 7"]
[null,{"$f":"'2. Scoring and Evidence'!C100","v":"Air Safety Competency \nAssessment & Development"},{"$f":"'2. Scoring and Evidence'!E100","v":0},null,"EFFECTIVE - 8"]
[null,{"$f":"'2. Scoring and Evidence'!C109","v":"Functional Competency \nAssessment & Development "},{"$f":"'2. Scoring and Evidence'!E109","v":0}]
["A5",{"$f":"'2. Scoring and Evidence'!C119","v":"Interfacing systems & \nX-Boundary Processes "},{"$f":"'2. Scoring and Evidence'!E119","v":0}]
[null,{"$f":"'2. Scoring and Evidence'!C129","v":"Suppliers & Contractors \n"},{"$f":"'2. Scoring and Evidence'!E129","v":0}]
["A6",{"$f":"'2. Scoring and Evidence'!C141","v":"Emergency Response\n"},{"$f":"'2. Scoring and Evidence'!E141","v":0}]
{"$rows_left_out":26}