{"text_format":"1","workbook":"xlsx","n_sheets":10,"sheets":["STATISTICAL NEIGHBOURS","3-4 year olds ","2 year olds ","Non-EYSFF spend","Early Years Pupil Premium","Disability Access Fund","EY Data","Options","Stat Neighbours","Select LAs"],"not_rendered":{"charts":14,"images":0,"macros":1,"external_links":0,"defined_names":45,"comments":0,"pivot_tables":0},"unopened":[],"bounds":{"document_bytes":16777216,"sheet_cells":100000,"rows_first":2000,"rows_last":500,"rows_between":2000,"halvings":0,"cell_chars":16384,"cell_head_chars":4096},"cells_cut":0,"cells_raw":0,"read":"whole","date_system":"1900"}

{"sheet":"STATISTICAL NEIGHBOURS","index":0,"n_rows":27,"n_cols":4,"rows_kept":27,"cut":false,"hidden":false,"merged":[]}
[null,"Early Years Funding Benchmarking Tool: 2023-2024"]
[null,"This worksheet allows you to view data for your own local authority along with your statistical "]
[null,"neighbours, or with your own choice of other local authorities."]
[]
[null,"Choose Local Authorities",null,"Other Local Authorities"]
[]
[null,"1. Please select your local authority"]
[]
[null,"My Local Authority"]
[]
[]
[]
[null,"2. Then either select your statistical neighbours:"]
[]
[]
[]
[]
[null,"Or make your own selection of local authorities \nusing the drop down boxes"]
[]
[null,"3. When you have made your selection, press the \"Create Table\" button to view the benchmarking table"]
[]
[]
[]
[]
[]
[null,"Note: When statistical neighbours are selected, local authorities are shown in order of closeness to your local authority"]
[null,"Cumberland & Westmorland and Furness will not be automatically selected as a statistical neighbour. However, you can manually select them."]

{"sheet":"3-4 year olds ","index":1,"n_rows":42,"n_cols":13,"rows_kept":42,"cut":false,"hidden":true,"merged":[[26,1,26,2],[25,3,25,6],[25,7,26,7],[25,8,26,8],[4,1,4,2],[22,3,22,4],[6,1,6,2],[7,1,7,2],[8,1,8,2],[5,1,5,2],[17,1,17,13],[25,9,25,12]]}
[]
[null,{"$f":"CONCATENATE('Select LAs'!B3,\" - Key Budget Statistics\")","v":"No LA selected - Key Budget Statistics"},null,null,null,null,null,null,null,null,null,null,"Financial Year 2023-2024"]
[]
[null,null,null,"PVIs","Nursery Schools","Primary Nursery Places","Centrally Retained"]
[null,{"$f":"'Select LAs'!D3","v":"No LA selected"},null,"All providers","Private, Voluntary, Independent","Nursery schools","Primary nursery places"]
["Total FTE","3-4 year old hourly average funding rate (£/hr)1",null,{"$f":"IFERROR(IF(INDEX('EY Data'!E:E, MATCH('Select LAs'!$A$3,'EY Data'!$B:$B, 0))=\"\",\"-\", INDEX('EY Data'!E:E, MATCH('Select LAs'!$A$3,'EY Data'!$B:$B, 0))), 0)","v":0},{"$f":"IFERROR(IF(INDEX('EY Data'!H:H, MATCH('Select LAs'!$A$3,'EY Data'!$B:$B, 0))=\"\",\"-\", INDEX('EY Data'!H:H, MATCH('Select LAs'!$A$3,'EY Data'!$B:$B, 0))), 0)","v":0},{"$f":"IFERROR(IF(INDEX('EY Data'!G:G, MATCH('Select LAs'!$A$3,'EY Data'!$B:$B, 0))=\"\",\"-\", INDEX('EY Data'!G:G, MATCH('Select LAs'!$A$3,'EY Data'!$B:$B, 0))), 0)","v":0},{"$f":"IFERROR(IF(INDEX('EY Data'!F:F, MATCH('Select LAs'!$A$3,'EY Data'!$B:$B, 0))=\"\",\"-\", INDEX('EY Data'!F:F, MATCH('Select LAs'!$A$3,'EY Data'!$B:$B, 0))), 0)","v":0}]
["Total budget","3-4 year old hourly average base rate for statutory hours (£/hr)2",null,{"$f":"IFERROR(IF(INDEX('EY Data'!S:S, MATCH('Select LAs'!$A$3,'EY Data'!$B:$B, 0))=\"\",\"-\", INDEX('EY Data'!S:S, MATCH('Select LAs'!$A$3,'EY Data'!$B:$B, 0))), 0)","v":0},{"$f":"IFERROR(IF(INDEX('EY Data'!V:V, MATCH('Select LAs'!$A$3,'EY Data'!$B:$B, 0))=\"\",\"-\", INDEX('EY Data'!V:V, MATCH('Select LAs'!$A$3,'EY Data'!$B:$B, 0))), 0)","v":0},{"$f":"IFERROR(IF(INDEX('EY Data'!U:U, MATCH('Select LAs'!$A$3,'EY Data'!$B:$B, 0))=\"\",\"-\", INDEX('EY Data'!U:U, MATCH('Select LAs'!$A$3,'EY Data'!$B:$B, 0))), 0)","v":0},{"$f":"IFERROR(IF(INDEX('EY Data'!T:T, MATCH('Select LAs'!$A$3,'EY Data'!$B:$B, 0))=\"\",\"-\", INDEX('EY Data'!T:T, MATCH('Select LAs'!$A$3,'EY Data'!$B:$B, 0))), 0)","v":0}]
["Total Hours"]
[null,"Pass-through rate (%)3",null,{"$f":"IF(OR('Select LAs'!$A$3 = \"LA No\", 'Select LAs'!$A$3 = 201, 'Select LAs'!$A$3 = 420), \"-\", INDEX('EY Data'!AH:AH, MATCH('Select LAs'!$A$3,'EY Data'!$B:$B, 0)))","v":"-"}]
[]
[]
[]
[]
[]
[]
[]
[]
["1)\n\n\n2)\n\n3)","3 and 4 year olds hourly average funding rate is derived by i) adding the total budgets for: EYSFF (i.e. base rate; supplements; and maintained nursery school lump sums) plus SEN Inclusion Fund (top-up grant element) for 3-4 year olds, and dividing this by ii) the base rate hours reported for both universal and additional 15 hours.\n\n3 and 4 year olds hourly average base rate is derived by taking the budget for the base rate and dividing it by the base rate hours reported for both universal and additional 15 hours.\n\nThe calculation methodology for the pass-through rate and for funding paid through supplements is included in the early years entitlements operational guide, available at: https://www.gov.uk/government/publications/early-years-national-funding-formula-allocations-and-guidance. Camden has approval to disapply the pass-through requirement in 2023-2024."]
[null,{"$f":"CONCATENATE(\"Benchmarking against \",IF(_SN=1,\"Statistical Neighbours\",\"Manual Selection\"))","v":"Benchmarking against Manual Selection"}]
[]
[]
[]
[null,null,"Order"]
[]
[]
[null,null,null,"Average funding rate to providers per hour",null,null,null,"Pass-through rate","Funding paid through supplements","SEN Inclusion Fund (top-up grant element) budget"]
[null,"Local Authority",null,"All providers","Private, Voluntary, Independent","Nursery schools","Primary nursery places",null,null,"All providers","Private, Voluntary, Independent","Nursery schools","Primary nursery places"]
[null,"England",null,{"$f":"ROUND(INDEX('EY Data'!E:E, MATCH($B28,'EY Data'!$C:$C, 0)), 5)","v":5.2558100000000003},{"$f":"ROUND(INDEX('EY Data'!H:H, MATCH($B28,'EY Data'!$C:$C, 0)),5)","v":5.0576499999999998},{"$f":"ROUND(INDEX('EY Data'!G:G, MATCH($B28,'EY Data'!$C:$C, 0)), 5)","v":8.5323100000000007},{"$f":"ROUND(INDEX('EY Data'!F:F, MATCH($B28,'EY Data'!$C:$C, 0)), 5)","v":5.2925500000000003},{"$f":"IF(INDEX('EY Data'!AH:AH, MATCH($B28,'EY Data'!$C:$C, 0))=\"-\", \"-\", ROUND(INDEX('EY Data'!AH:AH, MATCH($B28,'EY Data'!$C:$C, 0)), 3))","v":0.97799999999999998},{"$f":"IF(INDEX('EY Data'!AJ:AJ, MATCH($B28,'EY Data'!$C:$C, 0))=\"-\", \"-\", ROUND(INDEX('EY Data'!AJ:AJ, MATCH($B28,'EY Data'!$C:$C, 0)), 3))","v":4.5999999999999999E-2},{"$f":"ROUND(INDEX('EY Data'!Z:Z, MATCH($B28,'EY Data'!$C:$C, 0)), 0)","v":84373161},{"$f":"ROUND(INDEX('EY Data'!AC:AC, MATCH($B28,'EY Data'!$C:$C, 0)), 0)","v":56861950},{"$f":"ROUND(INDEX('EY Data'!AB:AB, MATCH($B28,'EY Data'!$C:$C, 0)), 0)","v":8534186},{"$f":"ROUND(INDEX('EY Data'!AA:AA, MATCH($B28,'EY Data'!$C:$C, 0)), 0)","v":18977025}]
[null,{"$f":"'Select LAs'!G3","v":"No LA selected"},null,{"$f":"IF('Select LAs'!$H3=0,\"-\",IF(INDEX('EY Data'!E:E, MATCH('Select LAs'!$H3,'EY Data'!$B:$B, 0))=\"\",\"-\", ROUND(INDEX('EY Data'!E:E, MATCH('Select LAs'!$H3,'EY Data'!$B:$B, 0)), 5)))","v":5.3035500000000004},{"$f":"IF('Select LAs'!$H3=0,\"-\",IF(INDEX('EY Data'!H:H, MATCH('Select LAs'!$H3,'EY Data'!$B:$B, 0))=\"\",\"-\", ROUND(INDEX('EY Data'!H:H, MATCH('Select LAs'!$H3,'EY Data'!$B:$B, 0)), 5)))","v":5.2468000000000004},{"$f":"IF('Select LAs'!$H3=0,\"-\",IF(INDEX('EY Data'!G:G, MATCH('Select LAs'!$H3,'EY Data'!$B:$B, 0))=\"\",\"-\", ROUND(INDEX('EY Data'!G:G, MATCH('Select LAs'!$H3,'EY Data'!$B:$B, 0)), 5)))","v":7.3579999999999997},{"$f":"IF('Select LAs'!$H3=0,\"-\",IF(INDEX('EY Data'!F:F, MATCH('Select LAs'!$H3,'EY Data'!$B:$B, 0))=\"\",\"-\", ROUND(INDEX('EY Data'!F:F, MATCH('Select LAs'!$H3,'EY Data'!$B:$B, 0)), 5)))","v":5.25},{"$f":"IF(OR('Select LAs'!$H3=0,'Select LAs'!$H3=201, 'Select LAs'!$H3=420), \"-\",IF(INDEX('EY Data'!AH:AH, MATCH('Select LAs'!$H3,'EY Data'!$B:$B, 0))=\"-\", \"-\", ROUND(INDEX('EY Data'!AH:AH, MATCH('Select LAs'!$H3,'EY Data'!$B:$B, 0)),3)))","v":0.97499999999999998},{"$f":"IF(OR('Select LAs'!$H3=0,'Select LAs'!$H3=201, 'Select LAs'!$H3=420), \"-\",IF(INDEX('EY Data'!AJ:AJ, MATCH('Select LAs'!$H3,'EY Data'!$B:$B, 0))=\"\", \"-\", ROUND(INDEX('EY Data'!AJ:AJ, MATCH('Select LAs'!$H3,'EY Data'!$B:$B, 0)),3)))","v":0.09},{"$f":"IF('Select LAs'!$H3=0,\"-\",IF(INDEX('EY Data'!Z:Z, MATCH('Select LAs'!$H3,'EY Data'!$B:$B, 0))=\"\",\"-\", ROUND(INDEX('EY Data'!Z:Z, MATCH('Select LAs'!$H3,'EY Data'!$B:$B, 0)), 0)))","v":489063},{"$f":"IF('Select LAs'!$H3=0,\"-\",IF(INDEX('EY Data'!AC:AC, MATCH('Select LAs'!$H3,'EY Data'!$B:$B, 0))=\"\",\"-\", ROUND(INDEX('EY Data'!AC:AC, MATCH('Select LAs'!$H3,'EY Data'!$B:$B, 0)), 0)))","v":489063},{"$f":"IF('Select LAs'!$H3=0,\"-\",IF(INDEX('EY Data'!AB:AB, MATCH('Select LAs'!$H3,'EY Data'!$B:$B, 0))=\"\",\"-\", ROUND(INDEX('EY Data'!AB:AB, MATCH('Select LAs'!$H3,'EY Data'!$B:$B, 0)), 0)))","v":0},{"$f":"IF('Select LAs'!$H3=0,\"-\",IF(INDEX('EY Data'!AA:AA, MATCH('Select LAs'!$H3,'EY Data'!$B:$B, 0))=\"\",\"-\", ROUND(INDEX('EY Data'!AA:AA, MATCH('Select LAs'!$H3,'EY Data'!$B:$B, 0)), 0)))","v":0}]
[null,{"$f":"'Select LAs'!G4","v":"No LA selected"},null,{"$f":"IF('Select LAs'!$H4=0,\"-\",IF(INDEX('EY Data'!E:E, MATCH('Select LAs'!$H4,'EY Data'!$B:$B, 0))=\"\",\"-\", ROUND(INDEX('EY Data'!E:E, MATCH('Select LAs'!$H4,'EY Data'!$B:$B, 0)), 5)))","v":5.4111099999999999},{"$f":"IF('Select LAs'!$H4=0,\"-\",IF(INDEX('EY Data'!H:H, MATCH('Select LAs'!$H4,'EY Data'!$B:$B, 0))=\"\",\"-\", ROUND(INDEX('EY Data'!H:H, MATCH('Select LAs'!$H4,'EY Data'!$B:$B, 0)), 5)))","v":5.3202199999999999},{"$f":"IF('Select LAs'!$H4=0,\"-\",IF(INDEX('EY Data'!G:G, MATCH('Select LAs'!$H4,'EY Data'!$B:$B, 0))=\"\",\"-\", ROUND(INDEX('EY Data'!G:G, MATCH('Select LAs'!$H4,'EY Data'!$B:$B, 0)), 5)))","v":5.4098100000000002},{"$f":"IF('Select LAs'!$H4=0,\"-\",IF(INDEX('EY Data'!F:F, MATCH('Select LAs'!$H4,'EY Data'!$B:$B, 0))=\"\",\"-\", ROUND(INDEX('EY Data'!F:F, MATCH('Select LAs'!$H4,'EY Data'!$B:$B, 0)), 5)))","v":8.4418699999999998},{"$f":"IF(OR('Select LAs'!$H4=0,'Select LAs'!$H4=201, 'Select LAs'!$H4=420), \"-\",IF(INDEX('EY Data'!AH:AH, MATCH('Select LAs'!$H4,'EY Data'!$B:$B, 0))=\"-\", \"-\", ROUND(INDEX('EY Data'!AH:AH, MATCH('Select LAs'!$H4,'EY Data'!$B:$B, 0)),3)))","v":0.98899999999999999},{"$f":"IF(OR('Select LAs'!$H4=0,'Select LAs'!$H4=201, 'Select LAs'!$H4=420), \"-\",IF(INDEX('EY Data'!AJ:AJ, MATCH('Select LAs'!$H4,'EY Data'!$B:$B, 0))=\"\", \"-\", ROUND(INDEX('EY Data'!AJ:AJ, MATCH('Select LAs'!$H4,'EY Data'!$B:$B, 0)),3)))","v":5.0999999999999997E-2},{"$f":"IF('Select LAs'!$H4=0,\"-\",IF(INDEX('EY Data'!Z:Z, MATCH('Select LAs'!$H4,'EY Data'!$B:$B, 0))=\"\",\"-\", ROUND(INDEX('EY Data'!Z:Z, MATCH('Select LAs'!$H4,'EY Data'!$B:$B, 0)), 0)))","v":283000},{"$f":"IF('Select LAs'!$H4=0,\"-\",IF(INDEX('EY Data'!AC:AC, MATCH('Select LAs'!$H4,'EY Data'!$B:$B, 0))=\"\",\"-\", ROUND(INDEX('EY Data'!AC:AC, MATCH('Select LAs'!$H4,'EY Data'!$B:$B, 0)), 0)))","v":130571},{"$f":"IF('Select LAs'!$H4=0,\"-\",IF(INDEX('EY Data'!AB:AB, MATCH('Select LAs'!$H4,'EY Data'!$B:$B, 0))=\"\",\"-\", ROUND(INDEX('EY Data'!AB:AB, MATCH('Select LAs'!$H4,'EY Data'!$B:$B, 0)), 0)))","v":14204},{"$f":"IF('Select LAs'!$H4=0,\"-\",IF(INDEX('EY Data'!AA:AA, MATCH('Select LAs'!$H4,'EY Data'!$B:$B, 0))=\"\",\"-\", ROUND(INDEX('EY Data'!AA:AA, MATCH('Select LAs'!$H4,'EY Data'!$B:$B, 0)), 0)))","v":138225}]
["",{"$f":"'Select LAs'!G5","v":"No LA selected"},null,{"$f":"IF('Select LAs'!$H5=0,\"-\",IF(INDEX('EY Data'!E:E, MATCH('Select LAs'!$H5,'EY Data'!$B:$B, 0))=\"\",\"-\", ROUND(INDEX('EY Data'!E:E, MATCH('Select LAs'!$H5,'EY Data'!$B:$B, 0)), 5)))","v":5.9813900000000002},{"$f":"IF('Select LAs'!$H5=0,\"-\",IF(INDEX('EY Data'!H:H, MATCH('Select LAs'!$H5,'EY Data'!$B:$B, 0))=\"\",\"-\", ROUND(INDEX('EY Data'!H:H, MATCH('Select LAs'!$H5,'EY Data'!$B:$B, 0)), 5)))","v":5.3630800000000001},{"$f":"IF('Select LAs'!$H5=0,\"-\",IF(INDEX('EY Data'!G:G, MATCH('Select LAs'!$H5,'EY Data'!$B:$B, 0))=\"\",\"-\", ROUND(INDEX('EY Data'!G:G, MATCH('Select LAs'!$H5,'EY Data'!$B:$B, 0)), 5)))","v":8.8561700000000005},{"$f":"IF('Select LAs'!$H5=0,\"-\",IF(INDEX('EY Data'!F:F, MATCH('Select LAs'!$H5,'EY Data'!$B:$B, 0))=\"\",\"-\", ROUND(INDEX('EY Data'!F:F, MATCH('Select LAs'!$H5,'EY Data'!$B:$B, 0)), 5)))","v":5.7808299999999999},{"$f":"IF(OR('Select LAs'!$H5=0,'Select LAs'!$H5=201, 'Select LAs'!$H5=420), \"-\",IF(INDEX('EY Data'!AH:AH, MATCH('Select LAs'!$H5,'EY Data'!$B:$B, 0))=\"-\", \"-\", ROUND(INDEX('EY Data'!AH:AH, MATCH('Select LAs'!$H5,'EY Data'!$B:$B, 0)),3)))","v":0.95299999999999996},{"$f":"IF(OR('Select LAs'!$H5=0,'Select LAs'!$H5=201, 'Select LAs'!$H5=420), \"-\",IF(INDEX('EY Data'!AJ:AJ, MATCH('Select LAs'!$H5,'EY Data'!$B:$B, 0))=\"\", \"-\", ROUND(INDEX('EY Data'!AJ:AJ, MATCH('Select LAs'!$H5,'EY Data'!$B:$B, 0)),3)))","v":4.9000000000000002E-2},{"$f":"IF('Select LAs'!$H5=0,\"-\",IF(INDEX('EY Data'!Z:Z, MATCH('Select LAs'!$H5,'EY Data'!$B:$B, 0))=\"\",\"-\", ROUND(INDEX('EY Data'!Z:Z, MATCH('Select LAs'!$H5,'EY Data'!$B:$B, 0)), 0)))","v":1828597},{"$f":"IF('Select LAs'!$H5=0,\"-\",IF(INDEX('EY Data'!AC:AC, MATCH('Select LAs'!$H5,'EY Data'!$B:$B, 0))=\"\",\"-\", ROUND(INDEX('EY Data'!AC:AC, MATCH('Select LAs'!$H5,'EY Data'!$B:$B, 0)), 0)))","v":609532},{"$f":"IF('Select LAs'!$H5=0,\"-\",IF(INDEX('EY Data'!AB:AB, MATCH('Select LAs'!$H5,'EY Data'!$B:$B, 0))=\"\",\"-\", ROUND(INDEX('EY Data'!AB:AB, MATCH('Select LAs'!$H5,'EY Data'!$B:$B, 0)), 0)))","v":609532},{"$f":"IF('Select LAs'!$H5=0,\"-\",IF(INDEX('EY Data'!AA:AA, MATCH('Select LAs'!$H5,'EY Data'!$B:$B, 0))=\"\",\"-\", ROUND(INDEX('EY Data'!AA:AA, MATCH('Select LAs'!$H5,'EY Data'!$B:$B, 0)), 0)))","v":609532}]
["",{"$f":"'Select LAs'!G6","v":"No LA selected"},null,{"$f":"IF('Select LAs'!$H6=0,\"-\",IF(INDEX('EY Data'!E:E, MATCH('Select LAs'!$H6,'EY Data'!$B:$B, 0))=\"\",\"-\", ROUND(INDEX('EY Data'!E:E, MATCH('Select LAs'!$H6,'EY Data'!$B:$B, 0)), 5)))","v":5.7378200000000001},{"$f":"IF('Select LAs'!$H6=0,\"-\",IF(INDEX('EY Data'!H:H, MATCH('Select LAs'!$H6,'EY Data'!$B:$B, 0))=\"\",\"-\", ROUND(INDEX('EY Data'!H:H, MATCH('Select LAs'!$H6,'EY Data'!$B:$B, 0)), 5)))","v":5.6331199999999999},{"$f":"IF('Select LAs'!$H6=0,\"-\",IF(INDEX('EY Data'!G:G, MATCH('Select LAs'!$H6,'EY Data'!$B:$B, 0))=\"\",\"-\", ROUND(INDEX('EY Data'!G:G, MATCH('Select LAs'!$H6,'EY Data'!$B:$B, 0)), 5)))","v":5.9646800000000004},{"$f":"IF('Select LAs'!$H6=0,\"-\",IF(INDEX('EY Data'!F:F, MATCH('Select LAs'!$H6,'EY Data'!$B:$B, 0))=\"\",\"-\", ROUND(INDEX('EY Data'!F:F, MATCH('Select LAs'!$H6,'EY Data'!$B:$B, 0)), 5)))","v":5.6679199999999996},{"$f":"IF(OR('Select LAs'!$H6=0,'Select LAs'!$H6=201, 'Select LAs'!$H6=420), \"-\",IF(INDEX('EY Data'!AH:AH, MATCH('Select LAs'!$H6,'EY Data'!$B:$B, 0))=\"-\", \"-\", ROUND(INDEX('EY Data'!AH:AH, MATCH('Select LAs'!$H6,'EY Data'!$B:$B, 0)),3)))","v":1.0089999999999999},{"$f":"IF(OR('Select LAs'!$H6=0,'Select LAs'!$H6=201, 'Select LAs'!$H6=420), \"-\",IF(INDEX('EY Data'!AJ:AJ, MATCH('Select LAs'!$H6,'EY Data'!$B:$B, 0))=\"\", \"-\", ROUND(INDEX('EY Data'!AJ:AJ, MATCH('Select LAs'!$H6,'EY Data'!$B:$B, 0)),3)))","v":0.106},{"$f":"IF('Select LAs'!$H6=0,\"-\",IF(INDEX('EY Data'!Z:Z, MATCH('Select LAs'!$H6,'EY Data'!$B:$B, 0))=\"\",\"-\", ROUND(INDEX('EY Data'!Z:Z, MATCH('Select LAs'!$H6,'EY Data'!$B:$B, 0)), 0)))","v":141200},{"$f":"IF('Select LAs'!$H6=0,\"-\",IF(INDEX('EY Data'!AC:AC, MATCH('Select LAs'!$H6,'EY Data'!$B:$B, 0))=\"\",\"-\", ROUND(INDEX('EY Data'!AC:AC, MATCH('Select LAs'!$H6,'EY Data'!$B:$B, 0)), 0)))","v":5500},{"$f":"IF('Select LAs'!$H6=0,\"-\",IF(INDEX('EY Data'!AB:AB, MATCH('Select LAs'!$H6,'EY Data'!$B:$B, 0))=\"\",\"-\", ROUND(INDEX('EY Data'!AB:AB, MATCH('Select LAs'!$H6,'EY Data'!$B:$B, 0)), 0)))","v":123400},{"$f":"IF('Select LAs'!$H6=0,\"-\",IF(INDEX('EY Data'!AA:AA, MATCH('Select LAs'!$H6,'EY Data'!$B:$B, 0))=\"\",\"-\", ROUND(INDEX('EY Data'!AA:AA, MATCH('Select LAs'!$H6,'EY Data'!$B:$B, 0)), 0)))","v":12300}]
["",{"$f":"'Select LAs'!G7","v":"No LA selected"},null,{"$f":"IF('Select LAs'!$H7=0,\"-\",IF(INDEX('EY Data'!E:E, MATCH('Select LAs'!$H7,'EY Data'!$B:$B, 0))=\"\",\"-\", ROUND(INDEX('EY Data'!E:E, MATCH('Select LAs'!$H7,'EY Data'!$B:$B, 0)), 5)))","v":5.4652099999999999},{"$f":"IF('Select LAs'!$H7=0,\"-\",IF(INDEX('EY Data'!H:H, MATCH('Select LAs'!$H7,'EY Data'!$B:$B, 0))=\"\",\"-\", ROUND(INDEX('EY Data'!H:H, MATCH('Select LAs'!$H7,'EY Data'!$B:$B, 0)), 5)))","v":4.9826100000000002},{"$f":"IF('Select LAs'!$H7=0,\"-\",IF(INDEX('EY Data'!G:G, MATCH('Select LAs'!$H7,'EY Data'!$B:$B, 0))=\"\",\"-\", ROUND(INDEX('EY Data'!G:G, MATCH('Select LAs'!$H7,'EY Data'!$B:$B, 0)), 5)))","v":8.3010199999999994},{"$f":"IF('Select LAs'!$H7=0,\"-\",IF(INDEX('EY Data'!F:F, MATCH('Select LAs'!$H7,'EY Data'!$B:$B, 0))=\"\",\"-\", ROUND(INDEX('EY Data'!F:F, MATCH('Select LAs'!$H7,'EY Data'!$B:$B, 0)), 5)))","v":5.1925499999999998},{"$f":"IF(OR('Select LAs'!$H7=0,'Select LAs'!$H7=201, 'Select LAs'!$H7=420), \"-\",IF(INDEX('EY Data'!AH:AH, MATCH('Select LAs'!$H7,'EY Data'!$B:$B, 0))=\"-\", \"-\", ROUND(INDEX('EY Data'!AH:AH, MATCH('Select LAs'!$H7,'EY Data'!$B:$B, 0)),3)))","v":0.95299999999999996},{"$f":"IF(OR('Select LAs'!$H7=0,'Select LAs'!$H7=201, 'Select LAs'!$H7=420), \"-\",IF(INDEX('EY Data'!AJ:AJ, MATCH('Select LAs'!$H7,'EY Data'!$B:$B, 0))=\"\", \"-\", ROUND(INDEX('EY Data'!AJ:AJ, MATCH('Select LAs'!$H7,'EY Data'!$B:$B, 0)),3)))","v":6.0999999999999999E-2},{"$f":"IF('Select LAs'!$H7=0,\"-\",IF(INDEX('EY Data'!Z:Z, MATCH('Select LAs'!$H7,'EY Data'!$B:$B, 0))=\"\",\"-\", ROUND(INDEX('EY Data'!Z:Z, MATCH('Select LAs'!$H7,'EY Data'!$B:$B, 0)), 0)))","v":1250000},{"$f":"IF('Select LAs'!$H7=0,\"-\",IF(INDEX('EY Data'!AC:AC, MATCH('Select LAs'!$H7,'EY Data'!$B:$B, 0))=\"\",\"-\", ROUND(INDEX('EY Data'!AC:AC, MATCH('Select LAs'!$H7,'EY Data'!$B:$B, 0)), 0)))","v":1250000},{"$f":"IF('Select LAs'!$H7=0,\"-\",IF(INDEX('EY Data'!AB:AB, MATCH('Select LAs'!$H7,'EY Data'!$B:$B, 0))=\"\",\"-\", ROUND(INDEX('EY Data'!AB:AB, MATCH('Select LAs'!$H7,'EY Data'!$B:$B, 0)), 0)))","v":0},{"$f":"IF('Select LAs'!$H7=0,\"-\",IF(INDEX('EY Data'!AA:AA, MATCH('Select LAs'!$H7,'EY Data'!$B:$B, 0))=\"\",\"-\", ROUND(INDEX('EY Data'!AA:AA, MATCH('Select LAs'!$H7,'EY Data'!$B:$B, 0)), 0)))","v":0}]
["",{"$f":"'Select LAs'!G8","v":"No LA selected"},null,{"$f":"IF('Select LAs'!$H8=0,\"-\",IF(INDEX('EY Data'!E:E, MATCH('Select LAs'!$H8,'EY Data'!$B:$B, 0))=\"\",\"-\", ROUND(INDEX('EY Data'!E:E, MATCH('Select LAs'!$H8,'EY Data'!$B:$B, 0)), 5)))","v":4.9786999999999999},{"$f":"IF('Select LAs'!$H8=0,\"-\",IF(INDEX('EY Data'!H:H, MATCH('Select LAs'!$H8,'EY Data'!$B:$B, 0))=\"\",\"-\", ROUND(INDEX('EY Data'!H:H, MATCH('Select LAs'!$H8,'EY Data'!$B:$B, 0)), 5)))","v":4.8316800000000004},{"$f":"IF('Select LAs'!$H8=0,\"-\",IF(INDEX('EY Data'!G:G, MATCH('Select LAs'!$H8,'EY Data'!$B:$B, 0))=\"\",\"-\", ROUND(INDEX('EY Data'!G:G, MATCH('Select LAs'!$H8,'EY Data'!$B:$B, 0)), 5)))","v":0},{"$f":"IF('Select LAs'!$H8=0,\"-\",IF(INDEX('EY Data'!F:F, MATCH('Select LAs'!$H8,'EY Data'!$B:$B, 0))=\"\",\"-\", ROUND(INDEX('EY Data'!F:F, MATCH('Select LAs'!$H8,'EY Data'!$B:$B, 0)), 5)))","v":5.2069799999999997},{"$f":"IF(OR('Select LAs'!$H8=0,'Select LAs'!$H8=201, 'Select LAs'!$H8=420), \"-\",IF(INDEX('EY Data'!AH:AH, MATCH('Select LAs'!$H8,'EY Data'!$B:$B, 0))=\"-\", \"-\", ROUND(INDEX('EY Data'!AH:AH, MATCH('Select LAs'!$H8,'EY Data'!$B:$B, 0)),3)))","v":0.99199999999999999},{"$f":"IF(OR('Select LAs'!$H8=0,'Select LAs'!$H8=201, 'Select LAs'!$H8=420), \"-\",IF(INDEX('EY Data'!AJ:AJ, MATCH('Select LAs'!$H8,'EY Data'!$B:$B, 0))=\"\", \"-\", ROUND(INDEX('EY Data'!AJ:AJ, MATCH('Select LAs'!$H8,'EY Data'!$B:$B, 0)),3)))","v":0.107},{"$f":"IF('Select LAs'!$H8=0,\"-\",IF(INDEX('EY Data'!Z:Z, MATCH('Select LAs'!$H8,'EY Data'!$B:$B, 0))=\"\",\"-\", ROUND(INDEX('EY Data'!Z:Z, MATCH('Select LAs'!$H8,'EY Data'!$B:$B, 0)), 0)))","v":500000},{"$f":"IF('Select LAs'!$H8=0,\"-\",IF(INDEX('EY Data'!AC:AC, MATCH('Select LAs'!$H8,'EY Data'!$B:$B, 0))=\"\",\"-\", ROUND(INDEX('EY Data'!AC:AC, MATCH('Select LAs'!$H8,'EY Data'!$B:$B, 0)), 0)))","v":300000},{"$f":"IF('Select LAs'!$H8=0,\"-\",IF(INDEX('EY Data'!AB:AB, MATCH('Select LAs'!$H8,'EY Data'!$B:$B, 0))=\"\",\"-\", ROUND(INDEX('EY Data'!AB:AB, MATCH('Select LAs'!$H8,'EY Data'!$B:$B, 0)), 0)))","v":0},{"$f":"IF('Select LAs'!$H8=0,\"-\",IF(INDEX('EY Data'!AA:AA, MATCH('Select LAs'!$H8,'EY Data'!$B:$B, 0))=\"\",\"-\", ROUND(INDEX('EY Data'!AA:AA, MATCH('Select LAs'!$H8,'EY Data'!$B:$B, 0)), 0)))","v":200000}]
["",{"$f":"'Select LAs'!G9","v":"No LA selected"},null,{"$f":"IF('Select LAs'!$H9=0,\"-\",IF(INDEX('EY Data'!E:E, MATCH('Select LAs'!$H9,'EY Data'!$B:$B, 0))=\"\",\"-\", ROUND(INDEX('EY Data'!E:E, MATCH('Select LAs'!$H9,'EY Data'!$B:$B, 0)), 5)))","v":4.96},{"$f":"IF('Select LAs'!$H9=0,\"-\",IF(INDEX('EY Data'!H:H, MATCH('Select LAs'!$H9,'EY Data'!$B:$B, 0))=\"\",\"-\", ROUND(INDEX('EY Data'!H:H, MATCH('Select LAs'!$H9,'EY Data'!$B:$B, 0)), 5)))","v":4.96},{"$f":"IF('Select LAs'!$H9=0,\"-\",IF(INDEX('EY Data'!G:G, MATCH('Select LAs'!$H9,'EY Data'!$B:$B, 0))=\"\",\"-\", ROUND(INDEX('EY Data'!G:G, MATCH('Select LAs'!$H9,'EY Data'!$B:$B, 0)), 5)))","v":0},{"$f":"IF('Select LAs'!$H9=0,\"-\",IF(INDEX('EY Data'!F:F, MATCH('Select LAs'!$H9,'EY Data'!$B:$B, 0))=\"\",\"-\", ROUND(INDEX('EY Data'!F:F, MATCH('Select LAs'!$H9,'EY Data'!$B:$B, 0)), 5)))","v":4.96},{"$f":"IF(OR('Select LAs'!$H9=0,'Select LAs'!$H9=201, 'Select LAs'!$H9=420), \"-\",IF(INDEX('EY Data'!AH:AH, MATCH('Select LAs'!$H9,'EY Data'!$B:$B, 0))=\"-\", \"-\", ROUND(INDEX('EY Data'!AH:AH, MATCH('Select LAs'!$H9,'EY Data'!$B:$B, 0)),3)))","v":0.95099999999999996},{"$f":"IF(OR('Select LAs'!$H9=0,'Select LAs'!$H9=201, 'Select LAs'!$H9=420), \"-\",IF(INDEX('EY Data'!AJ:AJ, MATCH('Select LAs'!$H9,'EY Data'!$B:$B, 0))=\"\", \"-\", ROUND(INDEX('EY Data'!AJ:AJ, MATCH('Select LAs'!$H9,'EY Data'!$B:$B, 0)),3)))","v":4.7E-2},{"$f":"IF('Select LAs'!$H9=0,\"-\",IF(INDEX('EY Data'!Z:Z, MATCH('Select LAs'!$H9,'EY Data'!$B:$B, 0))=\"\",\"-\", ROUND(INDEX('EY Data'!Z:Z, MATCH('Select LAs'!$H9,'EY Data'!$B:$B, 0)), 0)))","v":93872},{"$f":"IF('Select LAs'!$H9=0,\"-\",IF(INDEX('EY Data'!AC:AC, MATCH('Select LAs'!$H9,'EY Data'!$B:$B, 0))=\"\",\"-\", ROUND(INDEX('EY Data'!AC:AC, MATCH('Select LAs'!$H9,'EY Data'!$B:$B, 0)), 0)))","v":80730},{"$f":"IF('Select LAs'!$H9=0,\"-\",IF(INDEX('EY Data'!AB:AB, MATCH('Select LAs'!$H9,'EY Data'!$B:$B, 0))=\"\",\"-\", ROUND(INDEX('EY Data'!AB:AB, MATCH('Select LAs'!$H9,'EY Data'!$B:$B, 0)), 0)))","v":0},{"$f":"IF('Select LAs'!$H9=0,\"-\",IF(INDEX('EY Data'!AA:AA, MATCH('Select LAs'!$H9,'EY Data'!$B:$B, 0))=\"\",\"-\", ROUND(INDEX('EY Data'!AA:AA, MATCH('Select LAs'!$H9,'EY Data'!$B:$B, 0)), 0)))","v":13142}]
["",{"$f":"'Select LAs'!G10","v":"No LA selected"},null,{"$f":"IF('Select LAs'!$H10=0,\"-\",IF(INDEX('EY Data'!E:E, MATCH('Select LAs'!$H10,'EY Data'!$B:$B, 0))=\"\",\"-\", ROUND(INDEX('EY Data'!E:E, MATCH('Select LAs'!$H10,'EY Data'!$B:$B, 0)), 5)))","v":4.9437499999999996},{"$f":"IF('Select LAs'!$H10=0,\"-\",IF(INDEX('EY Data'!H:H, MATCH('Select LAs'!$H10,'EY Data'!$B:$B, 0))=\"\",\"-\", ROUND(INDEX('EY Data'!H:H, MATCH('Select LAs'!$H10,'EY Data'!$B:$B, 0)), 5)))","v":5.0023499999999999},{"$f":"IF('Select LAs'!$H10=0,\"-\",IF(INDEX('EY Data'!G:G, MATCH('Select LAs'!$H10,'EY Data'!$B:$B, 0))=\"\",\"-\", ROUND(INDEX('EY Data'!G:G, MATCH('Select LAs'!$H10,'EY Data'!$B:$B, 0)), 5)))","v":7.7902500000000003},{"$f":"IF('Select LAs'!$H10=0,\"-\",IF(INDEX('EY Data'!F:F, MATCH('Select LAs'!$H10,'EY Data'!$B:$B, 0))=\"\",\"-\", ROUND(INDEX('EY Data'!F:F, MATCH('Select LAs'!$H10,'EY Data'!$B:$B, 0)), 5)))","v":4.7145900000000003},{"$f":"IF(OR('Select LAs'!$H10=0,'Select LAs'!$H10=201, 'Select LAs'!$H10=420), \"-\",IF(INDEX('EY Data'!AH:AH, MATCH('Select LAs'!$H10,'EY Data'!$B:$B, 0))=\"-\", \"-\", ROUND(INDEX('EY Data'!AH:AH, MATCH('Select LAs'!$H10,'EY Data'!$B:$B, 0)),3)))","v":0.97199999999999998},{"$f":"IF(OR('Select LAs'!$H10=0,'Select LAs'!$H10=201, 'Select LAs'!$H10=420), \"-\",IF(INDEX('EY Data'!AJ:AJ, MATCH('Select LAs'!$H10,'EY Data'!$B:$B, 0))=\"\", \"-\", ROUND(INDEX('EY Data'!AJ:AJ, MATCH('Select LAs'!$H10,'EY Data'!$B:$B, 0)),3)))","v":4.2000000000000003E-2},{"$f":"IF('Select LAs'!$H10=0,\"-\",IF(INDEX('EY Data'!Z:Z, MATCH('Select LAs'!$H10,'EY Data'!$B:$B, 0))=\"\",\"-\", ROUND(INDEX('EY Data'!Z:Z, MATCH('Select LAs'!$H10,'EY Data'!$B:$B, 0)), 0)))","v":630000},{"$f":"IF('Select LAs'!$H10=0,\"-\",IF(INDEX('EY Data'!AC:AC, MATCH('Select LAs'!$H10,'EY Data'!$B:$B, 0))=\"\",\"-\", ROUND(INDEX('EY Data'!AC:AC, MATCH('Select LAs'!$H10,'EY Data'!$B:$B, 0)), 0)))","v":522900},{"$f":"IF('Select LAs'!$H10=0,\"-\",IF(INDEX('EY Data'!AB:AB, MATCH('Select LAs'!$H10,'EY Data'!$B:$B, 0))=\"\",\"-\", ROUND(INDEX('EY Data'!AB:AB, MATCH('Select LAs'!$H10,'EY Data'!$B:$B, 0)), 0)))","v":12600},{"$f":"IF('Select LAs'!$H10=0,\"-\",IF(INDEX('EY Data'!AA:AA, MATCH('Select LAs'!$H10,'EY Data'!$B:$B, 0))=\"\",\"-\", ROUND(INDEX('EY Data'!AA:AA, MATCH('Select LAs'!$H10,'EY Data'!$B:$B, 0)), 0)))","v":94500}]
["",{"$f":"'Select LAs'!G11","v":"No LA selected"},null,{"$f":"IF('Select LAs'!$H11=0,\"-\",IF(INDEX('EY Data'!E:E, MATCH('Select LAs'!$H11,'EY Data'!$B:$B, 0))=\"\",\"-\", ROUND(INDEX('EY Data'!E:E, MATCH('Select LAs'!$H11,'EY Data'!$B:$B, 0)), 5)))","v":5.1131799999999998},{"$f":"IF('Select LAs'!$H11=0,\"-\",IF(INDEX('EY Data'!H:H, MATCH('Select LAs'!$H11,'EY Data'!$B:$B, 0))=\"\",\"-\", ROUND(INDEX('EY Data'!H:H, MATCH('Select LAs'!$H11,'EY Data'!$B:$B, 0)), 5)))","v":4.7882699999999998},{"$f":"IF('Select LAs'!$H11=0,\"-\",IF(INDEX('EY Data'!G:G, MATCH('Select LAs'!$H11,'EY Data'!$B:$B, 0))=\"\",\"-\", ROUND(INDEX('EY Data'!G:G, MATCH('Select LAs'!$H11,'EY Data'!$B:$B, 0)), 5)))","v":10.25318},{"$f":"IF('Select LAs'!$H11=0,\"-\",IF(INDEX('EY Data'!F:F, MATCH('Select LAs'!$H11,'EY Data'!$B:$B, 0))=\"\",\"-\", ROUND(INDEX('EY Data'!F:F, MATCH('Select LAs'!$H11,'EY Data'!$B:$B, 0)), 5)))","v":4.8925999999999998},{"$f":"IF(OR('Select LAs'!$H11=0,'Select LAs'!$H11=201, 'Select LAs'!$H11=420), \"-\",IF(INDEX('EY Data'!AH:AH, MATCH('Select LAs'!$H11,'EY Data'!$B:$B, 0))=\"-\", \"-\", ROUND(INDEX('EY Data'!AH:AH, MATCH('Select LAs'!$H11,'EY Data'!$B:$B, 0)),3)))","v":1.056},{"$f":"IF(OR('Select LAs'!$H11=0,'Select LAs'!$H11=201, 'Select LAs'!$H11=420), \"-\",IF(INDEX('EY Data'!AJ:AJ, MATCH('Select LAs'!$H11,'EY Data'!$B:$B, 0))=\"\", \"-\", ROUND(INDEX('EY Data'!AJ:AJ, MATCH('Select LAs'!$H11,'EY Data'!$B:$B, 0)),3)))","v":3.4000000000000002E-2},{"$f":"IF('Select LAs'!$H11=0,\"-\",IF(INDEX('EY Data'!Z:Z, MATCH('Select LAs'!$H11,'EY Data'!$B:$B, 0))=\"\",\"-\", ROUND(INDEX('EY Data'!Z:Z, MATCH('Select LAs'!$H11,'EY Data'!$B:$B, 0)), 0)))","v":820000},{"$f":"IF('Select LAs'!$H11=0,\"-\",IF(INDEX('EY Data'!AC:AC, MATCH('Select LAs'!$H11,'EY Data'!$B:$B, 0))=\"\",\"-\", ROUND(INDEX('EY Data'!AC:AC, MATCH('Select LAs'!$H11,'EY Data'!$B:$B, 0)), 0)))","v":468081},{"$f":"IF('Select LAs'!$H11=0,\"-\",IF(INDEX('EY Data'!AB:AB, MATCH('Select LAs'!$H11,'EY Data'!$B:$B, 0))=\"\",\"-\", ROUND(INDEX('EY Data'!AB:AB, MATCH('Select LAs'!$H11,'EY Data'!$B:$B, 0)), 0)))","v":0},{"$f":"IF('Select LAs'!$H11=0,\"-\",IF(INDEX('EY Data'!AA:AA, MATCH('Select LAs'!$H11,'EY Data'!$B:$B, 0))=\"\",\"-\", ROUND(INDEX('EY Data'!AA:AA, MATCH('Select LAs'!$H11,'EY Data'!$B:$B, 0)), 0)))","v":351919}]
["",{"$f":"'Select LAs'!G12","v":"No LA selected"},null,{"$f":"IF('Select LAs'!$H12=0,\"-\",IF(INDEX('EY Data'!E:E, MATCH('Select LAs'!$H12,'EY Data'!$B:$B, 0))=\"\",\"-\", ROUND(INDEX('EY Data'!E:E, MATCH('Select LAs'!$H12,'EY Data'!$B:$B, 0)), 5)))","v":5.5575900000000003},{"$f":"IF('Select LAs'!$H12=0,\"-\",IF(INDEX('EY Data'!H:H, MATCH('Select LAs'!$H12,'EY Data'!$B:$B, 0))=\"\",\"-\", ROUND(INDEX('EY Data'!H:H, MATCH('Select LAs'!$H12,'EY Data'!$B:$B, 0)), 5)))","v":5.08033},{"$f":"IF('Select LAs'!$H12=0,\"-\",IF(INDEX('EY Data'!G:G, MATCH('Select LAs'!$H12,'EY Data'!$B:$B, 0))=\"\",\"-\", ROUND(INDEX('EY Data'!G:G, MATCH('Select LAs'!$H12,'EY Data'!$B:$B, 0)), 5)))","v":8.63504},{"$f":"IF('Select LAs'!$H12=0,\"-\",IF(INDEX('EY Data'!F:F, MATCH('Select LAs'!$H12,'EY Data'!$B:$B, 0))=\"\",\"-\", ROUND(INDEX('EY Data'!F:F, MATCH('Select LAs'!$H12,'EY Data'!$B:$B, 0)), 5)))","v":5.1520900000000003},{"$f":"IF(OR('Select LAs'!$H12=0,'Select LAs'!$H12=201, 'Select LAs'!$H12=420), \"-\",IF(INDEX('EY Data'!AH:AH, MATCH('Select LAs'!$H12,'EY Data'!$B:$B, 0))=\"-\", \"-\", ROUND(INDEX('EY Data'!AH:AH, MATCH('Select LAs'!$H12,'EY Data'!$B:$B, 0)),3)))","v":1},{"$f":"IF(OR('Select LAs'!$H12=0,'Select LAs'!$H12=201, 'Select LAs'!$H12=420), \"-\",IF(INDEX('EY Data'!AJ:AJ, MATCH('Select LAs'!$H12,'EY Data'!$B:$B, 0))=\"\", \"-\", ROUND(INDEX('EY Data'!AJ:AJ, MATCH('Select LAs'!$H12,'EY Data'!$B:$B, 0)),3)))","v":9.9000000000000005E-2},{"$f":"IF('Select LAs'!$H12=0,\"-\",IF(INDEX('EY Data'!Z:Z, MATCH('Select LAs'!$H12,'EY Data'!$B:$B, 0))=\"\",\"-\", ROUND(INDEX('EY Data'!Z:Z, MATCH('Select LAs'!$H12,'EY Data'!$B:$B, 0)), 0)))","v":266402},{"$f":"IF('Select LAs'!$H12=0,\"-\",IF(INDEX('EY Data'!AC:AC, MATCH('Select LAs'!$H12,'EY Data'!$B:$B, 0))=\"\",\"-\", ROUND(INDEX('EY Data'!AC:AC, MATCH('Select LAs'!$H12,'EY Data'!$B:$B, 0)), 0)))","v":109924},{"$f":"IF('Select LAs'!$H12=0,\"-\",IF(INDEX('EY Data'!AB:AB, MATCH('Select LAs'!$H12,'EY Data'!$B:$B, 0))=\"\",\"-\", ROUND(INDEX('EY Data'!AB:AB, MATCH('Select LAs'!$H12,'EY Data'!$B:$B, 0)), 0)))","v":73682},{"$f":"IF('Select LAs'!$H12=0,\"-\",IF(INDEX('EY Data'!AA:AA, MATCH('Select LAs'!$H12,'EY Data'!$B:$B, 0))=\"\",\"-\", ROUND(INDEX('EY Data'!AA:AA, MATCH('Select LAs'!$H12,'EY Data'!$B:$B, 0)), 0)))","v":82796}]
[null,{"$f":"'Select LAs'!G13","v":"No LA selected"},null,{"$f":"IF('Select LAs'!$H13=0,\"-\",IF(INDEX('EY Data'!E:E, MATCH('Select LAs'!$H13,'EY Data'!$B:$B, 0))=\"\",\"-\", ROUND(INDEX('EY Data'!E:E, MATCH('Select LAs'!$H13,'EY Data'!$B:$B, 0)), 5)))","v":5.3307200000000003},{"$f":"IF('Select LAs'!$H13=0,\"-\",IF(INDEX('EY Data'!H:H, MATCH('Select LAs'!$H13,'EY Data'!$B:$B, 0))=\"\",\"-\", ROUND(INDEX('EY Data'!H:H, MATCH('Select LAs'!$H13,'EY Data'!$B:$B, 0)), 5)))","v":5.0530799999999996},{"$f":"IF('Select LAs'!$H13=0,\"-\",IF(INDEX('EY Data'!G:G, MATCH('Select LAs'!$H13,'EY Data'!$B:$B, 0))=\"\",\"-\", ROUND(INDEX('EY Data'!G:G, MATCH('Select LAs'!$H13,'EY Data'!$B:$B, 0)), 5)))","v":8.6974},{"$f":"IF('Select LAs'!$H13=0,\"-\",IF(INDEX('EY Data'!F:F, MATCH('Select LAs'!$H13,'EY Data'!$B:$B, 0))=\"\",\"-\", ROUND(INDEX('EY Data'!F:F, MATCH('Select LAs'!$H13,'EY Data'!$B:$B, 0)), 5)))","v":5.3043699999999996},{"$f":"IF(OR('Select LAs'!$H13=0,'Select LAs'!$H13=201, 'Select LAs'!$H13=420), \"-\",IF(INDEX('EY Data'!AH:AH, MATCH('Select LAs'!$H13,'EY Data'!$B:$B, 0))=\"-\", \"-\", ROUND(INDEX('EY Data'!AH:AH, MATCH('Select LAs'!$H13,'EY Data'!$B:$B, 0)),3)))","v":1.0049999999999999},{"$f":"IF(OR('Select LAs'!$H13=0,'Select LAs'!$H13=201, 'Select LAs'!$H13=420), \"-\",IF(INDEX('EY Data'!AJ:AJ, MATCH('Select LAs'!$H13,'EY Data'!$B:$B, 0))=\"\", \"-\", ROUND(INDEX('EY Data'!AJ:AJ, MATCH('Select LAs'!$H13,'EY Data'!$B:$B, 0)),3)))","v":6.8000000000000005E-2},{"$f":"IF('Select LAs'!$H13=0,\"-\",IF(INDEX('EY Data'!Z:Z, MATCH('Select LAs'!$H13,'EY Data'!$B:$B, 0))=\"\",\"-\", ROUND(INDEX('EY Data'!Z:Z, MATCH('Select LAs'!$H13,'EY Data'!$B:$B, 0)), 0)))","v":250000},{"$f":"IF('Select LAs'!$H13=0,\"-\",IF(INDEX('EY Data'!AC:AC, MATCH('Select LAs'!$H13,'EY Data'!$B:$B, 0))=\"\",\"-\", ROUND(INDEX('EY Data'!AC:AC, MATCH('Select LAs'!$H13,'EY Data'!$B:$B, 0)), 0)))","v":130668},{"$f":"IF('Select LAs'!$H13=0,\"-\",IF(INDEX('EY Data'!AB:AB, MATCH('Select LAs'!$H13,'EY Data'!$B:$B, 0))=\"\",\"-\", ROUND(INDEX('EY Data'!AB:AB, MATCH('Select LAs'!$H13,'EY Data'!$B:$B, 0)), 0)))","v":17017},{"$f":"IF('Select LAs'!$H13=0,\"-\",IF(INDEX('EY Data'!AA:AA, MATCH('Select LAs'!$H13,'EY Data'!$B:$B, 0))=\"\",\"-\", ROUND(INDEX('EY Data'!AA:AA, MATCH('Select LAs'!$H13,'EY Data'!$B:$B, 0)), 0)))","v":102315}]
[null,"Selection Median",null,{"$f":"IF(COUNT(D$29:D$39)>0,MEDIAN(D$29:D$39),\"-\")","v":5.3307200000000003},5.0530799999999996,7.7902500000000003,{"$f":"IF(COUNT(G$29:G$39)>0,MEDIAN(G$29:G$39),\"-\")","v":5.2069799999999997},{"$f":"IF(COUNT(H$29:H$39)>0,MEDIAN(H$29:H$39),\"-\")","v":0.98899999999999999},{"$f":"IF(COUNT(I$29:I$39)>0,MEDIAN(I$29:I$39),\"-\")","v":6.0999999999999999E-2},{"$f":"IF(COUNT(J$29:J$39)>0,MEDIAN(J$29:J$39),\"-\")","v":489063},300000,12600,94500]
[null,"Selection Minimum",null,{"$f":"IF(COUNT(D$29:D$39)>0,MIN(D$29:D$39),\"-\")","v":4.9437499999999996},4.7882699999999998,0,{"$f":"IF(COUNT(G$29:G$39)>0,MIN(G$29:G$39),\"-\")","v":4.7145900000000003},{"$f":"IF(COUNT(H$29:H$39)>0,MIN(H$29:H$39),\"-\")","v":0.95099999999999996},{"$f":"IF(COUNT(I$29:I$39)>0,MIN(I$29:I$39),\"-\")","v":3.4000000000000002E-2},{"$f":"IF(COUNT(J$29:J$39)>0,MIN(J$29:J$39),\"-\")","v":93872},5500,0,0]
[null,"Selection Maximum",null,{"$f":"IF(COUNT(D$29:D$39)>0,MAX(D$29:D$39),\"-\")","v":5.9813900000000002},5.6331199999999999,10.25318,{"$f":"IF(COUNT(G$29:G$39)>0,MAX(G$29:G$39),\"-\")","v":8.4418699999999998},{"$f":"IF(COUNT(H$29:H$39)>0,MAX(H$29:H$39),\"-\")","v":1.056},{"$f":"IF(COUNT(I$29:I$39)>0,MAX(I$29:I$39),\"-\")","v":0.107},{"$f":"IF(COUNT(J$29:J$39)>0,MAX(J$29:J$39),\"-\")","v":1828597},1250000,609532,609532]

{"sheet":"2 year olds ","index":2,"n_rows":42,"n_cols":11,"rows_kept":42,"cut":false,"hidden":true,"merged":[[43,1,43,9],[4,1,4,2],[22,3,22,4],[26,1,26,2],[25,3,25,6],[6,1,6,2],[5,1,5,2],[25,7,25,10]]}
[]
[null,{"$f":"CONCATENATE('Select LAs'!B3,\" - Key Budget Statistics\")","v":"No LA selected - Key Budget Statistics"},null,null,null,null,null,null,null,null,{"$f":"'3-4 year olds '!M2","v":"Financial Year 2023-2024"}]
[]
[]
[null,{"$f":"'Select LAs'!D3","v":"No LA selected"},null,"All providers","Private, Voluntary, Independent","Nursery schools","Primary nursery places"]
[null,"2 year old hourly average funding rate (£/hr)",null,{"$f":"IFERROR(IF(INDEX('EY Data'!AL:AL, MATCH('Select LAs'!$A$3,'EY Data'!$B:$B, 0))=\"\",\"-\", INDEX('EY Data'!AL:AL, MATCH('Select LAs'!$A$3,'EY Data'!$B:$B, 0))), 0)","v":0},{"$f":"IFERROR(IF(INDEX('EY Data'!AO:AO, MATCH('Select LAs'!$A$3,'EY Data'!$B:$B, 0))=\"\",\"-\", INDEX('EY Data'!AO:AO, MATCH('Select LAs'!$A$3,'EY Data'!$B:$B, 0))), 0)","v":0},{"$f":"IFERROR(IF(INDEX('EY Data'!AN:AN, MATCH('Select LAs'!$A$3,'EY Data'!$B:$B, 0))=\"\",\"-\", INDEX('EY Data'!AN:AN, MATCH('Select LAs'!$A$3,'EY Data'!$B:$B, 0))), 0)","v":0},{"$f":"IFERROR(IF(INDEX('EY Data'!AM:AM, MATCH('Select LAs'!$A$3,'EY Data'!$B:$B, 0))=\"\",\"-\", INDEX('EY Data'!AM:AM, MATCH('Select LAs'!$A$3,'EY Data'!$B:$B, 0))), 0)","v":0}]
[null,"2 year old hourly average base rate (£/hr)",null,{"$f":"IFERROR(IF(INDEX('EY Data'!AQ:AQ, MATCH('Select LAs'!$A$3,'EY Data'!$B:$B, 0))=\"\",\"-\", INDEX('EY Data'!AQ:AQ, MATCH('Select LAs'!$A$3,'EY Data'!$B:$B, 0))), 0)","v":0},{"$f":"IFERROR(IF(INDEX('EY Data'!AT:AT, MATCH('Select LAs'!$A$3,'EY Data'!$B:$B, 0))=\"\",\"-\", INDEX('EY Data'!AT:AT, MATCH('Select LAs'!$A$3,'EY Data'!$B:$B, 0))), 0)","v":0},{"$f":"IFERROR(IF(INDEX('EY Data'!AS:AS, MATCH('Select LAs'!$A$3,'EY Data'!$B:$B, 0))=\"\",\"-\", INDEX('EY Data'!AS:AS, MATCH('Select LAs'!$A$3,'EY Data'!$B:$B, 0))), 0)","v":0},{"$f":"IFERROR(IF(INDEX('EY Data'!AR:AR, MATCH('Select LAs'!$A$3,'EY Data'!$B:$B, 0))=\"\",\"-\", INDEX('EY Data'!AR:AR, MATCH('Select LAs'!$A$3,'EY Data'!$B:$B, 0))), 0)","v":0}]
[]
[]
[]
[]
[]
[]
[]
[]
[]
[]
[]
[null,{"$f":"CONCATENATE(\"Benchmarking against \",IF(_SN=1,\"Statistical Neighbours\",\"Manual Selection\"))","v":"Benchmarking against Manual Selection"}]
[]
[]
[]
[null,null,"Order"]
[]
[]
[null,null,null,"Average funding rate to providers per hour",null,null,null,"SEN Inclusion Fund (top-up grant element) budget4"]
[null,"Local Authority",null,"All providers","Private, Voluntary, Independent","Nursery schools","Primary nursery places","All providers","Private, Voluntary, Independent","Nursery schools","Primary nursery places"]
[null,"England",null,{"$f":"ROUND(INDEX('EY Data'!AL:AL, MATCH($B28,'EY Data'!$C:$C, 0)), 5)","v":5.9221000000000004},{"$f":"ROUND(INDEX('EY Data'!AO:AO, MATCH($B28,'EY Data'!$C:$C, 0)), 5)","v":5.8983299999999996},{"$f":"ROUND(INDEX('EY Data'!AN:AN, MATCH($B28,'EY Data'!$C:$C, 0)), 5)","v":5.9980799999999999},{"$f":"ROUND(INDEX('EY Data'!AM:AM, MATCH($B28,'EY Data'!$C:$C, 0)), 5)","v":6.0648999999999997},{"$f":"ROUND(INDEX('EY Data'!AX:AX, MATCH($B28,'EY Data'!$C:$C, 0)), 3)","v":3943078.68},{"$f":"ROUND(INDEX('EY Data'!BA:BA, MATCH($B28,'EY Data'!$C:$C, 0)), 3)","v":3157450.8},{"$f":"ROUND(INDEX('EY Data'!AZ:AZ, MATCH($B28,'EY Data'!$C:$C, 0)), 3)","v":216601.41},{"$f":"ROUND(INDEX('EY Data'!AY:AY, MATCH($B28,'EY Data'!$C:$C, 0)), 3)","v":569026.47}]
[null,{"$f":"'Select LAs'!O3","v":"No LA selected"},null,{"$f":"IF('Select LAs'!$P3=0,\"-\",IF(INDEX('EY Data'!AL:AL, MATCH('Select LAs'!$P3,'EY Data'!$B:$B, 0))=\"\",\"-\", ROUND(INDEX('EY Data'!AL:AL, MATCH('Select LAs'!$P3,'EY Data'!$B:$B, 0)),5)))","v":5.62},{"$f":"IF('Select LAs'!$P3=0,\"-\",IF(INDEX('EY Data'!AO:AO, MATCH('Select LAs'!$P3,'EY Data'!$B:$B, 0))=\"\",\"-\", ROUND(INDEX('EY Data'!AO:AO, MATCH('Select LAs'!$P3,'EY Data'!$B:$B, 0)),5)))","v":5.62},{"$f":"IF('Select LAs'!$P3=0,\"-\",IF(INDEX('EY Data'!AN:AN, MATCH('Select LAs'!$P3,'EY Data'!$B:$B, 0))=\"\",\"-\", ROUND(INDEX('EY Data'!AN:AN, MATCH('Select LAs'!$P3,'EY Data'!$B:$B, 0)),5)))","v":5.62},{"$f":"IF('Select LAs'!$P3=0,\"-\",IF(INDEX('EY Data'!AM:AM, MATCH('Select LAs'!$P3,'EY Data'!$B:$B, 0))=\"\",\"-\", ROUND(INDEX('EY Data'!AM:AM, MATCH('Select LAs'!$P3,'EY Data'!$B:$B, 0)),5)))","v":5.62},{"$f":"IF('Select LAs'!$P3=0,\"-\",IF(INDEX('EY Data'!AX:AX, MATCH('Select LAs'!$P3,'EY Data'!$B:$B, 0))=\"\",\"-\",ROUND(INDEX('EY Data'!AX:AX, MATCH('Select LAs'!$P3,'EY Data'!$B:$B, 0)),0)))","v":0},{"$f":"IF('Select LAs'!$P3=0,\"-\",IF(INDEX('EY Data'!BA:BA, MATCH('Select LAs'!$P3,'EY Data'!$B:$B, 0))=\"\",\"-\",ROUND(INDEX('EY Data'!BA:BA, MATCH('Select LAs'!$P3,'EY Data'!$B:$B, 0)),0)))","v":0},{"$f":"IF('Select LAs'!$P3=0,\"-\",IF(INDEX('EY Data'!AZ:AZ, MATCH('Select LAs'!$P3,'EY Data'!$B:$B, 0))=\"\",\"-\",ROUND(INDEX('EY Data'!AZ:AZ, MATCH('Select LAs'!$P3,'EY Data'!$B:$B, 0)),0)))","v":0},{"$f":"IF('Select LAs'!$P3=0,\"-\",IF(INDEX('EY Data'!AY:AY, MATCH('Select LAs'!$P3,'EY Data'!$B:$B, 0))=\"\",\"-\",ROUND(INDEX('EY Data'!AY:AY, MATCH('Select LAs'!$P3,'EY Data'!$B:$B, 0)),0)))","v":0}]
[null,{"$f":"'Select LAs'!O4","v":"No LA selected"},null,{"$f":"IF('Select LAs'!$P4=0,\"-\",IF(INDEX('EY Data'!AL:AL, MATCH('Select LAs'!$P4,'EY Data'!$B:$B, 0))=\"\",\"-\", ROUND(INDEX('EY Data'!AL:AL, MATCH('Select LAs'!$P4,'EY Data'!$B:$B, 0)),5)))","v":5.67849},{"$f":"IF('Select LAs'!$P4=0,\"-\",IF(INDEX('EY Data'!AO:AO, MATCH('Select LAs'!$P4,'EY Data'!$B:$B, 0))=\"\",\"-\", ROUND(INDEX('EY Data'!AO:AO, MATCH('Select LAs'!$P4,'EY Data'!$B:$B, 0)),5)))","v":5.6781100000000002},{"$f":"IF('Select LAs'!$P4=0,\"-\",IF(INDEX('EY Data'!AN:AN, MATCH('Select LAs'!$P4,'EY Data'!$B:$B, 0))=\"\",\"-\", ROUND(INDEX('EY Data'!AN:AN, MATCH('Select LAs'!$P4,'EY Data'!$B:$B, 0)),5)))","v":5.6795900000000001},{"$f":"IF('Select LAs'!$P4=0,\"-\",IF(INDEX('EY Data'!AM:AM, MATCH('Select LAs'!$P4,'EY Data'!$B:$B, 0))=\"\",\"-\", ROUND(INDEX('EY Data'!AM:AM, MATCH('Select LAs'!$P4,'EY Data'!$B:$B, 0)),5)))","v":5.6878399999999996},{"$f":"IF('Select LAs'!$P4=0,\"-\",IF(INDEX('EY Data'!AX:AX, MATCH('Select LAs'!$P4,'EY Data'!$B:$B, 0))=\"\",\"-\",ROUND(INDEX('EY Data'!AX:AX, MATCH('Select LAs'!$P4,'EY Data'!$B:$B, 0)),0)))","v":10000},{"$f":"IF('Select LAs'!$P4=0,\"-\",IF(INDEX('EY Data'!BA:BA, MATCH('Select LAs'!$P4,'EY Data'!$B:$B, 0))=\"\",\"-\",ROUND(INDEX('EY Data'!BA:BA, MATCH('Select LAs'!$P4,'EY Data'!$B:$B, 0)),0)))","v":8745},{"$f":"IF('Select LAs'!$P4=0,\"-\",IF(INDEX('EY Data'!AZ:AZ, MATCH('Select LAs'!$P4,'EY Data'!$B:$B, 0))=\"\",\"-\",ROUND(INDEX('EY Data'!AZ:AZ, MATCH('Select LAs'!$P4,'EY Data'!$B:$B, 0)),0)))","v":837},{"$f":"IF('Select LAs'!$P4=0,\"-\",IF(INDEX('EY Data'!AY:AY, MATCH('Select LAs'!$P4,'EY Data'!$B:$B, 0))=\"\",\"-\",ROUND(INDEX('EY Data'!AY:AY, MATCH('Select LAs'!$P4,'EY Data'!$B:$B, 0)),0)))","v":419}]
["",{"$f":"'Select LAs'!O5","v":"No LA selected"},null,{"$f":"IF('Select LAs'!$P5=0,\"-\",IF(INDEX('EY Data'!AL:AL, MATCH('Select LAs'!$P5,'EY Data'!$B:$B, 0))=\"\",\"-\", ROUND(INDEX('EY Data'!AL:AL, MATCH('Select LAs'!$P5,'EY Data'!$B:$B, 0)),5)))","v":5.86},{"$f":"IF('Select LAs'!$P5=0,\"-\",IF(INDEX('EY Data'!AO:AO, MATCH('Select LAs'!$P5,'EY Data'!$B:$B, 0))=\"\",\"-\", ROUND(INDEX('EY Data'!AO:AO, MATCH('Select LAs'!$P5,'EY Data'!$B:$B, 0)),5)))","v":5.86},{"$f":"IF('Select LAs'!$P5=0,\"-\",IF(INDEX('EY Data'!AN:AN, MATCH('Select LAs'!$P5,'EY Data'!$B:$B, 0))=\"\",\"-\", ROUND(INDEX('EY Data'!AN:AN, MATCH('Select LAs'!$P5,'EY Data'!$B:$B, 0)),5)))","v":5.86},{"$f":"IF('Select LAs'!$P5=0,\"-\",IF(INDEX('EY Data'!AM:AM, MATCH('Select LAs'!$P5,'EY Data'!$B:$B, 0))=\"\",\"-\", ROUND(INDEX('EY Data'!AM:AM, MATCH('Select LAs'!$P5,'EY Data'!$B:$B, 0)),5)))","v":0},{"$f":"IF('Select LAs'!$P5=0,\"-\",IF(INDEX('EY Data'!AX:AX, MATCH('Select LAs'!$P5,'EY Data'!$B:$B, 0))=\"\",\"-\",ROUND(INDEX('EY Data'!AX:AX, MATCH('Select LAs'!$P5,'EY Data'!$B:$B, 0)),0)))","v":0},{"$f":"IF('Select LAs'!$P5=0,\"-\",IF(INDEX('EY Data'!BA:BA, MATCH('Select LAs'!$P5,'EY Data'!$B:$B, 0))=\"\",\"-\",ROUND(INDEX('EY Data'!BA:BA, MATCH('Select LAs'!$P5,'EY Data'!$B:$B, 0)),0)))","v":0},{"$f":"IF('Select LAs'!$P5=0,\"-\",IF(INDEX('EY Data'!AZ:AZ, MATCH('Select LAs'!$P5,'EY Data'!$B:$B, 0))=\"\",\"-\",ROUND(INDEX('EY Data'!AZ:AZ, MATCH('Select LAs'!$P5,'EY Data'!$B:$B, 0)),0)))","v":0},{"$f":"IF('Select LAs'!$P5=0,\"-\",IF(INDEX('EY Data'!AY:AY, MATCH('Select LAs'!$P5,'EY Data'!$B:$B, 0))=\"\",\"-\",ROUND(INDEX('EY Data'!AY:AY, MATCH('Select LAs'!$P5,'EY Data'!$B:$B, 0)),0)))","v":0}]
["",{"$f":"'Select LAs'!O6","v":"No LA selected"},null,{"$f":"IF('Select LAs'!$P6=0,\"-\",IF(INDEX('EY Data'!AL:AL, MATCH('Select LAs'!$P6,'EY Data'!$B:$B, 0))=\"\",\"-\", ROUND(INDEX('EY Data'!AL:AL, MATCH('Select LAs'!$P6,'EY Data'!$B:$B, 0)),5)))","v":6.11},{"$f":"IF('Select LAs'!$P6=0,\"-\",IF(INDEX('EY Data'!AO:AO, MATCH('Select LAs'!$P6,'EY Data'!$B:$B, 0))=\"\",\"-\", ROUND(INDEX('EY Data'!AO:AO, MATCH('Select LAs'!$P6,'EY Data'!$B:$B, 0)),5)))","v":6.11},{"$f":"IF('Select LAs'!$P6=0,\"-\",IF(INDEX('EY Data'!AN:AN, MATCH('Select LAs'!$P6,'EY Data'!$B:$B, 0))=\"\",\"-\", ROUND(INDEX('EY Data'!AN:AN, MATCH('Select LAs'!$P6,'EY Data'!$B:$B, 0)),5)))","v":6.11},{"$f":"IF('Select LAs'!$P6=0,\"-\",IF(INDEX('EY Data'!AM:AM, MATCH('Select LAs'!$P6,'EY Data'!$B:$B, 0))=\"\",\"-\", ROUND(INDEX('EY Data'!AM:AM, MATCH('Select LAs'!$P6,'EY Data'!$B:$B, 0)),5)))","v":6.11},{"$f":"IF('Select LAs'!$P6=0,\"-\",IF(INDEX('EY Data'!AX:AX, MATCH('Select LAs'!$P6,'EY Data'!$B:$B, 0))=\"\",\"-\",ROUND(INDEX('EY Data'!AX:AX, MATCH('Select LAs'!$P6,'EY Data'!$B:$B, 0)),0)))","v":0},{"$f":"IF('Select LAs'!$P6=0,\"-\",IF(INDEX('EY Data'!BA:BA, MATCH('Select LAs'!$P6,'EY Data'!$B:$B, 0))=\"\",\"-\",ROUND(INDEX('EY Data'!BA:BA, MATCH('Select LAs'!$P6,'EY Data'!$B:$B, 0)),0)))","v":0},{"$f":"IF('Select LAs'!$P6=0,\"-\",IF(INDEX('EY Data'!AZ:AZ, MATCH('Select LAs'!$P6,'EY Data'!$B:$B, 0))=\"\",\"-\",ROUND(INDEX('EY Data'!AZ:AZ, MATCH('Select LAs'!$P6,'EY Data'!$B:$B, 0)),0)))","v":0},{"$f":"IF('Select LAs'!$P6=0,\"-\",IF(INDEX('EY Data'!AY:AY, MATCH('Select LAs'!$P6,'EY Data'!$B:$B, 0))=\"\",\"-\",ROUND(INDEX('EY Data'!AY:AY, MATCH('Select LAs'!$P6,'EY Data'!$B:$B, 0)),0)))","v":0}]
["",{"$f":"'Select LAs'!O7","v":"No LA selected"},null,{"$f":"IF('Select LAs'!$P7=0,\"-\",IF(INDEX('EY Data'!AL:AL, MATCH('Select LAs'!$P7,'EY Data'!$B:$B, 0))=\"\",\"-\", ROUND(INDEX('EY Data'!AL:AL, MATCH('Select LAs'!$P7,'EY Data'!$B:$B, 0)),5)))","v":5.81},{"$f":"IF('Select LAs'!$P7=0,\"-\",IF(INDEX('EY Data'!AO:AO, MATCH('Select LAs'!$P7,'EY Data'!$B:$B, 0))=\"\",\"-\", ROUND(INDEX('EY Data'!AO:AO, MATCH('Select LAs'!$P7,'EY Data'!$B:$B, 0)),5)))","v":0},{"$f":"IF('Select LAs'!$P7=0,\"-\",IF(INDEX('EY Data'!AN:AN, MATCH('Select LAs'!$P7,'EY Data'!$B:$B, 0))=\"\",\"-\", ROUND(INDEX('EY Data'!AN:AN, MATCH('Select LAs'!$P7,'EY Data'!$B:$B, 0)),5)))","v":5.81},{"$f":"IF('Select LAs'!$P7=0,\"-\",IF(INDEX('EY Data'!AM:AM, MATCH('Select LAs'!$P7,'EY Data'!$B:$B, 0))=\"\",\"-\", ROUND(INDEX('EY Data'!AM:AM, MATCH('Select LAs'!$P7,'EY Data'!$B:$B, 0)),5)))","v":5.81},{"$f":"IF('Select LAs'!$P7=0,\"-\",IF(INDEX('EY Data'!AX:AX, MATCH('Select LAs'!$P7,'EY Data'!$B:$B, 0))=\"\",\"-\",ROUND(INDEX('EY Data'!AX:AX, MATCH('Select LAs'!$P7,'EY Data'!$B:$B, 0)),0)))","v":0},{"$f":"IF('Select LAs'!$P7=0,\"-\",IF(INDEX('EY Data'!BA:BA, MATCH('Select LAs'!$P7,'EY Data'!$B:$B, 0))=\"\",\"-\",ROUND(INDEX('EY Data'!BA:BA, MATCH('Select LAs'!$P7,'EY Data'!$B:$B, 0)),0)))","v":0},{"$f":"IF('Select LAs'!$P7=0,\"-\",IF(INDEX('EY Data'!AZ:AZ, MATCH('Select LAs'!$P7,'EY Data'!$B:$B, 0))=\"\",\"-\",ROUND(INDEX('EY Data'!AZ:AZ, MATCH('Select LAs'!$P7,'EY Data'!$B:$B, 0)),0)))","v":0},{"$f":"IF('Select LAs'!$P7=0,\"-\",IF(INDEX('EY Data'!AY:AY, MATCH('Select LAs'!$P7,'EY Data'!$B:$B, 0))=\"\",\"-\",ROUND(INDEX('EY Data'!AY:AY, MATCH('Select LAs'!$P7,'EY Data'!$B:$B, 0)),0)))","v":0}]
["",{"$f":"'Select LAs'!O8","v":"No LA selected"},null,{"$f":"IF('Select LAs'!$P8=0,\"-\",IF(INDEX('EY Data'!AL:AL, MATCH('Select LAs'!$P8,'EY Data'!$B:$B, 0))=\"\",\"-\", ROUND(INDEX('EY Data'!AL:AL, MATCH('Select LAs'!$P8,'EY Data'!$B:$B, 0)),5)))","v":5.34},{"$f":"IF('Select LAs'!$P8=0,\"-\",IF(INDEX('EY Data'!AO:AO, MATCH('Select LAs'!$P8,'EY Data'!$B:$B, 0))=\"\",\"-\", ROUND(INDEX('EY Data'!AO:AO, MATCH('Select LAs'!$P8,'EY Data'!$B:$B, 0)),5)))","v":5.34},{"$f":"IF('Select LAs'!$P8=0,\"-\",IF(INDEX('EY Data'!AN:AN, MATCH('Select LAs'!$P8,'EY Data'!$B:$B, 0))=\"\",\"-\", ROUND(INDEX('EY Data'!AN:AN, MATCH('Select LAs'!$P8,'EY Data'!$B:$B, 0)),5)))","v":0},{"$f":"IF('Select LAs'!$P8=0,\"-\",IF(INDEX('EY Data'!AM:AM, MATCH('Select LAs'!$P8,'EY Data'!$B:$B, 0))=\"\",\"-\", ROUND(INDEX('EY Data'!AM:AM, MATCH('Select LAs'!$P8,'EY Data'!$B:$B, 0)),5)))","v":0},{"$f":"IF('Select LAs'!$P8=0,\"-\",IF(INDEX('EY Data'!AX:AX, MATCH('Select LAs'!$P8,'EY Data'!$B:$B, 0))=\"\",\"-\",ROUND(INDEX('EY Data'!AX:AX, MATCH('Select LAs'!$P8,'EY Data'!$B:$B, 0)),0)))","v":0},{"$f":"IF('Select LAs'!$P8=0,\"-\",IF(INDEX('EY Data'!BA:BA, MATCH('Select LAs'!$P8,'EY Data'!$B:$B, 0))=\"\",\"-\",ROUND(INDEX('EY Data'!BA:BA, MATCH('Select LAs'!$P8,'EY Data'!$B:$B, 0)),0)))","v":0},{"$f":"IF('Select LAs'!$P8=0,\"-\",IF(INDEX('EY Data'!AZ:AZ, MATCH('Select LAs'!$P8,'EY Data'!$B:$B, 0))=\"\",\"-\",ROUND(INDEX('EY Data'!AZ:AZ, MATCH('Select LAs'!$P8,'EY Data'!$B:$B, 0)),0)))","v":0},{"$f":"IF('Select LAs'!$P8=0,\"-\",IF(INDEX('EY Data'!AY:AY, MATCH('Select LAs'!$P8,'EY Data'!$B:$B, 0))=\"\",\"-\",ROUND(INDEX('EY Data'!AY:AY, MATCH('Select LAs'!$P8,'EY Data'!$B:$B, 0)),0)))","v":0}]
["",{"$f":"'Select LAs'!O9","v":"No LA selected"},null,{"$f":"IF('Select LAs'!$P9=0,\"-\",IF(INDEX('EY Data'!AL:AL, MATCH('Select LAs'!$P9,'EY Data'!$B:$B, 0))=\"\",\"-\", ROUND(INDEX('EY Data'!AL:AL, MATCH('Select LAs'!$P9,'EY Data'!$B:$B, 0)),5)))","v":5.94},{"$f":"IF('Select LAs'!$P9=0,\"-\",IF(INDEX('EY Data'!AO:AO, MATCH('Select LAs'!$P9,'EY Data'!$B:$B, 0))=\"\",\"-\", ROUND(INDEX('EY Data'!AO:AO, MATCH('Select LAs'!$P9,'EY Data'!$B:$B, 0)),5)))","v":5.94},{"$f":"IF('Select LAs'!$P9=0,\"-\",IF(INDEX('EY Data'!AN:AN, MATCH('Select LAs'!$P9,'EY Data'!$B:$B, 0))=\"\",\"-\", ROUND(INDEX('EY Data'!AN:AN, MATCH('Select LAs'!$P9,'EY Data'!$B:$B, 0)),5)))","v":0},{"$f":"IF('Select LAs'!$P9=0,\"-\",IF(INDEX('EY Data'!AM:AM, MATCH('Select LAs'!$P9,'EY Data'!$B:$B, 0))=\"\",\"-\", ROUND(INDEX('EY Data'!AM:AM, MATCH('Select LAs'!$P9,'EY Data'!$B:$B, 0)),5)))","v":0},{"$f":"IF('Select LAs'!$P9=0,\"-\",IF(INDEX('EY Data'!AX:AX, MATCH('Select LAs'!$P9,'EY Data'!$B:$B, 0))=\"\",\"-\",ROUND(INDEX('EY Data'!AX:AX, MATCH('Select LAs'!$P9,'EY Data'!$B:$B, 0)),0)))","v":13437},{"$f":"IF('Select LAs'!$P9=0,\"-\",IF(INDEX('EY Data'!BA:BA, MATCH('Select LAs'!$P9,'EY Data'!$B:$B, 0))=\"\",\"-\",ROUND(INDEX('EY Data'!BA:BA, MATCH('Select LAs'!$P9,'EY Data'!$B:$B, 0)),0)))","v":13437},{"$f":"IF('Select LAs'!$P9=0,\"-\",IF(INDEX('EY Data'!AZ:AZ, MATCH('Select LAs'!$P9,'EY Data'!$B:$B, 0))=\"\",\"-\",ROUND(INDEX('EY Data'!AZ:AZ, MATCH('Select LAs'!$P9,'EY Data'!$B:$B, 0)),0)))","v":0},{"$f":"IF('Select LAs'!$P9=0,\"-\",IF(INDEX('EY Data'!AY:AY, MATCH('Select LAs'!$P9,'EY Data'!$B:$B, 0))=\"\",\"-\",ROUND(INDEX('EY Data'!AY:AY, MATCH('Select LAs'!$P9,'EY Data'!$B:$B, 0)),0)))","v":0}]
["",{"$f":"'Select LAs'!O10","v":"No LA selected"},null,{"$f":"IF('Select LAs'!$P10=0,\"-\",IF(INDEX('EY Data'!AL:AL, MATCH('Select LAs'!$P10,'EY Data'!$B:$B, 0))=\"\",\"-\", ROUND(INDEX('EY Data'!AL:AL, MATCH('Select LAs'!$P10,'EY Data'!$B:$B, 0)),5)))","v":5.63},{"$f":"IF('Select LAs'!$P10=0,\"-\",IF(INDEX('EY Data'!AO:AO, MATCH('Select LAs'!$P10,'EY Data'!$B:$B, 0))=\"\",\"-\", ROUND(INDEX('EY Data'!AO:AO, MATCH('Select LAs'!$P10,'EY Data'!$B:$B, 0)),5)))","v":5.63},{"$f":"IF('Select LAs'!$P10=0,\"-\",IF(INDEX('EY Data'!AN:AN, MATCH('Select LAs'!$P10,'EY Data'!$B:$B, 0))=\"\",\"-\", ROUND(INDEX('EY Data'!AN:AN, MATCH('Select LAs'!$P10,'EY Data'!$B:$B, 0)),5)))","v":5.63},{"$f":"IF('Select LAs'!$P10=0,\"-\",IF(INDEX('EY Data'!AM:AM, MATCH('Select LAs'!$P10,'EY Data'!$B:$B, 0))=\"\",\"-\", ROUND(INDEX('EY Data'!AM:AM, MATCH('Select LAs'!$P10,'EY Data'!$B:$B, 0)),5)))","v":5.63},{"$f":"IF('Select LAs'!$P10=0,\"-\",IF(INDEX('EY Data'!AX:AX, MATCH('Select LAs'!$P10,'EY Data'!$B:$B, 0))=\"\",\"-\",ROUND(INDEX('EY Data'!AX:AX, MATCH('Select LAs'!$P10,'EY Data'!$B:$B, 0)),0)))","v":0},{"$f":"IF('Select LAs'!$P10=0,\"-\",IF(INDEX('EY Data'!BA:BA, MATCH('Select LAs'!$P10,'EY Data'!$B:$B, 0))=\"\",\"-\",ROUND(INDEX('EY Data'!BA:BA, MATCH('Select LAs'!$P10,'EY Data'!$B:$B, 0)),0)))","v":0},{"$f":"IF('Select LAs'!$P10=0,\"-\",IF(INDEX('EY Data'!AZ:AZ, MATCH('Select LAs'!$P10,'EY Data'!$B:$B, 0))=\"\",\"-\",ROUND(INDEX('EY Data'!AZ:AZ, MATCH('Select LAs'!$P10,'EY Data'!$B:$B, 0)),0)))","v":0},{"$f":"IF('Select LAs'!$P10=0,\"-\",IF(INDEX('EY Data'!AY:AY, MATCH('Select LAs'!$P10,'EY Data'!$B:$B, 0))=\"\",\"-\",ROUND(INDEX('EY Data'!AY:AY, MATCH('Select LAs'!$P10,'EY Data'!$B:$B, 0)),0)))","v":0}]
["",{"$f":"'Select LAs'!O11","v":"No LA selected"},null,{"$f":"IF('Select LAs'!$P11=0,\"-\",IF(INDEX('EY Data'!AL:AL, MATCH('Select LAs'!$P11,'EY Data'!$B:$B, 0))=\"\",\"-\", ROUND(INDEX('EY Data'!AL:AL, MATCH('Select LAs'!$P11,'EY Data'!$B:$B, 0)),5)))","v":5.54},{"$f":"IF('Select LAs'!$P11=0,\"-\",IF(INDEX('EY Data'!AO:AO, MATCH('Select LAs'!$P11,'EY Data'!$B:$B, 0))=\"\",\"-\", ROUND(INDEX('EY Data'!AO:AO, MATCH('Select LAs'!$P11,'EY Data'!$B:$B, 0)),5)))","v":5.54},{"$f":"IF('Select LAs'!$P11=0,\"-\",IF(INDEX('EY Data'!AN:AN, MATCH('Select LAs'!$P11,'EY Data'!$B:$B, 0))=\"\",\"-\", ROUND(INDEX('EY Data'!AN:AN, MATCH('Select LAs'!$P11,'EY Data'!$B:$B, 0)),5)))","v":5.54},{"$f":"IF('Select LAs'!$P11=0,\"-\",IF(INDEX('EY Data'!AM:AM, MATCH('Select LAs'!$P11,'EY Data'!$B:$B, 0))=\"\",\"-\", ROUND(INDEX('EY Data'!AM:AM, MATCH('Select LAs'!$P11,'EY Data'!$B:$B, 0)),5)))","v":5.54},{"$f":"IF('Select LAs'!$P11=0,\"-\",IF(INDEX('EY Data'!AX:AX, MATCH('Select LAs'!$P11,'EY Data'!$B:$B, 0))=\"\",\"-\",ROUND(INDEX('EY Data'!AX:AX, MATCH('Select LAs'!$P11,'EY Data'!$B:$B, 0)),0)))","v":0},{"$f":"IF('Select LAs'!$P11=0,\"-\",IF(INDEX('EY Data'!BA:BA, MATCH('Select LAs'!$P11,'EY Data'!$B:$B, 0))=\"\",\"-\",ROUND(INDEX('EY Data'!BA:BA, MATCH('Select LAs'!$P11,'EY Data'!$B:$B, 0)),0)))","v":0},{"$f":"IF('Select LAs'!$P11=0,\"-\",IF(INDEX('EY Data'!AZ:AZ, MATCH('Select LAs'!$P11,'EY Data'!$B:$B, 0))=\"\",\"-\",ROUND(INDEX('EY Data'!AZ:AZ, MATCH('Select LAs'!$P11,'EY Data'!$B:$B, 0)),0)))","v":0},{"$f":"IF('Select LAs'!$P11=0,\"-\",IF(INDEX('EY Data'!AY:AY, MATCH('Select LAs'!$P11,'EY Data'!$B:$B, 0))=\"\",\"-\",ROUND(INDEX('EY Data'!AY:AY, MATCH('Select LAs'!$P11,'EY Data'!$B:$B, 0)),0)))","v":0}]
["",{"$f":"'Select LAs'!O12","v":"No LA selected"},null,{"$f":"IF('Select LAs'!$P12=0,\"-\",IF(INDEX('EY Data'!AL:AL, MATCH('Select LAs'!$P12,'EY Data'!$B:$B, 0))=\"\",\"-\", ROUND(INDEX('EY Data'!AL:AL, MATCH('Select LAs'!$P12,'EY Data'!$B:$B, 0)),5)))","v":5.67},{"$f":"IF('Select LAs'!$P12=0,\"-\",IF(INDEX('EY Data'!AO:AO, MATCH('Select LAs'!$P12,'EY Data'!$B:$B, 0))=\"\",\"-\", ROUND(INDEX('EY Data'!AO:AO, MATCH('Select LAs'!$P12,'EY Data'!$B:$B, 0)),5)))","v":5.67},{"$f":"IF('Select LAs'!$P12=0,\"-\",IF(INDEX('EY Data'!AN:AN, MATCH('Select LAs'!$P12,'EY Data'!$B:$B, 0))=\"\",\"-\", ROUND(INDEX('EY Data'!AN:AN, MATCH('Select LAs'!$P12,'EY Data'!$B:$B, 0)),5)))","v":5.67},{"$f":"IF('Select LAs'!$P12=0,\"-\",IF(INDEX('EY Data'!AM:AM, MATCH('Select LAs'!$P12,'EY Data'!$B:$B, 0))=\"\",\"-\", ROUND(INDEX('EY Data'!AM:AM, MATCH('Select LAs'!$P12,'EY Data'!$B:$B, 0)),5)))","v":5.67},{"$f":"IF('Select LAs'!$P12=0,\"-\",IF(INDEX('EY Data'!AX:AX, MATCH('Select LAs'!$P12,'EY Data'!$B:$B, 0))=\"\",\"-\",ROUND(INDEX('EY Data'!AX:AX, MATCH('Select LAs'!$P12,'EY Data'!$B:$B, 0)),0)))","v":0},{"$f":"IF('Select LAs'!$P12=0,\"-\",IF(INDEX('EY Data'!BA:BA, MATCH('Select LAs'!$P12,'EY Data'!$B:$B, 0))=\"\",\"-\",ROUND(INDEX('EY Data'!BA:BA, MATCH('Select LAs'!$P12,'EY Data'!$B:$B, 0)),0)))","v":0},{"$f":"IF('Select LAs'!$P12=0,\"-\",IF(INDEX('EY Data'!AZ:AZ, MATCH('Select LAs'!$P12,'EY Data'!$B:$B, 0))=\"\",\"-\",ROUND(INDEX('EY Data'!AZ:AZ, MATCH('Select LAs'!$P12,'EY Data'!$B:$B, 0)),0)))","v":0},{"$f":"IF('Select LAs'!$P12=0,\"-\",IF(INDEX('EY Data'!AY:AY, MATCH('Select LAs'!$P12,'EY Data'!$B:$B, 0))=\"\",\"-\",ROUND(INDEX('EY Data'!AY:AY, MATCH('Select LAs'!$P12,'EY Data'!$B:$B, 0)),0)))","v":0}]
[null,{"$f":"'Select LAs'!O13","v":"No LA selected"},null,{"$f":"IF('Select LAs'!$P13=0,\"-\",IF(INDEX('EY Data'!AL:AL, MATCH('Select LAs'!$P13,'EY Data'!$B:$B, 0))=\"\",\"-\", ROUND(INDEX('EY Data'!AL:AL, MATCH('Select LAs'!$P13,'EY Data'!$B:$B, 0)),5)))","v":5.63},{"$f":"IF('Select LAs'!$P13=0,\"-\",IF(INDEX('EY Data'!AO:AO, MATCH('Select LAs'!$P13,'EY Data'!$B:$B, 0))=\"\",\"-\", ROUND(INDEX('EY Data'!AO:AO, MATCH('Select LAs'!$P13,'EY Data'!$B:$B, 0)),5)))","v":5.63},{"$f":"IF('Select LAs'!$P13=0,\"-\",IF(INDEX('EY Data'!AN:AN, MATCH('Select LAs'!$P13,'EY Data'!$B:$B, 0))=\"\",\"-\", ROUND(INDEX('EY Data'!AN:AN, MATCH('Select LAs'!$P13,'EY Data'!$B:$B, 0)),5)))","v":5.63},{"$f":"IF('Select LAs'!$P13=0,\"-\",IF(INDEX('EY Data'!AM:AM, MATCH('Select LAs'!$P13,'EY Data'!$B:$B, 0))=\"\",\"-\", ROUND(INDEX('EY Data'!AM:AM, MATCH('Select LAs'!$P13,'EY Data'!$B:$B, 0)),5)))","v":5.63},{"$f":"IF('Select LAs'!$P13=0,\"-\",IF(INDEX('EY Data'!AX:AX, MATCH('Select LAs'!$P13,'EY Data'!$B:$B, 0))=\"\",\"-\",ROUND(INDEX('EY Data'!AX:AX, MATCH('Select LAs'!$P13,'EY Data'!$B:$B, 0)),0)))","v":0},{"$f":"IF('Select LAs'!$P13=0,\"-\",IF(INDEX('EY Data'!BA:BA, MATCH('Select LAs'!$P13,'EY Data'!$B:$B, 0))=\"\",\"-\",ROUND(INDEX('EY Data'!BA:BA, MATCH('Select LAs'!$P13,'EY Data'!$B:$B, 0)),0)))","v":0},{"$f":"IF('Select LAs'!$P13=0,\"-\",IF(INDEX('EY Data'!AZ:AZ, MATCH('Select LAs'!$P13,'EY Data'!$B:$B, 0))=\"\",\"-\",ROUND(INDEX('EY Data'!AZ:AZ, MATCH('Select LAs'!$P13,'EY Data'!$B:$B, 0)),0)))","v":0},{"$f":"IF('Select LAs'!$P13=0,\"-\",IF(INDEX('EY Data'!AY:AY, MATCH('Select LAs'!$P13,'EY Data'!$B:$B, 0))=\"\",\"-\",ROUND(INDEX('EY Data'!AY:AY, MATCH('Select LAs'!$P13,'EY Data'!$B:$B, 0)),0)))","v":0}]
[null,"Selection Median",null,{"$f":"IF(COUNT(D$29:D$39)>0,MEDIAN(D$29:D$39),\"-\")","v":5.67},5.63,5.63,{"$f":"IF(COUNT(G$29:G$39)>0,MEDIAN(G$29:G$39),\"-\")","v":5.63},{"$f":"IF(COUNT(H$29:H$39)>0,MEDIAN(H$29:H$39),\"-\")","v":0},{"$f":"IF(COUNT(I$29:I$39)>0,MEDIAN(I$29:I$39),\"-\")","v":0},0,0]
[null,"Selection Minimum",null,{"$f":"IF(COUNT(D$29:D$39)>0,MIN(D$29:D$39),\"-\")","v":5.34},0,0,{"$f":"IF(COUNT(G$29:G$39)>0,MIN(G$29:G$39),\"-\")","v":0},{"$f":"IF(COUNT(H$29:H$39)>0,MIN(H$29:H$39),\"-\")","v":0},{"$f":"IF(COUNT(I$29:I$39)>0,MIN(I$29:I$39),\"-\")","v":0},0,0]
[null,"Selection Maximum",null,{"$f":"IF(COUNT(D$29:D$39)>0,MAX(D$29:D$39),\"-\")","v":6.11},6.11,6.11,{"$f":"IF(COUNT(G$29:G$39)>0,MAX(G$29:G$39),\"-\")","v":6.11},{"$f":"IF(COUNT(H$29:H$39)>0,MAX(H$29:H$39),\"-\")","v":13437},{"$f":"IF(COUNT(I$29:I$39)>0,MAX(I$29:I$39),\"-\")","v":13437},837,419]

{"sheet":"Non-EYSFF spend","index":3,"n_rows":32,"n_cols":11,"rows_kept":32,"cut":false,"hidden":true,"merged":[[13,1,13,2],[30,1,30,10],[31,2,31,10],[9,3,9,4],[12,3,12,6],[12,7,12,10]]}
[]
[null,{"$f":"'Select LAs'!B3","v":"No LA selected"},null,null,null,null,null,null,null,null,{"$f":"'3-4 year olds '!M2","v":"Financial Year 2023-2024"}]
[]
[null,null,null,"PVIs","Nursery Schools","Primary Nursery Places"]
[]
[null,{"$f":"CONCATENATE(\"Benchmarking against \",IF(_SN=1,\"Statistical Neighbours\",\"Manual Selection\"))","v":"Benchmarking against Manual Selection"}]
[]
[]
[]
[null,null,"Order"]
[]
[]
[null,null,null,"3-4 year olds",null,null,null,"2 year olds"]
[null,"Local Authority",null,"Total delegated EYSFF budget 1","SEN Inclusion Fund (top-up grant element) budget","Contingency funding","Central spend","Total delegated EYSFF budget","SEN Inclusion Fund (top-up grant element) budget","Contingency funding","Central spend"]
[null,"England",null,{"$f":"ROUND(INDEX('EY Data'!X:X, MATCH($B15,'EY Data'!$C:$C, 0)), 0)","v":3197412163},{"$f":"ROUND(INDEX('EY Data'!Z:Z, MATCH($B15,'EY Data'!$C:$C, 0)), 0)","v":84373161},{"$f":"ROUND(INDEX('EY Data'!AE:AE, MATCH($B15,'EY Data'!$C:$C, 0)), 0)","v":25774716},{"$f":"ROUND(INDEX('EY Data'!AF:AF, MATCH($B15,'EY Data'!$C:$C, 0)), 0)","v":128309011},{"$f":"ROUND(INDEX('EY Data'!AV:AV, MATCH($B15,'EY Data'!$C:$C, 0)), 0)","v":438722774},{"$f":"ROUND(INDEX('EY Data'!AX:AX, MATCH($B15,'EY Data'!$C:$C, 0)), 0)","v":3943079},{"$f":"ROUND(INDEX('EY Data'!BC:BC, MATCH($B15,'EY Data'!$C:$C, 0)), 0)","v":2277500},{"$f":"ROUND(INDEX('EY Data'!BD:BD, MATCH($B15,'EY Data'!$C:$C, 0)), 0)","v":7587029}]
[null,{"$f":"'Select LAs'!K3","v":"No LA selected"},null,{"$f":"IF('Select LAs'!$L3=0,\"-\",IF(INDEX('EY Data'!X:X, MATCH('Select LAs'!$L3,'EY Data'!$B:$B, 0))=\"\",\"-\",ROUND(INDEX('EY Data'!X:X, MATCH('Select LAs'!$L3,'EY Data'!$B:$B, 0)),0)))","v":32133393},{"$f":"IF('Select LAs'!$L3=0,\"-\",IF(INDEX('EY Data'!Z:Z, MATCH('Select LAs'!$L3,'EY Data'!$B:$B, 0))=\"\",\"-\",ROUND(INDEX('EY Data'!Z:Z, MATCH('Select LAs'!$L3,'EY Data'!$B:$B, 0)),0)))","v":489063},{"$f":"IF('Select LAs'!$L3=0,\"-\",IF(INDEX('EY Data'!AE:AE, MATCH('Select LAs'!$L3,'EY Data'!$B:$B, 0))=\"\",\"-\",ROUND(INDEX('EY Data'!AE:AE, MATCH('Select LAs'!$L3,'EY Data'!$B:$B, 0)),0)))","v":97097},{"$f":"IF('Select LAs'!$L3=0,\"-\",IF(INDEX('EY Data'!AF:AF, MATCH('Select LAs'!$L3,'EY Data'!$B:$B, 0))=\"\",\"-\",ROUND(INDEX('EY Data'!AF:AF, MATCH('Select LAs'!$L3,'EY Data'!$B:$B, 0)),0)))","v":783734},{"$f":"IF('Select LAs'!$L3=0,\"-\",IF(INDEX('EY Data'!AV:AV, MATCH('Select LAs'!$L3,'EY Data'!$B:$B, 0))=\"\",\"-\",ROUND(INDEX('EY Data'!AV:AV, MATCH('Select LAs'!$L3,'EY Data'!$B:$B, 0)),0)))","v":7201243},{"$f":"IF('Select LAs'!$L3=0,\"-\",IF(INDEX('EY Data'!AX:AX, MATCH('Select LAs'!$L3,'EY Data'!$B:$B, 0))=\"\",\"-\",ROUND(INDEX('EY Data'!AX:AX, MATCH('Select LAs'!$L3,'EY Data'!$B:$B, 0)),0)))","v":0},{"$f":"IF('Select LAs'!$L3=0,\"-\",IF(INDEX('EY Data'!BC:BC, MATCH('Select LAs'!$L3,'EY Data'!$B:$B, 0))=\"\",\"-\",ROUND(INDEX('EY Data'!BC:BC, MATCH('Select LAs'!$L3,'EY Data'!$B:$B, 0)),0)))","v":0},{"$f":"IF('Select LAs'!$L3=0,\"-\",IF(INDEX('EY Data'!BD:BD, MATCH('Select LAs'!$L3,'EY Data'!$B:$B, 0))=\"\",\"-\",ROUND(INDEX('EY Data'!BD:BD, MATCH('Select LAs'!$L3,'EY Data'!$B:$B, 0)),0)))","v":100841}]
[null,{"$f":"'Select LAs'!K4","v":"No LA selected"},null,{"$f":"IF('Select LAs'!$L4=0,\"-\",IF(INDEX('EY Data'!X:X, MATCH('Select LAs'!$L4,'EY Data'!$B:$B, 0))=\"\",\"-\",ROUND(INDEX('EY Data'!X:X, MATCH('Select LAs'!$L4,'EY Data'!$B:$B, 0)),0)))","v":17136697},{"$f":"IF('Select LAs'!$L4=0,\"-\",IF(INDEX('EY Data'!Z:Z, MATCH('Select LAs'!$L4,'EY Data'!$B:$B, 0))=\"\",\"-\",ROUND(INDEX('EY Data'!Z:Z, MATCH('Select LAs'!$L4,'EY Data'!$B:$B, 0)),0)))","v":283000},{"$f":"IF('Select LAs'!$L4=0,\"-\",IF(INDEX('EY Data'!AE:AE, MATCH('Select LAs'!$L4,'EY Data'!$B:$B, 0))=\"\",\"-\",ROUND(INDEX('EY Data'!AE:AE, MATCH('Select LAs'!$L4,'EY Data'!$B:$B, 0)),0)))","v":0},{"$f":"IF('Select LAs'!$L4=0,\"-\",IF(INDEX('EY Data'!AF:AF, MATCH('Select LAs'!$L4,'EY Data'!$B:$B, 0))=\"\",\"-\",ROUND(INDEX('EY Data'!AF:AF, MATCH('Select LAs'!$L4,'EY Data'!$B:$B, 0)),0)))","v":960000},{"$f":"IF('Select LAs'!$L4=0,\"-\",IF(INDEX('EY Data'!AV:AV, MATCH('Select LAs'!$L4,'EY Data'!$B:$B, 0))=\"\",\"-\",ROUND(INDEX('EY Data'!AV:AV, MATCH('Select LAs'!$L4,'EY Data'!$B:$B, 0)),0)))","v":3060330},{"$f":"IF('Select LAs'!$L4=0,\"-\",IF(INDEX('EY Data'!AX:AX, MATCH('Select LAs'!$L4,'EY Data'!$B:$B, 0))=\"\",\"-\",ROUND(INDEX('EY Data'!AX:AX, MATCH('Select LAs'!$L4,'EY Data'!$B:$B, 0)),0)))","v":10000},{"$f":"IF('Select LAs'!$L4=0,\"-\",IF(INDEX('EY Data'!BC:BC, MATCH('Select LAs'!$L4,'EY Data'!$B:$B, 0))=\"\",\"-\",ROUND(INDEX('EY Data'!BC:BC, MATCH('Select LAs'!$L4,'EY Data'!$B:$B, 0)),0)))","v":0},{"$f":"IF('Select LAs'!$L4=0,\"-\",IF(INDEX('EY Data'!BD:BD, MATCH('Select LAs'!$L4,'EY Data'!$B:$B, 0))=\"\",\"-\",ROUND(INDEX('EY Data'!BD:BD, MATCH('Select LAs'!$L4,'EY Data'!$B:$B, 0)),0)))","v":65000}]
["",{"$f":"'Select LAs'!K5","v":"No LA selected"},null,{"$f":"IF('Select LAs'!$L5=0,\"-\",IF(INDEX('EY Data'!X:X, MATCH('Select LAs'!$L5,'EY Data'!$B:$B, 0))=\"\",\"-\",ROUND(INDEX('EY Data'!X:X, MATCH('Select LAs'!$L5,'EY Data'!$B:$B, 0)),0)))","v":31066275},{"$f":"IF('Select LAs'!$L5=0,\"-\",IF(INDEX('EY Data'!Z:Z, MATCH('Select LAs'!$L5,'EY Data'!$B:$B, 0))=\"\",\"-\",ROUND(INDEX('EY Data'!Z:Z, MATCH('Select LAs'!$L5,'EY Data'!$B:$B, 0)),0)))","v":1828597},{"$f":"IF('Select LAs'!$L5=0,\"-\",IF(INDEX('EY Data'!AE:AE, MATCH('Select LAs'!$L5,'EY Data'!$B:$B, 0))=\"\",\"-\",ROUND(INDEX('EY Data'!AE:AE, MATCH('Select LAs'!$L5,'EY Data'!$B:$B, 0)),0)))","v":0},{"$f":"IF('Select LAs'!$L5=0,\"-\",IF(INDEX('EY Data'!AF:AF, MATCH('Select LAs'!$L5,'EY Data'!$B:$B, 0))=\"\",\"-\",ROUND(INDEX('EY Data'!AF:AF, MATCH('Select LAs'!$L5,'EY Data'!$B:$B, 0)),0)))","v":1502000},{"$f":"IF('Select LAs'!$L5=0,\"-\",IF(INDEX('EY Data'!AV:AV, MATCH('Select LAs'!$L5,'EY Data'!$B:$B, 0))=\"\",\"-\",ROUND(INDEX('EY Data'!AV:AV, MATCH('Select LAs'!$L5,'EY Data'!$B:$B, 0)),0)))","v":3577254},{"$f":"IF('Select LAs'!$L5=0,\"-\",IF(INDEX('EY Data'!AX:AX, MATCH('Select LAs'!$L5,'EY Data'!$B:$B, 0))=\"\",\"-\",ROUND(INDEX('EY Data'!AX:AX, MATCH('Select LAs'!$L5,'EY Data'!$B:$B, 0)),0)))","v":0},{"$f":"IF('Select LAs'!$L5=0,\"-\",IF(INDEX('EY Data'!BC:BC, MATCH('Select LAs'!$L5,'EY Data'!$B:$B, 0))=\"\",\"-\",ROUND(INDEX('EY Data'!BC:BC, MATCH('Select LAs'!$L5,'EY Data'!$B:$B, 0)),0)))","v":0},{"$f":"IF('Select LAs'!$L5=0,\"-\",IF(INDEX('EY Data'!BD:BD, MATCH('Select LAs'!$L5,'EY Data'!$B:$B, 0))=\"\",\"-\",ROUND(INDEX('EY Data'!BD:BD, MATCH('Select LAs'!$L5,'EY Data'!$B:$B, 0)),0)))","v":18314}]
["",{"$f":"'Select LAs'!K6","v":"No LA selected"},null,{"$f":"IF('Select LAs'!$L6=0,\"-\",IF(INDEX('EY Data'!X:X, MATCH('Select LAs'!$L6,'EY Data'!$B:$B, 0))=\"\",\"-\",ROUND(INDEX('EY Data'!X:X, MATCH('Select LAs'!$L6,'EY Data'!$B:$B, 0)),0)))","v":14284598},{"$f":"IF('Select LAs'!$L6=0,\"-\",IF(INDEX('EY Data'!Z:Z, MATCH('Select LAs'!$L6,'EY Data'!$B:$B, 0))=\"\",\"-\",ROUND(INDEX('EY Data'!Z:Z, MATCH('Select LAs'!$L6,'EY Data'!$B:$B, 0)),0)))","v":141200},{"$f":"IF('Select LAs'!$L6=0,\"-\",IF(INDEX('EY Data'!AE:AE, MATCH('Select LAs'!$L6,'EY Data'!$B:$B, 0))=\"\",\"-\",ROUND(INDEX('EY Data'!AE:AE, MATCH('Select LAs'!$L6,'EY Data'!$B:$B, 0)),0)))","v":234000},{"$f":"IF('Select LAs'!$L6=0,\"-\",IF(INDEX('EY Data'!AF:AF, MATCH('Select LAs'!$L6,'EY Data'!$B:$B, 0))=\"\",\"-\",ROUND(INDEX('EY Data'!AF:AF, MATCH('Select LAs'!$L6,'EY Data'!$B:$B, 0)),0)))","v":761300},{"$f":"IF('Select LAs'!$L6=0,\"-\",IF(INDEX('EY Data'!AV:AV, MATCH('Select LAs'!$L6,'EY Data'!$B:$B, 0))=\"\",\"-\",ROUND(INDEX('EY Data'!AV:AV, MATCH('Select LAs'!$L6,'EY Data'!$B:$B, 0)),0)))","v":2146327},{"$f":"IF('Select LAs'!$L6=0,\"-\",IF(INDEX('EY Data'!AX:AX, MATCH('Select LAs'!$L6,'EY Data'!$B:$B, 0))=\"\",\"-\",ROUND(INDEX('EY Data'!AX:AX, MATCH('Select LAs'!$L6,'EY Data'!$B:$B, 0)),0)))","v":0},{"$f":"IF('Select LAs'!$L6=0,\"-\",IF(INDEX('EY Data'!BC:BC, MATCH('Select LAs'!$L6,'EY Data'!$B:$B, 0))=\"\",\"-\",ROUND(INDEX('EY Data'!BC:BC, MATCH('Select LAs'!$L6,'EY Data'!$B:$B, 0)),0)))","v":40000},{"$f":"IF('Select LAs'!$L6=0,\"-\",IF(INDEX('EY Data'!BD:BD, MATCH('Select LAs'!$L6,'EY Data'!$B:$B, 0))=\"\",\"-\",ROUND(INDEX('EY Data'!BD:BD, MATCH('Select LAs'!$L6,'EY Data'!$B:$B, 0)),0)))","v":0}]
["",{"$f":"'Select LAs'!K7","v":"No LA selected"},null,{"$f":"IF('Select LAs'!$L7=0,\"-\",IF(INDEX('EY Data'!X:X, MATCH('Select LAs'!$L7,'EY Data'!$B:$B, 0))=\"\",\"-\",ROUND(INDEX('EY Data'!X:X, MATCH('Select LAs'!$L7,'EY Data'!$B:$B, 0)),0)))","v":71897058},{"$f":"IF('Select LAs'!$L7=0,\"-\",IF(INDEX('EY Data'!Z:Z, MATCH('Select LAs'!$L7,'EY Data'!$B:$B, 0))=\"\",\"-\",ROUND(INDEX('EY Data'!Z:Z, MATCH('Select LAs'!$L7,'EY Data'!$B:$B, 0)),0)))","v":1250000},{"$f":"IF('Select LAs'!$L7=0,\"-\",IF(INDEX('EY Data'!AE:AE, MATCH('Select LAs'!$L7,'EY Data'!$B:$B, 0))=\"\",\"-\",ROUND(INDEX('EY Data'!AE:AE, MATCH('Select LAs'!$L7,'EY Data'!$B:$B, 0)),0)))","v":0},{"$f":"IF('Select LAs'!$L7=0,\"-\",IF(INDEX('EY Data'!AF:AF, MATCH('Select LAs'!$L7,'EY Data'!$B:$B, 0))=\"\",\"-\",ROUND(INDEX('EY Data'!AF:AF, MATCH('Select LAs'!$L7,'EY Data'!$B:$B, 0)),0)))","v":3400000},{"$f":"IF('Select LAs'!$L7=0,\"-\",IF(INDEX('EY Data'!AV:AV, MATCH('Select LAs'!$L7,'EY Data'!$B:$B, 0))=\"\",\"-\",ROUND(INDEX('EY Data'!AV:AV, MATCH('Select LAs'!$L7,'EY Data'!$B:$B, 0)),0)))","v":13853835},{"$f":"IF('Select LAs'!$L7=0,\"-\",IF(INDEX('EY Data'!AX:AX, MATCH('Select LAs'!$L7,'EY Data'!$B:$B, 0))=\"\",\"-\",ROUND(INDEX('EY Data'!AX:AX, MATCH('Select LAs'!$L7,'EY Data'!$B:$B, 0)),0)))","v":0},{"$f":"IF('Select LAs'!$L7=0,\"-\",IF(INDEX('EY Data'!BC:BC, MATCH('Select LAs'!$L7,'EY Data'!$B:$B, 0))=\"\",\"-\",ROUND(INDEX('EY Data'!BC:BC, MATCH('Select LAs'!$L7,'EY Data'!$B:$B, 0)),0)))","v":0},{"$f":"IF('Select LAs'!$L7=0,\"-\",IF(INDEX('EY Data'!BD:BD, MATCH('Select LAs'!$L7,'EY Data'!$B:$B, 0))=\"\",\"-\",ROUND(INDEX('EY Data'!BD:BD, MATCH('Select LAs'!$L7,'EY Data'!$B:$B, 0)),0)))","v":0}]
["",{"$f":"'Select LAs'!K8","v":"No LA selected"},null,{"$f":"IF('Select LAs'!$L8=0,\"-\",IF(INDEX('EY Data'!X:X, MATCH('Select LAs'!$L8,'EY Data'!$B:$B, 0))=\"\",\"-\",ROUND(INDEX('EY Data'!X:X, MATCH('Select LAs'!$L8,'EY Data'!$B:$B, 0)),0)))","v":17298685},{"$f":"IF('Select LAs'!$L8=0,\"-\",IF(INDEX('EY Data'!Z:Z, MATCH('Select LAs'!$L8,'EY Data'!$B:$B, 0))=\"\",\"-\",ROUND(INDEX('EY Data'!Z:Z, MATCH('Select LAs'!$L8,'EY Data'!$B:$B, 0)),0)))","v":500000},{"$f":"IF('Select LAs'!$L8=0,\"-\",IF(INDEX('EY Data'!AE:AE, MATCH('Select LAs'!$L8,'EY Data'!$B:$B, 0))=\"\",\"-\",ROUND(INDEX('EY Data'!AE:AE, MATCH('Select LAs'!$L8,'EY Data'!$B:$B, 0)),0)))","v":400000},{"$f":"IF('Select LAs'!$L8=0,\"-\",IF(INDEX('EY Data'!AF:AF, MATCH('Select LAs'!$L8,'EY Data'!$B:$B, 0))=\"\",\"-\",ROUND(INDEX('EY Data'!AF:AF, MATCH('Select LAs'!$L8,'EY Data'!$B:$B, 0)),0)))","v":958489},{"$f":"IF('Select LAs'!$L8=0,\"-\",IF(INDEX('EY Data'!AV:AV, MATCH('Select LAs'!$L8,'EY Data'!$B:$B, 0))=\"\",\"-\",ROUND(INDEX('EY Data'!AV:AV, MATCH('Select LAs'!$L8,'EY Data'!$B:$B, 0)),0)))","v":3483634},{"$f":"IF('Select LAs'!$L8=0,\"-\",IF(INDEX('EY Data'!AX:AX, MATCH('Select LAs'!$L8,'EY Data'!$B:$B, 0))=\"\",\"-\",ROUND(INDEX('EY Data'!AX:AX, MATCH('Select LAs'!$L8,'EY Data'!$B:$B, 0)),0)))","v":0},{"$f":"IF('Select LAs'!$L8=0,\"-\",IF(INDEX('EY Data'!BC:BC, MATCH('Select LAs'!$L8,'EY Data'!$B:$B, 0))=\"\",\"-\",ROUND(INDEX('EY Data'!BC:BC, MATCH('Select LAs'!$L8,'EY Data'!$B:$B, 0)),0)))","v":0},{"$f":"IF('Select LAs'!$L8=0,\"-\",IF(INDEX('EY Data'!BD:BD, MATCH('Select LAs'!$L8,'EY Data'!$B:$B, 0))=\"\",\"-\",ROUND(INDEX('EY Data'!BD:BD, MATCH('Select LAs'!$L8,'EY Data'!$B:$B, 0)),0)))","v":255822}]
["",{"$f":"'Select LAs'!K9","v":"No LA selected"},null,{"$f":"IF('Select LAs'!$L9=0,\"-\",IF(INDEX('EY Data'!X:X, MATCH('Select LAs'!$L9,'EY Data'!$B:$B, 0))=\"\",\"-\",ROUND(INDEX('EY Data'!X:X, MATCH('Select LAs'!$L9,'EY Data'!$B:$B, 0)),0)))","v":11546304},{"$f":"IF('Select LAs'!$L9=0,\"-\",IF(INDEX('EY Data'!Z:Z, MATCH('Select LAs'!$L9,'EY Data'!$B:$B, 0))=\"\",\"-\",ROUND(INDEX('EY Data'!Z:Z, MATCH('Select LAs'!$L9,'EY Data'!$B:$B, 0)),0)))","v":93872},{"$f":"IF('Select LAs'!$L9=0,\"-\",IF(INDEX('EY Data'!AE:AE, MATCH('Select LAs'!$L9,'EY Data'!$B:$B, 0))=\"\",\"-\",ROUND(INDEX('EY Data'!AE:AE, MATCH('Select LAs'!$L9,'EY Data'!$B:$B, 0)),0)))","v":140800},{"$f":"IF('Select LAs'!$L9=0,\"-\",IF(INDEX('EY Data'!AF:AF, MATCH('Select LAs'!$L9,'EY Data'!$B:$B, 0))=\"\",\"-\",ROUND(INDEX('EY Data'!AF:AF, MATCH('Select LAs'!$L9,'EY Data'!$B:$B, 0)),0)))","v":610200},{"$f":"IF('Select LAs'!$L9=0,\"-\",IF(INDEX('EY Data'!AV:AV, MATCH('Select LAs'!$L9,'EY Data'!$B:$B, 0))=\"\",\"-\",ROUND(INDEX('EY Data'!AV:AV, MATCH('Select LAs'!$L9,'EY Data'!$B:$B, 0)),0)))","v":1981917},{"$f":"IF('Select LAs'!$L9=0,\"-\",IF(INDEX('EY Data'!AX:AX, MATCH('Select LAs'!$L9,'EY Data'!$B:$B, 0))=\"\",\"-\",ROUND(INDEX('EY Data'!AX:AX, MATCH('Select LAs'!$L9,'EY Data'!$B:$B, 0)),0)))","v":13437},{"$f":"IF('Select LAs'!$L9=0,\"-\",IF(INDEX('EY Data'!BC:BC, MATCH('Select LAs'!$L9,'EY Data'!$B:$B, 0))=\"\",\"-\",ROUND(INDEX('EY Data'!BC:BC, MATCH('Select LAs'!$L9,'EY Data'!$B:$B, 0)),0)))","v":43700},{"$f":"IF('Select LAs'!$L9=0,\"-\",IF(INDEX('EY Data'!BD:BD, MATCH('Select LAs'!$L9,'EY Data'!$B:$B, 0))=\"\",\"-\",ROUND(INDEX('EY Data'!BD:BD, MATCH('Select LAs'!$L9,'EY Data'!$B:$B, 0)),0)))","v":104100}]
["",{"$f":"'Select LAs'!K10","v":"No LA selected"},null,{"$f":"IF('Select LAs'!$L10=0,\"-\",IF(INDEX('EY Data'!X:X, MATCH('Select LAs'!$L10,'EY Data'!$B:$B, 0))=\"\",\"-\",ROUND(INDEX('EY Data'!X:X, MATCH('Select LAs'!$L10,'EY Data'!$B:$B, 0)),0)))","v":29215048},{"$f":"IF('Select LAs'!$L10=0,\"-\",IF(INDEX('EY Data'!Z:Z, MATCH('Select LAs'!$L10,'EY Data'!$B:$B, 0))=\"\",\"-\",ROUND(INDEX('EY Data'!Z:Z, MATCH('Select LAs'!$L10,'EY Data'!$B:$B, 0)),0)))","v":630000},{"$f":"IF('Select LAs'!$L10=0,\"-\",IF(INDEX('EY Data'!AE:AE, MATCH('Select LAs'!$L10,'EY Data'!$B:$B, 0))=\"\",\"-\",ROUND(INDEX('EY Data'!AE:AE, MATCH('Select LAs'!$L10,'EY Data'!$B:$B, 0)),0)))","v":0},{"$f":"IF('Select LAs'!$L10=0,\"-\",IF(INDEX('EY Data'!AF:AF, MATCH('Select LAs'!$L10,'EY Data'!$B:$B, 0))=\"\",\"-\",ROUND(INDEX('EY Data'!AF:AF, MATCH('Select LAs'!$L10,'EY Data'!$B:$B, 0)),0)))","v":1555824},{"$f":"IF('Select LAs'!$L10=0,\"-\",IF(INDEX('EY Data'!AV:AV, MATCH('Select LAs'!$L10,'EY Data'!$B:$B, 0))=\"\",\"-\",ROUND(INDEX('EY Data'!AV:AV, MATCH('Select LAs'!$L10,'EY Data'!$B:$B, 0)),0)))","v":5392989},{"$f":"IF('Select LAs'!$L10=0,\"-\",IF(INDEX('EY Data'!AX:AX, MATCH('Select LAs'!$L10,'EY Data'!$B:$B, 0))=\"\",\"-\",ROUND(INDEX('EY Data'!AX:AX, MATCH('Select LAs'!$L10,'EY Data'!$B:$B, 0)),0)))","v":0},{"$f":"IF('Select LAs'!$L10=0,\"-\",IF(INDEX('EY Data'!BC:BC, MATCH('Select LAs'!$L10,'EY Data'!$B:$B, 0))=\"\",\"-\",ROUND(INDEX('EY Data'!BC:BC, MATCH('Select LAs'!$L10,'EY Data'!$B:$B, 0)),0)))","v":0},{"$f":"IF('Select LAs'!$L10=0,\"-\",IF(INDEX('EY Data'!BD:BD, MATCH('Select LAs'!$L10,'EY Data'!$B:$B, 0))=\"\",\"-\",ROUND(INDEX('EY Data'!BD:BD, MATCH('Select LAs'!$L10,'EY Data'!$B:$B, 0)),0)))","v":0}]
["",{"$f":"'Select LAs'!K11","v":"No LA selected"},null,{"$f":"IF('Select LAs'!$L11=0,\"-\",IF(INDEX('EY Data'!X:X, MATCH('Select LAs'!$L11,'EY Data'!$B:$B, 0))=\"\",\"-\",ROUND(INDEX('EY Data'!X:X, MATCH('Select LAs'!$L11,'EY Data'!$B:$B, 0)),0)))","v":28817070},{"$f":"IF('Select LAs'!$L11=0,\"-\",IF(INDEX('EY Data'!Z:Z, MATCH('Select LAs'!$L11,'EY Data'!$B:$B, 0))=\"\",\"-\",ROUND(INDEX('EY Data'!Z:Z, MATCH('Select LAs'!$L11,'EY Data'!$B:$B, 0)),0)))","v":820000},{"$f":"IF('Select LAs'!$L11=0,\"-\",IF(INDEX('EY Data'!AE:AE, MATCH('Select LAs'!$L11,'EY Data'!$B:$B, 0))=\"\",\"-\",ROUND(INDEX('EY Data'!AE:AE, MATCH('Select LAs'!$L11,'EY Data'!$B:$B, 0)),0)))","v":3030661},{"$f":"IF('Select LAs'!$L11=0,\"-\",IF(INDEX('EY Data'!AF:AF, MATCH('Select LAs'!$L11,'EY Data'!$B:$B, 0))=\"\",\"-\",ROUND(INDEX('EY Data'!AF:AF, MATCH('Select LAs'!$L11,'EY Data'!$B:$B, 0)),0)))","v":1492383},{"$f":"IF('Select LAs'!$L11=0,\"-\",IF(INDEX('EY Data'!AV:AV, MATCH('Select LAs'!$L11,'EY Data'!$B:$B, 0))=\"\",\"-\",ROUND(INDEX('EY Data'!AV:AV, MATCH('Select LAs'!$L11,'EY Data'!$B:$B, 0)),0)))","v":5361529},{"$f":"IF('Select LAs'!$L11=0,\"-\",IF(INDEX('EY Data'!AX:AX, MATCH('Select LAs'!$L11,'EY Data'!$B:$B, 0))=\"\",\"-\",ROUND(INDEX('EY Data'!AX:AX, MATCH('Select LAs'!$L11,'EY Data'!$B:$B, 0)),0)))","v":0},{"$f":"IF('Select LAs'!$L11=0,\"-\",IF(INDEX('EY Data'!BC:BC, MATCH('Select LAs'!$L11,'EY Data'!$B:$B, 0))=\"\",\"-\",ROUND(INDEX('EY Data'!BC:BC, MATCH('Select LAs'!$L11,'EY Data'!$B:$B, 0)),0)))","v":457808},{"$f":"IF('Select LAs'!$L11=0,\"-\",IF(INDEX('EY Data'!BD:BD, MATCH('Select LAs'!$L11,'EY Data'!$B:$B, 0))=\"\",\"-\",ROUND(INDEX('EY Data'!BD:BD, MATCH('Select LAs'!$L11,'EY Data'!$B:$B, 0)),0)))","v":119490}]
["",{"$f":"'Select LAs'!K12","v":"No LA selected"},null,{"$f":"IF('Select LAs'!$L12=0,\"-\",IF(INDEX('EY Data'!X:X, MATCH('Select LAs'!$L12,'EY Data'!$B:$B, 0))=\"\",\"-\",ROUND(INDEX('EY Data'!X:X, MATCH('Select LAs'!$L12,'EY Data'!$B:$B, 0)),0)))","v":16184195},{"$f":"IF('Select LAs'!$L12=0,\"-\",IF(INDEX('EY Data'!Z:Z, MATCH('Select LAs'!$L12,'EY Data'!$B:$B, 0))=\"\",\"-\",ROUND(INDEX('EY Data'!Z:Z, MATCH('Select LAs'!$L12,'EY Data'!$B:$B, 0)),0)))","v":266402},{"$f":"IF('Select LAs'!$L12=0,\"-\",IF(INDEX('EY Data'!AE:AE, MATCH('Select LAs'!$L12,'EY Data'!$B:$B, 0))=\"\",\"-\",ROUND(INDEX('EY Data'!AE:AE, MATCH('Select LAs'!$L12,'EY Data'!$B:$B, 0)),0)))","v":118395},{"$f":"IF('Select LAs'!$L12=0,\"-\",IF(INDEX('EY Data'!AF:AF, MATCH('Select LAs'!$L12,'EY Data'!$B:$B, 0))=\"\",\"-\",ROUND(INDEX('EY Data'!AF:AF, MATCH('Select LAs'!$L12,'EY Data'!$B:$B, 0)),0)))","v":0},{"$f":"IF('Select LAs'!$L12=0,\"-\",IF(INDEX('EY Data'!AV:AV, MATCH('Select LAs'!$L12,'EY Data'!$B:$B, 0))=\"\",\"-\",ROUND(INDEX('EY Data'!AV:AV, MATCH('Select LAs'!$L12,'EY Data'!$B:$B, 0)),0)))","v":2926853},{"$f":"IF('Select LAs'!$L12=0,\"-\",IF(INDEX('EY Data'!AX:AX, MATCH('Select LAs'!$L12,'EY Data'!$B:$B, 0))=\"\",\"-\",ROUND(INDEX('EY Data'!AX:AX, MATCH('Select LAs'!$L12,'EY Data'!$B:$B, 0)),0)))","v":0},{"$f":"IF('Select LAs'!$L12=0,\"-\",IF(INDEX('EY Data'!BC:BC, MATCH('Select LAs'!$L12,'EY Data'!$B:$B, 0))=\"\",\"-\",ROUND(INDEX('EY Data'!BC:BC, MATCH('Select LAs'!$L12,'EY Data'!$B:$B, 0)),0)))","v":0},{"$f":"IF('Select LAs'!$L12=0,\"-\",IF(INDEX('EY Data'!BD:BD, MATCH('Select LAs'!$L12,'EY Data'!$B:$B, 0))=\"\",\"-\",ROUND(INDEX('EY Data'!BD:BD, MATCH('Select LAs'!$L12,'EY Data'!$B:$B, 0)),0)))","v":0}]
[null,{"$f":"'Select LAs'!K13","v":"No LA selected"},null,{"$f":"IF('Select LAs'!$L13=0,\"-\",IF(INDEX('EY Data'!X:X, MATCH('Select LAs'!$L13,'EY Data'!$B:$B, 0))=\"\",\"-\",ROUND(INDEX('EY Data'!X:X, MATCH('Select LAs'!$L13,'EY Data'!$B:$B, 0)),0)))","v":15807330},{"$f":"IF('Select LAs'!$L13=0,\"-\",IF(INDEX('EY Data'!Z:Z, MATCH('Select LAs'!$L13,'EY Data'!$B:$B, 0))=\"\",\"-\",ROUND(INDEX('EY Data'!Z:Z, MATCH('Select LAs'!$L13,'EY Data'!$B:$B, 0)),0)))","v":250000},{"$f":"IF('Select LAs'!$L13=0,\"-\",IF(INDEX('EY Data'!AE:AE, MATCH('Select LAs'!$L13,'EY Data'!$B:$B, 0))=\"\",\"-\",ROUND(INDEX('EY Data'!AE:AE, MATCH('Select LAs'!$L13,'EY Data'!$B:$B, 0)),0)))","v":695560},{"$f":"IF('Select LAs'!$L13=0,\"-\",IF(INDEX('EY Data'!AF:AF, MATCH('Select LAs'!$L13,'EY Data'!$B:$B, 0))=\"\",\"-\",ROUND(INDEX('EY Data'!AF:AF, MATCH('Select LAs'!$L13,'EY Data'!$B:$B, 0)),0)))","v":623639},{"$f":"IF('Select LAs'!$L13=0,\"-\",IF(INDEX('EY Data'!AV:AV, MATCH('Select LAs'!$L13,'EY Data'!$B:$B, 0))=\"\",\"-\",ROUND(INDEX('EY Data'!AV:AV, MATCH('Select LAs'!$L13,'EY Data'!$B:$B, 0)),0)))","v":3143460},{"$f":"IF('Select LAs'!$L13=0,\"-\",IF(INDEX('EY Data'!AX:AX, MATCH('Select LAs'!$L13,'EY Data'!$B:$B, 0))=\"\",\"-\",ROUND(INDEX('EY Data'!AX:AX, MATCH('Select LAs'!$L13,'EY Data'!$B:$B, 0)),0)))","v":0},{"$f":"IF('Select LAs'!$L13=0,\"-\",IF(INDEX('EY Data'!BC:BC, MATCH('Select LAs'!$L13,'EY Data'!$B:$B, 0))=\"\",\"-\",ROUND(INDEX('EY Data'!BC:BC, MATCH('Select LAs'!$L13,'EY Data'!$B:$B, 0)),0)))","v":0},{"$f":"IF('Select LAs'!$L13=0,\"-\",IF(INDEX('EY Data'!BD:BD, MATCH('Select LAs'!$L13,'EY Data'!$B:$B, 0))=\"\",\"-\",ROUND(INDEX('EY Data'!BD:BD, MATCH('Select LAs'!$L13,'EY Data'!$B:$B, 0)),0)))","v":0}]
[null,"Selection Median",null,{"$f":"IF(COUNT(D$16:D$26)>0,MEDIAN(D$16:D$26),\"-\")","v":17298685},489063,118395,958489,{"$f":"IF(COUNT(H$16:H$26)>0,MEDIAN(H$16:H$26),\"-\")","v":3483634},{"$f":"IF(COUNT(I$16:I$26)>0,MEDIAN(I$16:I$26),\"-\")","v":0},{"$f":"IF(COUNT(J$16:J$26)>0,MEDIAN(J$16:J$26),\"-\")","v":0},{"$f":"IF(COUNT(K$16:K$26)>0,MEDIAN(K$16:K$26),\"-\")","v":18314}]
[null,"Selection Minimum",null,{"$f":"IF(COUNT(D$16:D$26)>0,MIN(D$16:D$26),\"-\")","v":11546304},93872,0,0,{"$f":"IF(COUNT(H$16:H$26)>0,MIN(H$16:H$26),\"-\")","v":1981917},{"$f":"IF(COUNT(I$16:I$26)>0,MIN(I$16:I$26),\"-\")","v":0},{"$f":"IF(COUNT(J$16:J$26)>0,MIN(J$16:J$26),\"-\")","v":0},{"$f":"IF(COUNT(K$16:K$26)>0,MIN(K$16:K$26),\"-\")","v":0}]
[null,"Selection Maximum",null,{"$f":"IF(COUNT(D$16:D$26)>0,MAX(D$16:D$26),\"-\")","v":71897058},1828597,3030661,3400000,{"$f":"IF(COUNT(H$16:H$26)>0,MAX(H$16:H$26),\"-\")","v":13853835},{"$f":"IF(COUNT(I$16:I$26)>0,MAX(I$16:I$26),\"-\")","v":13437},{"$f":"IF(COUNT(J$16:J$26)>0,MAX(J$16:J$26),\"-\")","v":457808},{"$f":"IF(COUNT(K$16:K$26)>0,MAX(K$16:K$26),\"-\")","v":255822}]
[]
[]
[null,"1)","This shows the total delegated EYSFF budget for all hours (i.e. for the statutory universal 15 hours, statutory additional 15 hours and any local extra hours on top of the statutory hours for maintained settings  (excluding the budget for ‘funded hours above statutory core hours’ for PVIs which is recorded within the central spend). Please note the hourly rates shown in the ‘3-4 years olds’ sheet is only for the statutory hours (i.e. for the statutory universal 15 hours and statutory additional 15 hours)."]

{"sheet":"Early Years Pupil Premium","index":4,"n_rows":32,"n_cols":11,"rows_kept":32,"cut":false,"hidden":true,"merged":[[4,1,4,2],[5,1,5,2],[16,1,16,2],[8,1,9,11]]}
[]
[null,{"$f":"CONCATENATE('Select LAs'!B3,\" - Key Budget Statistics\")","v":"No LA selected - Key Budget Statistics"},null,null,null,null,null,null,null,null,{"$f":"'3-4 year olds '!M2","v":"Financial Year 2023-2024"}]
[]
[]
[null,{"$f":"'Select LAs'!D3","v":"No LA selected"},null,"All establishments"]
[null,"Early Years Pupil Premium - total",null,{"$f":"IF('Select LAs'!$A$3=\"LA No\", \"-\", INDEX('EY Data'!BF:BF, MATCH('Select LAs'!$A$3,'EY Data'!$B:$B, 0)))","v":"-"}]
[]
[]
[null,{"$f":"CONCATENATE(\"Benchmarking against \",IF(_SN=1,\"Statistical Neighbours\",\"Manual Selection\"))","v":"Benchmarking against Manual Selection"}]
[]
[]
[]
[null,null,"Order"]
[]
[]
[]
[null,"Local Authority",null,"Early Years Pupil Premium"]
[null,"England",null,{"$f":"ROUND(INDEX('EY Data'!BF:BF, MATCH($B18,'EY Data'!$C:$C, 0)), 0)","v":40653777}]
[null,{"$f":"'Select LAs'!S3","v":"No LA selected"},null,{"$f":"IF(OR('Select LAs'!S3=0, 'Select LAs'!S3=\"No LA selected\"),\"-\",IF(INDEX('EY Data'!BF:BF, MATCH('Select LAs'!$T3,'EY Data'!$B:$B, 0))=\"\",\"-\",ROUND(INDEX('EY Data'!BF:BF, MATCH('Select LAs'!$T3,'EY Data'!$B:$B, 0)),0)))","v":"-"}]
[null,{"$f":"'Select LAs'!S4","v":"Barking and Dagenham"},null,{"$f":"IF(OR('Select LAs'!S4=0, 'Select LAs'!S4=\"No LA selected\"),\"-\",IF(INDEX('EY Data'!BF:BF, MATCH('Select LAs'!$T4,'EY Data'!$B:$B, 0))=\"\",\"-\",ROUND(INDEX('EY Data'!BF:BF, MATCH('Select LAs'!$T4,'EY Data'!$B:$B, 0)),0)))","v":214981}]
[null,{"$f":"'Select LAs'!S5","v":"Barnet"},null,{"$f":"IF(OR('Select LAs'!S5=0, 'Select LAs'!S5=\"No LA selected\"),\"-\",IF(INDEX('EY Data'!BF:BF, MATCH('Select LAs'!$T5,'EY Data'!$B:$B, 0))=\"\",\"-\",ROUND(INDEX('EY Data'!BF:BF, MATCH('Select LAs'!$T5,'EY Data'!$B:$B, 0)),0)))","v":173333}]
[null,{"$f":"'Select LAs'!S6","v":"Barnsley"},null,{"$f":"IF(OR('Select LAs'!S6=0, 'Select LAs'!S6=\"No LA selected\"),\"-\",IF(INDEX('EY Data'!BF:BF, MATCH('Select LAs'!$T6,'EY Data'!$B:$B, 0))=\"\",\"-\",ROUND(INDEX('EY Data'!BF:BF, MATCH('Select LAs'!$T6,'EY Data'!$B:$B, 0)),0)))","v":170693}]
[null,{"$f":"'Select LAs'!S7","v":"Bath and North East Somerset"},null,{"$f":"IF(OR('Select LAs'!S7=0, 'Select LAs'!S7=\"No LA selected\"),\"-\",IF(INDEX('EY Data'!BF:BF, MATCH('Select LAs'!$T7,'EY Data'!$B:$B, 0))=\"\",\"-\",ROUND(INDEX('EY Data'!BF:BF, MATCH('Select LAs'!$T7,'EY Data'!$B:$B, 0)),0)))","v":100755}]
[null,{"$f":"'Select LAs'!S8","v":"Bedford Borough"},null,{"$f":"IF(OR('Select LAs'!S8=0, 'Select LAs'!S8=\"No LA selected\"),\"-\",IF(INDEX('EY Data'!BF:BF, MATCH('Select LAs'!$T8,'EY Data'!$B:$B, 0))=\"\",\"-\",ROUND(INDEX('EY Data'!BF:BF, MATCH('Select LAs'!$T8,'EY Data'!$B:$B, 0)),0)))","v":163197}]
[null,{"$f":"'Select LAs'!S9","v":"Bexley"},null,{"$f":"IF(OR('Select LAs'!S9=0, 'Select LAs'!S9=\"No LA selected\"),\"-\",IF(INDEX('EY Data'!BF:BF, MATCH('Select LAs'!$T9,'EY Data'!$B:$B, 0))=\"\",\"-\",ROUND(INDEX('EY Data'!BF:BF, MATCH('Select LAs'!$T9,'EY Data'!$B:$B, 0)),0)))","v":89859}]
[null,{"$f":"'Select LAs'!S10","v":"Birmingham"},null,{"$f":"IF(OR('Select LAs'!S10=0, 'Select LAs'!S10=\"No LA selected\"),\"-\",IF(INDEX('EY Data'!BF:BF, MATCH('Select LAs'!$T10,'EY Data'!$B:$B, 0))=\"\",\"-\",ROUND(INDEX('EY Data'!BF:BF, MATCH('Select LAs'!$T10,'EY Data'!$B:$B, 0)),0)))","v":1471434}]
[null,{"$f":"'Select LAs'!S11","v":"Blackburn with Darwen"},null,{"$f":"IF(OR('Select LAs'!S11=0, 'Select LAs'!S11=\"No LA selected\"),\"-\",IF(INDEX('EY Data'!BF:BF, MATCH('Select LAs'!$T11,'EY Data'!$B:$B, 0))=\"\",\"-\",ROUND(INDEX('EY Data'!BF:BF, MATCH('Select LAs'!$T11,'EY Data'!$B:$B, 0)),0)))","v":113696}]
[null,{"$f":"'Select LAs'!S12","v":"Blackpool"},null,{"$f":"IF(OR('Select LAs'!S12=0, 'Select LAs'!S12=\"No LA selected\"),\"-\",IF(INDEX('EY Data'!BF:BF, MATCH('Select LAs'!$T12,'EY Data'!$B:$B, 0))=\"\",\"-\",ROUND(INDEX('EY Data'!BF:BF, MATCH('Select LAs'!$T12,'EY Data'!$B:$B, 0)),0)))","v":117916}]
[null,{"$f":"'Select LAs'!S13","v":"Bolton"},null,{"$f":"IF(OR('Select LAs'!S13=0, 'Select LAs'!S13=\"No LA selected\"),\"-\",IF(INDEX('EY Data'!BF:BF, MATCH('Select LAs'!$T13,'EY Data'!$B:$B, 0))=\"\",\"-\",ROUND(INDEX('EY Data'!BF:BF, MATCH('Select LAs'!$T13,'EY Data'!$B:$B, 0)),0)))","v":289600}]
[null,"Selection Median",null,{"$f":"IFERROR(MEDIAN(D19:D29), 0)","v":166945}]
[null,"Selection Minimum",null,{"$f":"MIN(D19:D29)","v":89859}]
[null,"Selection Maximum",null,{"$f":"MAX(D19:D29)","v":1471434}]

{"sheet":"Disability Access Fund","index":5,"n_rows":32,"n_cols":11,"rows_kept":32,"cut":false,"hidden":true,"merged":[[4,1,4,2],[5,1,5,2],[8,1,9,11],[16,1,16,2]]}
[]
[null,{"$f":"CONCATENATE('Select LAs'!B3,\" - Key Budget Statistics\")","v":"No LA selected - Key Budget Statistics"},null,null,null,null,null,null,null,null,{"$f":"'3-4 year olds '!M2","v":"Financial Year 2023-2024"}]
[]
[]
[null,{"$f":"'Select LAs'!D3","v":"No LA selected"},null,"All establishments"]
[null,"Disability Access Fund - total",null,{"$f":"IF('Select LAs'!$A$3=\"LA No\", \"-\", INDEX('EY Data'!BH:BH, MATCH('Select LAs'!$A$3,'EY Data'!$B:$B, 0)))","v":"-"}]
[]
[]
[null,{"$f":"CONCATENATE(\"Benchmarking against \",IF(_SN=1,\"Statistical Neighbours\",\"Manual Selection\"))","v":"Benchmarking against Manual Selection"}]
[]
[]
[]
[null,null,"Order"]
[]
[]
[]
[null,"Local Authority",null,"Disability Access Fund"]
[null,"England",null,{"$f":"ROUND(INDEX('EY Data'!BH:BH, MATCH($B18,'EY Data'!$C:$C, 0)), 0)","v":21107703}]
[null,{"$f":"'Select LAs'!AC3","v":"No LA selected"},null,{"$f":"IF(OR('Select LAs'!AC3=0, 'Select LAs'!AC3=\"No LA selected\"),\"-\",IF(INDEX('EY Data'!BH:BH, MATCH('Select LAs'!$AD3,'EY Data'!$B:$B, 0))=\"\",\"-\",ROUND(INDEX('EY Data'!BH:BH, MATCH('Select LAs'!$AD3,'EY Data'!$B:$B, 0)),0)))","v":"-"}]
[null,{"$f":"'Select LAs'!AC4","v":"Barking and Dagenham"},null,{"$f":"IF(OR('Select LAs'!AC4=0, 'Select LAs'!AC4=\"No LA selected\"),\"-\",IF(INDEX('EY Data'!BH:BH, MATCH('Select LAs'!$AD4,'EY Data'!$B:$B, 0))=\"\",\"-\",ROUND(INDEX('EY Data'!BH:BH, MATCH('Select LAs'!$AD4,'EY Data'!$B:$B, 0)),0)))","v":114264}]
[null,{"$f":"'Select LAs'!AC5","v":"Barnet"},null,{"$f":"IF(OR('Select LAs'!AC5=0, 'Select LAs'!AC5=\"No LA selected\"),\"-\",IF(INDEX('EY Data'!BH:BH, MATCH('Select LAs'!$AD5,'EY Data'!$B:$B, 0))=\"\",\"-\",ROUND(INDEX('EY Data'!BH:BH, MATCH('Select LAs'!$AD5,'EY Data'!$B:$B, 0)),0)))","v":150696}]
[null,{"$f":"'Select LAs'!AC6","v":"Barnsley"},null,{"$f":"IF(OR('Select LAs'!AC6=0, 'Select LAs'!AC6=\"No LA selected\"),\"-\",IF(INDEX('EY Data'!BH:BH, MATCH('Select LAs'!$AD6,'EY Data'!$B:$B, 0))=\"\",\"-\",ROUND(INDEX('EY Data'!BH:BH, MATCH('Select LAs'!$AD6,'EY Data'!$B:$B, 0)),0)))","v":111780}]
[null,{"$f":"'Select LAs'!AC7","v":"Bath and North East Somerset"},null,{"$f":"IF(OR('Select LAs'!AC7=0, 'Select LAs'!AC7=\"No LA selected\"),\"-\",IF(INDEX('EY Data'!BH:BH, MATCH('Select LAs'!$AD7,'EY Data'!$B:$B, 0))=\"\",\"-\",ROUND(INDEX('EY Data'!BH:BH, MATCH('Select LAs'!$AD7,'EY Data'!$B:$B, 0)),0)))","v":63756}]
[null,{"$f":"'Select LAs'!AC8","v":"Bedford Borough"},null,{"$f":"IF(OR('Select LAs'!AC8=0, 'Select LAs'!AC8=\"No LA selected\"),\"-\",IF(INDEX('EY Data'!BH:BH, MATCH('Select LAs'!$AD8,'EY Data'!$B:$B, 0))=\"\",\"-\",ROUND(INDEX('EY Data'!BH:BH, MATCH('Select LAs'!$AD8,'EY Data'!$B:$B, 0)),0)))","v":44712}]
[null,{"$f":"'Select LAs'!AC9","v":"Bexley"},null,{"$f":"IF(OR('Select LAs'!AC9=0, 'Select LAs'!AC9=\"No LA selected\"),\"-\",IF(INDEX('EY Data'!BH:BH, MATCH('Select LAs'!$AD9,'EY Data'!$B:$B, 0))=\"\",\"-\",ROUND(INDEX('EY Data'!BH:BH, MATCH('Select LAs'!$AD9,'EY Data'!$B:$B, 0)),0)))","v":73069}]
[null,{"$f":"'Select LAs'!AC10","v":"Birmingham"},null,{"$f":"IF(OR('Select LAs'!AC10=0, 'Select LAs'!AC10=\"No LA selected\"),\"-\",IF(INDEX('EY Data'!BH:BH, MATCH('Select LAs'!$AD10,'EY Data'!$B:$B, 0))=\"\",\"-\",ROUND(INDEX('EY Data'!BH:BH, MATCH('Select LAs'!$AD10,'EY Data'!$B:$B, 0)),0)))","v":570492}]
[null,{"$f":"'Select LAs'!AC11","v":"Blackburn with Darwen"},null,{"$f":"IF(OR('Select LAs'!AC11=0, 'Select LAs'!AC11=\"No LA selected\"),\"-\",IF(INDEX('EY Data'!BH:BH, MATCH('Select LAs'!$AD11,'EY Data'!$B:$B, 0))=\"\",\"-\",ROUND(INDEX('EY Data'!BH:BH, MATCH('Select LAs'!$AD11,'EY Data'!$B:$B, 0)),0)))","v":57132}]
[null,{"$f":"'Select LAs'!AC12","v":"Blackpool"},null,{"$f":"IF(OR('Select LAs'!AC12=0, 'Select LAs'!AC12=\"No LA selected\"),\"-\",IF(INDEX('EY Data'!BH:BH, MATCH('Select LAs'!$AD12,'EY Data'!$B:$B, 0))=\"\",\"-\",ROUND(INDEX('EY Data'!BH:BH, MATCH('Select LAs'!$AD12,'EY Data'!$B:$B, 0)),0)))","v":74520}]
[null,{"$f":"'Select LAs'!AC13","v":"Bolton"},null,{"$f":"IF(OR('Select LAs'!AC13=0, 'Select LAs'!AC13=\"No LA selected\"),\"-\",IF(INDEX('EY Data'!BH:BH, MATCH('Select LAs'!$AD13,'EY Data'!$B:$B, 0))=\"\",\"-\",ROUND(INDEX('EY Data'!BH:BH, MATCH('Select LAs'!$AD13,'EY Data'!$B:$B, 0)),0)))","v":148200}]
[null,"Selection Median",null,{"$f":"IFERROR(MEDIAN(D19:D29), 0)","v":93150}]
[null,"Selection Minimum",null,{"$f":"MIN(D19:D29)","v":44712}]
[null,"Selection Maximum",null,{"$f":"MAX(D19:D29)","v":570492}]

{"sheet":"EY Data","index":6,"n_rows":177,"n_cols":71,"rows_kept":177,"cut":false,"hidden":true,"merged":[[2,54,2,55],[2,4,2,7],[8,64,8,68],[2,30,2,31],[2,37,2,40],[2,9,2,16],[2,18,2,21],[2,42,2,45],[2,25,2,28],[2,49,2,52]]}
[]
[null,1,2,3,4,5,6,7,8,9,10,11,12,13,14,15,16,17,18,19,20,21,22,23,24,25,26,27,28,29,30,31,32,33,34,35,36,37,38,39,40,41,42,43,44,45,46,47,48,49,50,51,52,53,54,55,56,57,58,59]
[null,null,null,null,"3 and 4 year olds hourly average funding rate",null,null,null,null,"3 and 4 year olds components of hourly average funding rate for all providers",null,null,null,null,null,null,null,null,"3 and 4 year olds hourly average base rate",null,null,null,null,"3 and 4 year olds EYSFF total budget ",null,"3 and 4 year olds SEN Inclusion Fund (top-up grant element)",null,null,null,null,"3 and 4 year olds contingency funding & central spend",null,null,"3 and 4 year olds",null,"3 and 4 year olds",null,"2 year olds hourly average funding rate",null,null,null,null,"2 year olds hourly average base rate",null,null,null,null,"2 year olds EYSFF total budget ",null,"2 year olds SEN Inclusion Fund (top-up grant element)",null,null,null,null,"2 year olds contingency funding & central spend",null,null,"EYPP",null,"DAF"]
[null,"LA Number","LA name",null,"All Providers","Primary Nursery Class","Maintained Nursery School","Private, Voluntary and Independent (PVI)",null,"Base rate","Supplements - Deprivation","Supplements - Quality","Supplements - Flexibility","Supplements - Rurality/Sparsity","Supplements - EAL","Maintained nursery school (MNS) lump sums","SEN Inclusion Fund (top-up grant element)",null,"All Providers","Primary Nursery Class","Maintained Nursery School","Private, Voluntary and Independent (PVI)",null,"All Providers",null,"All Providers","Primary Nursery Class","Maintained Nursery School","Private, Voluntary and Independent (PVI)",null,"Contingency Funding","Central Spend",null,"Pass Through Rate (%)",null,"Funding Paid Through Supplements (%)",null,"All Providers","Primary Nursery Class","Maintained Nursery School","Private, Voluntary and Independent (PVI)",null,"All Providers","Primary Nursery Class","Maintained Nursery School","Private, Voluntary and Independent (PVI)",null,"All Providers",null,"All Providers","Primary Nursery Class","Maintained Nursery School","Private, Voluntary and Independent (PVI)",null,"Contingency Funding","Central Spend",null,"Early Years Pupil Premium",null,"Disability Access Fund"]
[null,301,"Barking and Dagenham",null,6.6368285535245874,0,0,6.6368285535245874,null,6.0100000002622087,0.3285501093193911,0,0,0,0,0,0.2982784439429878,null,6.0100000002622087,0,0,6.0100000002622087,null,19338947.57,null,910049,0,0,910049,null,0,0,null,1.1042975962603307,null,5.1833637604716876E-2,null,6.698593813738043,0,0,6.698593813738043,null,6.3599999999999994,0,0,6.3599999999999994,null,4038110.28,null,214981,0,0,214981,null,0,0,null,214981,null,114264]
[null,302,"Barnet",null,6.2596239421329303,6.079094051774339,9.0793172075471702,6.081143209076175,null,5.8699999993198864,0.1302203549149781,0,0,0,0,0.16872189987023223,9.0681688027834009E-2,null,5.8699999993198864,5.8699999991499086,5.87,5.87,null,27211413.409999996,null,400000,320000,22857.14,57142.86,null,0,1414047.67,null,0.95021872804941998,null,2.1702595442694126E-2,null,6.9200000069871361,6.9200000087626936,6.92,6.92,null,6.9200000069871361,6.9200000087626936,6.92,6.92,null,3169253.02,null,0,0,0,0,null,0,0,null,173333,null,150696]
[null,370,"Barnsley",null,4.7532228272138637,4.7817038283925388,0,4.7337371352205384,null,4.5699999996381946,0.14704224260580101,0,0,0,0,0,3.6180584969868632E-2,null,4.5699999996381946,4.57,0,4.5699999993906593,null,13037495.789999999,null,100000,50000,0,50000,null,0,583529,null,0.97602111441763117,null,3.1172551580935164E-2,null,5.4375321978034155,0,0,5.4375321978034155,null,5.3700000051282366,0,0,5.3700000051282366,null,2408430.02,null,30288,0,0,30288,null,0,96471,null,170693,null,111780,null,null,"3 and 4 year olds components of hourly average funding rate for all providers"]
[null,800,"Bath and North East Somerset",null,4.8492914569481949,4.8735917673395921,0,4.8432163604193379,null,4.54,8.057230394906427E-2,0,0,0,0,0,0.22871915299912995,null,4.54,4.54,0,4.54,null,9267320.1500000004,null,458734,91747,0,366987,null,0,487752,null,0.99370726576807278,null,1.7437732525081694E-2,null,6.01,6.01,0,6.01,null,6.01,6.01,0,6.01,null,922679.24,null,0,0,0,0,null,0,0,null,100755,null,63756]
[null,822,"Bedford Borough",null,5.5882694575706946,5.4144997075805747,8.3015257016423245,5.3715942434712831,null,4.8600000000000003,0.16819409477209343,0,0,0,0,0.19018847311221956,0.36988688968638123,null,4.8600000000000003,4.8600000000000003,4.8600000000000003,4.8600000000000003,null,11444562.66,null,811208,260889.55,56170.28,494148.17,null,0,782424,null,1.040092675232847,null,3.3450199336371667E-2,null,5.86,5.86,5.86,5.86,null,5.86,5.86,5.86,5.86,null,1150939.1600000001,null,0,0,0,0,null,0,75249,null,163197,null,44712,null,null,null,null,"Supplements"]
[null,303,"Bexley",null,5.4788533440045262,5.5250002734427435,0,5.4617570075899726,null,5.2200000000000006,0.12394789124656402,2.1319673130869618E-2,0,0,7.6626357376781487E-2,0,3.6959422250311381E-2,null,5.2200000000000006,5.2200000000000006,0,5.22,null,16196366.039999999,null,110000,0,0,110000,null,0,519400,null,0.94954130745312437,null,4.0775128097808783E-2,null,6.63,0,0,6.63,null,6.63,0,0,6.63,null,1716957.84,null,0,0,0,0,null,0,222600,null,89859,null,73069,null,null,null,{"$f":"\"Base rate, \"&TEXT($BL$11, \"£#,##0.00\")","v":"Base rate, "},{"$f":"\"Deprivation, \"&TEXT($BM$11, \"£#,##0.00\")","v":"Deprivation, "},{"$f":"\"Quality, \"&TEXT($BN$11, \"£#,##0.00\")","v":"Quality, "},{"$f":"\"Flexibility, \"&TEXT($BO$11, \"£#,##0.00\")","v":"Flexibility, "},{"$f":"\"Rurality/ Sparsity, \"&TEXT($BP$11, \"£#,##0.00\")","v":"Rurality/ Sparsity, "},{"$f":"\"EAL, \"&TEXT($BQ$11, \"£#,##0.00\")","v":"EAL, "},{"$f":"\"Maintained nursery school (MNS) lump sums, \"&TEXT($BR$11, \"£#,##0.00\")","v":"Maintained nursery school (MNS) lump sums, "},{"$f":"\"SEN Inclusion Fund (top-up grant element), \"&TEXT($BS$11, \"£#,##0.00\")","v":"SEN Inclusion Fund (top-up grant element), "}]
[null,330,"Birmingham",null,5.4652112989461115,5.1925468244278985,8.301017544681363,4.9826123541172969,null,4.7,0.30542591114639073,0,0,0,0,0.36639114468362688,9.3394243116093401E-2,null,4.7,4.6999999995039969,4.7000000017737076,4.6999999998694602,null,71897058.060000002,null,1250000,0,0,1250000,null,0,3400000,null,0.95305049612382897,null,6.1018965532233634E-2,null,5.81,5.81,5.8100000000000005,0,null,5.81,5.81,5.8100000000000005,0,null,13853834.609999999,null,0,0,0,0,null,0,0,null,1471434,null,570492,null,null,"Hourly rate (£ per hour)",{"$f":"IF($BL$13=\"\", \"\", INDEX(J:J, MATCH($BL$13, $B:$B,0)))","v":""},"","","","","","",""]
[null,889,"Blackburn with Darwen",null,5.0952926189147751,4.7922400814600348,7.0433654960791001,4.8336277694721916,null,4.6000000021006997,0.12875192231803498,0,0,0,0,0.27726093110043804,8.9279763395602646E-2,null,4.6000000021006997,4.5999999999999996,4.5999999999999996,4.6000000033892094,null,9532083.7899999991,null,170000,31201.420000000002,14963.279999999999,123835.29999999999,null,3400,621000,null,0.95815528515662163,null,2.7227463900818049E-2,null,5.23,5.23,5.23,5.23,null,5.23,5.23,5.23,5.23,null,1517746,null,0,0,0,0,null,0,116100,null,113696,null,57132]
[null,890,"Blackpool",null,4.8231801621186889,4.9664797526297937,0,4.7686782720703853,null,4.59,8.2898736189112546E-2,8.888833483519025E-2,0,0,0,0,6.1393091094386419E-2,null,4.59,4.59,0,4.59,null,6980603.6600000001,null,90000,0,0,90000,null,0,292294,null,0.9685100727145961,null,3.6076176540869531E-2,null,5.4799999999999995,5.4799999999999995,0,5.4799999999999995,null,5.4799999999999995,5.4799999999999995,0,5.4799999999999995,null,1686963.2,null,0,0,0,0,null,0,46176,null,117916,null,74520,null,null,"LA Number",{"$f":"IF('EY Data'!$BL$14=\"Choice\", \"\", INDEX('Stat Neighbours'!$A:$A, MATCH('EY Data'!$BL$14, 'Stat Neighbours'!$C:$C,0)))","v":""}]
[null,350,"Bolton",null,4.9676119885101206,4.9012917963481355,8.290584468211696,4.8089906731238585,null,4.5200000004126739,0.20413446905382293,0,0,0,0,0.11451696870272138,0.12896055034090245,null,4.5200000004126739,4.520000001034977,4.5199999972584859,4.5200000003110654,null,18760200.02,null,500000,140000,60000,300000,null,0,824000,null,0.96675045461641029,null,4.3210977666534561E-2,null,5.5300000002127909,5.5300000515255823,5.5300000055943013,5.529999987455148,null,5.5300000002127909,5.5300000515255823,5.5300000055943013,5.529999987455148,null,2598800.44,null,0,0,0,0,null,0,141000,null,289600,null,148200,null,null,"LA Name",{"$f":"LAchoice","v":"Choice"}]
[null,839,"Bournemouth, Christchurch & Poole",null,4.8399999796510356,0,0,4.8399999796510356,null,4.49,0.08,0,0,0,0,0,0.26999997965103562,null,4.49,0,0,4.49,null,17966516.280000001,null,1061479,0,0,1061479,null,0,117942,null,0.99383983155052058,null,1.7505470459518599E-2,null,5.7200001212847447,0,0,5.7200001212847447,null,5.57,0,0,5.57,null,2296249.21,null,61838,0,0,61838,null,0,66058,null,117418,null,118404]
[null,867,"Bracknell Forest",null,5.3040292218273448,5.3696750434855343,0,5.2714718343493603,null,4.92,0.21444717018429318,9.5993475289864669E-2,0,0,0,0,7.3588576353187621E-2,null,4.92,4.9200000000000008,0,4.92,null,7355809.2799999993,null,103491,34497,0,68994,null,103491,398042,null,0.96373078820439662,null,5.9352675332006423E-2,null,6.5264967462039047,0,0,6.5264967462039047,null,6.38,0,0,6.38,null,588236,null,13507,0,0,13507,null,0,31671,null,55590,null,40042]
[null,380,"Bradford",null,5.1900023696529454,5.2122166419152549,8.3827509743814392,4.912868894792723,null,4.459999998929252,0.32442153302390858,0.10350280664126595,0,0,0,0.22028483656103207,8.1793194497485677E-2,null,4.4599999989292529,4.4600000016313537,4.4599999895896394,4.45999999915042,null,34349007.440000005,null,550000,223305.08,75000,251694.92,null,0,649329.52,null,0.99142932622067159,null,8.7547251148373667E-2,null,5.684855035253765,5.9700655833834855,5.6920209973753275,5.6680117531920171,null,5.6100000008234057,5.61,5.6099999999999994,5.6100000009571938,null,7494485.9000000004,null,100000,23333.33,10000,66666.67,null,0,0,null,437089,null,120000]
[null,304,"Brent",null,5.8610474228250018,5.5431422349246215,12.050591658564009,5.4414016263376084,null,4.84000000023675,0.54999999881625183,0.11088780917107059,0,0,0,0.23024228888045378,0.12991732572047476,null,4.84000000023675,4.8400000012628102,4.8400000205076514,4.8399999974961307,null,19366043.830000002,null,439003.23,0,439003.23,0,null,0,998265,null,0.94954555378491512,null,0.12014202634695909,null,6.8400000015707452,0,6.840000021543668,6.8399999991181879,null,6.8400000015707452,0,6.840000021543668,6.8399999991181879,null,3483694.9699999997,null,0,0,0,0,null,0,0,null,92945,null,119232]
[null,846,"Brighton and Hove",null,5.2926528686790384,5.3152587550773962,7.8818408849181028,5.1564519023869595,null,4.5600000006113408,0.16156895624378664,0.10143871546796369,0,0,0,0.11823956868709391,0.35140562766885308,null,4.5600000006113408,4.5599999999999996,4.5599999999999996,4.5600000007042407,null,12932249.030000001,null,919700,45985,45985,827730,null,0,543072.56999999995,null,1.0307596215123394,null,5.4531879188379533E-2,null,6.5083434417546222,13.084545454545454,6.8847169811320752,6.4254458906356806,null,6.1299999972805503,6.13,6.13,6.1299999970455419,null,1803305.99,null,111300,15300,16000,80000,null,0,75727.429999999993,null,191561,null,105894]
[null,801,"Bristol, City of",null,5.9813897214287159,5.7808348037524251,8.856173279399334,5.3630777692214542,null,4.9400000003636668,0.10000842434599991,0.15437664049046168,0,0,0,0.45450446762179075,0.33250018860679664,null,4.9400000003636668,4.9399999961532535,4.9400000047108046,4.9400000005539271,null,31066275.300000001,null,1828596.9899999998,609532.32999999996,609532.32999999996,609532.32999999996,null,0,1502000,null,0.95291125065636639,null,4.8973085676824131E-2,null,5.8600000098287675,0,5.8600000156987262,5.8600000044103444,null,5.8600000098287675,0,5.8600000156987262,5.8600000044103444,null,3577254,null,0,0,0,0,null,0,18313.59,null,382528,null,151524]
[null,305,"Bromley",null,5.4246139709921319,0,0,5.4246139709921319,null,5.200000000561297,0.10935996323659015,0,0,0,0,0,0.11525400719424454,null,5.200000000561297,0,0,5.200000000561297,null,18918169.609999999,null,410670,0,0,410670,null,0,836069,null,0.98450344301127624,null,2.0597579365924715E-2,null,6.7,0,0,6.7,null,6.7,0,0,6.7,null,1829000.17,null,0,0,0,0,null,0,33259,null,128180,null,96050]
[null,825,"Buckinghamshire",null,5.020746264676303,5.2209984078921297,6.8650944806914396,4.9248110107454925,null,4.770000000268567,7.9999999494461002E-2,6.0000050964649027E-2,0,0,0,4.1233023552576353E-2,6.9513190396050278E-2,null,4.770000000268567,4.7699999991276494,4.7700000289418574,4.7699999996305431,null,31340700.27,null,440010,110000,10000,320010,null,315269,1666827,null,0.95118068081681983,null,2.8513248271425498E-2,null,6.36,6.3600000369501304,6.3599999160030469,6.3599999977593775,null,6.36,6.3600000369501304,6.3599999160030469,6.3599999977593775,null,2805043.02,null,0,0,0,0,null,0,147634,null,206665,null,147384]
[null,351,"Bury",null,4.9237933383669832,4.74,10.545860503508047,4.8887243799030244,null,4.5700000022358527,0.17000000223585249,0,0,0,0,9.4359234864452565E-2,8.9434099030825026E-2,null,4.5700000022358536,4.57,4.5699999999999994,4.5700000037181097,null,11069717.800000001,null,200000,0,0,200000,null,640000,310000,null,1.0440047388573814,null,3.5864979340817491E-2,null,5.9790380652156738,5.62,5.62,6.0106600983682128,null,5.6199999999999992,5.62,5.62,5.62,null,1565293.64,null,100000,0,0,100000,null,309000,104189.57,null,157889,null,86112]
[null,381,"Calderdale",null,4.8958648099033022,4.9695637607412708,0,4.8776666477113988,null,4.6099999999999994,0.10741121735488947,0,0,0,0,0,0.17845359254841248,null,4.6100000000000003,4.6100000000000003,0,4.6100000000000003,null,11895726.040000001,null,450000,80000,0,370000,null,0,543056,null,1.0053110492614581,null,2.2769102036246963E-2,null,5.8812607763490208,5.58,0,5.8900991542045569,null,5.58,5.58,0,5.5799999999999992,null,2222659.08,null,120000,0,0,120000,null,0,16500,null,209952,null,107640]
[null,873,"Cambridgeshire",null,5.0680311931012074,4.9821980743388705,7.8512893836832438,4.8932574159943485,null,4.6299999990502672,0.13441647789942204,0,0,0,0,0.16103605468679427,0.14257866146472375,null,4.6299999990502672,4.6300000038240947,4.6299999897079838,4.6299999992414511,null,33709957.449999996,null,975813,81303,60467,834043,null,1200000,0,null,1.0170814232514815,null,2.8212579347278045E-2,null,6.12,6.12,6.12,6.12,null,6.12,6.12,6.12,6.12,null,2801325.96,null,0,0,0,0,null,0,0,null,443740,null,213624]
[null,202,"Camden",null,8.1308325823058567,8.0317900951121697,11.474120300751879,7.7908777321014293,null,6.65,0.80000051462268185,0.10995726701905456,0,0,0,0.11286061380333823,0.45801418686078232,null,6.65,6.6499999999999995,6.65,6.65,null,11975332.09,null,712000,282000,210000,220000,null,0,299383,null,0.92019458402350451,null,0.12036545810499592,null,8.9212950713416852,8.7999300069993005,8.8520719582449647,9.0194049611091707,null,8.1,8.1,8.1000000000000014,8.1,null,1824557.4,null,185000,35000,50000,100000,null,0,299384,null,116280,null,28800]
[null,823,"Central Bedfordshire",null,4.9059516200578797,4.9348645093883636,6.302378508454364,4.7859456572120846,null,4.4799999997799267,4.3162132858401391E-2,0.19117212830230107,0,0,0,5.4071385441530596E-2,0.1375459736757198,null,4.4799999997799267,4.4799999994648347,4.4800000000000004,4.4799999999999995,null,17333861.25,null,500000,205612.59,19376.650000000001,275010.76,null,190252.31,795000,null,0.97909234069357776,null,4.9706755649937054E-2,null,5.96,5.96,5.96,5.96,null,5.96,5.96,5.96,5.96,null,1427503.44,null,0,0,0,0,null,0,0,null,191201,null,111780]
[null,895,"Cheshire East",null,4.7255385245933015,4.7271816485430627,10.267944567070394,4.6788323000541583,null,4.4800000010171388,0.10355252823024257,0,0,8.5312978852314543E-3,9.3166039468976832E-3,2.5602679200377017E-2,9.853541431341406E-2,null,4.4800000010171388,4.48000000174022,4.480000076233142,4.4800000002123017,null,21835362.049999997,null,465000,66592,12078,386330,null,0,1149104.7,null,0.96507922903345467,null,2.6383365647203755E-2,null,5.5296314630832475,5.4300000000000006,5.43,5.5500170920102629,null,5.4300000000000006,5.4300000000000006,5.43,5.4300000000000006,null,1894342.3800000001,null,34758.03,0,0,34758.03,null,27440.55,27440.55,null,132066,null,159804]
[null,896,"Cheshire West and Chester",null,4.6513161768659534,4.655032896365686,0,4.6498887569098413,null,4.3399999978610753,0.13864143650066554,2.3147297326930866E-4,0,7.2917887686823474E-3,0,0,0.16515148076226085,null,4.3399999978610753,4.3399999959706816,0,4.3399999985870883,null,18457054.25,null,679469,188542.25,0,490926.75,null,818756,0,null,0.99595948741320917,null,3.2581215390857947E-2,null,5.5972234339616245,5.6980736309566478,0,5.5823281599182497,null,5.5100000028347615,5.510000049139042,0,5.5099999959957575,null,2526843.96,null,40000,11099.39,0,28900.61,null,25000,0,null,154447,null,115920]
[null,201,"City of London",null,8.9414842609964573,8.938202538202539,0,8.9448062503277228,null,8.4,2.032520325203252E-2,0,0,0,0,0,0.52115905774442361,null,8.4,8.4,0,8.4,null,323138.40000000002,null,20000,10000,0,10000,null,0,0,null,"-",null,"N/A",null,8.4,8.4,0,8.4,null,8.4,8.4,0,8.4,null,19656,null,0,0,0,0,null,0,0,null,0,null,0]
[null,908,"Cornwall",null,4.8565270634026669,4.8167671352177832,8.7286159532910492,4.8016746399879908,null,4.6999999994465886,2.3359500376300198E-2,3.5737320596079349E-2,0,0,0,5.131264886309736E-2,4.6117594120600007E-2,null,4.6999999994465886,4.7000000008938532,4.7,4.6999999990545422,null,26076866.980000004,null,250000,57420,3505,189075,null,189000.02,361000,null,0.99385612307682736,null,1.2417654694231867E-2,null,5.6300000017105107,5.63,5.63,5.6300000020569643,null,5.6300000017105107,5.63,5.63,5.6300000020569643,null,3949697,null,0,0,0,0,null,0,0,null,279717,null,165600]
[null,331,"Coventry",null,4.8818273024666858,5.1502690875687049,8.4475061784897036,4.5732318084573986,null,4.4300000010476452,0.21086078235429459,0.10865859291664812,0,0,0,5.5827307276108622E-2,7.6480618871989758E-2,null,4.4300000010476452,4.4299999996581043,4.43,4.430000002145384,null,19723271.509999998,null,313910.33999999997,134217.32,5013.3,174679.72,null,0,1042528,null,0.94999999905326327,null,6.7274043951496873E-2,null,5.6376590471369932,5.635951460319844,5.6378309409888354,5.6378308371319008,null,5.5500000085789409,5.55,5.55,5.5500000099114608,null,3234664.88,null,51089.659999999996,4579.1499999999996,2202.8000000000002,44307.71,null,0,82230,null,401530,null,152352]
[null,306,"Croydon",null,6.3186398201849237,5.7826821636119803,7.1507794075352313,6.8466191442401039,null,5.7800000006640175,6.0267829500160873E-2,0,0,0,0,0.17115318815924288,0.30721880186150247,null,5.7800000006640175,5.78,5.7799999999999994,5.7800000033711552,null,27159315.520000003,null,1388000,0,694000,694000,null,0,773292,null,1.0635790020805675,null,1.0319360558926056E-2,null,6.630000001856633,6.63,6.6299999724521328,6.6300066326461558,null,6.630000001856633,6.63,6.6299999724521328,6.6300066326461558,null,3213883.02,null,0,0,0,0,null,0,515528,null,168855,null,134136]
[null,942,"Cumberland",null,4.8369045408192193,4.8303526546258198,8.2764765345010733,4.5970564261853069,null,4.4799999966070985,6.1170621143565869E-2,0.10241849454560398,0,0,0,0.12374236907383081,6.9573059449119665E-2,null,4.4799999966070985,4.4799999988557699,4.4799999665898724,4.4799999964054047,null,13488864.18,null,196852.59000000003,97285.38,6663.66,92903.55,null,249634.69,333531.09000000003,null,0.99144591315926656,null,3.5229024733472711E-2,null,5.700440608457253,5.7004406719361231,5.7004404250315357,5.7004405954229886,null,5.6300000104643209,5.6300000350689778,5.6300002137985592,5.629999995942307,null,2044471.11,null,25579.71,5825.03,658.94,19095.740000000002,null,37836.47,0,null,155518.79999999999,null,107640]
[null,841,"Darlington",null,5.1630278331051498,4.9413866212940274,8.1141633885643891,4.8876428556720137,null,4.7,3.8797903635906419E-2,1.762271034491017E-2,5.4983654586894136E-3,0,0,0.22548048329734283,0.17562837036830067,null,4.7,4.7,4.7,4.7,null,6247441,null,220000,55000,55000,110000,null,0,113754,null,0.99347029171183243,null,1.3002946859628023E-2,null,5.629999999999999,5.6300000000000008,5.63,5.63,null,5.629999999999999,5.6300000000000008,5.63,5.63,null,1089906.0699999998,null,0,0,0,0,null,0,0,null,97892,null,38916]
[null,831,"Derby",null,5.3250277683754801,5.0580025503974815,8.7489996187373276,5.0588080633955688,null,4.6999999996870914,0.22884155958272415,0,0,0,1.8896429149829065E-2,0.23648088045289073,0.14080889950294553,null,4.6999999996870914,4.7,4.6999999999999993,4.6999999994399593,null,17060462.09,null,450000,65784,87981,296235,null,112477,470000,null,0.96875749003788703,null,5.0070959560185431E-2,null,5.6799999975079762,5.6800000257929115,5.6799999462532877,5.6800000010446174,null,5.6799999975079762,5.6800000257929115,5.6799999462532877,5.6800000010446174,null,2735124.99,null,0,0,0,0,null,0,0,null,322135,null,137448]
[null,830,"Derbyshire",null,4.8620167089823649,4.9583317921132952,7.9117838166845686,4.5706780517184438,null,4.47,0.1288532051917422,8.8880921338548469E-2,0,0,0,0.15354407821669194,2.0738504235382024E-2,null,4.47,4.47,4.47,4.47,null,38098051.530000001,null,163200,0,0,163200,null,57000,1396223,null,0.96907797885190472,null,4.644762707381838E-2,null,5.6299999963678058,5.63,5.6299998205537714,5.63,null,5.6299999963678058,5.63,5.6299998205537714,5.63,null,4650082.17,null,0,0,0,0,null,0,0,null,500606,null,258336]
[null,878,"Devon",null,4.836281937572271,5.2991770658459982,7.0881848056879546,4.7051533159489658,null,4.46,0.10383585776048454,6.942594601987663E-2,0,0,0,3.4885120818092773E-2,0.168135012973816,null,4.4600000000000009,4.46,4.46,4.46,null,35905733.620000005,null,1293235,208917.16999999998,19093.580000000002,1065224.25,null,153830,1018557.2,null,0.99135437909629742,null,3.7395211217935889E-2,null,5.4696115800170055,5.8877442104906246,5.4,5.4548101851593733,null,5.32,5.32,5.32,5.32,null,4120002.24,null,100000,16154.62,1476.42,82368.960000000006,null,15170,100442.8,null,480000,null,248000]
[null,371,"Doncaster",null,4.8220682887128374,4.6904482085457113,0,4.9703282836020781,null,4.5,0.10253165515499484,0,0.1335532055166625,0,0,0,8.5983428041179755E-2,null,4.5,4.5,0,4.5,null,16761701,null,304308,0,0,304308,null,0,792470,null,0.97219118724049147,null,4.9848106108085342E-2,null,5.6300000060907722,5.63,0,5.6300000064206781,null,5.6300000060907722,5.63,0,5.6300000064206781,null,3697396.66,null,0,0,0,0,null,0,0,null,316240,null,136620]
[null,838,"Dorset",null,4.6750240840881547,4.6960149508415459,0,4.6723775630924242,null,4.4099999986347695,0.18086649480008027,0,3.0327348970241801E-2,4.7170578784076822E-2,0,0,6.6596628989856908E-3,null,4.4099999986347695,4.4099999857246219,0,4.4100000002624764,null,14019822.000000002,null,20000,0,0,20000,null,35129,700500,null,0.96236580061336308,null,5.5343670554447826E-2,null,5.6800000091518958,5.6800001252621373,0,5.6799999971140789,null,5.6800000091518958,5.6800001252621373,0,5.6799999971140789,null,1737782.03,null,0,0,0,0,null,0,0,null,147149,null,81972]
[null,332,"Dudley",null,4.7281650249586722,4.8641557908420712,9.2115851685952475,4.526631178830578,null,4.4799999999999995,2.5306495278762133E-2,9.9999189089312546E-2,0,0,0,8.8106025413940942E-2,3.475331517665689E-2,null,4.4799999999999995,4.4799999999999995,4.4800000000000004,4.4800000000000004,null,16205918.84,null,120000,60000,0,60000,null,409438,419100,null,0.97513047780851758,null,2.720898306347035E-2,null,5.67,5.67,5.67,5.67,null,5.67,5.67,5.67,5.67,null,2890826.82,null,0,0,0,0,null,0,0,null,286530,null,128340]
[null,840,"Durham",null,4.9066495353220514,4.6615924396306587,7.1707277491341816,4.6542752945229946,null,4.2200000002520079,0.17976343788849755,0.17956218267844604,0,0,0,0.2475814539218911,7.9742460581209165E-2,null,4.2200000002520079,4.22,4.2200000061574672,4.2199999993926562,null,26815322.959999997,null,443000,79607,35440,327953,null,0,1283000,null,0.95472706881159941,null,7.8466929482661027E-2,null,5.5299999999999994,5.53,5.53,5.53,null,5.5299999999999994,5.53,5.53,5.53,null,5445523.7199999997,null,0,0,0,0,null,0,100283.28,null,544032,null,250056]
[null,307,"Ealing",null,6.270120402073883,6.0515718908919887,8.8237862035767822,6.0745782429743302,null,4.7299999988499879,0.28446256739983888,0.28446256739983888,0,0,0,0.19888080228570856,0.77231446613850863,null,4.7299999988499879,4.7300000021397155,4.7299999878243808,4.7299999977015768,null,20738170.199999999,null,2887754,1195953,240672,1451129,null,773000,1186000,null,1.0317311450586344,null,0.10736613944342092,null,6.919999999999999,6.92,6.92,6.92,null,6.919999999999999,6.92,6.92,6.92,null,3206797.1999999997,null,0,0,0,0,null,0,0,null,157440,null,107640]
[null,811,"East Riding of Yorkshire",null,4.8283235778730269,4.7244791557180168,11.410178533094811,4.7254736192666806,null,4.57,0.13108602726266605,0,0,0,0,9.9357762463189322E-2,2.7879788147170927E-2,null,4.57,4.5699999999999994,4.57,4.57,null,17393303.970000003,null,101016,0,0,101016,null,0,360000,null,0.95920749920563941,null,2.7884200906443404E-2,null,5.63,5.63,5.63,5.6300000000000008,null,5.63,5.63,5.63,5.6300000000000008,null,1950817.52,null,0,0,0,0,null,0,0,null,134222,null,101016]
[null,845,"East Sussex",null,4.737676773076763,4.7199267342031481,0,4.739470937322829,null,4.6099999991632563,6.673395386206564E-2,0,0,0,0,0,6.0942820051439729E-2,null,4.6099999991632563,4.6100000000000003,0,4.6099999990786795,null,23474675.360000003,null,305900,16700,0,289200,null,0,934600,null,0.9688500558439187,null,1.4269350049064959E-2,null,6.1999647447494164,6.1854503026662346,0,6.2010348914867945,null,6.1300000003173016,6.129999999999999,0,6.1300000003406954,null,3863846.0300000003,null,44100,2400,0,41700,null,0,0,null,303649,null,162288]
[null,308,"Enfield",null,5.8201376171989319,5.8199999716772437,0,5.8202193087514491,null,5.4400000011103931,0.12000000055519684,0.13000000083279525,0,0,0,0,0.13013761470054663,null,5.4400000011103931,5.4400000029813418,0,5.4399999999999995,null,20497234.379999999,null,468798.1,174418.02,0,294380.08,null,0,1103479.48,null,0.95100287862727639,null,4.3936731331849076E-2,null,6.6300000099226235,6.6300000099226235,0,6.6300000099226235,null,6.6300000099226235,6.6300000099226235,0,6.6300000099226235,null,4009020.4499999997,null,0,0,0,0,null,0,0,null,251925,null,152352]
[null,881,"Essex",null,5.0310765406266311,5.0174231186625002,8.855464851029609,4.9977048302298606,null,4.7700000000000005,7.1014185867549873E-2,0,0,0,0,3.021452555514648E-2,0.15984782920393528,null,4.7700000000000005,4.7700000000000005,4.7700000000000005,4.7699999999999996,null,79227397.919999987,null,2599822,381234,25561,2193027,null,3610021,3213027,null,1.0343382503870964,null,1.466927861415129E-2,null,5.8900000000000006,5.89,5.89,5.8900000000000006,null,5.8900000000000006,5.89,5.89,5.8900000000000006,null,10136748.9,null,0,0,0,0,null,0,0,null,723900,null,616032]
[null,390,"Gateshead",null,4.8858067878998295,5.0804725534272137,9.5193822138439668,4.6734500983421521,null,4.18,0.23749996527928477,0.23749963543248992,9.5000147563039802E-2,0,0,6.1202204765418169E-2,7.460483485959811E-2,null,4.18,4.18,4.18,4.1800000000000006,null,11085490.419999998,null,171897,67621,2400,101876,null,0,376709,null,0.96492091662688251,null,0.11999995336459475,null,5.7143660013076421,5.7173428534337267,0,5.7141785089368939,null,5.6300000153840237,5.6300002596391012,0,5.63,null,1829820.38,null,27420,1682,0,25738,null,184723,0,null,182560,null,87768]
[null,916,"Gloucestershire",null,4.7558732292756902,0,0,4.7558732292756902,null,4.5,0.16999999999999998,0,0,0,0,0,8.5873229275689994E-2,null,4.5,0,0,4.5,null,32741902.379999999,null,602067,0,0,602067,null,233893,2364100,null,0.98341551300509822,null,3.6402569593147749E-2,null,5.36,0,0,5.36,null,5.36,0,0,5.36,null,2932992,null,0,0,0,0,null,18255,0,null,343555,null,431746]
[null,203,"Greenwich",null,6.6851825264184335,6.4129961527357686,10.589655892560208,6.4129960766267322,null,5.4700000005718463,0.39000000114369227,0,0,0,0,0.27218645705990352,0.55299606764299103,null,5.4700000005718463,5.4700000010923215,5.4700000000000006,5.47,null,21446981.190000001,null,1934073,1012515.71,126040.36,795516.92999999993,null,466920,1176891.1000000001,null,0.97273391736441217,null,6.6552901199576478E-2,null,7.5600010849634911,7.56,7.56,7.5600013731849929,null,7.0600000000000005,7.06,7.06,7.06,null,3253565.7,null,230423,7085,41279,182059,null,0,0,null,296015,null,120888]
[null,204,"Hackney",null,6.3707923868194909,6.2399682032878596,10.207854156920153,6.2397980625481058,null,5.36,0.26222778285478082,0.29084009183427001,0,0,0,0.1309349515554305,0.32678956057501002,null,5.3599999999999994,5.3599999999999994,5.36,5.36,null,24272292.27,null,1312364,371577,43322,897465,null,0,1313209,null,0.95410666432248548,null,9.3533151725936348E-2,null,7.3400000000000007,7.3400000000000007,7.34,7.3400000000000007,null,7.3400000000000007,7.3400000000000007,7.34,7.3400000000000007,null,4845295.4800000004,null,0,0,0,0,null,0,98886,null,232866,null,155664]
[null,876,"Halton",null,5.3826513905417492,5.4339731550626773,7.7888564593301437,5.0575639315113259,null,4.6499999972832171,0.26121019926948974,0.13215850503490467,0,0,0,0.28834301359228109,5.0939675361856437E-2,null,4.6499999972832171,4.6499999999999995,4.6500000000000004,4.6499999966141914,null,7850037.8300000001,null,75000,13801,4566,56633,null,8593,274339,null,0.97966541424169085,null,7.7997213287334138E-2,null,5.3700000016597365,0,5.37,5.3700000017250149,null,5.3700000016597365,0,5.37,5.3700000017250149,null,1294181.17,null,0,0,0,0,null,1407,44906,null,164013,null,62100]
[null,205,"Hammersmith and Fulham",null,8.5019831551843446,7.9634237217119574,15.911982156210815,7.1991912687127968,null,6.4800000032778122,0.71168717372097767,0.109995813792556,0,0,0,0.85529908236827557,0.34500108202472302,null,6.4800000032778122,6.4800000007091381,6.4800000170452199,6.4800000019170323,null,12940432.209999999,null,547318,109463.6,229873.56,207980.84,null,20000,650000,null,0.95028459666029608,null,0.11253336916294703,null,7.5599999632863941,7.5599999074575344,7.5599999259660047,7.5599999813341334,null,7.5599999632863941,7.5599999074575344,7.5599999259660047,7.5599999813341334,null,1153141.99,null,0,0,0,0,null,0,0,null,94228,null,55476]
[null,850,"Hampshire",null,5.0955190006825521,5.162807960861862,7.0049406010967177,5.0582284528643129,null,4.7700000000331491,3.7777071350432234E-2,0.15541249066653984,0,0,0,3.8386144773636721E-2,9.3943293858796614E-2,null,4.7700000000331482,4.7700000192836702,4.7699999971287887,4.7699999998357629,null,75441604.029999971,null,1417000,22039,14804.36,1380156.64,null,1200396,4022562,null,0.98032105717499574,null,3.8924477818488186E-2,null,6.0096638087263159,6.009664219063116,6.0096637993886652,6.0096638025935736,null,5.9399999998142308,5.9400001372138229,5.9399998117386117,5.9400000019282793,null,6395000.0199999996,null,75000.009999999995,1116.95,1628.17,72254.89,null,36000,263438,null,734000,null,450000]
[null,309,"Haringey",null,6.5002693676265322,5.8897387550337861,13.697852227540062,5.8747928947575261,null,5.33,0.37,2.8631706641701501E-2,0,0,0,0.52029054029871546,0.25134712068611514,null,5.33,5.33,5.33,5.33,null,16586920.5,null,667167,222389,222389,222389,null,166436.04999999999,819016.29,null,0.97554996155438267,null,6.9585849999666244E-2,null,6.7399672192955817,6.9289536621823622,6.8679738228794838,6.6806746973996649,null,6.6300000000000008,6.6300000000000008,6.6300000000000008,6.6300000000000008,null,2532209.16,null,42000,14000,14000,14000,null,0,0,null,145601,null,91908]
[null,310,"Harrow",null,5.7778317227241223,5.7708220875212675,9.8776244211336763,5.7065110153215599,null,4.9000000000000004,6.0000000000000005E-2,0.24000000000000002,0.24000000000000002,0,0,5.1406724830898934E-2,0.2864249978932234,null,4.9000000000000004,4.9000000018682686,4.8999999758793136,4.9000000000000004,null,15965084.4,null,832719.1,177074.12,34521.870000000003,621123.11,null,0,876548.05,null,0.94965588688113156,null,9.9264705882352935E-2,null,6.9199999973454096,0,0,6.9199999973454096,null,6.9199999973454096,0,0,6.9199999973454096,null,2085444,null,0,0,0,0,null,0,0,null,122560,null,62928]
[null,805,"Hartlepool",null,4.8353024120889474,4.868293684351956,0,4.8246256814772472,null,4.5600000000000005,9.5214373016294755E-3,0.23524073063154896,0,0,0,0,3.0540244155768868E-2,null,4.5600000000000005,4.5599999999999996,0,4.5599999999999996,null,4972904.82,null,31609,0,0,31609,null,0,263406,null,0.94996118115696415,null,5.0941578246414133E-2,null,5.63,5.63,0,5.63,null,5.63,5.63,0,5.63,null,1410399.45,null,0,0,0,0,null,0,0,null,178369,null,51336]
[null,311,"Havering",null,5.6842262726630262,5.8567896475744794,0,5.6237435135185088,null,5.3400000024020686,0.1308604001131014,4.242058454750125E-2,0,0,0,0,0.17094528560035477,null,5.3400000024020686,5.340000004859089,0,5.3400000015408926,null,18361779.990000002,null,569327,142332,0,426995,null,0,790000,null,0.99374585186416531,null,3.1429739399682244E-2,null,6.4600000195549674,6.4600001558637912,0,6.460000012352908,null,6.4600000195549674,6.4600001558637912,0,6.460000012352908,null,1982105.01,null,0,0,0,0,null,0,0,null,120365,null,112608]
[null,884,"Herefordshire",null,4.7428343258845365,4.5875932628247424,0,4.8126530443659465,null,4.4800000010414971,2.8633883440889185E-2,0,0,0.16129563505645317,0,0,7.2904806345696835E-2,null,4.4800000010414971,4.4800000013429013,0,4.4800000009059424,null,8967723.3300000001,null,140000,15000,0,125000,null,0,39300,null,0.9738879519270095,null,4.0670746250598258E-2,null,5.6802679280565407,5.63,0,5.681546391752577,null,5.63,5.63,0,5.63,null,1119998.42,null,10000,0,0,10000,null,0,353700,null,122598,null,49680]
[null,919,"Hertfordshire",null,5.9251941170813343,5.9404551291629506,8.6688694561785837,5.6290163485136198,null,5.4699999997057187,0.13196309565965347,0.10750780022663904,0,0,0,0.1747975644024567,4.0925657086866192E-2,null,5.4699999997057187,5.4700000005094456,5.4700000030349099,5.469999999027376,null,85980111,null,598000,148865.60999999999,151824.34,297310.05,null,0,2722275.79,null,0.98098623787080086,null,4.1942747456892311E-2,null,6.3200000057544887,6.32,6.3200000390163451,6.3200000033546857,null,6.3200000057544887,6.32,6.3200000390163451,6.3200000033546857,null,8346875.0099999998,null,0,0,0,0,null,0,245671.19999999998,null,1054000,null,388000]
[null,312,"Hillingdon",null,7.2089953411794303,6.5587536144593903,24.644386446886447,6.9093167898866472,null,6,0.52103501739726654,0,0,0,0,0.10147570194211716,0.58648462184004757,null,6,6,6,6,null,24842123.799999997,null,2200000,0,1586955,613045,null,0,293000,null,1.1210598800058855,null,7.9900662395956071E-2,null,6.79,0,0,6.79,null,6.79,0,0,6.79,null,113997.31,null,0,0,0,0,null,0,0,null,185000,null,114000]
[null,313,"Hounslow",null,6.3375604216432881,6.3375604368634191,0,6.3375604114595241,null,5.9899999986553913,5.5681708201824068E-2,0,0,0,0,0,0.29187871478607358,null,5.9899999986553913,5.99,0,5.9899999977557146,null,18434562.73,null,889999.96,356777.96,0,533222,null,0,307000,null,0.98869897373530236,null,9.210162046517931E-3,null,6.9199999905002265,0,0,6.9199999905002265,null,6.9199999905002265,0,0,6.9199999905002265,null,2913753.88,null,0,0,0,0,null,0,0,null,136848,null,101016]
[null,921,"Isle of Wight",null,4.6276470967053376,4.6801476762620586,0,4.6176470018466071,null,4.160000002023537,0.1899991455613548,1.0000001180396786E-2,0.15999997672932051,0,0,0,0.10764797121072943,null,4.160000002023537,4.1599999894607294,0,4.1600000044164496,null,5360908.169999999,null,127675,20428,0,107247,null,0,288871,null,0.95023554347132189,null,7.9645839186236259E-2,null,5.6576483548069794,5.6576495163725005,0,5.6576481335596807,null,5.5500000031067351,5.5499998252440079,0,5.5500000369848479,null,893220.83000000007,null,17325,2772,0,14553,null,0,39199,null,89439,null,52992]
[null,420,"Isles of Scilly",null,5.0453699427709608,0,0,5.0453699427709608,null,4.8700000584566281,0,0,0,0,0,0,0.17536988431433298,null,4.8700000584566281,0,0,4.8700000584566281,null,83309.63,null,3000,0,0,3000,null,0,73498,null,"-",null,"N/A",null,5.63,0,0,5.63,null,5.63,0,0,5.63,null,34928.519999999997,null,0,0,0,0,null,0,0,null,0,null,0]
[null,206,"Islington",null,8.488216384570217,7.6016330147965467,15.462378306216104,8.3508807893297092,null,6.2,0.5674069081718619,4.2908478210921343E-2,1.2958566286283221E-2,0,0,0.22264072911082178,1.4423017027903295,null,6.2,6.2,6.2,6.2,null,13799776.199999999,null,2824820,726642.6,507192.64,1590984.76,null,112484,783114,null,1.0380862759574161,null,9.1345292156305657E-2,null,7.4783736454475749,7.48,7.48,7.4776007155760569,null,6.18,6.18,6.1800000000000006,6.18,null,2516158.64,null,0,0,0,0,null,0,127853,null,199530,null,118404]
[null,207,"Kensington and Chelsea",null,8.1246444650389442,7.8934838699701579,11.576052435357788,7.5175596183522861,null,7.1899999999999995,0.32368896321317597,0,0,0,0,0.50001146421721954,0.1109440376085495,null,7.1899999999999995,7.1899999999999995,7.19,7.1899999999999995,null,10834787.43,null,150000,150000,0,0,null,430000,570000,null,0.95008045159085741,null,4.3079899207692611E-2,null,7.56,7.5600000000000005,7.56,7.56,null,7.56,7.5600000000000005,7.56,7.56,null,749997.36,null,0,0,0,0,null,0,0,null,82873,null,23184]
[null,886,"Kent",null,5.0307265192747455,5.7113907970979936,7.8087452147017178,4.9553333985595458,null,4.5500000001774854,6.2412436974372702E-2,0.31381698177849909,0,0,0,7.4481523775258218E-3,9.7048947966863391E-2,null,4.5500000001774845,4.5500000020794023,4.550000023315433,4.5499999999025702,null,83393018.239999995,null,1640400,132290.69,11701.62,1496407.69,null,0,3847900,null,0.99203677937257384,null,7.6372695373688737E-2,null,5.6799999981668634,5.6800000101576416,5.6799975691402356,5.6800000010766558,null,5.6799999981668634,5.6800000101576416,5.6799975691402356,5.6800000010766558,null,8675841.9299999997,null,0,0,0,0,null,0,425900,null,841818,null,737748]
[null,810,"Kingston upon Hull, City of",null,4.7994492430084277,4.7138885769148464,7.1282791573999438,4.7144703600994866,null,4.38,0.18000006174482647,0,0,0,0,8.8997620766020039E-2,0.15045156049758099,null,4.3800000000000008,4.38,4.38,4.38,null,13552869.620000001,null,438600,214300,5000,219300,null,0,677525,null,0.963282470187238,null,3.9473697216563575E-2,null,5.7623053049239434,0,0,5.7623053049239434,null,5.53,0,0,5.53,null,3570732.06,null,150000,0,0,150000,null,0,174640,null,518721,null,30000]
[null,314,"Kingston upon Thames",null,6.0202983781396142,6.1129254012009318,10.124842105263157,5.7940238695296955,null,5.6499999999999995,7.6350596218865974E-2,1.8337068643318008E-2,0,0,0,0.12322510128309701,0.15238561199433248,null,5.65,5.65,5.65,5.6499999999999995,null,11552100.010000002,null,300000,160000,20000,120000,null,137000,217200,null,0.95619594652787299,null,1.6482648036959126E-2,null,6.7500000000000009,6.75,6.75,6.75,null,6.7500000000000009,6.75,6.75,6.75,null,1079199.99,null,0,0,0,0,null,0,0,null,67500,null,56300]
[null,382,"Kirklees",null,4.8079070294138146,4.7940706060105898,8.0524321130378933,4.780142874102399,null,4.6999999999999993,6.325368287339779E-2,0,0,0,0,2.4897522711603309E-2,1.9755823828814127E-2,null,4.6999999999999993,4.7,4.7,4.7,null,24236802.149999999,null,100000.59999999999,21717.3,891.62,77391.679999999993,null,0,744100,null,0.982137475708873,null,1.3279511670946839E-2,null,5.6,5.6,5.6,5.6,null,5.6,5.6,5.6,5.6,null,4409860,null,0,0,0,0,null,0,0,null,481310,null,149040]
[null,340,"Knowsley",null,5.1320924247714972,5.2761742881472742,0,4.9715051012980567,null,4.5299999998185854,5.9185395783970279E-2,0.36779106135692141,0.12522680520397303,0,0,0,4.9889162608047231E-2,null,4.5299999998185863,4.5299999975907115,0,4.5300000023016755,null,11205687.359999999,null,110000,55000,0,55000,null,42240.7,585213.93999999994,null,0.99062503474797614,null,0.10865430480830406,null,5.46,5.4599999817710128,0,5.4600000018433104,null,5.46,5.4599999817710128,0,5.4600000018433104,null,1956951.36,null,0,0,0,0,null,27598.63,40501.01,null,176347,null,105984]
[null,208,"Lambeth",null,7.3629454693722112,6.9915821513647369,12.123291249295878,6.9227502501325597,null,6.3300000006485373,0.31999999935146201,0.25,0,0,0,0.34294519439211824,0.12000027498009312,null,6.3300000006485391,6.3299999975252339,6.3299999999999992,6.3300000030738257,null,22336226.07,null,370064,111019.2,222038.39999999999,37006.400000000001,null,0,1104990,null,0.95222666513957599,null,8.2608695558182912E-2,null,7.5600000097910565,7.56,7.56,7.5600000137402237,null,7.5600000097910565,7.56,7.56,7.5600000137402237,null,3088532.92,null,0,0,0,0,null,0,0,null,260810,null,77832]
[null,888,"Lancashire",null,5.1622936137485116,5.0059836814186234,8.5870710390563794,4.8447816308705045,null,4.75,9.590824452479281E-2,3.8179755564621137E-3,0,0,0,0.27764007044142547,3.492732322583169E-2,null,4.75,4.7500000026201992,4.7499999977922691,4.7499999997782663,null,73400504.489999995,null,500000,166670,166670,166660,null,0,0,null,1.0037703247903118,null,2.0563268018783967E-2,null,5.43,5.4300000000000006,5.43,5.43,null,5.43,5.4300000000000006,5.43,5.43,null,10897781.939999999,null,0,0,0,0,null,0,0,null,974805,null,437184]
[null,383,"Leeds",null,5.0797384252692428,5.0871608598457323,0,5.0746185152801493,null,4.84,0.18980182977523505,0,0,0,0,0,4.9936595494008196E-2,null,4.84,4.84,0,4.84,null,47037997.509999998,null,467000,219042,0,247958,null,0,1832000,null,0.96207167145250827,null,3.7735448870302044E-2,null,5.87,5.87,0,5.87,null,5.87,5.87,0,5.87,null,7303002.0099999998,null,0,0,0,0,null,0,0,null,606000,null,292000]
[null,856,"Leicester",null,4.8252719543415274,4.6437311354877782,0,4.9422448125378819,null,4.4199999995642187,6.2070199045455451E-2,9.4806416857314321E-2,0,0,0,0,0.24839533887453946,null,4.4199999995642187,4.4199999983936191,0,4.420000000318475,null,18904845.109999999,null,1026000,0,0,1026000,null,0,231462.88,null,0.95929859927266947,null,3.4275911081505815E-2,null,5.3000000055711496,0,0,5.3000000055711496,null,5.3000000055711496,0,0,5.3000000055711496,null,3805319.02,null,0,0,0,0,null,0,0,null,481204,null,101016]
[null,855,"Leicestershire",null,4.5382098227902326,0,8.24,4.5135750753695199,null,4.4399999994477168,3.0086253746566299E-2,0,0,0,0,2.5121139454591102E-2,4.3002430141357774E-2,null,4.4399999994477168,0,4.4400000000000004,4.4399999994440416,null,32557281.699999999,null,311452.2,0,0,311452.2,null,946000,1681915,null,0.95353256394352259,null,6.7305756628447452E-3,null,5.3458400368112828,0,0,5.3458400368112828,null,5.3300000087313286,0,0,5.3300000087313286,null,3052227.17,null,9070.7999999999993,0,0,9070.7999999999993,null,0,152611,null,372767,null,232668]
[null,209,"Lewisham",null,6.12326074155109,6.0529455656382334,10.348417136591479,5.9342963728767462,null,5.5099999993431386,0.23000000059974318,0,0,0,0,0.13929406737211639,0.24396667423609203,null,5.5099999993431386,5.51,5.5100000000000007,5.5099999990970892,null,20586340.710000001,null,854249,258649.51,100664.7,494934.79,null,462408,1085465,null,0.96619695045404397,null,4.0069686516033431E-2,null,6.7800000096836204,6.7799996536711582,6.780000187996869,6.7800000106028309,null,6.7800000096836204,6.7799996536711582,6.780000187996869,6.7800000106028309,null,3080666.0300000003,null,0,0,0,0,null,0,0,null,89644,null,124200]
[null,925,"Lincolnshire",null,4.7512784874061156,4.8587956708214399,7.7508551318775192,4.612068643439506,null,4.4199999996323474,0.14462503165452267,0,0,0,0,9.4954442343274423E-2,9.1699013775971061E-2,null,4.4199999996323482,4.4200000026680337,4.4199999893222737,4.4199999994492156,null,36210027.939999998,null,698370,40000,30000,628370,null,0,1676905,null,0.95612403389380718,null,3.1683879982086854E-2,null,5.29,5.2899999246071463,5.29,5.2900000059730079,null,5.29,5.2899999246071463,5.29,5.2900000059730079,null,4648026.76,null,0,0,0,0,null,249434,0,null,798596,null,274896]
[null,341,"Liverpool",null,5.113180856111148,4.8926006018261559,10.253175898554236,4.7882683652398157,null,4.5199999999999996,0.13848673357245508,0,0,0,1.9356513997940031E-2,0.29386585372165602,0.1414717548190973,null,4.5199999999999996,4.5199999999999996,4.5199999999999996,4.5200000000000005,null,28817070.009999998,null,820000,351919.04,0,468080.96,null,3030660.95,1492383.24,null,1.0557676447604822,null,3.3742739809072622E-2,null,5.54,5.54,5.54,5.5400000000000009,null,5.54,5.54,5.54,5.5400000000000009,null,5361528.9000000004,null,0,0,0,0,null,457808,119489.63,null,563486,null,284832]
[null,821,"Luton",null,5.5893493593010435,5.2802516663523322,7.970839815431761,5.1640358397592117,null,4.8399999992762277,0.16462933402545304,4.1725495060966178E-2,0,0,0,0.40297382995405984,0.14002070098433628,null,4.8399999992762277,4.84,4.84,4.8399999989625471,null,15058121.98,null,386919,63941,55965,267013,null,334008,208929,null,0.97488261829830503,null,4.0891858798080917E-2,null,5.7704227827852606,0,5.7704218801778024,5.7704230092250182,null,5.6099999999999994,0,5.61,5.61,null,2447906.67,null,70000,0,14039,55961,null,0,208929,null,252339,null,108468]
[null,352,"Manchester",null,5.3035502498756317,5.25,7.3580012531328318,5.2467977494898639,null,4.7,0.33883394081670476,0.1286955256492377,0,0,0,5.6512048329881354E-2,7.950873507980738E-2,null,4.7,4.7,4.7,4.7,null,32133392.800000001,null,489063,0,0,489063,null,97097,783734,null,0.97459696497959813,null,9.0474465506180157E-2,null,5.62,5.62,5.6199999999999992,5.62,null,5.62,5.62,5.6199999999999992,5.62,null,7201243.2000000002,null,0,0,0,0,null,0,100841,null,856335,null,269928]
[null,887,"Medway",null,4.7777849944008954,4.7300000000000004,0,4.8069159039325067,null,4.24,0.39,0.05,0.05,0,0,0,4.7784994400895855E-2,null,4.24,4.24,0,4.24,null,15839587.5,null,160020,0,0,160020,null,0,842211,null,0.94985785176956172,null,0.10359408033826638,null,5.76,5.76,0,5.76,null,5.76,5.76,0,5.76,null,2135064.96,null,0,0,0,0,null,0,139339,null,176160,null,119232]
[null,315,"Merton",null,6.2896757053509154,6.29276025532858,0,6.2866702048804814,null,6.1800000024594581,9.5695654093359298E-2,0,0,1.0638875670443014E-2,0,0,3.3411731276549077E-3,null,6.1800000024594581,6.1800000026579216,0,6.1800000022660795,null,15335904.73,null,8151,1482,0,6669,null,0,0,null,1.0177468778884975,null,1.691518789188514E-2,null,7.220465564641211,7.5843448275862073,0,7.1898453440477113,null,6.9199999910784022,6.92,0,6.9199999903276552,null,1618648.59,null,0,0,0,0,null,0,0,null,101780,null,67068]
[null,806,"Middlesbrough",null,5.1509761328582231,4.8838083426516388,0,5.7571600407360943,null,4.5799999971568797,0.12575269695655567,0,0.36321035387421396,0,0,0,8.2013084870573835E-2,null,4.5799999971568797,4.579999999054726,0,4.5799999928508077,null,9271013.9900000002,null,150000,105000,0,45000,null,0,144531.26999999999,null,0.98489027396906748,null,9.6462145452980819E-2,null,5.6300000000000008,5.6300000204736378,0,5.6299999942253844,null,5.6300000000000008,5.6300000204736378,0,5.6299999942253844,null,2499888.9000000004,null,0,0,0,0,null,0,0,null,248819,null,86112]
[null,826,"Milton Keynes",null,5.2199036051010204,5.3284129376137495,10.006216959179424,5.082747802888365,null,4.9099999999999993,8.5249754420162083E-2,6.5169408837354101E-2,0,0,0,6.0757496922689377E-2,9.8726944920814935E-2,null,4.9099999999999993,4.9099999976931823,4.909999983801038,4.9100000012566207,null,18622093.719999999,null,359000,91912,5760,261328,null,1723983,593000,null,0.99527398816965162,null,2.9724645015510469E-2,null,5.68,5.68,5.68,5.6800000000000006,null,5.68,5.68,5.68,5.6800000000000006,null,2048753.28,null,0,0,0,0,null,0,0,null,173841,null,95220]
[null,391,"Newcastle upon Tyne",null,5.3307188162009371,5.3043735075588652,8.6974039492340136,5.053076471866901,null,4.7499999991700497,0.34384283779869151,0,0,0,0,0.15388088052766905,8.299509870452719E-2,null,4.7499999991700497,4.7500000000000009,4.75,4.7499999984722594,null,15807330.190000001,null,250000,102315,17017,130668,null,695560,623639,null,1.0051580332886527,null,6.7501658139752618E-2,null,5.63,5.63,5.63,5.63,null,5.63,5.63,5.63,5.63,null,3143459.83,null,0,0,0,0,null,0,0,null,400894,null,129996]
[null,316,"Newham",null,6.3343262728963845,5.8387706840369242,8.9937500979993068,5.8408877569514113,null,5.3800000017911431,5.6145690827776491E-2,0.17640000110663601,0,0,0,0.49375426087840557,0.22802631829242423,null,5.3800000017911431,5.3800000022495889,5.3800000018519549,5.3800000011121476,null,25227810.479999997,null,942077,452196.96,150732.32,339147.72,null,0,1137600,null,0.95434183163358099,null,4.1433193531837574E-2,null,6.3899999998522183,6.3899999849324525,6.3900000140282431,6.3900000011617744,null,6.3899999998522183,6.3899999849324525,6.3900000140282431,6.3900000011617744,null,4323957.0199999996,null,0,0,0,0,null,0,0,null,112735,null,134137]
[null,926,"Norfolk",null,4.6756126328486154,4.8923768861351418,8.0903025605603034,4.5706935116899015,null,4.3099999999999996,4.2962364751908483E-2,0.10751046816288934,6.4325792531492829E-2,0,0,4.9343617894506128E-2,0.10147038950781848,null,4.3099999999999996,4.3100000000000005,4.3099999999999996,4.3099999999999996,null,38316802.82,null,850000,127500,42500,680000,null,210784.18,2052320,null,0.95000013789253424,null,4.7471422095630732E-2,null,5.6970540861940124,5.6399999259456051,5.64,5.703262310845691,null,5.6399999954356739,5.6399999259456051,5.64,5.6400000000000006,null,4942678.0100000007,null,50000,0,0,50000,null,0,0,null,631229,null,275724]
[null,812,"North East Lincolnshire",null,4.8886711669670886,4.8130185185185184,7.5283251809821961,4.7682034814259975,null,4.57,2.4920056054092758E-2,1.9963085649650776E-2,0,0,0,0.12334463516084906,0.15044339010249652,null,4.5699999999999994,4.57,4.57,4.5699999999999994,null,8503673.6999999993,null,270000,17290,5434,247276,null,0,435910,null,0.97850647470354013,null,9.7257374294364828E-3,null,5.5196911932217381,0,0,5.5196911932217381,null,5.4300000000000006,0,0,5.4300000000000006,null,1816231.83,null,30000,0,0,30000,null,0,95591,null,156415,null,60444]
[null,813,"North Lincolnshire",null,4.8080498541738717,4.857639764554893,0,4.7950369401706707,null,4.5799999986667306,1.5332650105062604E-2,3.0301596211122351E-3,0,4.302826661979374E-2,0,0,0.16665877916117292,null,4.5799999986667306,4.5799999941689755,0,4.5799999998469882,null,7658657.7199999997,null,275000,30250,0,244750,null,0,393000,null,0.98727923083652391,null,1.322686999517717E-2,null,5.6300000022046666,5.63,0,5.6300000022436949,null,5.6300000022046666,5.63,0,5.6300000022436949,null,1276836.99,null,0,0,0,0,null,0,0,null,205686,null,48057]
[null,940,"North Northamptonshire",null,4.7792125325000008,4.8421118212847656,8.0469391949558471,4.4105956781017861,null,4.25,0.125,7.4999999999999997E-2,0,0,0,0.25421253249999998,7.4999999999999997E-2,null,4.25,4.25,4.25,4.25,null,18816850.130000003,null,300000,74840.850000000006,21529.88,203629.27,null,736315.27,991385.01,null,0.95518835699797167,null,4.49438202247191E-2,null,5.7500000124035724,5.7500000745637649,5.75,5.75,null,5.7500000124035724,5.7500000745637649,5.75,5.75,null,2317880.7800000003,null,0,0,0,0,null,0,0,null,252982,null,125856]
[null,802,"North Somerset",null,4.8438374347336843,5.2635700625972515,0,4.7755088795480338,null,4.400000001797757,0.18251355978120837,0,0,0,0,0,0.26132387315471861,null,4.400000001797757,4.4000000000000004,0,4.4000000020904144,null,10196071.32,null,581444.4,87425.27,0,494019.13,null,23888,221983,null,0.99478967971202337,null,3.9828263970989958E-2,null,6.0177858526263046,6.0149935881604391,0,6.0181441088215628,null,5.7199999906852552,5.7199998197886046,0,5.720000012611826,null,1228160.3599999999,null,63938.6,7202.5,0,56736.1,null,0,13603,null,92747,null,69552]
[null,392,"North Tyneside",null,4.946112187574875,5.0157000899160051,7.6319547728880623,4.7632758579811423,null,4.6399999951338575,6.3214263244821031E-2,0.11177071921446537,0,0,0,5.2641055943925971E-2,7.8486154037804956E-2,null,4.6399999951338584,4.6399999969540646,4.6399999146336128,4.6399999962967255,null,12403782.789999999,null,200000,125448,3281,71271,null,0,656296.94999999995,null,0.97092681183153762,null,3.6341750446489608E-2,null,5.6000000000000005,5.6,5.6000000000000005,5.6,null,5.6000000000000005,5.6,5.6000000000000005,5.6,null,1817537.96,null,0,0,0,0,null,0,0,null,120934,null,92736]
[null,815,"North Yorkshire",null,4.7859997361284492,4.7272756279547474,7.5686414498340309,4.7205802258875744,null,4.57,6.3295842216350984E-2,0,0,0,0,6.285396060874468E-2,8.9849933303352988E-2,null,4.57,4.57,4.57,4.57,null,30931369.130000003,null,591800,79000,14200,498600,null,0,1559100,null,0.96984519079452969,null,1.3661083680353386E-2,null,5.7794762580414094,5.7772788285539969,5.7825758707312103,5.7794718008884463,null,5.6400000000000006,5.6400000000000006,5.64,5.6400000000000006,null,3275396.16,null,81000,2700,2100,76200,null,0,33000,null,290619,null,159804]
[null,929,"Northumberland",null,4.8629460218133342,5.0071124566642657,0,4.7019486074799248,null,4.5800000013653444,0.10136755371038976,0.13658414436944058,0,0,0,0,4.4994322368159041E-2,null,4.5800000013653444,4.5800000023526852,0,4.5800000002627357,null,15526470,null,145000,76500,0,68500,null,0,859830,null,0.99855154452019179,null,4.9388560310231498E-2,null,5.6752441202452681,5.6752712739619433,0,5.675234784564851,null,5.6300000113110267,5.63,0,5.6300000151998555,null,2488721.7999999998,null,20000,5120,0,14880,null,0,0,null,225505,null,109296]
[null,892,"Nottingham",null,5.41111386917731,8.4418688904331702,5.4098098554376879,5.3202216327584351,null,4.9600000006212639,0.23240101722009729,0,3.6655214393017645E-2,0,0,9.414880380466932E-2,8.7908833138261686E-2,null,4.9600000006212639,4.96,4.96,4.9600000014142225,null,17136697.469999999,null,283000.01,138224.68,14204.3,130571.03,null,0,960000,null,0.98853212959723025,null,5.1454071186789858E-2,null,5.6784947474115546,5.6878443113772459,5.6795909554242998,5.6781067942086931,null,5.6600000107269466,5.66,5.6600000702182269,5.6600000057978166,null,3060330.1399999997,null,10000,418.5,837,8744.5,null,0,65000,null,389861,null,134136]
[null,891,"Nottinghamshire",null,4.8767159250399885,4.8774103535061997,0,4.8762145956286993,null,4.699999999682503,2.6595530229451193E-2,9.1912560118282305E-2,0,0,0,0,5.820783500975197E-2,null,4.6999999996825039,4.699999999747571,0,4.6999999996355282,null,45529600.079999998,null,550000,300000,0,250000,null,0,1214416,null,1.001379040049279,null,2.4594353300544079E-2,null,5.6600000047294152,5.6600000580159895,0,5.6600000006113893,null,5.6600000047294152,5.6600000580159895,0,5.6600000006113893,null,5983827,null,0,0,0,0,null,0,0,null,765005,null,267444]
[null,353,"Oldham",null,4.8028123580248323,4.8028123537701317,0,4.8028123617556329,null,4.6000000000000005,0.14143479234767289,0,0,0,0,0,6.1377565677159067E-2,null,4.6000000000000005,4.6000000000000005,0,4.5999999999999996,null,14986556.4,null,194000,90636,0,103364,null,0,686536,null,0.95673552948701845,null,2.9829534421930311E-2,null,5.46,0,0,5.46,null,5.46,0,0,5.46,null,3495699.48,null,0,0,0,0,null,0,172729,null,270016,null,129996]
[null,931,"Oxfordshire",null,4.9176662913914937,4.9564611731739152,7.7201833986438348,4.7581235069113808,null,4.5800000005093322,3.5466508855511066E-2,7.0000050423781324E-2,0,0,0,0.12733278111652821,0.10486695048634248,null,4.5800000005093322,4.5800000019119613,4.5800000101994529,4.5799999997521086,null,37797017.379999995,null,823566.01,118777.09,88512.75,616276.17000000004,null,0,1646603,null,0.95620670118811169,null,2.2509297192391083E-2,null,6.2100000067240808,6.2100000338922925,6.2100000121069918,6.2100000056197358,null,6.2100000067240808,6.2100000338922925,6.2100000121069918,6.2100000056197358,null,3417121,null,0,0,0,0,null,0,0,null,371162,null,211968]
[null,874,"Peterborough",null,5.9861803867763586,5.7203106467339548,8.9305716233757781,5.9116924161156197,null,5.4299999985606071,0.10334322070429051,0,0.2021013950773432,0,0,8.9594081517761784E-2,0.16114169091635547,null,5.4299999985606071,5.4299999400459846,5.4299999495738058,5.4300000016709946,null,16592185.09,null,459000,0,0,459000,null,170000,586555,null,1.0969186770747896,null,5.3255612479951225E-2,null,6.0099999952172309,6.0099999128212733,6.0100000692765452,6.009999998066708,null,6.0099999952172309,6.0099999128212733,6.0100000692765452,6.009999998066708,null,2638848.02,null,0,0,0,0,null,30000,53849,null,192167,null,85179]
[null,879,"Plymouth",null,5.0144017403170649,4.8460375804049551,11.360143696649939,4.8497939605215672,null,4.4700000007237088,0.14218166147912187,7.0000000723708822E-2,0,0,0,0.16399676010036973,0.1682233172901563,null,4.4700000007237088,4.470000017603712,4.4700000000000006,4.47,null,13392619.549999999,null,464892.27,18620.439999999999,13841.02,432430.81,null,0,687896.36,null,0.95105980004248958,null,4.5316836782067348E-2,null,5.865921266387736,5.8641518401421706,5.8781540905836023,5.8656676088936273,null,5.8,5.8000000000000007,5.8,5.8,null,2048595.96,null,23283.8,931.35,698.51,21653.94,null,0,0,null,155684,null,125856]
[null,851,"Portsmouth",null,4.9599999991477786,4.9599999829555843,0,4.9600000017837171,null,4.6899999987216683,0.19999999999999998,3.0000003834993523E-2,0,0,0,0,3.9999996591116867E-2,null,4.6899999987216683,4.6900000048698329,0,4.6899999977208049,null,11546303.729999999,null,93872.38,13142.13,0,80730.25,null,140800,610200,null,0.95075688300537864,null,4.674796823485259E-2,null,5.9399999880923362,0,0,5.9399999880923362,null,5.9,0,0,5.9,null,1981916.79,null,13436.72,0,0,13436.72,null,43700,104100,null,173600,null,89400]
[null,870,"Reading",null,5.992377367265652,5.5661376005324321,8.6170210473752711,5.5871960708280177,null,5.33,0.11544923912556508,0,0,0,0,0.38692369068368831,0.16000443745639878,null,5.33,5.33,5.33,5.3299999999999992,null,10935395.959999999,null,300000,62500,62500,175000,null,0,738600,null,0.96413340162151084,null,2.1201049547218628E-2,null,6.51,6.51,6.51,6.5100000000000007,null,6.51,6.51,6.51,6.5100000000000007,null,1217493.69,null,0,0,0,0,null,0,0,null,138692,null,56304]
[null,317,"Redbridge",null,5.3499999987570526,5.3500000006667676,0,5.3499999983194888,null,5.0599999990056439,0.1299999982598756,0,0,0,0,0,0.1600000014915352,null,5.0599999990056439,5.059999999733293,0,5.0599999988389195,null,20877817.659999996,null,643632.15,119981.79,0,523650.36,null,223259.9,1144458.4099999999,null,0.94999999978374039,null,2.5048169234753243E-2,null,6.6300000051023318,6.629996651140134,0,6.6300000107328865,null,6.6300000051023318,6.629996651140134,0,6.6300000107328865,null,2598811.4899999998,null,0,0,0,0,null,0,0,null,107187,null,96876]
[null,807,"Redcar and Cleveland",null,4.7878349674661713,4.8276255282248401,0,4.6992941656466742,null,4.37,8.8924806076950094E-2,0.21728906589514166,0,0,0,0,0.11162109549407961,null,4.37,4.37,0,4.37,null,6284045.8399999999,null,150000,50000,0,100000,null,0,0,null,0.97313718850938447,null,6.5483290618389256E-2,null,5.4500000036569647,0,0,5.4500000036569647,null,5.4500000036569647,0,0,5.4500000036569647,null,1490306.97,null,0,0,0,0,null,0,0,null,117648,null,63200]
[null,318,"Richmond upon Thames",null,5.8297618300172793,5.9864345098527645,5.63,5.7898468337415823,null,5.6300000017606218,9.2836269705988614E-2,0,0,0,0,0,0.10692555855066882,null,5.6300000017606218,5.6300000093880183,5.63,5.6299999996045473,null,13326900.049999999,null,249000,149000,0,100000,null,234200,198300,null,0.95414856863478559,null,1.6222073339553562E-2,null,6.9200000093021172,6.92,6.92,6.9200000102535277,null,6.9200000093021172,6.92,6.92,6.9200000102535277,null,892700,null,0,0,0,0,null,0,0,null,51100,null,53000]
[null,354,"Rochdale",null,4.8655197624448325,4.7110764292614027,7.9229877038704695,4.81376055181277,null,4.4399999999999995,0.20530789048402409,1.59028328345013E-2,0,0,1.5498336823949735E-2,8.7353339758966295E-2,0.10145736254339113,null,4.4400000000000004,4.439999998136261,4.4400000215360276,4.4400000000000004,null,13147764.129999999,null,280000,0,0,280000,null,81006,641600,null,0.95387277031053885,null,5.0614450695648752E-2,null,5.5599999929855439,5.5599996780161502,5.5600002391043155,5.5599999943471428,null,5.5599999929855439,5.5599996780161502,5.5600002391043155,5.5599999943471428,null,2536476,null,0,0,0,0,null,0,75000,null,273044,null,133308]
[null,372,"Rotherham",null,5.1436277056220323,4.7861495018834468,8.1139279372546973,4.843594212615522,null,4.5600000000000005,9.8064460539886017E-2,0,0,0,0,0.32681332534822372,0.15874991973392286,null,4.5599999999999996,4.5600000000000005,4.5600000000000005,4.5599999999999996,null,15215581.739999998,null,484560,155059.20000000001,58147.199999999997,271353.59999999998,null,0,748319,null,0.98503361559791602,null,2.1052619896230459E-2,null,6.0113370676466547,6.240140542947052,6.0876007770762506,5.9350698305045544,null,5.6300000000000008,5.63,5.63,5.63,null,2782098.2800000003,null,188440,60300.800000000003,22612.799999999999,105526.39999999999,null,0,0,null,336211,null,145728]
[null,857,"Rutland",null,4.7869017739866644,0,0,4.786929601389132,null,4.6399730209162016,1.5986313390455823E-3,0,0,0,0,0,0.14533012173141657,null,4.6399730209162016,0,0,4.6399999941867618,null,1596906.27,null,50000,0,0,50000,null,0,83775.27,null,0.98293670923750809,null,3.4441595623517713E-4,null,5.629999807948991,5.63,5.63,5.629999807930548,null,5.629999807948991,5.63,5.63,5.629999807930548,null,117260.51,null,0,0,0,0,null,0,0,null,6316,null,10764]
[null,355,"Salford",null,4.9787018166611423,5.206981833994659,0,4.8316789714563226,null,4.32,0.18362931944788272,0.33521098807960359,0,0,0,0,0.13986150913365586,null,4.32,4.32,0,4.32,null,17298684.740000002,null,500000,200000,0,300000,null,400000,958489,null,0.99231793839533478,null,0.10722410217182787,null,5.34,0,0,5.34,null,5.34,0,0,5.34,null,3483634.44,null,0,0,0,0,null,0,255822,null,313703,null,166428]
[null,333,"Sandwell",null,4.8196924586508247,4.5577182838017194,0,5.0642056074229114,null,4.4399999998017732,9.4985484776126811E-2,0,0.16577116176838444,0,0,0,0.11893581230454013,null,4.4399999998017732,4.4400000016424332,0,4.4399999980837972,null,18971268.170000002,null,480000,0,0,480000,null,150000,1046285.6,null,0.95046181996007695,null,5.5471207331523373E-2,null,5.8100000040069419,0,0,5.8100000040069419,null,5.8100000040069419,0,0,5.8100000040069419,null,4349951.07,null,0,0,0,0,null,0,0,null,339452,null,134964]
[null,343,"Sefton",null,4.9518952748500729,4.8599192088432002,11.154227089462786,4.6865635581210183,null,4.4900000013007935,0.1,9.9997157767389211E-2,0,0,0,0.15189981136550937,0.10999830441638071,null,4.4900000013007935,4.4900000031183271,4.49,4.49,null,14889062.690000001,null,338250,67650,135300,135300,null,30750,184500,null,0.98767798176257782,null,4.2643343052072347E-2,null,5.3500000115503727,5.35,5.35,5.3500000140699813,null,5.3500000115503727,5.35,5.35,5.3500000140699813,null,2315942.7800000003,null,0,0,0,0,null,0,129850,null,182000,null,96900]
[null,373,"Sheffield",null,4.9437518496799457,4.7145860420489702,7.7902490593309288,5.0023523727530756,null,4.5899999999668699,0.20228461494417194,0,0,0,0,4.7109431470978659E-2,0.10435780329792457,null,4.5899999999668699,4.5899999980444193,4.589999993004878,4.5900000012841033,null,29215048.16,null,630000,94500,12600,522900,null,0,1555823.78,null,0.97155603535892199,null,4.2210476046178426E-2,null,5.6300000123185869,5.6300000104985717,5.6300002541355028,5.6300000067491656,null,5.6300000123185869,5.6300000104985717,5.6300002541355028,5.6300000067491656,null,5392989.0600000005,null,0,0,0,0,null,0,0,null,787146,null,258336]
[null,893,"Shropshire",null,4.6776262092203718,4.6627745380584313,0,4.6875273257791292,null,4.4400000000000004,7.4258190381366301E-2,0,0,7.4258190381366301E-2,0,0,8.9109828457639567E-2,null,4.4400000000000004,4.4400000000000004,0,4.4399999999999995,null,15447846.08,null,300000,50000,0,250000,null,0,376340,null,0.96049819491178068,null,3.2366971900848973E-2,null,5.9038170211459962,5.5355253013823074,0,6.0265819324636203,null,5.29,5.29,0,5.2899999999999991,null,1723640.7,null,200000,20000,0,180000,null,0,0,null,145008,null,86940]
[null,871,"Slough",null,6.4137802867594109,5.9437931321172037,9.0523132085235236,5.9384404801043971,null,5.82,9.4251555218449259E-2,0,0,0,0,0.460681654516434,3.8847077024527561E-2,null,5.82,5.82,5.8199999999999994,5.82,null,13128263.33,null,80000,25000,25000,30000,null,63826,648854,null,0.9544006055206038,null,1.593634534115923E-2,null,6.52,6.5200000000000005,6.5200000000000005,6.5200000000000005,null,6.52,6.5200000000000005,6.5200000000000005,6.5200000000000005,null,1359895.96,null,0,0,0,0,null,0,71318,null,128051,null,52164]
[null,334,"Solihull",null,4.7607109790266895,4.9001300975644471,0,4.6367023080423211,null,4.4499999999999993,8.9088065324526428E-2,9.0397423044941277E-2,0,0,0,0,0.13122549065722225,null,4.4499999999999993,4.449999996741786,0,4.4500000028980722,null,13582360.439999999,null,385000,181239,0,203761,null,40986,750399,null,0.95303011373893909,null,3.8770072575102413E-2,null,5.85,0,0,5.85,null,5.85,0,0,5.85,null,1956084.39,null,0,0,0,0,null,0,75000,null,216069,null,101016]
[null,933,"Somerset",null,4.8565065633831432,4.8584859011689323,0,4.8563598391625691,null,4.6500000000000012,7.0000000000000007E-2,0,0,0,0,0,0.13650656338314215,null,4.6500000000000012,4.6499999999999995,0,4.6500000000000012,null,26866400.48,null,777000,54400,0,722600,null,0,830900,null,0.99722927379530657,null,1.4830508474576272E-2,null,5.6632606394240952,5.9334982332155475,0,5.646036036036036,null,5.46,5.46,0,5.46,null,2578758,null,96000,13400,0,82600,null,0,79600,null,141500,null,155700]
[null,803,"South Gloucestershire",null,4.8932499378760426,0,0,4.8932499378760426,null,4.51,4.181006946887865E-2,0,0,0,0,0,0.34143986840716373,null,4.51,0,0,4.51,null,16558975.23,null,1242120,0,0,1242120,null,0,889472,null,1.0006646089726059,null,9.1853721554241378E-3,null,5.8000000000000007,0,0,5.8000000000000007,null,5.8000000000000007,0,0,5.8000000000000007,null,1603073.6,null,0,0,0,0,null,0,84430,null,115580,null,91910]
[null,393,"South Tyneside",null,5.134988832761139,4.9296134781644874,7.5353262875260647,4.8115346684745948,null,4.33,0.17411059349908037,0.19051210638534175,0.12023617794842567,0,0,0.29144906823732153,2.8680886690970159E-2,null,4.33,4.33,4.33,4.33,null,8367819.1699999999,null,47000,17000,0,30000,null,0,417900,null,0.94971379897165709,null,0.10070053767621141,null,5.6300000000000008,5.63,5.63,5.63,null,5.6300000000000008,5.63,5.63,5.63,null,1659459.3900000001,null,0,0,0,0,null,0,0,null,149623,null,76176]
[null,852,"Southampton",null,5.7378223692296313,5.667917517225785,5.9646806501918439,5.6331212066105216,null,5.03,8.7462332334589818E-2,0.28727343815566164,0.19102934221741744,0,3.3523945780676558E-2,5.2371389398999824E-2,5.6161921342285828E-2,null,5.03,5.03,5.03,5.0299999999999994,null,14284597.75,null,141200,12300,123400,5500,null,234000,761300,null,1.0094948452740262,null,0.10645910207518723,null,6.11,6.11,6.1099999999999994,6.1099999999999994,null,6.11,6.11,6.1099999999999994,6.1099999999999994,null,2146326.91,null,0,0,0,0,null,40000,0,null,225353,null,127512]
[null,882,"Southend-on-Sea",null,5.0066194557353354,5.0066194503644752,0,5.0066194570780498,null,4.830000000537086,8.8000269402324832E-2,0,0,0,0,0,8.8619185795923552E-2,null,4.8300000005370869,4.8299999897953665,0,4.8300000032225165,null,9156821.2600000016,null,165000,33000,0,132000,null,0,273295,null,0.99932524066573547,null,1.789350641971579E-2,null,5.6800000248825553,5.6800003981208702,0,5.6800000052384325,null,5.6800000248825553,5.6800003981208702,0,5.6800000052384325,null,1369634.31,null,0,0,0,0,null,0,9645,null,198747.43,null,78660]
[null,210,"Southwark",null,7.2431571889117361,6.8660913522880325,12.057682795433898,6.6182302686019714,null,6.15,0.36745271816016029,0.14811800694550356,0,0,0,0.48993498012940867,8.7651483676664199E-2,null,6.15,6.15,6.1499999999999995,6.1499999999999995,null,20408969.149999999,null,250000,94000,94000,62000,null,0,875001.19,null,0.95654705506831861,null,7.7348324152316433E-2,null,7.2682043776808234,7.0392435064935057,7.1841280355582411,7.3105543209292803,null,6.8,6.8,6.8,6.8,null,3158529.04,null,0,0,0,0,null,126805.96,0,null,293489,null,111780]
[null,342,"St Helens",null,4.7267651832518141,4.8207671291349561,7.2635340407508124,4.588660531658654,null,4.4400000000000004,2.4809405333961452E-2,9.0044853376614831E-2,0,0,0,5.2708796830939916E-2,0.11920212771029878,null,4.4400000000000004,4.4400000000000004,4.4399999999999995,4.4400000000000004,null,9663340.629999999,null,250000,87128.77,5347.17,157524.06,null,159051.37,523000,null,0.95002729379956796,null,2.5215792248661349E-2,null,5.4799999938761692,5.4799997998951682,5.479999425012668,5.4800000104636837,null,5.4799999938761692,5.4799997998951682,5.479999425012668,5.4800000104636837,null,1789729.09,null,0,0,0,0,null,0,88180.91,null,148782,null,86940]
[null,860,"Staffordshire",null,4.721047688962912,0,36.880336847966035,4.6295883326171605,null,4.5200000000000005,5.789944510952004E-2,3.2440147390532512E-2,0,0,0,1.498457913872716E-2,9.572351732413098E-2,null,4.5200000000000014,0,4.5200000000000005,4.5200000000000005,null,46870033.320000015,null,970000,0,0,970000,null,202670,2484470,null,0.97044423078082498,null,1.9594997437285096E-2,null,5.67,0,0,5.67,null,5.67,0,0,5.67,null,5947376.4000000004,null,0,0,0,0,null,104890,0,null,552393,null,245916]
[null,356,"Stockport",null,4.9553591727711597,4.8404897328360832,7.5442057917651884,4.7741371169672124,null,4.5599999999999996,2.7815645623920086E-2,0.10205894349392013,0,0,0,0.13904957794730743,0.12643500570601179,null,4.5600000000000005,4.5600000000000005,4.5599999999999996,4.5599999999999996,null,19096468.34,null,500000,200000,50000,250000,null,70000,710000,null,0.98848748106542972,null,2.7692550546915475E-2,null,5.5,5.5,5.5,5.5,null,5.5,5.5,5.5,5.5,null,2165509.5,null,0,0,0,0,null,0,170000,null,219000,null,109000]
[null,808,"Stockton-on-Tees",null,4.7758662409128236,4.814532135552966,0,4.7027459101456843,null,4.3599999994579051,0.14271831566592938,0.2084570438304055,0,1.0481425509213819E-2,0,0,5.420945644936951E-2,null,4.3599999994579051,4.3599999994474983,0,4.3599999994775862,null,10452029.059999999,null,120000,79704.66,0,40295.339999999997,null,0,556423,null,0.95517324818256477,null,7.6595314211650306E-2,null,5.540000003183807,5.5399999553427746,0,5.5400000127304443,null,5.540000003183807,5.5399999553427746,0,5.5400000127304443,null,2088066,null,0,0,0,0,null,0,0,null,190437,null,115920]
[null,861,"Stoke-on-Trent",null,4.8522198479163752,4.8197741851822675,7.6118460667798535,4.8171729439163204,null,4.5599999991874585,0.22500000033855885,0,0,0,0,3.3363961174556069E-2,3.3855887215801662E-2,null,4.5599999991874594,4.5599999999999996,4.5599999999999996,4.5599999977995944,null,14231982.550000001,null,100000,63554.97,1353.74,35091.29,null,182000,601269,null,0.95989001516018313,null,4.7021943649079717E-2,null,5.63,5.63,5.63,5.63,null,5.63,5.63,5.63,5.63,null,2988938.85,null,0,0,0,0,null,0,0,null,451575,null,118404]
[null,935,"Suffolk",null,4.7113321104944754,4.7686861805802963,8.8038190086402928,4.6780052499499787,null,4.5999999999999996,6.744999905690649E-2,0,0,0,0,1.8968334200471688E-2,2.4913777237096868E-2,null,4.5999999999999996,4.5999999980175899,4.5999999999999996,4.6000000003456174,null,32001634.990000002,null,170126,28921.42,3402.52,137802.06,null,0,1338962,null,0.95958359433415197,null,1.4451145501405537E-2,null,5.7399999983195826,5.7399999999999993,5.7399999999999993,5.7399999982521903,null,5.7399999983195826,5.7399999999999993,5.7399999999999993,5.7399999982521903,null,4782143.87,null,0,0,0,0,null,0,0,null,322628,null,187575]
[null,394,"Sunderland",null,5.5027522405251768,5.1806151829856946,7.4974005557593024,5.1545320489589788,null,4.53,0.19849305534187492,0.19989267954636974,8.8742054981999538E-2,7.0881400329908051E-3,0,0.31130797973460195,0.16722833088734029,null,4.5299999999999994,4.53,4.53,4.5299999999999994,null,15952810.989999998,null,500000,260000,82000,158000,null,0,700000,null,0.97631773843959213,null,9.8366777383462001E-2,null,5.6299999874923561,5.6299999862124803,5.6299999689494582,5.6299999946402206,null,5.6299999874923561,5.6299999862124803,5.6299999689494582,5.6299999946402206,null,2835786.01,null,0,0,0,0,null,0,0,null,387634,null,191268]
[null,936,"Surrey",null,5.7227719228581924,5.9704951930365446,11.888743374492906,5.5583467077225688,null,5.1399999999694401,0.10989459036048169,5.8643198100494932E-2,0,0,0,7.682722915074397E-2,0.33740690527703238,null,5.1399999999694401,5.1399999958956144,5.14,5.1400000003405282,null,70487143.620000005,null,4416200,340489,595303,3480408,null,22778,3675455,null,0.97206273401726073,null,3.1748439057605056E-2,null,6.9454248294199736,6.9454152861552405,6.9454315454676889,6.9454250567188325,null,6.65,6.65,6.65,6.65,null,4841891.6000000006,null,215100,10432,8174,196494,null,0,0,null,396745,null,410688]
[null,319,"Sutton",null,6.0106257617880532,5.9202261055491094,9.633020115187108,5.7765519173404964,null,5.3600000001769912,3.6083561831124683E-2,0.10414659912866246,0.24999999889380711,0,0,0.18207714278828077,7.8318458969187224E-2,null,5.3600000001769912,5.3599999999999994,5.36,5.3600000003052184,null,13407035.92,null,177000,0,0,177000,null,302800,620400,null,0.97059765660826003,null,6.786339833247973E-2,null,6.2664548129886786,0,0,6.2664548129886786,null,6.13,0,0,6.13,null,1347698.89,null,30000,0,0,30000,null,0,0,null,85600,null,79500]
[null,866,"Swindon",null,4.8433046843830931,4.7142147204653755,0,4.9191280015274748,null,4.34,4.5456030563231602E-2,0,0.31798396591217831,0,0,0,0.13986468790768372,null,4.34,4.3400000000000007,0,4.34,null,13451400.969999999,null,400000,0,0,400000,null,0,726400,null,0.94966758517315575,null,7.7271103011361655E-2,null,5.7799999993431079,5.78,0,5.7799999992040014,null,5.7799999993431079,5.78,0,5.7799999992040014,null,1759799.55,null,0,0,0,0,null,0,54400,null,219900,null,77000]
[null,357,"Tameside",null,4.8636668332360831,4.8944175809863264,0,4.839310297402621,null,4.4900000010755443,9.8535646211819997E-2,0.10165631344919357,0,0,0,0,0.17347487249952495,null,4.4900000010755443,4.4900000000784983,0,4.4900000018652673,null,13518361.170000002,null,500000,90000,0,410000,null,0,760050,null,0.96119897890041162,null,4.2683105795434224E-2,null,5.6044171109060779,0,0,5.6044171109060779,null,5.4600000070020416,0,0,5.4600000070020416,null,2495272.31,null,66000,0,0,66000,null,0,60965,null,204290,null,131652]
[null,894,"Telford and Wrekin",null,4.9638289334130912,4.9613988914709903,8.4165960764365035,4.7521705937935899,null,4.3,0.15996054916749941,5.0256603383601869E-2,0.23405075402806619,0,0,0.14511723146152439,7.4443795372398522E-2,null,4.3,4.3,4.3,4.3,null,11165409.680000002,null,170000,54073.58,6731.8,109194.62,null,0,190000,null,0.98341055141868683,null,9.364309000406025E-2,null,5.572127406060754,5.6036350444404137,5.5751289237668162,5.5616627395472218,null,5.4799999999999995,5.4799999999999995,5.48,5.4799999999999995,null,1784485.2799999998,null,30000,9542.4,1187.97,19269.63,null,0,0,null,185325,null,93564]
[null,883,"Thurrock",null,5.0546018498196785,5.054601220684467,0,5.0546020595314145,null,4.7900000007588268,0.14854615898807333,0,0,0,0,0,0.11605569007277976,null,4.7900000007588259,4.789999995357773,0,4.7900000025591769,null,11063843.579999998,null,260000,65000,0,195000,null,0,490000,null,0.99109840192542742,null,3.0078924886607988E-2,null,5.9893324139476647,5.9893324135748074,0,5.9893324140719502,null,5.5000000174761565,5.4999999999999991,0,5.500000023301542,null,1573572.5,null,140000,35000,0,105000,null,0,0,null,67652,null,83628]
[null,880,"Torbay",null,4.76446182872645,4.6023998847275029,0,4.8618980950665058,null,4.4000000000000004,0.16679263477758036,0,0,0,0,0,0.1976691939488695,null,4.4000000000000004,4.4000000000000004,0,4.4000000000000004,null,6035251.2000000002,null,261230,0,0,261230,null,0,326970,null,0.9625175411568585,null,3.6522927164986937E-2,null,5.5964967204118441,5.42,0,5.65585861055043,null,5.42,5.42,0,5.42,null,1037035.7000000001,null,33770,0,0,33770,null,0,55519,null,105816,null,62928]
[null,211,"Tower Hamlets",null,8.2496686032480415,8.09549611260441,9.9783121075742436,8.0191119385402132,null,7.3999999999999995,0.45,0,0,0,0,0.18966855746597575,0.2100000457820656,null,7.3999999999999995,7.4,7.3999999999999995,7.3999999999999995,null,24585033.100000001,null,642173,424696,42344,175133,null,0,1090274,null,0.95719401677568716,null,5.7324840764331211E-2,null,7.3999999999999995,7.4,7.3999999999999995,7.3999999999999995,null,7.3999999999999995,7.4,7.3999999999999995,7.3999999999999995,null,3425400.8,null,0,0,0,0,null,0,37032,null,260647,null,120888]
[null,358,"Trafford",null,4.8062707004525551,4.9139524162934158,0,4.7271680146744304,null,4.38,9.3433737873966763E-2,0.11257946042119729,0,0,0,0,0.22025750215739007,null,4.38,4.38,0,4.38,null,14970402.630000003,null,719000,287600,0,431400,null,55000,770004,null,0.99037357847684937,null,4.4922068338518695E-2,null,5.42,5.42,0,5.42,null,5.42,5.42,0,5.42,null,1658032.2,null,0,0,0,0,null,0,107062,null,111887,null,73692]
[null,384,"Wakefield",null,4.8859493603295743,4.7914744368060376,7.3352803430063656,4.7981459360182468,null,4.7000000012154874,4.6973905558822457E-2,0,0,0,0,9.0355947898219491E-2,4.861950565704358E-2,null,4.7000000012154874,4.7000000011989354,4.7000000201424053,4.6999999993162005,null,19898720.850000001,null,200000,88000,12000,100000,null,0,812177.2,null,0.97669926933428786,null,9.8955474543028239E-3,null,5.6586932801122565,5.955976383498478,5.6491427932117704,5.6464651148056335,null,5.629999991965879,5.6299999110973262,5.6299999298095003,5.6300000019758132,null,2943197.01,null,15000,6600,900,7500,null,0,0,null,414493,null,178020]
[null,335,"Walsall",null,5.4309033185557158,4.9092275732927613,8.4959615762763647,4.8865315256163226,null,4.8600000000000003,4.5379794039848612E-2,0,0,0,0,0.50390527500729621,2.1618249508570865E-2,null,4.8600000000000003,4.8600000000000003,4.8600000000000003,4.8600000000000003,null,17515292.100000001,null,70000,0,70000,0,null,500001.49,400000,null,1.0062206950218293,null,9.2510255974442845E-3,null,5.5395119752217461,5.51,5.6303804020705428,5.51,null,5.51,5.51,5.51,5.51,null,3734077.41,null,20000,0,20000,0,null,0,100000,null,294665,null,139992]
[null,320,"Waltham Forest",null,5.8458111313675243,5.7613320506466881,9.0907053647839113,5.6459932893538038,null,5.1399999989047274,0.18641614001646833,0.12652673082955776,0,0,0,0.12173947034501932,0.27112879127175066,null,5.1399999989047291,5.1400000000000006,5.1400000000000006,5.1399999978606683,null,19341127.190000001,null,940670,245514.87,99711.02,595444.11,null,0,1045189,null,0.9508424686083895,null,5.7389721169099697E-2,null,6.15,6.15,6.1499999999999995,6.1499999999999995,null,6.15,6.15,6.1499999999999995,6.1499999999999995,null,2341503.0300000003,null,0,0,0,0,null,0,123237,null,159670,null,99360]
[null,212,"Wandsworth",null,6.5575011953250559,6.6799377198553049,13.594274966065543,6.1973404671015064,null,5.8,0.24454607754529717,0,0,0,0,0.21055755206967106,0.30239756571008869,null,5.8,5.8,5.8,5.8,null,20984221.329999998,null,1014464,279042,31189,704233,null,735076,1077520,null,0.95383966076811999,null,4.0457310509014736E-2,null,7.56,7.56,7.5600000000000005,7.56,null,7.56,7.56,7.5600000000000005,7.56,null,1979124.8399999999,null,0,0,0,0,null,0,0,null,154083,null,113436]
[null,877,"Warrington",null,5.0774337133897536,5.0139650205293922,7.6822432818462545,5.0093418648133143,null,4.9100000007712028,1.0000000771202736E-2,0,0,0,0,6.6817390529121432E-2,9.0616321318226098E-2,null,4.9100000007712037,4.9100000056087412,4.9100000308490586,4.9099999977965654,null,12932571.860000001,null,235000,64625,5875,164500,null,19574,32376,null,1.0241151978828074,null,2.0325204813145862E-3,null,5.3099999961470017,5.3099999439582826,5.3100006166558744,5.3099999944956986,null,5.3099999961470017,5.3099999439582826,5.3100006166558744,5.3099999944956986,null,1378147.31,null,0,0,0,0,null,0,0,null,145948,null,74520]
[null,937,"Warwickshire",null,4.834487150751376,5.4151752973759617,8.2283723162083735,4.6256457424948296,null,4.5388513385142781,8.9148653187884799E-2,0,0,0,0,0.1357835277796659,7.0703631269547734E-2,null,4.5388513385142781,4.5399999925321879,4.5099999935274013,4.5399999992977751,null,32677741.799999997,null,485000,485000,0,0,null,0,1660030.25,null,0.96482618559360289,null,1.9262889660269043E-2,null,5.8999999999999986,5.9000000394235323,5.8999999772000216,5.8999999977325936,null,5.8999999999999986,5.9000000394235323,5.8999999772000216,5.8999999977325936,null,3160177.4699999997,null,0,0,0,0,null,0,0,null,226919.73,null,199548]
[null,869,"West Berkshire",null,5.4137091745603856,5.5164972097347924,8.5117920000240321,5.1004484572750384,null,4.690000003571476,8.0654639080418242E-2,0.39135131523803235,0,0,0,0.18949041157238361,6.2212805098076703E-2,null,4.690000003571476,4.6900000118715051,4.6899999814459914,4.6900000030553128,null,9290074.7199999988,null,108000,23836.69,11624.78,72538.53,null,0,446433.8,null,0.98199600808045184,null,9.143847530764812E-2,null,6.1300000203060252,6.1300001285297476,6.1299999951415671,6.129999993267611,null,6.1300000203060252,6.1300001285297476,6.1299999951415671,6.129999993267611,null,724514.02,null,0,0,0,0,null,0,34816.44,null,78917.320000000007,null,43060]
[null,213,"Westminster",null,8.5115968831880782,7.8005906731517767,15.910378160670042,7.3150003247962543,null,7,0.31500020087125852,0,0,0,0,1.0581770878735299,0.1384195944432903,null,7,6.9999999999999991,7,6.9999999999999991,null,10283516.18,null,170000,170000,0,0,null,283000,497000,null,0.94979576123822029,null,4.3062227234626764E-2,null,7.5599999999999987,7.5600000000000005,7.5600000000000005,7.56,null,7.5599999999999987,7.5600000000000005,7.5600000000000005,7.56,null,1285305.8399999999,null,0,0,0,0,null,0,0,null,122630,null,57960]
[null,943,"Westmorland and Furness",null,4.7709904453908356,4.7721871119601031,6.6277874167868802,4.5706557096583404,null,4.4799999956102043,2.9809261195240321E-2,0.10099449497708636,0,0,0,9.1202195951247803E-2,6.8984497657056457E-2,null,4.4799999956102052,4.4799999980217819,4.4799999650451738,4.4799999958411636,null,10711218.92,null,157147.41,83692.88,7104.72,66349.81,null,191933.89,272454.8,null,0.97369152218290234,null,2.8368970620742229E-2,null,5.7266527460878667,5.7266528292571888,5.7266526370296829,5.7266527297857888,null,5.6300000179860596,5.6300000288145968,5.6300000641925436,5.6300000078278432,null,1189476.79,null,20420.28,5031.45,1806.8,13582.03,null,465734.04,0,null,121634.31,null,46368]
[null,941,"West Northamptonshire",null,4.7446616919927118,4.5630617287929818,9.0403939358691012,4.560826585526554,null,4.29,7.7431467195265488E-2,0,0,0,0,0.17273173451251531,0.20449849028493192,null,4.29,4.29,4.29,4.29,null,22867494.479999997,null,1030000,85758,73954,870288,null,570000,1240000,null,0.95044653185106831,null,1.7729291867970957E-2,null,5.629999997267003,5.6300000000000008,5.63,5.6299999970038588,null,5.629999997267003,5.6300000000000008,5.63,5.6299999970038588,null,2060009.68,null,0,0,0,0,null,0,0,null,245000,null,140000]
[null,938,"West Sussex",null,5.1763383848018227,5.0373328375336364,7.6072592637239156,5.0841905244921177,null,4.9700000009075307,3.9143344679003073E-2,0,0,0,0,9.4171372722003446E-2,7.3023666493285247E-2,null,4.9700000009075307,4.9700000399838462,4.9700000143506822,4.9699999998444913,null,48360314.780000001,null,691990.93,0,0,691990.93,null,0,2534732.2999999998,null,0.94993775926725599,null,7.8143790222117669E-3,null,6.24000051711627,0,6.04,6.24992758201887,null,6.0400000028569965,0,6.04,6.0400000029988039,null,5073860.87,null,168009.07,0,0,168009.07,null,0,0,null,489315,null,302220]
[null,359,"Wigan",null,4.7647911091104707,4.7160085444123263,7.2253787442396309,4.6611354883693243,null,4.5699999995472709,8.8030720930808465E-2,0,0,0,0,8.1608754080733231E-2,2.5151634551659561E-2,null,4.56999999954727,4.57,4.5699999999999994,4.5699999993608982,null,18844260.259999998,null,100000,33334,33333,33333,null,0,765807,null,0.95575150102647721,null,1.8898699088393603E-2,null,5.630000003527539,5.6299999363369562,5.6300001576107022,5.6300000031835316,null,5.630000003527539,5.6299999363369562,5.6300001576107022,5.6300000031835316,null,3192027.5900000003,null,0,0,0,0,null,56697,0,null,173414,null,111780]
[null,865,"Wiltshire",null,4.8061305498354931,4.8028114109656466,0,4.8064993435673271,null,4.6800000000000006,3.0251053694621909E-2,0,0,6.9310479137978968E-3,0,0,8.8948448227073013E-2,null,4.6800000000000006,4.6800000000000006,0,4.6800000000000006,null,28584660.030000001,null,539000,53900,0,485100,null,0,468700,null,0.98688512316950572,null,7.8822697126197019E-3,null,5.7499999999999991,5.75,0,5.75,null,5.7499999999999991,5.75,0,5.75,null,2714100.05,null,0,0,0,0,null,0,0,null,183400,null,175500]
[null,868,"Windsor and Maidenhead",null,5.663231646867005,5.8608857699805066,8.4587742690058469,5.3231181225683812,null,4.8199999998875969,0.22681964117451414,0.24623950913075579,0,0,0,0.2690094367768559,0.10116305989728207,null,4.8199999998875969,4.82,4.82,4.8199999998648702,null,9896619.8399999999,null,180000,50000,40000,90000,null,80000,290000,null,0.96208322438289429,null,8.9373486462555926E-2,null,6.7733845892363744,0,6.8663983488132088,6.7364278392675567,null,6.6599999523784534,0,6.66,6.6599999465004753,null,587381.16,null,10000,2000,2000,6000,null,20000,71039,null,41182,null,33948]
[null,344,"Wirral",null,5.0364906604036879,4.9255861582287412,9.0588356321080195,4.8579146502936856,null,4.2199999991370376,0.11448482443729067,0.14441223802963729,0.22025001551579371,0,0,0.15531245863679788,0.18203112464713131,null,4.2199999991370376,4.2199999975286877,4.2199999868392855,4.2200000007906775,null,18001098.399999999,null,675000,259349,29088,386563,null,274243.33,107932,null,1.0030637595319278,null,0.10196469063837103,null,5.5500000000000007,5.5500000316665332,5.5499999905229274,5.5499999911478053,null,5.5500000000000007,5.5500000316665332,5.5499999905229274,5.5499999911478053,null,3188238.5700000003,null,0,0,0,0,null,0,463727.27,null,255048.78,null,149040]
[null,872,"Wokingham",null,5.4450698837371379,0,0,5.363920735421317,null,5.0600000000000005,2.2337534631592413E-2,0.2099810110992941,0,0,0,8.1149148315821026E-2,7.1602189690430321E-2,null,5.0600000000000005,0,0,5.0600000000000005,null,11256920.460000001,null,150000,0,0,150000,null,0,562015,null,0.95243281150249559,null,4.3897309605123655E-2,null,6.3999999999999995,0,0,6.3999999999999995,null,6.3999999999999995,0,0,6.3999999999999995,null,482668.79999999999,null,0,0,0,0,null,0,50352,null,61729,null,52164]
[null,336,"Wolverhampton",null,5.5575853793176133,5.1520892810455807,8.6350403019933744,5.0803266107537475,null,4.5600000000000005,0.35000064188625368,0.15000000337834871,0,0,0,0.40758493337558521,8.9999800677426481E-2,null,4.5600000000000005,4.5600000013829547,4.5599999999999996,4.5599999982542307,null,16184195.469999999,null,266401.75,82795.78,73681.64,109924.33,null,118394.5,0,null,0.99999966021232689,null,9.8814344170593649E-2,null,5.6699999941882977,5.67,5.6700000000000008,5.6699999905714309,null,5.6699999941882977,5.67,5.6700000000000008,5.6699999905714309,null,2926853.43,null,0,0,0,0,null,0,0,null,377759.86,null,107640]
[null,885,"Worcestershire",null,4.9680459195767179,4.905784115328311,8.1312809917355366,4.9740737415640819,null,4.5996635694376593,4.5730557082024614E-2,0,0,0,0,2.5555607214147815E-2,0.29709618584288655,null,4.5996635694376593,4.5999999999999996,4.5599999999999996,4.6000000000000005,null,30642200.960000001,null,1949000,850000,25000,1074000,null,300000,1590000,null,1.0242753325348244,null,9.8442792659846536E-3,null,6.3106023871144892,8.2171845620441921,5.9834187373102585,6.0151753485161237,null,5.5,5.5,5.5,5.5,null,3765718,null,555000,250000,5000,300000,null,0,0,null,293655,null,205344]
[null,816,"York",null,4.6987807774312751,4.9235331944570246,6.3824071721022166,4.6240362593439617,null,4.53,4.9381416311943732E-2,0,0,0,0,6.0120795489897037E-2,5.9278565629434038E-2,null,4.53,4.53,4.53,4.5299999999999994,null,9783262.6400000006,null,125000,16000,2000,107000,null,0,509180,null,0.95249691620972843,null,1.0783425057376768E-2,null,5.77,0,5.77,5.77,null,5.77,0,5.77,5.77,null,1001371.96,null,0,0,0,0,null,0,0,null,109784,null,52992]
[]
[null,null,"England",null,5.2558115551194646,5.2925499351181191,8.5323095043592261,5.0576459912771474,null,4.7956640662922334,0.13435372250141098,6.3548270602222651E-2,1.3587941003433036E-2,1.5302490630112911E-3,9.1600242822726318E-4,0.11101667532397022,0.13519462790495515,null,4.7956640662922316,4.8586187742067652,4.9846109167034633,4.7617073171174162,null,3197412162.8500009,null,84373161.419999987,18977025.479999997,8534185.7799999993,56861950.160000019,null,25774715.649999995,128309010.70999998,null,0.9782368526413675,null,4.5749615066685095E-2,null,5.9220993425955033,6.0648995261160668,5.998076394343518,5.8983267000136674,null,5.8596739530989623,5.9668121089551969,5.949952440639513,5.8384945353634592,null,438722773.86000013,null,3943078.6799999997,569026.47,216601.41,3157450.7999999989,null,2277499.65,7587028.6799999997,null,40653777.230000004,null,21107703]
[]
[null,null,"Median",null,5.020746264676303,5.0066194503644752,8.4475061784897036,4.8932574159943485,null,4.6099999991632563,0.10741121735488947,3.8179755564621137E-3,0,0,0,6.1202204765418169E-2,0.10435780329792457,null,4.6099999991632563,4.59,4.5099999935274013,4.6099999990786795,null,16586920.5,null,400000,91829.5,34521.870000000003,250000,null,0,687896.36,null,0.97155603535892199,null,4.0069686516033431E-2,null,5.7500000124035724,5.7333264146285945,5.76,5.75,null,5.67,5.63,5.55,5.6699999905714309,null,2495272.31,null,42859,6600,2000,40519.769999999997,null,0,0,null,191201,null,111780]
[null,null,"Min",null,4.5382098227902326,4.5577182838017194,5.4098098554376879,4.4105956781017861,null,4.160000002023537,1.5986313390455823E-3,2.3147297326930866E-4,5.4983654586894136E-3,6.9310479137978968E-3,9.3166039468976832E-3,7.4481523775258218E-3,3.3411731276549077E-3,null,4.160000002023537,4.1599999894607294,4.18,4.1600000044164496,null,83309.63,null,3000,1482,891.62,3000,null,3400,32376,null,0.92019458402350451,null,3.4441595623517713E-4,null,5.23,5.23,5.23,5.23,null,5.23,5.23,5.23,5.23,null,19656,null,9070.7999999999993,418.5,658.94,6000,null,0,9645,null,0,null,0]
[null,null,"Max",null,8.9414842609964573,8.938202538202539,36.880336847966035,8.9448062503277228,null,8.4,0.80000051462268185,0.39135131523803235,0.36321035387421396,0.16129563505645317,7.6626357376781487E-2,1.0581770878735299,1.4423017027903295,null,8.4,8.4,7.3999999999999995,8.4,null,85980111,null,4416200,1195953,1586955,3480408,null,3610021,4022562,null,1.1210598800058855,null,0.12036545810499592,null,8.9212950713416852,13.084545454545454,8.8520719582449647,9.0194049611091707,null,8.4,8.4,8.1000000000000014,8.4,null,13853834.609999999,null,230423,60300.800000000003,50000,214981,null,465734.04,515528,null,1471434,null,737748]
[]
[null,null,"East Midlands",null,4.8447002448141747,4.867734117523181,6.6707859942827694,4.6788131733927694,null,4.50748300946666,0.10001448653468209,4.3366096184987948E-2,2.264775693194129E-3,0,1.1590379306139083E-3,9.7097629748181633E-2,9.3315209255853016E-2,null,4.5074830094666609,4.5288571262828237,4.7210615331788217,4.4819750295809202,null,247562425.84000003,null,4862022.21,704607.53,227669.18,3929745.4999999995,null,2421792.27,9946082.1600000001,null,0.96852734337328472,null,3.0827490589670041E-2,null,5.5331442660945047,5.6100898501549707,5.6091072729057236,5.5245176706821191,null,5.5298923640157849,5.6089368972773537,5.6054819386018222,5.5211375752223173,null,32430088.220000003,null,19070.8,418.5,837,17815.3,null,249434,217611,null,4134472,null,1682564]
[null,null,"East of England",null,5.2237816121360954,5.2951295970086099,8.2591067993443019,5.0663680779114362,null,4.8522142749763617,9.6327621369456745E-2,4.7930873753146738E-2,1.6277953124815621E-2,0,0,9.7461001780951642E-2,0.11356988713136447,null,4.8522142749763617,4.8975526275019545,5.032934837571549,4.8330511951800181,null,349885299.99999994,null,7775888,1396267.17,415266.79,5964354.04,null,5715065.4900000002,12462787.789999999,null,1.0021272361478861,null,3.3820366416911135E-2,null,5.9422582682835712,5.9233034779199816,5.9857702323913085,5.9415375525818561,null,5.9053658507320614,5.8457062740088519,5.9390927457952509,5.9080288376323935,null,41618175.850000009,null,260000,35000,14039,210961,null,30000,593343.19999999995,null,4240800.43,null,2193382]
[]
[null,null,"Inner London",null,7.1449909942036598,6.8830973015659573,11.709906197851945,6.6517171642320267,null,6.044302409424863,0.33788458806315841,0.10461652528851866,7.3843317897491403E-4,0,0,0.35262870994106238,0.30482032830708294,null,6.0443024094248621,6.1031026771437098,6.1265694756543763,5.9923141285757984,null,235097144.12,null,10476696,3661675.87,1853745.62,4961274.51,null,2209404.0499999998,11302572.48,null,0.95988034424511448,null,7.0211330663375912E-2,null,7.2375175815794588,7.2955338308447528,7.3112437678687003,7.2109312635698473,null,7.0540246794301851,7.1040115349749433,7.0656157888752835,7.0402522775088556,null,33982532.520000003,null,185000,35000,50000,100000,null,126805.96,563155,null,2165416,null,1213669]
[null,null,"Outer London",null,6.0691696499505499,6.0128168318889719,9.2644129036901024,5.8803796869860792,null,5.4539779287456032,0.19130993480086433,5.6525940863967138E-2,2.0280365809563595E-2,4.1683703193862425E-4,3.6627252312637325E-3,8.9901203759747583E-2,0.25309471370760256,null,5.4539779287456023,5.5366504708468325,5.5104219749029548,5.397561679019014,null,362135704.23000002,null,15758846.540000001,4055049.47,3263760.62,8440036.4500000011,null,2137179.9,13499539.710000001,null,0.98999187801199917,null,4.7523819322163992E-2,null,6.7720583526770657,6.7333585091106913,6.8664845035254656,6.7719692521451575,null,6.6910434741885467,6.71468985081074,6.7668496037992698,6.6806353581656719,null,44894144.839999996,null,475404,7085,41279,427040,null,0,894624,null,2711143,null,1910983]
[null,null,"London",null,6.4518071304053031,6.3220926840973766,10.5331501205878,6.1427431820271519,null,5.6639386932763447,0.24344215575224415,7.3630323627986535E-2,1.3329884760894448E-2,2.6858056490230189E-4,2.3600033977777064E-3,0.18334552102338386,0.27149196800177128,null,5.6639386932763456,5.7379533782909391,5.8300831521255878,5.5998613674862492,null,597232848.3499999,null,26235542.539999999,7716725.3399999999,5117506.24,13401310.959999999,null,4346583.9499999993,24802112.190000001,null,0.9777590674192026,null,5.6740620804531329E-2,null,6.9646053471456204,6.9810398297019658,7.1276547498900689,6.942261585992247,null,6.8411982799760747,6.8862158946277692,6.9422902172217666,6.8201463019193032,null,78876677.359999999,null,660404,42085,91279,527040,null,126805.96,1457779,null,4876559,null,3124652]
[]
[null,null,"North East",null,5.0306965155339745,4.9654013116787148,7.5850605012758301,4.8267950422598522,null,4.4606240829470734,0.1614094270345309,0.14505270310728424,4.6724223923586293E-2,1.5337576754466281E-3,0,0.13145245186585203,8.3899868980201603E-2,null,4.4606240829470725,4.4790187374598753,4.4196967318224427,4.447773935709697,null,143186461.22999999,null,2428506,1018195.66,195138,1215172.3399999999,null,695560,5995489.2199999997,null,0.97307900800166047,null,7.1104286849372131E-2,null,5.6010492834390018,5.6097206406911235,5.6081288139199197,5.5981819302935367,null,5.5915111476509471,5.6023144639767644,5.6081288139199197,5.5871607441946169,null,27798876.480000004,null,27420,1682,0,25738,null,184723,100283.28,null,2844347,null,1292780]
[null,null,"North West",null,4.9830921402135377,4.9433365355566794,8.4534011662233031,4.8092854293614371,null,4.5514278678170585,0.12857525354419885,6.5144167667620712E-2,1.2687782760006937E-2,8.1572038307070062E-4,2.309606037035933E-3,0.12244095190063492,9.969079010390991E-2,null,4.5514278678170594,4.5341006592121262,4.6215662907878814,4.5562590934688041,null,420620429.49000001,null,8586634.5899999999,2491333.8600000003,523884.11,5571416.6200000001,null,5980007.04,13078348.770000001,null,0.98465183738720174,null,4.5420625947919978E-2,null,5.5079852173302708,5.5123716414932415,5.4815445899987143,5.5090823792767205,null,5.486572886841631,5.4966072283368552,5.4804882762138556,5.4859233217451155,null,68244856.570000008,null,266337.74,16924.419999999998,658.94,248754.38,null,942787.65,2263979.94,null,6153251.5800000001,null,3172612]
[null,null,"South East",null,5.2135492909784897,5.3504745385061163,7.9012140319264077,5.094668877361638,null,4.79622816747277,8.7788688449101052E-2,0.12468318284202595,8.3452680943691248E-3,0,8.3987087328196491E-4,7.1523507552430754E-2,0.12414060569451157,null,4.79622816747277,4.7999583854493988,4.9974653898972452,4.7881595352498438,null,510743297.16999996,null,12458025.32,1119896.5999999999,1034591.51,10303537.209999999,null,3884543,25051278.670000002,null,0.97030270211555647,null,5.063446012731683E-2,null,6.1287936095559505,6.1054202962081723,6.2986114141387395,6.1216928624378069,null,6.049645693383928,6.0247977721504737,6.2249517361436482,6.0423551981791288,null,51041382.859999992,null,512377.8,16320.95,11802.17,484254.68,null,139700,1454533.8699999999,null,4877469.32,null,3290228]
[null,null,"South West",null,4.9373543176600974,5.0302917619803713,8.824780282595194,4.8400818207852954,null,4.5686345013701315,9.4179121097401536E-2,2.9931895573033766E-2,1.6917138909683122E-2,3.1055134166293511E-3,0,5.9168964143968938E-2,0.165417183149249,null,4.5686345013701315,4.5747320379395298,4.8453476614368682,4.561782876102555,null,282213125.12000006,null,9782798.6600000001,1181962.21,645971.92999999993,7954864.5199999996,null,635740.02,10777670.560000001,null,0.97959026969917795,null,3.2593762570943839E-2,null,5.6826217679134388,5.7404529200218439,5.8201271180834899,5.6687147718450728,null,5.6145646278215589,5.6477901333550227,5.8121980465385343,5.5986629136693669,null,32541107.460000001,null,250839.80000000002,22284.199999999997,2174.9300000000003,226380.67,null,33425,472366.39,null,2865749,null,2019448]
[null,null,"West Midlands",null,5.0021829076483346,4.9470859161561966,8.6396589973406854,4.7666403125469712,null,4.5568730355732026,0.14227828972924214,2.8509780581316316E-2,1.7650054905861738E-2,8.2089204992377429E-3,0,0.14601337876763024,0.102649447591844,null,4.5568730355732034,4.5629627643555271,4.6647025265036692,4.5460470402590438,null,334082302.31,null,6999312.0899999999,1975880.65,181780.47999999998,4841650.96,null,1903489.99,13999721.85,null,0.97322326601754949,null,4.4300968599285041E-2,null,5.7740415432451728,5.9650690599339091,5.7900426220321473,5.7420265565826449,null,5.6819496937508047,5.6016368278305597,5.7792849797919255,5.6495127999584085,null,53436627.730000004,null,301089.66000000003,34121.550000000003,23390.77,243577.34,null,104890,610930,null,5364913.5900000008,null,2334192]
[null,null,"Yorkshire and The Humber",null,4.9246227187894513,4.8495428712157951,7.9809690259751029,4.8489305142730901,null,4.6071860659002164,0.13940408315588201,1.1913989138340617E-2,7.6428470190246832E-3,1.1480494245574143E-3,0,7.5067766438898939E-2,8.2259917712532341E-2,null,4.6071860659002164,4.6224314011404104,4.5380505617120228,4.6025444355539982,null,299471217.45999992,null,5087284.5999999996,1288463.58,185272.82,3613548.1999999997,null,0,12195519.499999998,null,0.97553790176866406,null,2.8684375273130176E-2,null,5.7092127525202319,5.8042069232895299,5.7434399223051082,5.6998322275282556,null,5.6311316952065269,5.6716545213479188,5.6210396032713001,5.6280104050073421,null,51545504.539999999,null,333728,90234.13,33512.800000000003,209981.07,null,0,416202,null,5174581,null,1951477]

{"sheet":"Options","index":7,"n_rows":69,"n_cols":1,"rows_kept":69,"cut":false,"hidden":true,"merged":[]}
["3-4 yrs Chart Choice"]
["3-4 yrs per hour"]
["% Pass through rate"]
["% Funding provided through supplements"]
["SEN Inclusion Fund"]
[]
["2 yrs Chart Choice"]
["2 yrs per hour"]
["SEN Inclusion Fund"]
[]
["Non-EYSFF Spend Chart Choice"]
["3-4 yrs EYSFF"]
["3-4 yrs Non-EYSFF"]
["2 yrs EYSFF"]
["2 yrs Non-EYSFF"]
[]
["3-4 yrs SortOptions"]
["Original"]
["All provider rate"]
["PVI rate"]
["Nursery school rate"]
["Primary nursery place rate"]
["Pass-through rate"]
["Funding paid through supplements"]
["SEN Inclusion Fund - All providers"]
["SEN Inclusion Fund - PVI"]
["SEN Inclusion Fund - Nursery school"]
["SEN Inclusion Fund - Primary nursery places"]
[]
["2 yrs SortOptions"]
["Original"]
["All provider rate"]
["PVI rate"]
["Nursery school rate"]
["Primary nursery place rate"]
["SEN Inclusion Fund - All providers"]
["SEN Inclusion Fund - PVI"]
["SEN Inclusion Fund - Nursery school"]
["SEN Inclusion Fund - Primary nursery places"]
[]
["Non-EYSFF spend SortOptions"]
["Original"]
["3-4 year olds EYSFF budget"]
["3-4 year olds SEN Inclusion Fund"]
["3-4 year olds contingency funding"]
["3-4 year olds central spend"]
["2 year olds EYSFF budget"]
["2 year olds SEN Inclusion Fund"]
["2 year olds contingency funding"]
["2 year olds central spend"]
[]
["Early Years Pupil Premium SortOptions"]
["Original"]
["Early Years Pupil Premium"]
[]
["Disability Access Fund SortOptions"]
["Original"]
["Disability Access Fund"]
[]
[1]
[{"$f":"INDEX(LAs,A60)","v":"Choice"}]
[1]
[1]
[1]
[1]
[1]
[4]
[1]
[2]

{"sheet":"Stat Neighbours","index":8,"n_rows":154,"n_cols":13,"rows_kept":154,"cut":false,"hidden":true,"merged":[]}
["Statistical Neighbours"]
[]
["LA No","Region","Choice","LA No","LA No","LA No","LA No","LA No","LA No","LA No","LA No","LA No","LA No"]
[301,"London (Outer)","Barking and Dagenham",203,308,352,821,330,320,871,892,331,316]
[302,"London (Outer)","Barnet",315,314,870,319,312,317,313,826,307,305]
[370,"Yorkshire and The Humber","Barnsley",807,371,359,372,812,384,342,840,394,357]
[800,"South West","Bath and North East Somerset",916,873,931,865,938,850,802,803,885,878]
[822,"East of England","Bedford Borough",941,886,866,826,937,940,887,919,881,831]
[303,"London (Outer)","Bexley",311,883,887,826,882,941,886,866,822,881]
[330,"West Midlands","Birmingham",821,333,336,892,352,335,308,831,320,380]
[889,"North West","Blackburn with Darwen",380,335,350,874,354,831,382,353,331,894]
[890,"North West","Blackpool",805,806,876,807,861,393,810,812,340,357]
[350,"North West","Bolton",382,831,332,357,354,894,381,383,372,331]
[839,"South West","Bournemouth, Christchurch & Poole",882,845,866,935,886,921,938,916,878,800]
[867,"South East","Bracknell Forest",919,850,823,869,931,938,358,803,825,816]
[380,"Yorkshire and The Humber","Bradford",354,353,889,382,335,874,831,350,332,894]
[304,"London (Outer)","Brent",307,320,306,309,316,308,313,871,317,203]
[846,"South East","Brighton and Hove",870,801,800,839,882,851,383,373,816,845]
[801,"South West","Bristol, City of",851,852,870,373,846,831,331,879,383,874]
[305,"London (Outer)","Bromley",358,919,867,319,356,822,931,334,850,823]
[825,"South East","Buckinghamshire",936,869,868,919,931,850,867,873,823,358]
[351,"North West","Bury",381,888,808,343,356,877,334,891,886,896]
[381,"Yorkshire and The Humber","Calderdale",888,808,351,841,891,830,343,382,359,383]
[873,"East of England","Cambridgeshire",931,916,850,800,865,938,869,919,885,937]
[202,"Inner London","Camden",213,205,207,206,212,352,203,870,309,302]
[823,"East of England","Central Bedfordshire",850,855,937,803,881,895,938,867,869,919]
[895,"North West","Cheshire East",896,937,823,815,850,877,802,811,885,855]
[896,"North West","Cheshire West and Chester",877,937,811,895,885,356,860,891,334,881]
[908,"South West","Cornwall",933,926,878,884,935,838,893,925,845,921]
[331,"West Midlands","Coventry",831,350,874,383,373,851,887,335,357,852]
[306,"London (Outer)","Croydon",308,320,209,309,304,203,208,330,315,307]
[942,"North West","Cumberland"]
[841,"North East","Darlington",808,344,342,392,840,381,390,359,343,807]
[831,"East Midlands","Derby",874,373,350,894,331,335,332,887,382,383]
[830,"East Midlands","Derbyshire",891,888,860,925,885,940,896,359,886]
[878,"South West","Devon",933,893,838,884,908,916,935,865,885,926]
[371,"Yorkshire and The Humber","Doncaster",372,370,812,359,384,357,813,807,332,894]
[838,"South West","Dorset",878,933,893,916,885,845,935,908,865,926]
[332,"West Midlands","Dudley",372,894,887,359,371,888,813,830,357,891]
[840,"North East","Durham",342,390,394,841,370,384,359,807,808,392]
[307,"London (Outer)","Ealing",313,315,317,312,310,304,302,871,320,870]
[811,"Yorkshire and The Humber","East Riding of Yorkshire",896,860,877,815,937,895,830,891,885,929]
[845,"South East","East Sussex",886,885,838,881,935,878,802,933,839,926]
[308,"London (Outer)","Enfield",320,306,203,309,330,301,821,870,312,307]
[881,"East of England","Essex",886,885,860,938,937,803,823,855,850,802]
[390,"North East","Gateshead",394,840,342,841,393,384,392,357,370,359]
[916,"South West","Gloucestershire",865,800,938,873,878,838,893,850,803,885]
[203,"London (Outer)","Greenwich",308,301,309,320,352,870,210,205,307,315]
[204,"Inner London","Hackney",210,208,309,209,206,320,205,306,203,308]
[876,"North West","Halton",805,340,394,806,393,807,370,812,840,841]
[205,"Inner London","Hammersmith and Fulham",212,213,202,207,206,309,203,315,870,210]
[850,"South East","Hampshire",938,803,823,873,802,916,855,885,937,919]
[309,"Inner London","Haringey",320,204,210,308,208,209,306,203,205,206]
[310,"London (Outer)","Harrow",317,307,313,312,302,315,314,871,319,304]
[805,"North East","Hartlepool",876,890,806,340,393,394,807,355,370,812]
[311,"London (Outer)","Havering",303,887,881,351,886,883,941,866,888,882]
[884,"West Midlands","Herefordshire",893,878,908,933,838,865,935,926,916]
[919,"East of England","Hertfordshire",867,931,850,358,823,825,869,938,873,868]
[312,"London (Outer)","Hillingdon",313,317,871,319,302,870,307,331,826,315]
[313,"London (Outer)","Hounslow",307,312,871,317,302,310,315,870,856,319]
[921,"South East","Isle of Wight",880,926,845,908,925,879,882,839,935,830]
[206,"Inner London","Islington",205,202,213,210,309,204,352,208,212,203]
[207,"Inner London","Kensington and Chelsea",213,205,212,202,302,201,315,870,846,206]
[886,"South East","Kent",881,845,866,885,888,941,891,937,935,860]
[810,"Yorkshire and The Humber","Kingston Upon Hull, City of",861,806,890,812,355,805,851,393,879,852]
[314,"London (Outer)","Kingston upon Thames",302,319,315,318,868,870,936,919,867,305]
[382,"Yorkshire and The Humber","Kirklees",350,381,332,351,831,354,808,383,888,894]
[340,"North West","Knowsley",876,805,393,806,394,890,341,355,357,807]
[208,"Inner London","Lambeth",204,209,210,309,306,206,320,205,308,203]
[888,"North West","Lancashire",891,381,830,343,351,808,886,860,359,896]
[383,"Yorkshire and The Humber","Leeds",373,841,381,351,808,350,831,392,382,344]
[856,"East Midlands","Leicester",871,313,333,336,312,889,331,335,852,874]
[855,"East Midlands","Leicestershire",803,937,823,885,850,881,938,802,860,895]
[209,"Inner London","Lewisham",208,306,309,320,204,210,308,304,203,205]
[925,"East Midlands","Lincolnshire",926,830,891,935,813,940,908,860,885]
[341,"North West","Liverpool",355,393,391,340,806,805,394,876,390,841]
[821,"East of England","Luton",330,871,333,380,308,335,312,831,317,874]
[352,"North West","Manchester",892,801,852,330,355,851,373,341,336,391]
[887,"South East","Medway",866,894,332,882,886,883,941,372,311,940]
[315,"London (Outer)","Merton",302,307,870,314,319,317,312,212,313,308]
[806,"North East","Middlesbrough",805,355,876,861,357,354,890,393,810,340]
[826,"South East","Milton Keynes",822,383,941,303,870,883,866,919,886,831]
[391,"North East","Newcastle upon Tyne",355,341,806,373,383,805,876,393,394,390]
[316,"Inner London","Newham",304,320,301,203,309,307,871,308,821,204]
[926,"East of England","Norfolk",925,935,908,933,878,921,838,845,893]
[812,"Yorkshire and The Humber","North East Lincolnshire",807,371,370,357,372,359,342,384,894,813]
[813,"Yorkshire and The Humber","North Lincolnshire",371,894,372,925,830,359,332,926,940,891]
[940,"East Midlands","North Northamptonshire",941,891,860,925,830,886,885,935,937]
[802,"South West","North Somerset",885,803,938,850,916,855,881,937,865,845]
[392,"North East","North Tyneside",841,808,343,342,344,390,840,929,381,359]
[815,"Yorkshire and The Humber","North Yorkshire",895,811,937,896,857,823,885,860,877,869]
[929,"North East","Northumberland",811,877,392,896,808,381,860,830,891,888]
[892,"East Midlands","Nottingham",352,336,852,333,801,330,851,355,331,810]
[891,"East Midlands","Nottinghamshire",830,860,888,885,925,940,881,886,896]
[353,"North West","Oldham",354,380,335,357,382,350,831,332,889,372]
[931,"South East","Oxfordshire",873,919,800,850,869,865,916,825,867,938]
[874,"East of England","Peterborough",831,894,887,335,879,852,851,373,350,372]
[879,"South West","Plymouth",880,851,894,921,882,372,839,887,874,357]
[851,"South East","Portsmouth",852,879,373,831,874,801,894,882,331,355]
[870,"South East","Reading",319,826,801,822,846,302,312,831,373,852]
[317,"London (Outer)","Redbridge",312,307,302,313,871,310,315,821,319,870]
[807,"North East","Redcar and Cleveland",370,812,359,342,357,371,372,840,344,841]
[318,"London (Outer)","Richmond upon Thames",868,936,872,931,314,825,919,305,873,869]
[354,"North West","Rochdale",353,357,350,335,382,806,372,371,831,861]
[372,"Yorkshire and The Humber","Rotherham",371,359,332,357,370,894,813,807,812,384]
[857,"East Midlands","Rutland",815,869,895,865,823,825,931,850,937,873]
[355,"North West","Salford",341,806,393,391,805,373,394,357,390,876]
[333,"West Midlands","Sandwell",336,335,330,831,331,892,874,861,821,889]
[343,"North West","Sefton",344,888,808,392,891,351,359,830,841,381]
[373,"Yorkshire and The Humber","Sheffield",831,383,851,350,894,879,852,874,357,381]
[893,"West Midlands","Shropshire",878,884,838,865,933,916,935,885,908]
[871,"South East","Slough",312,313,317,821,307,856,870,302,889,330]
[334,"West Midlands","Solihull",356,877,896,937,358,895,351,881,823,811]
[933,"South West","Somerset",878,908,935,838,893,926,884,916,845,865]
[803,"South West","South Gloucestershire",938,855,850,802,885,916,823,881,937,865]
[393,"North East","South Tyneside",394,390,355,805,876,807,357,342,341,840]
[852,"South East","Southampton",851,373,874,879,831,801,331,861,810,355]
[882,"East of England","Southend-on-Sea",839,866,887,886,845,879,921,894,935,881]
[210,"Inner London","Southwark",204,208,309,206,203,209,205,320,308,306]
[342,"North West","St. Helens",359,807,841,840,370,808,384,390,357,392]
[860,"West Midlands","Staffordshire",891,830,885,937,881,811,896,940,888]
[356,"North West","Stockport",896,334,877,937,881,885,351,888,886,802]
[808,"North East","Stockton-on-Tees",841,381,888,351,359,342,343,344,392,840]
[861,"West Midlands","Stoke-on-Trent",810,806,357,371,812,335,370,354,372,890]
[935,"East of England","Suffolk",933,926,878,908,838,893,925,845,885,916]
[394,"North East","Sunderland",390,393,840,370,342,876,357,807,384,841]
[936,"South East","Surrey",868,825,869,872,919,931,867,850,873,823]
[319,"London (Outer)","Sutton",305,870,919,822,867,302,314,303,826,866]
[866,"South West","Swindon",886,887,882,941,894,881,839,891,888,940]
[357,"North West","Tameside",372,807,371,812,359,342,370,394,841,390]
[894,"West Midlands","Telford and Wrekin",887,372,813,332,371,866,359,874,888,879]
[883,"East of England","Thurrock",887,303,311,866,332,882,941,894,826,874]
[880,"South West","Torbay",921,879,807,372,882,894,359,839,812,926]
[211,"Inner London","Tower Hamlets",202,316,213,206,352,204,330,821,205,309]
[358,"North West","Trafford",919,305,334,356,867,823,816,895,850,825]
[384,"Yorkshire and The Humber","Wakefield",359,371,370,342,372,390,840,394,807,812]
[335,"West Midlands","Walsall",831,354,874,861,350,357,332,333,382,894]
[320,"London (Outer)","Waltham Forest",308,309,306,304,203,330,821,307,209,315]
[212,"Inner London","Wandsworth",205,207,315,213,202,870,302,846,309,318]
[877,"North West","Warrington",896,937,334,811,356,860,895,891,351,881]
[937,"West Midlands","Warwickshire",896,885,860,855,823,895,881,877,850,802]
[869,"South East","West Berkshire",825,850,823,931,936,919,873,895,867,857]
[943,"North West","Westmorland and Furness"]
[941,"East Midlands","West Northamptonshire",940,886,866,881,937,822,860,891,885,887]
[938,"South East","West Sussex",850,803,916,802,885,881,855,823,865,800]
[213,"Inner London","Westminster",202,205,207,206,212,352,203,870,302,315]
[359,"North West","Wigan",342,372,807,371,370,384,808,332,357,812]
[865,"South West","Wiltshire",916,893,878,873,938,800,885,850,802,838]
[868,"South East","Windsor and Maidenhead",936,825,869,919,872,931,867,873,850,358]
[344,"North West","Wirral",343,841,808,342,392,807,359,888,381,840]
[872,"South East","Wokingham",936,868,825,869,867,919,895,931,857,850]
[336,"West Midlands","Wolverhampton",333,892,335,331,330,831,852,373,874,861]
[885,"West Midlands","Worcestershire",937,802,881,860,838,845,938,803,855,886]
[816,"Yorkshire and The Humber","York",937,896,877,356,895,919,850,823,867,885]

{"sheet":"Select LAs","index":9,"n_rows":41,"n_cols":36,"rows_kept":41,"cut":false,"hidden":true,"merged":[]}
["LAs to benchmark",null,null,null,1,null,null,null,5,null,null,null,1,null,null,null,null,null,{"$f":"Options!A65","v":1},null,null,null,null,null,null,null,null,null,{"$f":"Options!A66","v":1}]
["LA","Name","Symbol","Result","value","order","LA name","LA code","value1","order1","LA name","LA code","value2","order2","LA name","LA code",null,null,"LA name","LA code",null,"Original code","EYPP","To rank","Rank","Rank",null,null,"LA name","LA code",null,"Original code","DAF","To rank","Rank","Rank"]
[{"$f":"INDEX('Stat Neighbours'!A3:A155,MATCH(LAchoice,LAs,0))","v":"LA No"},{"$f":"IF('Select LAs'!A3 = \"LA No\", \"No LA selected\", VLOOKUP('Select LAs'!A3,'Stat Neighbours'!$A$4:$C$155,3,0))","v":"No LA selected"},null,{"$f":"CONCATENATE(B3,C3)","v":"No LA selected"},{"$f":"IF(D3=\"No LA selected\", \"No LA selected\", VLOOKUP(D3,'3-4 year olds '!$B$29:$N$39,$E$1+2,0))","v":"No LA selected"},null,{"$f":"IFERROR(IF($A$3=\"LA No\", \"No LA selected\", INDEX($D$3:$D$13,MATCH(H3,$A$3:$A$13,0))), \"No LA selected\")","v":"No LA selected"},352,{"$f":"IF(D3=\"No LA selected\", \"No LA selected\", VLOOKUP(D3,'Non-EYSFF spend'!$B$16:$L$26,$I$1+2,0))","v":"No LA selected"},null,{"$f":"IFERROR(IF($A$3=\"LA No\", \"No LA selected\", INDEX($D$3:$D$13,MATCH(L3,$A$3:$A$13,0))), \"No LA selected\")","v":"No LA selected"},352,{"$f":"IF(D3=\"No LA selected\", \"No LA selected\", VLOOKUP(D3,'2 year olds '!$B$29:$L$39,$M$1+2,0))","v":"No LA selected"},null,{"$f":"IFERROR(IF($A$3=\"LA No\", \"No LA selected\", INDEX($D$3:$D$13,MATCH(P3,$A$3:$A$13,0))), \"No LA selected\")","v":"No LA selected"},352,null,null,{"$f":"IF($S$1=1,B3,INDEX($D$3:$D$13,MATCH(T3,$A$3:$A$13,0)))","v":"No LA selected"},{"$f":"IF($S$1=1,V3,INDEX(V:V,MATCH(U3,Y:Y,0)))","v":"LA No"},1,{"$f":"'Select LAs'!A3","v":"LA No"},{"$f":"_xlfn.IFNA(INDEX('EY Data'!BF:BF,MATCH('Select LAs'!V3,'EY Data'!B:B,0)), 0)","v":0},{"$f":"IF($A$3=\"LA No\", 0, W3*1000+V3)","v":0},{"$f":"IF(COUNTIFS($Z$3:Z3, Z3) > 1, Z3 + COUNTIFS($Z$3:Z3, Z3) - 1, Z3)","v":11},{"$f":"RANK(X3,$X$3:$X$13)","v":11},null,null,{"$f":"IF($AC$1=1,B3,INDEX($D$3:$D$13,MATCH(AD3,$A$3:$A$13,0)))","v":"No LA selected"},{"$f":"IF($AC$1=1,AF3,INDEX(AF:AF,MATCH(AE3,AI:AI,0)))","v":"LA No"},1,{"$f":"'Select LAs'!A3","v":"LA No"},{"$f":"_xlfn.IFNA(INDEX('EY Data'!BH:BH,MATCH('Select LAs'!AF3,'EY Data'!B:B,0)), 0)","v":0},{"$f":"IF($A$3=\"LA No\", 0, AG3*1000+AF3)","v":0},{"$f":"IF(COUNTIFS($AJ$3:AJ3, AJ3) > 1, AJ3 + COUNTIFS($AJ$3:AJ3, AJ3) - 1, AJ3)","v":11},{"$f":"RANK(AH3,$AH$3:$AH$13)","v":11}]
[{"$f":"IF(OR(ISBLANK(D16),D16=1), 0, INDEX(OFFSET(LAs,0,-2),D16))","v":301},{"$f":"IF(OR(ISBLANK(D16),D16=1),\"No LA selected\",INDEX(LAs,D16))","v":"Barking and Dagenham"},null,{"$f":"CONCATENATE(B4,C4)","v":"Barking and Dagenham"},{"$f":"IF(D4=\"No LA selected\", \"No LA selected\", VLOOKUP(D4,'3-4 year olds '!$B$29:$N$39,$E$1+2,0))","v":{"$error":"#N/A"}},null,{"$f":"IFERROR(IF($A$3=\"LA No\", \"No LA selected\", INDEX($D$3:$D$13,MATCH(H4,$A$3:$A$13,0))), \"No LA selected\")","v":"No LA selected"},892,{"$f":"IF(D4=\"No LA selected\", \"No LA selected\", VLOOKUP(D4,'Non-EYSFF spend'!$B$16:$L$26,$I$1+2,0))","v":{"$error":"#N/A"}},null,{"$f":"IFERROR(IF($A$3=\"LA No\", \"No LA selected\", INDEX($D$3:$D$13,MATCH(L4,$A$3:$A$13,0))), \"No LA selected\")","v":"No LA selected"},892,{"$f":"IF(D4=\"No LA selected\", \"No LA selected\", VLOOKUP(D4,'2 year olds '!$B$29:$L$39,$M$1+2,0))","v":{"$error":"#N/A"}},null,{"$f":"IFERROR(IF($A$3=\"LA No\", \"No LA selected\", INDEX($D$3:$D$13,MATCH(P4,$A$3:$A$13,0))), \"No LA selected\")","v":"No LA selected"},892,null,null,{"$f":"IF($S$1=1,B4,INDEX($D$3:$D$13,MATCH(T4,$A$3:$A$13,0)))","v":"Barking and Dagenham"},{"$f":"IF($S$1=1,V4,INDEX(V:V,MATCH(U4,Y:Y,0)))","v":301},2,{"$f":"'Select LAs'!A4","v":301},{"$f":"_xlfn.IFNA(INDEX('EY Data'!BF:BF,MATCH('Select LAs'!V4,'EY Data'!B:B,0)), 0)","v":214981},{"$f":"W4*1000+V4","v":214981301},{"$f":"IF(COUNTIFS($Z$3:Z4, Z4) > 1, Z4 + COUNTIFS($Z$3:Z4, Z4) - 1, Z4)","v":3},3,null,null,{"$f":"IF($AC$1=1,B4,INDEX($D$3:$D$13,MATCH(AD4,$A$3:$A$13,0)))","v":"Barking and Dagenham"},{"$f":"IF($AC$1=1,AF4,INDEX(AF:AF,MATCH(AE4,AI:AI,0)))","v":301},2,{"$f":"'Select LAs'!A4","v":301},{"$f":"_xlfn.IFNA(INDEX('EY Data'!BH:BH,MATCH('Select LAs'!AF4,'EY Data'!B:B,0)), 0)","v":114264},{"$f":"AG4*1000+AF4","v":114264301},{"$f":"IF(COUNTIFS($AJ$3:AJ4, AJ4) > 1, AJ4 + COUNTIFS($AJ$3:AJ4, AJ4) - 1, AJ4)","v":4},{"$f":"RANK(AH4,$AH$3:$AH$13)","v":4}]
[302,"Barnet",null,{"$f":"CONCATENATE(B5,C5)","v":"Barnet"},{"$f":"IF(D5=\"No LA selected\", \"No LA selected\", VLOOKUP(D5,'3-4 year olds '!$B$29:$N$39,$E$1+2,0))","v":{"$error":"#N/A"}},null,"No LA selected",801,{"$f":"IF(D5=\"No LA selected\", \"No LA selected\", VLOOKUP(D5,'Non-EYSFF spend'!$B$16:$L$26,$I$1+2,0))","v":{"$error":"#N/A"}},null,"No LA selected",801,{"$f":"IF(D5=\"No LA selected\", \"No LA selected\", VLOOKUP(D5,'2 year olds '!$B$29:$L$39,$M$1+2,0))","v":{"$error":"#N/A"}},null,"No LA selected",801,null,null,"Barnet",302,3,{"$f":"'Select LAs'!A5","v":302},{"$f":"_xlfn.IFNA(INDEX('EY Data'!BF:BF,MATCH('Select LAs'!V5,'EY Data'!B:B,0)), 0)","v":173333},173333302,{"$f":"IF(COUNTIFS($Z$3:Z5, Z5) > 1, Z5 + COUNTIFS($Z$3:Z5, Z5) - 1, Z5)","v":4},4,null,null,"Barnet",302,3,{"$f":"'Select LAs'!A5","v":302},{"$f":"_xlfn.IFNA(INDEX('EY Data'!BH:BH,MATCH('Select LAs'!AF5,'EY Data'!B:B,0)), 0)","v":150696},150696302,{"$f":"IF(COUNTIFS($AJ$3:AJ5, AJ5) > 1, AJ5 + COUNTIFS($AJ$3:AJ5, AJ5) - 1, AJ5)","v":2},2]
[370,"Barnsley",null,"Barnsley",{"$f":"IF(D6=\"No LA selected\", \"No LA selected\", VLOOKUP(D6,'3-4 year olds '!$B$29:$N$39,$E$1+2,0))","v":{"$error":"#N/A"}},null,"No LA selected",852,{"$f":"IF(D6=\"No LA selected\", \"No LA selected\", VLOOKUP(D6,'Non-EYSFF spend'!$B$16:$L$26,$I$1+2,0))","v":{"$error":"#N/A"}},null,"No LA selected",852,{"$f":"IF(D6=\"No LA selected\", \"No LA selected\", VLOOKUP(D6,'2 year olds '!$B$29:$L$39,$M$1+2,0))","v":{"$error":"#N/A"}},null,"No LA selected",852,null,null,"Barnsley",370,4,{"$f":"'Select LAs'!A6","v":370},{"$f":"_xlfn.IFNA(INDEX('EY Data'!BF:BF,MATCH('Select LAs'!V6,'EY Data'!B:B,0)), 0)","v":170693},170693370,{"$f":"IF(COUNTIFS($Z$3:Z6, Z6) > 1, Z6 + COUNTIFS($Z$3:Z6, Z6) - 1, Z6)","v":5},5,null,null,"Barnsley",370,4,{"$f":"'Select LAs'!A6","v":370},{"$f":"_xlfn.IFNA(INDEX('EY Data'!BH:BH,MATCH('Select LAs'!AF6,'EY Data'!B:B,0)), 0)","v":111780},111780370,{"$f":"IF(COUNTIFS($AJ$3:AJ6, AJ6) > 1, AJ6 + COUNTIFS($AJ$3:AJ6, AJ6) - 1, AJ6)","v":5},5]
[800,"Bath and North East Somerset",null,"Bath and North East Somerset",{"$f":"IF(D7=\"No LA selected\", \"No LA selected\", VLOOKUP(D7,'3-4 year olds '!$B$29:$N$39,$E$1+2,0))","v":{"$error":"#N/A"}},null,"No LA selected",330,{"$f":"IF(D7=\"No LA selected\", \"No LA selected\", VLOOKUP(D7,'Non-EYSFF spend'!$B$16:$L$26,$I$1+2,0))","v":{"$error":"#N/A"}},null,"No LA selected",330,{"$f":"IF(D7=\"No LA selected\", \"No LA selected\", VLOOKUP(D7,'2 year olds '!$B$29:$L$39,$M$1+2,0))","v":{"$error":"#N/A"}},null,"No LA selected",330,null,null,"Bath and North East Somerset",800,5,{"$f":"'Select LAs'!A7","v":800},{"$f":"_xlfn.IFNA(INDEX('EY Data'!BF:BF,MATCH('Select LAs'!V7,'EY Data'!B:B,0)), 0)","v":100755},100755800,{"$f":"IF(COUNTIFS($Z$3:Z7, Z7) > 1, Z7 + COUNTIFS($Z$3:Z7, Z7) - 1, Z7)","v":9},9,null,null,"Bath and North East Somerset",800,5,{"$f":"'Select LAs'!A7","v":800},{"$f":"_xlfn.IFNA(INDEX('EY Data'!BH:BH,MATCH('Select LAs'!AF7,'EY Data'!B:B,0)), 0)","v":63756},63756800,{"$f":"IF(COUNTIFS($AJ$3:AJ7, AJ7) > 1, AJ7 + COUNTIFS($AJ$3:AJ7, AJ7) - 1, AJ7)","v":8},8]
[822,"Bedford Borough",null,"Bedford Borough",{"$f":"IF(D8=\"No LA selected\", \"No LA selected\", VLOOKUP(D8,'3-4 year olds '!$B$29:$N$39,$E$1+2,0))","v":{"$error":"#N/A"}},null,"No LA selected",355,{"$f":"IF(D8=\"No LA selected\", \"No LA selected\", VLOOKUP(D8,'Non-EYSFF spend'!$B$16:$L$26,$I$1+2,0))","v":{"$error":"#N/A"}},null,"No LA selected",355,{"$f":"IF(D8=\"No LA selected\", \"No LA selected\", VLOOKUP(D8,'2 year olds '!$B$29:$L$39,$M$1+2,0))","v":{"$error":"#N/A"}},null,"No LA selected",355,null,null,"Bedford Borough",822,6,{"$f":"'Select LAs'!A8","v":822},{"$f":"_xlfn.IFNA(INDEX('EY Data'!BF:BF,MATCH('Select LAs'!V8,'EY Data'!B:B,0)), 0)","v":163197},163197822,{"$f":"IF(COUNTIFS($Z$3:Z8, Z8) > 1, Z8 + COUNTIFS($Z$3:Z8, Z8) - 1, Z8)","v":6},6,null,null,"Bedford Borough",822,6,{"$f":"'Select LAs'!A8","v":822},{"$f":"_xlfn.IFNA(INDEX('EY Data'!BH:BH,MATCH('Select LAs'!AF8,'EY Data'!B:B,0)), 0)","v":44712},44712822,{"$f":"IF(COUNTIFS($AJ$3:AJ8, AJ8) > 1, AJ8 + COUNTIFS($AJ$3:AJ8, AJ8) - 1, AJ8)","v":10},10]
[303,"Bexley",null,"Bexley",{"$f":"IF(D9=\"No LA selected\", \"No LA selected\", VLOOKUP(D9,'3-4 year olds '!$B$29:$N$39,$E$1+2,0))","v":{"$error":"#N/A"}},null,"No LA selected",851,{"$f":"IF(D9=\"No LA selected\", \"No LA selected\", VLOOKUP(D9,'Non-EYSFF spend'!$B$16:$L$26,$I$1+2,0))","v":{"$error":"#N/A"}},null,"No LA selected",851,{"$f":"IF(D9=\"No LA selected\", \"No LA selected\", VLOOKUP(D9,'2 year olds '!$B$29:$L$39,$M$1+2,0))","v":{"$error":"#N/A"}},null,"No LA selected",851,null,null,"Bexley",303,7,{"$f":"'Select LAs'!A9","v":303},{"$f":"_xlfn.IFNA(INDEX('EY Data'!BF:BF,MATCH('Select LAs'!V9,'EY Data'!B:B,0)), 0)","v":89859},89859303,{"$f":"IF(COUNTIFS($Z$3:Z9, Z9) > 1, Z9 + COUNTIFS($Z$3:Z9, Z9) - 1, Z9)","v":10},10,null,null,"Bexley",303,7,{"$f":"'Select LAs'!A9","v":303},{"$f":"_xlfn.IFNA(INDEX('EY Data'!BH:BH,MATCH('Select LAs'!AF9,'EY Data'!B:B,0)), 0)","v":73069},73069303,{"$f":"IF(COUNTIFS($AJ$3:AJ9, AJ9) > 1, AJ9 + COUNTIFS($AJ$3:AJ9, AJ9) - 1, AJ9)","v":7},7]
[330,"Birmingham",null,"Birmingham",{"$f":"IF(D10=\"No LA selected\", \"No LA selected\", VLOOKUP(D10,'3-4 year olds '!$B$29:$N$39,$E$1+2,0))","v":{"$error":"#N/A"}},null,"No LA selected",373,{"$f":"IF(D10=\"No LA selected\", \"No LA selected\", VLOOKUP(D10,'Non-EYSFF spend'!$B$16:$L$26,$I$1+2,0))","v":{"$error":"#N/A"}},null,"No LA selected",373,{"$f":"IF(D10=\"No LA selected\", \"No LA selected\", VLOOKUP(D10,'2 year olds '!$B$29:$L$39,$M$1+2,0))","v":{"$error":"#N/A"}},null,"No LA selected",373,null,null,"Birmingham",330,8,{"$f":"'Select LAs'!A10","v":330},{"$f":"_xlfn.IFNA(INDEX('EY Data'!BF:BF,MATCH('Select LAs'!V10,'EY Data'!B:B,0)), 0)","v":1471434},1471434330,{"$f":"IF(COUNTIFS($Z$3:Z10, Z10) > 1, Z10 + COUNTIFS($Z$3:Z10, Z10) - 1, Z10)","v":1},1,null,null,"Birmingham",330,8,{"$f":"'Select LAs'!A10","v":330},{"$f":"_xlfn.IFNA(INDEX('EY Data'!BH:BH,MATCH('Select LAs'!AF10,'EY Data'!B:B,0)), 0)","v":570492},570492330,{"$f":"IF(COUNTIFS($AJ$3:AJ10, AJ10) > 1, AJ10 + COUNTIFS($AJ$3:AJ10, AJ10) - 1, AJ10)","v":1},1]
[889,"Blackburn with Darwen",null,"Blackburn with Darwen",{"$f":"IF(D11=\"No LA selected\", \"No LA selected\", VLOOKUP(D11,'3-4 year olds '!$B$29:$N$39,$E$1+2,0))","v":{"$error":"#N/A"}},null,"No LA selected",341,{"$f":"IF(D11=\"No LA selected\", \"No LA selected\", VLOOKUP(D11,'Non-EYSFF spend'!$B$16:$L$26,$I$1+2,0))","v":{"$error":"#N/A"}},null,"No LA selected",341,{"$f":"IF(D11=\"No LA selected\", \"No LA selected\", VLOOKUP(D11,'2 year olds '!$B$29:$L$39,$M$1+2,0))","v":{"$error":"#N/A"}},null,"No LA selected",341,null,null,"Blackburn with Darwen",889,9,{"$f":"'Select LAs'!A11","v":889},{"$f":"_xlfn.IFNA(INDEX('EY Data'!BF:BF,MATCH('Select LAs'!V11,'EY Data'!B:B,0)), 0)","v":113696},113696889,{"$f":"IF(COUNTIFS($Z$3:Z11, Z11) > 1, Z11 + COUNTIFS($Z$3:Z11, Z11) - 1, Z11)","v":8},8,null,null,"Blackburn with Darwen",889,9,{"$f":"'Select LAs'!A11","v":889},{"$f":"_xlfn.IFNA(INDEX('EY Data'!BH:BH,MATCH('Select LAs'!AF11,'EY Data'!B:B,0)), 0)","v":57132},57132889,{"$f":"IF(COUNTIFS($AJ$3:AJ11, AJ11) > 1, AJ11 + COUNTIFS($AJ$3:AJ11, AJ11) - 1, AJ11)","v":9},9]
[890,"Blackpool",null,"Blackpool",{"$f":"IF(D12=\"No LA selected\", \"No LA selected\", VLOOKUP(D12,'3-4 year olds '!$B$29:$N$39,$E$1+2,0))","v":{"$error":"#N/A"}},null,"No LA selected",336,{"$f":"IF(D12=\"No LA selected\", \"No LA selected\", VLOOKUP(D12,'Non-EYSFF spend'!$B$16:$L$26,$I$1+2,0))","v":{"$error":"#N/A"}},null,"No LA selected",336,{"$f":"IF(D12=\"No LA selected\", \"No LA selected\", VLOOKUP(D12,'2 year olds '!$B$29:$L$39,$M$1+2,0))","v":{"$error":"#N/A"}},null,"No LA selected",336,null,null,"Blackpool",890,10,{"$f":"'Select LAs'!A12","v":890},{"$f":"_xlfn.IFNA(INDEX('EY Data'!BF:BF,MATCH('Select LAs'!V12,'EY Data'!B:B,0)), 0)","v":117916},117916890,{"$f":"IF(COUNTIFS($Z$3:Z12, Z12) > 1, Z12 + COUNTIFS($Z$3:Z12, Z12) - 1, Z12)","v":7},7,null,null,"Blackpool",890,10,{"$f":"'Select LAs'!A12","v":890},{"$f":"_xlfn.IFNA(INDEX('EY Data'!BH:BH,MATCH('Select LAs'!AF12,'EY Data'!B:B,0)), 0)","v":74520},74520890,{"$f":"IF(COUNTIFS($AJ$3:AJ12, AJ12) > 1, AJ12 + COUNTIFS($AJ$3:AJ12, AJ12) - 1, AJ12)","v":6},6]
[350,"Bolton",null,"Bolton",{"$f":"IF(D13=\"No LA selected\", \"No LA selected\", VLOOKUP(D13,'3-4 year olds '!$B$29:$N$39,$E$1+2,0))","v":{"$error":"#N/A"}},null,"No LA selected",391,{"$f":"IF(D13=\"No LA selected\", \"No LA selected\", VLOOKUP(D13,'Non-EYSFF spend'!$B$16:$L$26,$I$1+2,0))","v":{"$error":"#N/A"}},null,"No LA selected",391,{"$f":"IF(D13=\"No LA selected\", \"No LA selected\", VLOOKUP(D13,'2 year olds '!$B$29:$L$39,$M$1+2,0))","v":{"$error":"#N/A"}},null,"No LA selected",391,null,null,"Bolton",350,11,{"$f":"'Select LAs'!A13","v":350},{"$f":"_xlfn.IFNA(INDEX('EY Data'!BF:BF,MATCH('Select LAs'!V13,'EY Data'!B:B,0)), 0)","v":289600},289600350,{"$f":"IF(COUNTIFS($Z$3:Z13, Z13) > 1, Z13 + COUNTIFS($Z$3:Z13, Z13) - 1, Z13)","v":2},2,null,null,"Bolton",350,11,{"$f":"'Select LAs'!A13","v":350},{"$f":"_xlfn.IFNA(INDEX('EY Data'!BH:BH,MATCH('Select LAs'!AF13,'EY Data'!B:B,0)), 0)","v":148200},148200350,{"$f":"IF(COUNTIFS($AJ$3:AJ13, AJ13) > 1, AJ13 + COUNTIFS($AJ$3:AJ13, AJ13) - 1, AJ13)","v":3},3]
[]
["Stat neighbours"]
[{"$f":"IF('Select LAs'!$A$3=\"LA No\", \"No LA selected\", VLOOKUP('Select LAs'!$A$3,'Stat Neighbours'!$A$4:$M$155,ROW(A4),0))","v":"No LA selected"},{"$f":"IF('Select LAs'!A16=\"No LA selected\", \"No LA selected\", VLOOKUP('Select LAs'!A16,'Stat Neighbours'!$A$4:$C$155,3,0))","v":"No LA selected"},{"$f":"IF(B16=\"No LA selected\", 0, MATCH(B16,LAs,0))","v":0},0,{"$f":"IF(C16=0, 0, IF(C16=D16,1,0))","v":0}]
[{"$f":"IF('Select LAs'!$A$3=\"LA No\", \"No LA selected\", VLOOKUP('Select LAs'!$A$3,'Stat Neighbours'!$A$4:$M$155,ROW(A5),0))","v":"No LA selected"},{"$f":"IF('Select LAs'!A17=\"No LA selected\", \"No LA selected\", VLOOKUP('Select LAs'!A17,'Stat Neighbours'!$A$4:$C$155,3,0))","v":"No LA selected"},0,0,{"$f":"IF(C17=0, 0, IF(C17=D17,1,0))","v":0}]
[{"$f":"IF('Select LAs'!$A$3=\"LA No\", \"No LA selected\", VLOOKUP('Select LAs'!$A$3,'Stat Neighbours'!$A$4:$M$155,ROW(A6),0))","v":"No LA selected"},{"$f":"IF('Select LAs'!A18=\"No LA selected\", \"No LA selected\", VLOOKUP('Select LAs'!A18,'Stat Neighbours'!$A$4:$C$155,3,0))","v":"No LA selected"},0,0,0]
[{"$f":"IF('Select LAs'!$A$3=\"LA No\", \"No LA selected\", VLOOKUP('Select LAs'!$A$3,'Stat Neighbours'!$A$4:$M$155,ROW(A7),0))","v":"No LA selected"},{"$f":"IF('Select LAs'!A19=\"No LA selected\", \"No LA selected\", VLOOKUP('Select LAs'!A19,'Stat Neighbours'!$A$4:$C$155,3,0))","v":"No LA selected"},0,0,0]
[{"$f":"IF('Select LAs'!$A$3=\"LA No\", \"No LA selected\", VLOOKUP('Select LAs'!$A$3,'Stat Neighbours'!$A$4:$M$155,ROW(A8),0))","v":"No LA selected"},{"$f":"IF('Select LAs'!A20=\"No LA selected\", \"No LA selected\", VLOOKUP('Select LAs'!A20,'Stat Neighbours'!$A$4:$C$155,3,0))","v":"No LA selected"},0,0,0]
[{"$f":"IF('Select LAs'!$A$3=\"LA No\", \"No LA selected\", VLOOKUP('Select LAs'!$A$3,'Stat Neighbours'!$A$4:$M$155,ROW(A9),0))","v":"No LA selected"},{"$f":"IF('Select LAs'!A21=\"No LA selected\", \"No LA selected\", VLOOKUP('Select LAs'!A21,'Stat Neighbours'!$A$4:$C$155,3,0))","v":"No LA selected"},0,0,0]
[{"$f":"IF('Select LAs'!$A$3=\"LA No\", \"No LA selected\", VLOOKUP('Select LAs'!$A$3,'Stat Neighbours'!$A$4:$M$155,ROW(A10),0))","v":"No LA selected"},{"$f":"IF('Select LAs'!A22=\"No LA selected\", \"No LA selected\", VLOOKUP('Select LAs'!A22,'Stat Neighbours'!$A$4:$C$155,3,0))","v":"No LA selected"},0,0,0]
[{"$f":"IF('Select LAs'!$A$3=\"LA No\", \"No LA selected\", VLOOKUP('Select LAs'!$A$3,'Stat Neighbours'!$A$4:$M$155,ROW(A11),0))","v":"No LA selected"},{"$f":"IF('Select LAs'!A23=\"No LA selected\", \"No LA selected\", VLOOKUP('Select LAs'!A23,'Stat Neighbours'!$A$4:$C$155,3,0))","v":"No LA selected"},0,0,0]
[{"$f":"IF('Select LAs'!$A$3=\"LA No\", \"No LA selected\", VLOOKUP('Select LAs'!$A$3,'Stat Neighbours'!$A$4:$M$155,ROW(A12),0))","v":"No LA selected"},{"$f":"IF('Select LAs'!A24=\"No LA selected\", \"No LA selected\", VLOOKUP('Select LAs'!A24,'Stat Neighbours'!$A$4:$C$155,3,0))","v":"No LA selected"},0,0,0]
[{"$f":"IF('Select LAs'!$A$3=\"LA No\", \"No LA selected\", VLOOKUP('Select LAs'!$A$3,'Stat Neighbours'!$A$4:$M$155,ROW(A13),0))","v":"No LA selected"},{"$f":"IF('Select LAs'!A25=\"No LA selected\", \"No LA selected\", VLOOKUP('Select LAs'!A25,'Stat Neighbours'!$A$4:$C$155,3,0))","v":"No LA selected"},0,0,0]
[]
[null,null,null,{"$f":"COUNT(Rightindices)","v":10},{"$f":"IF(AND(E16:E25),1,0)","v":0}]
[]
[null,null,null,"Check for duplicates",{"$f":"MAX(COUNTIFS(E31:E41,E31:E41))","v":1}]
[]
[null,null,null,null,{"$f":"A3","v":"LA No"}]
[null,null,null,null,{"$f":"IF(A4=0, \"zero1\", A4)","v":301}]
[null,null,null,null,{"$f":"IF(A5=0, \"zero2\", A5)","v":302}]
[null,null,null,null,{"$f":"IF(A6=0, \"zero3\", A6)","v":370}]
[null,null,null,null,{"$f":"IF(A7=0, \"zero4\", A7)","v":800}]
[null,null,null,null,{"$f":"IF(A8=0, \"zero5\", A8)","v":822}]
[null,null,null,null,{"$f":"IF(A9=0, \"zero6\", A9)","v":303}]
[null,null,null,null,{"$f":"IF(A10=0, \"zero7\", A10)","v":330}]
[null,null,null,null,{"$f":"IF(A11=0, \"zero8\", A11)","v":889}]
[null,null,null,null,{"$f":"IF(A12=0, \"zero9\", A12)","v":890}]
[null,null,null,null,{"$f":"IF(A13=0, \"zero10\", A13)","v":350}]