{"text_format":"1","workbook":"xlsx","n_sheets":10,"sheets":["STATISTICAL NEIGHBOURS","3-4 year olds ","2 year olds ","Non-EYSFF spend","Early Years Pupil Premium","Disability Access Fund","EY Data","Options","Stat Neighbours","Select LAs"],"not_rendered":{"charts":14,"images":0,"macros":1,"external_links":0,"defined_names":45,"comments":0,"pivot_tables":0},"unopened":[],"bounds":{"document_bytes":16777216,"sheet_cells":100000,"rows_first":2000,"rows_last":500,"rows_between":2000,"halvings":0,"cell_chars":16384,"cell_head_chars":4096},"cells_cut":0,"cells_raw":0,"read":"whole","date_system":"1900"}

{"sheet":"STATISTICAL NEIGHBOURS","index":0,"n_rows":27,"n_cols":4,"rows_kept":27,"cut":false,"hidden":false,"merged":[]}
[null,"Early Years Funding Benchmarking Tool: 2023-2024"]
[null,"This worksheet allows you to view data for your own local authority along with your statistical "]
[null,"neighbours, or with your own choice of other local authorities."]
[]
[null,"Choose Local Authorities",null,"Other Local Authorities"]
[]
[null,"1. Please select your local authority"]
[]
{"$rows_left_out":20}
{"sheet":"3-4 year olds ","index":1,"n_rows":42,"n_cols":13,"rows_kept":42,"cut":false,"hidden":true,"merged":[[26,1,26,2],[25,3,25,6],[25,7,26,7],[25,8,26,8],[4,1,4,2],[22,3,22,4],[6,1,6,2],[7,1,7,2],[8,1,8,2],[5,1,5,2],[17,1,17,13],[25,9,25,12]]}
[]
[null,{"$f":"CONCATENATE('Select LAs'!B3,\" - Key Budget Statistics\")","v":"No LA selected - Key Budget Statistics"},null,null,null,null,null,null,null,null,null,null,"Financial Year 2023-2024"]
[]
[null,null,null,"PVIs","Nursery Schools","Primary Nursery Places","Centrally Retained"]
[null,{"$f":"'Select LAs'!D3","v":"No LA selected"},null,"All providers","Private, Voluntary, Independent","Nursery schools","Primary nursery places"]
["Total FTE","3-4 year old hourly average funding rate (£/hr)1",null,{"$f":"IFERROR(IF(INDEX('EY Data'!E:E, MATCH('Select LAs'!$A$3,'EY Data'!$B:$B, 0))=\"\",\"-\", INDEX('EY Data'!E:E, MATCH('Select LAs'!$A$3,'EY Data'!$B:$B, 0))), 0)","v":0},{"$f":"IFERROR(IF(INDEX('EY Data'!H:H, MATCH('Select LAs'!$A$3,'EY Data'!$B:$B, 0))=\"\",\"-\", INDEX('EY Data'!H:H, MATCH('Select LAs'!$A$3,'EY Data'!$B:$B, 0))), 0)","v":0},{"$f":"IFERROR(IF(INDEX('EY Data'!G:G, MATCH('Select LAs'!$A$3,'EY Data'!$B:$B, 0))=\"\",\"-\", INDEX('EY Data'!G:G, MATCH('Select LAs'!$A$3,'EY Data'!$B:$B, 0))), 0)","v":0},{"$f":"IFERROR(IF(INDEX('EY Data'!F:F, MATCH('Select LAs'!$A$3,'EY Data'!$B:$B, 0))=\"\",\"-\", INDEX('EY Data'!F:F, MATCH('Select LAs'!$A$3,'EY Data'!$B:$B, 0))), 0)","v":0}]
["Total budget","3-4 year old hourly average base rate for statutory hours (£/hr)2",null,{"$f":"IFERROR(IF(INDEX('EY Data'!S:S, MATCH('Select LAs'!$A$3,'EY Data'!$B:$B, 0))=\"\",\"-\", INDEX('EY Data'!S:S, MATCH('Select LAs'!$A$3,'EY Data'!$B:$B, 0))), 0)","v":0},{"$f":"IFERROR(IF(INDEX('EY Data'!V:V, MATCH('Select LAs'!$A$3,'EY Data'!$B:$B, 0))=\"\",\"-\", INDEX('EY Data'!V:V, MATCH('Select LAs'!$A$3,'EY Data'!$B:$B, 0))), 0)","v":0},{"$f":"IFERROR(IF(INDEX('EY Data'!U:U, MATCH('Select LAs'!$A$3,'EY Data'!$B:$B, 0))=\"\",\"-\", INDEX('EY Data'!U:U, MATCH('Select LAs'!$A$3,'EY Data'!$B:$B, 0))), 0)","v":0},{"$f":"IFERROR(IF(INDEX('EY Data'!T:T, MATCH('Select LAs'!$A$3,'EY Data'!$B:$B, 0))=\"\",\"-\", INDEX('EY Data'!T:T, MATCH('Select LAs'!$A$3,'EY Data'!$B:$B, 0))), 0)","v":0}]
["Total Hours"]
{"$rows_left_out":35}
{"sheet":"2 year olds ","index":2,"n_rows":42,"n_cols":11,"rows_kept":42,"cut":false,"hidden":true,"merged":[[43,1,43,9],[4,1,4,2],[22,3,22,4],[26,1,26,2],[25,3,25,6],[6,1,6,2],[5,1,5,2],[25,7,25,10]]}
[]
[null,{"$f":"CONCATENATE('Select LAs'!B3,\" - Key Budget Statistics\")","v":"No LA selected - Key Budget Statistics"},null,null,null,null,null,null,null,null,{"$f":"'3-4 year olds '!M2","v":"Financial Year 2023-2024"}]
[]
[]
[null,{"$f":"'Select LAs'!D3","v":"No LA selected"},null,"All providers","Private, Voluntary, Independent","Nursery schools","Primary nursery places"]
[null,"2 year old hourly average funding rate (£/hr)",null,{"$f":"IFERROR(IF(INDEX('EY Data'!AL:AL, MATCH('Select LAs'!$A$3,'EY Data'!$B:$B, 0))=\"\",\"-\", INDEX('EY Data'!AL:AL, MATCH('Select LAs'!$A$3,'EY Data'!$B:$B, 0))), 0)","v":0},{"$f":"IFERROR(IF(INDEX('EY Data'!AO:AO, MATCH('Select LAs'!$A$3,'EY Data'!$B:$B, 0))=\"\",\"-\", INDEX('EY Data'!AO:AO, MATCH('Select LAs'!$A$3,'EY Data'!$B:$B, 0))), 0)","v":0},{"$f":"IFERROR(IF(INDEX('EY Data'!AN:AN, MATCH('Select LAs'!$A$3,'EY Data'!$B:$B, 0))=\"\",\"-\", INDEX('EY Data'!AN:AN, MATCH('Select LAs'!$A$3,'EY Data'!$B:$B, 0))), 0)","v":0},{"$f":"IFERROR(IF(INDEX('EY Data'!AM:AM, MATCH('Select LAs'!$A$3,'EY Data'!$B:$B, 0))=\"\",\"-\", INDEX('EY Data'!AM:AM, MATCH('Select LAs'!$A$3,'EY Data'!$B:$B, 0))), 0)","v":0}]
[null,"2 year old hourly average base rate (£/hr)",null,{"$f":"IFERROR(IF(INDEX('EY Data'!AQ:AQ, MATCH('Select LAs'!$A$3,'EY Data'!$B:$B, 0))=\"\",\"-\", INDEX('EY Data'!AQ:AQ, MATCH('Select LAs'!$A$3,'EY Data'!$B:$B, 0))), 0)","v":0},{"$f":"IFERROR(IF(INDEX('EY Data'!AT:AT, MATCH('Select LAs'!$A$3,'EY Data'!$B:$B, 0))=\"\",\"-\", INDEX('EY Data'!AT:AT, MATCH('Select LAs'!$A$3,'EY Data'!$B:$B, 0))), 0)","v":0},{"$f":"IFERROR(IF(INDEX('EY Data'!AS:AS, MATCH('Select LAs'!$A$3,'EY Data'!$B:$B, 0))=\"\",\"-\", INDEX('EY Data'!AS:AS, MATCH('Select LAs'!$A$3,'EY Data'!$B:$B, 0))), 0)","v":0},{"$f":"IFERROR(IF(INDEX('EY Data'!AR:AR, MATCH('Select LAs'!$A$3,'EY Data'!$B:$B, 0))=\"\",\"-\", INDEX('EY Data'!AR:AR, MATCH('Select LAs'!$A$3,'EY Data'!$B:$B, 0))), 0)","v":0}]
[]
{"$rows_left_out":35}
{"sheet":"Non-EYSFF spend","index":3,"n_rows":32,"n_cols":11,"rows_kept":32,"cut":false,"hidden":true,"merged":[[13,1,13,2],[30,1,30,10],[31,2,31,10],[9,3,9,4],[12,3,12,6],[12,7,12,10]]}
[]
[null,{"$f":"'Select LAs'!B3","v":"No LA selected"},null,null,null,null,null,null,null,null,{"$f":"'3-4 year olds '!M2","v":"Financial Year 2023-2024"}]
[]
[null,null,null,"PVIs","Nursery Schools","Primary Nursery Places"]
[]
[null,{"$f":"CONCATENATE(\"Benchmarking against \",IF(_SN=1,\"Statistical Neighbours\",\"Manual Selection\"))","v":"Benchmarking against Manual Selection"}]
[]
[]
{"$rows_left_out":25}
{"sheet":"Early Years Pupil Premium","index":4,"n_rows":32,"n_cols":11,"rows_kept":32,"cut":false,"hidden":true,"merged":[[4,1,4,2],[5,1,5,2],[16,1,16,2],[8,1,9,11]]}
[]
[null,{"$f":"CONCATENATE('Select LAs'!B3,\" - Key Budget Statistics\")","v":"No LA selected - Key Budget Statistics"},null,null,null,null,null,null,null,null,{"$f":"'3-4 year olds '!M2","v":"Financial Year 2023-2024"}]
[]
[]
[null,{"$f":"'Select LAs'!D3","v":"No LA selected"},null,"All establishments"]
[null,"Early Years Pupil Premium - total",null,{"$f":"IF('Select LAs'!$A$3=\"LA No\", \"-\", INDEX('EY Data'!BF:BF, MATCH('Select LAs'!$A$3,'EY Data'!$B:$B, 0)))","v":"-"}]
[]
[]
{"$rows_left_out":25}
{"sheet":"Disability Access Fund","index":5,"n_rows":32,"n_cols":11,"rows_kept":32,"cut":false,"hidden":true,"merged":[[4,1,4,2],[5,1,5,2],[8,1,9,11],[16,1,16,2]]}
[]
[null,{"$f":"CONCATENATE('Select LAs'!B3,\" - Key Budget Statistics\")","v":"No LA selected - Key Budget Statistics"},null,null,null,null,null,null,null,null,{"$f":"'3-4 year olds '!M2","v":"Financial Year 2023-2024"}]
[]
[]
[null,{"$f":"'Select LAs'!D3","v":"No LA selected"},null,"All establishments"]
[null,"Disability Access Fund - total",null,{"$f":"IF('Select LAs'!$A$3=\"LA No\", \"-\", INDEX('EY Data'!BH:BH, MATCH('Select LAs'!$A$3,'EY Data'!$B:$B, 0)))","v":"-"}]
[]
[]
{"$rows_left_out":25}
{"sheet":"EY Data","index":6,"n_rows":177,"n_cols":71,"rows_kept":177,"cut":false,"hidden":true,"merged":[[2,54,2,55],[2,4,2,7],[8,64,8,68],[2,30,2,31],[2,37,2,40],[2,9,2,16],[2,18,2,21],[2,42,2,45],[2,25,2,28],[2,49,2,52]]}
[]
[null,1,2,3,4,5,6,7,8,9,10,11,12,13,14,15,16,17,18,19,20,21,22,23,24,25,26,27,28,29,30,31,32,33,34,35,36,37,38,39,40,41,42,43,44,45,46,47,48,49,50,51,52,53,54,55,56,57,58,59]
[null,null,null,null,"3 and 4 year olds hourly average funding rate",null,null,null,null,"3 and 4 year olds components of hourly average funding rate for all providers",null,null,null,null,null,null,null,null,"3 and 4 year olds hourly average base rate",null,null,null,null,"3 and 4 year olds EYSFF total budget ",null,"3 and 4 year olds SEN Inclusion Fund (top-up grant element)",null,null,null,null,"3 and 4 year olds contingency funding & central spend",null,null,"3 and 4 year olds",null,"3 and 4 year olds",null,"2 year olds hourly average funding rate",null,null,null,null,"2 year olds hourly average base rate",null,null,null,null,"2 year olds EYSFF total budget ",null,"2 year olds SEN Inclusion Fund (top-up grant element)",null,null,null,null,"2 year olds contingency funding & central spend",null,null,"EYPP",null,"DAF"]
[null,"LA Number","LA name",null,"All Providers","Primary Nursery Class","Maintained Nursery School","Private, Voluntary and Independent (PVI)",null,"Base rate","Supplements - Deprivation","Supplements - Quality","Supplements - Flexibility","Supplements - Rurality/Sparsity","Supplements - EAL","Maintained nursery school (MNS) lump sums","SEN Inclusion Fund (top-up grant element)",null,"All Providers","Primary Nursery Class","Maintained Nursery School","Private, Voluntary and Independent (PVI)",null,"All Providers",null,"All Providers","Primary Nursery Class","Maintained Nursery School","Private, Voluntary and Independent (PVI)",null,"Contingency Funding","Central Spend",null,"Pass Through Rate (%)",null,"Funding Paid Through Supplements (%)",null,"All Providers","Primary Nursery Class","Maintained Nursery School","Private, Voluntary and Independent (PVI)",null,"All Providers","Primary Nursery Class","Maintained Nursery School","Private, Voluntary and Independent (PVI)",null,"All Providers",null,"All Providers","Primary Nursery Class","Maintained Nursery School","Private, Voluntary and Independent (PVI)",null,"Contingency Funding","Central Spend",null,"Early Years Pupil Premium",null,"Disability Access Fund"]
[null,301,"Barking and Dagenham",null,6.6368285535245874,0,0,6.6368285535245874,null,6.0100000002622087,0.3285501093193911,0,0,0,0,0,0.2982784439429878,null,6.0100000002622087,0,0,6.0100000002622087,null,19338947.57,null,910049,0,0,910049,null,0,0,null,1.1042975962603307,null,5.1833637604716876E-2,null,6.698593813738043,0,0,6.698593813738043,null,6.3599999999999994,0,0,6.3599999999999994,null,4038110.28,null,214981,0,0,214981,null,0,0,null,214981,null,114264]
[null,302,"Barnet",null,6.2596239421329303,6.079094051774339,9.0793172075471702,6.081143209076175,null,5.8699999993198864,0.1302203549149781,0,0,0,0,0.16872189987023223,9.0681688027834009E-2,null,5.8699999993198864,5.8699999991499086,5.87,5.87,null,27211413.409999996,null,400000,320000,22857.14,57142.86,null,0,1414047.67,null,0.95021872804941998,null,2.1702595442694126E-2,null,6.9200000069871361,6.9200000087626936,6.92,6.92,null,6.9200000069871361,6.9200000087626936,6.92,6.92,null,3169253.02,null,0,0,0,0,null,0,0,null,173333,null,150696]
[null,370,"Barnsley",null,4.7532228272138637,4.7817038283925388,0,4.7337371352205384,null,4.5699999996381946,0.14704224260580101,0,0,0,0,0,3.6180584969868632E-2,null,4.5699999996381946,4.57,0,4.5699999993906593,null,13037495.789999999,null,100000,50000,0,50000,null,0,583529,null,0.97602111441763117,null,3.1172551580935164E-2,null,5.4375321978034155,0,0,5.4375321978034155,null,5.3700000051282366,0,0,5.3700000051282366,null,2408430.02,null,30288,0,0,30288,null,0,96471,null,170693,null,111780,null,null,"3 and 4 year olds components of hourly average funding rate for all providers"]
[null,800,"Bath and North East Somerset",null,4.8492914569481949,4.8735917673395921,0,4.8432163604193379,null,4.54,8.057230394906427E-2,0,0,0,0,0,0.22871915299912995,null,4.54,4.54,0,4.54,null,9267320.1500000004,null,458734,91747,0,366987,null,0,487752,null,0.99370726576807278,null,1.7437732525081694E-2,null,6.01,6.01,0,6.01,null,6.01,6.01,0,6.01,null,922679.24,null,0,0,0,0,null,0,0,null,100755,null,63756]
{"$rows_left_out":170}
{"sheet":"Options","index":7,"n_rows":69,"n_cols":1,"rows_kept":69,"cut":false,"hidden":true,"merged":[]}
["3-4 yrs Chart Choice"]
["3-4 yrs per hour"]
["% Pass through rate"]
["% Funding provided through supplements"]
["SEN Inclusion Fund"]
[]
["2 yrs Chart Choice"]
["2 yrs per hour"]
{"$rows_left_out":62}
{"sheet":"Stat Neighbours","index":8,"n_rows":154,"n_cols":13,"rows_kept":154,"cut":false,"hidden":true,"merged":[]}
["Statistical Neighbours"]
[]
["LA No","Region","Choice","LA No","LA No","LA No","LA No","LA No","LA No","LA No","LA No","LA No","LA No"]
[301,"London (Outer)","Barking and Dagenham",203,308,352,821,330,320,871,892,331,316]
[302,"London (Outer)","Barnet",315,314,870,319,312,317,313,826,307,305]
[370,"Yorkshire and The Humber","Barnsley",807,371,359,372,812,384,342,840,394,357]
[800,"South West","Bath and North East Somerset",916,873,931,865,938,850,802,803,885,878]
[822,"East of England","Bedford Borough",941,886,866,826,937,940,887,919,881,831]
{"$rows_left_out":147}
{"sheet":"Select LAs","index":9,"n_rows":41,"n_cols":36,"rows_kept":41,"cut":false,"hidden":true,"merged":[]}
["LAs to benchmark",null,null,null,1,null,null,null,5,null,null,null,1,null,null,null,null,null,{"$f":"Options!A65","v":1},null,null,null,null,null,null,null,null,null,{"$f":"Options!A66","v":1}]
["LA","Name","Symbol","Result","value","order","LA name","LA code","value1","order1","LA name","LA code","value2","order2","LA name","LA code",null,null,"LA name","LA code",null,"Original code","EYPP","To rank","Rank","Rank",null,null,"LA name","LA code",null,"Original code","DAF","To rank","Rank","Rank"]
[{"$f":"INDEX('Stat Neighbours'!A3:A155,MATCH(LAchoice,LAs,0))","v":"LA No"},{"$f":"IF('Select LAs'!A3 = \"LA No\", \"No LA selected\", VLOOKUP('Select LAs'!A3,'Stat Neighbours'!$A$4:$C$155,3,0))","v":"No LA selected"},null,{"$f":"CONCATENATE(B3,C3)","v":"No LA selected"},{"$f":"IF(D3=\"No LA selected\", \"No LA selected\", VLOOKUP(D3,'3-4 year olds '!$B$29:$N$39,$E$1+2,0))","v":"No LA selected"},null,{"$f":"IFERROR(IF($A$3=\"LA No\", \"No LA selected\", INDEX($D$3:$D$13,MATCH(H3,$A$3:$A$13,0))), \"No LA selected\")","v":"No LA selected"},352,{"$f":"IF(D3=\"No LA selected\", \"No LA selected\", VLOOKUP(D3,'Non-EYSFF spend'!$B$16:$L$26,$I$1+2,0))","v":"No LA selected"},null,{"$f":"IFERROR(IF($A$3=\"LA No\", \"No LA selected\", INDEX($D$3:$D$13,MATCH(L3,$A$3:$A$13,0))), \"No LA selected\")","v":"No LA selected"},352,{"$f":"IF(D3=\"No LA selected\", \"No LA selected\", VLOOKUP(D3,'2 year olds '!$B$29:$L$39,$M$1+2,0))","v":"No LA selected"},null,{"$f":"IFERROR(IF($A$3=\"LA No\", \"No LA selected\", INDEX($D$3:$D$13,MATCH(P3,$A$3:$A$13,0))), \"No LA selected\")","v":"No LA selected"},352,null,null,{"$f":"IF($S$1=1,B3,INDEX($D$3:$D$13,MATCH(T3,$A$3:$A$13,0)))","v":"No LA selected"},{"$f":"IF($S$1=1,V3,INDEX(V:V,MATCH(U3,Y:Y,0)))","v":"LA No"},1,{"$f":"'Select LAs'!A3","v":"LA No"},{"$f":"_xlfn.IFNA(INDEX('EY Data'!BF:BF,MATCH('Select LAs'!V3,'EY Data'!B:B,0)), 0)","v":0},{"$f":"IF($A$3=\"LA No\", 0, W3*1000+V3)","v":0},{"$f":"IF(COUNTIFS($Z$3:Z3, Z3) > 1, Z3 + COUNTIFS($Z$3:Z3, Z3) - 1, Z3)","v":11},{"$f":"RANK(X3,$X$3:$X$13)","v":11},null,null,{"$f":"IF($AC$1=1,B3,INDEX($D$3:$D$13,MATCH(AD3,$A$3:$A$13,0)))","v":"No LA selected"},{"$f":"IF($AC$1=1,AF3,INDEX(AF:AF,MATCH(AE3,AI:AI,0)))","v":"LA No"},1,{"$f":"'Select LAs'!A3","v":"LA No"},{"$f":"_xlfn.IFNA(INDEX('EY Data'!BH:BH,MATCH('Select LAs'!AF3,'EY Data'!B:B,0)), 0)","v":0},{"$f":"IF($A$3=\"LA No\", 0, AG3*1000+AF3)","v":0},{"$f":"IF(COUNTIFS($AJ$3:AJ3, AJ3) > 1, AJ3 + COUNTIFS($AJ$3:AJ3, AJ3) - 1, AJ3)","v":11},{"$f":"RANK(AH3,$AH$3:$AH$13)","v":11}]
[{"$f":"IF(OR(ISBLANK(D16),D16=1), 0, INDEX(OFFSET(LAs,0,-2),D16))","v":301},{"$f":"IF(OR(ISBLANK(D16),D16=1),\"No LA selected\",INDEX(LAs,D16))","v":"Barking and Dagenham"},null,{"$f":"CONCATENATE(B4,C4)","v":"Barking and Dagenham"},{"$f":"IF(D4=\"No LA selected\", \"No LA selected\", VLOOKUP(D4,'3-4 year olds '!$B$29:$N$39,$E$1+2,0))","v":{"$error":"#N/A"}},null,{"$f":"IFERROR(IF($A$3=\"LA No\", \"No LA selected\", INDEX($D$3:$D$13,MATCH(H4,$A$3:$A$13,0))), \"No LA selected\")","v":"No LA selected"},892,{"$f":"IF(D4=\"No LA selected\", \"No LA selected\", VLOOKUP(D4,'Non-EYSFF spend'!$B$16:$L$26,$I$1+2,0))","v":{"$error":"#N/A"}},null,{"$f":"IFERROR(IF($A$3=\"LA No\", \"No LA selected\", INDEX($D$3:$D$13,MATCH(L4,$A$3:$A$13,0))), \"No LA selected\")","v":"No LA selected"},892,{"$f":"IF(D4=\"No LA selected\", \"No LA selected\", VLOOKUP(D4,'2 year olds '!$B$29:$L$39,$M$1+2,0))","v":{"$error":"#N/A"}},null,{"$f":"IFERROR(IF($A$3=\"LA No\", \"No LA selected\", INDEX($D$3:$D$13,MATCH(P4,$A$3:$A$13,0))), \"No LA selected\")","v":"No LA selected"},892,null,null,{"$f":"IF($S$1=1,B4,INDEX($D$3:$D$13,MATCH(T4,$A$3:$A$13,0)))","v":"Barking and Dagenham"},{"$f":"IF($S$1=1,V4,INDEX(V:V,MATCH(U4,Y:Y,0)))","v":301},2,{"$f":"'Select LAs'!A4","v":301},{"$f":"_xlfn.IFNA(INDEX('EY Data'!BF:BF,MATCH('Select LAs'!V4,'EY Data'!B:B,0)), 0)","v":214981},{"$f":"W4*1000+V4","v":214981301},{"$f":"IF(COUNTIFS($Z$3:Z4, Z4) > 1, Z4 + COUNTIFS($Z$3:Z4, Z4) - 1, Z4)","v":3},3,null,null,{"$f":"IF($AC$1=1,B4,INDEX($D$3:$D$13,MATCH(AD4,$A$3:$A$13,0)))","v":"Barking and Dagenham"},{"$f":"IF($AC$1=1,AF4,INDEX(AF:AF,MATCH(AE4,AI:AI,0)))","v":301},2,{"$f":"'Select LAs'!A4","v":301},{"$f":"_xlfn.IFNA(INDEX('EY Data'!BH:BH,MATCH('Select LAs'!AF4,'EY Data'!B:B,0)), 0)","v":114264},{"$f":"AG4*1000+AF4","v":114264301},{"$f":"IF(COUNTIFS($AJ$3:AJ4, AJ4) > 1, AJ4 + COUNTIFS($AJ$3:AJ4, AJ4) - 1, AJ4)","v":4},{"$f":"RANK(AH4,$AH$3:$AH$13)","v":4}]
[302,"Barnet",null,{"$f":"CONCATENATE(B5,C5)","v":"Barnet"},{"$f":"IF(D5=\"No LA selected\", \"No LA selected\", VLOOKUP(D5,'3-4 year olds '!$B$29:$N$39,$E$1+2,0))","v":{"$error":"#N/A"}},null,"No LA selected",801,{"$f":"IF(D5=\"No LA selected\", \"No LA selected\", VLOOKUP(D5,'Non-EYSFF spend'!$B$16:$L$26,$I$1+2,0))","v":{"$error":"#N/A"}},null,"No LA selected",801,{"$f":"IF(D5=\"No LA selected\", \"No LA selected\", VLOOKUP(D5,'2 year olds '!$B$29:$L$39,$M$1+2,0))","v":{"$error":"#N/A"}},null,"No LA selected",801,null,null,"Barnet",302,3,{"$f":"'Select LAs'!A5","v":302},{"$f":"_xlfn.IFNA(INDEX('EY Data'!BF:BF,MATCH('Select LAs'!V5,'EY Data'!B:B,0)), 0)","v":173333},173333302,{"$f":"IF(COUNTIFS($Z$3:Z5, Z5) > 1, Z5 + COUNTIFS($Z$3:Z5, Z5) - 1, Z5)","v":4},4,null,null,"Barnet",302,3,{"$f":"'Select LAs'!A5","v":302},{"$f":"_xlfn.IFNA(INDEX('EY Data'!BH:BH,MATCH('Select LAs'!AF5,'EY Data'!B:B,0)), 0)","v":150696},150696302,{"$f":"IF(COUNTIFS($AJ$3:AJ5, AJ5) > 1, AJ5 + COUNTIFS($AJ$3:AJ5, AJ5) - 1, AJ5)","v":2},2]
[370,"Barnsley",null,"Barnsley",{"$f":"IF(D6=\"No LA selected\", \"No LA selected\", VLOOKUP(D6,'3-4 year olds '!$B$29:$N$39,$E$1+2,0))","v":{"$error":"#N/A"}},null,"No LA selected",852,{"$f":"IF(D6=\"No LA selected\", \"No LA selected\", VLOOKUP(D6,'Non-EYSFF spend'!$B$16:$L$26,$I$1+2,0))","v":{"$error":"#N/A"}},null,"No LA selected",852,{"$f":"IF(D6=\"No LA selected\", \"No LA selected\", VLOOKUP(D6,'2 year olds '!$B$29:$L$39,$M$1+2,0))","v":{"$error":"#N/A"}},null,"No LA selected",852,null,null,"Barnsley",370,4,{"$f":"'Select LAs'!A6","v":370},{"$f":"_xlfn.IFNA(INDEX('EY Data'!BF:BF,MATCH('Select LAs'!V6,'EY Data'!B:B,0)), 0)","v":170693},170693370,{"$f":"IF(COUNTIFS($Z$3:Z6, Z6) > 1, Z6 + COUNTIFS($Z$3:Z6, Z6) - 1, Z6)","v":5},5,null,null,"Barnsley",370,4,{"$f":"'Select LAs'!A6","v":370},{"$f":"_xlfn.IFNA(INDEX('EY Data'!BH:BH,MATCH('Select LAs'!AF6,'EY Data'!B:B,0)), 0)","v":111780},111780370,{"$f":"IF(COUNTIFS($AJ$3:AJ6, AJ6) > 1, AJ6 + COUNTIFS($AJ$3:AJ6, AJ6) - 1, AJ6)","v":5},5]
[800,"Bath and North East Somerset",null,"Bath and North East Somerset",{"$f":"IF(D7=\"No LA selected\", \"No LA selected\", VLOOKUP(D7,'3-4 year olds '!$B$29:$N$39,$E$1+2,0))","v":{"$error":"#N/A"}},null,"No LA selected",330,{"$f":"IF(D7=\"No LA selected\", \"No LA selected\", VLOOKUP(D7,'Non-EYSFF spend'!$B$16:$L$26,$I$1+2,0))","v":{"$error":"#N/A"}},null,"No LA selected",330,{"$f":"IF(D7=\"No LA selected\", \"No LA selected\", VLOOKUP(D7,'2 year olds '!$B$29:$L$39,$M$1+2,0))","v":{"$error":"#N/A"}},null,"No LA selected",330,null,null,"Bath and North East Somerset",800,5,{"$f":"'Select LAs'!A7","v":800},{"$f":"_xlfn.IFNA(INDEX('EY Data'!BF:BF,MATCH('Select LAs'!V7,'EY Data'!B:B,0)), 0)","v":100755},100755800,{"$f":"IF(COUNTIFS($Z$3:Z7, Z7) > 1, Z7 + COUNTIFS($Z$3:Z7, Z7) - 1, Z7)","v":9},9,null,null,"Bath and North East Somerset",800,5,{"$f":"'Select LAs'!A7","v":800},{"$f":"_xlfn.IFNA(INDEX('EY Data'!BH:BH,MATCH('Select LAs'!AF7,'EY Data'!B:B,0)), 0)","v":63756},63756800,{"$f":"IF(COUNTIFS($AJ$3:AJ7, AJ7) > 1, AJ7 + COUNTIFS($AJ$3:AJ7, AJ7) - 1, AJ7)","v":8},8]
[822,"Bedford Borough",null,"Bedford Borough",{"$f":"IF(D8=\"No LA selected\", \"No LA selected\", VLOOKUP(D8,'3-4 year olds '!$B$29:$N$39,$E$1+2,0))","v":{"$error":"#N/A"}},null,"No LA selected",355,{"$f":"IF(D8=\"No LA selected\", \"No LA selected\", VLOOKUP(D8,'Non-EYSFF spend'!$B$16:$L$26,$I$1+2,0))","v":{"$error":"#N/A"}},null,"No LA selected",355,{"$f":"IF(D8=\"No LA selected\", \"No LA selected\", VLOOKUP(D8,'2 year olds '!$B$29:$L$39,$M$1+2,0))","v":{"$error":"#N/A"}},null,"No LA selected",355,null,null,"Bedford Borough",822,6,{"$f":"'Select LAs'!A8","v":822},{"$f":"_xlfn.IFNA(INDEX('EY Data'!BF:BF,MATCH('Select LAs'!V8,'EY Data'!B:B,0)), 0)","v":163197},163197822,{"$f":"IF(COUNTIFS($Z$3:Z8, Z8) > 1, Z8 + COUNTIFS($Z$3:Z8, Z8) - 1, Z8)","v":6},6,null,null,"Bedford Borough",822,6,{"$f":"'Select LAs'!A8","v":822},{"$f":"_xlfn.IFNA(INDEX('EY Data'!BH:BH,MATCH('Select LAs'!AF8,'EY Data'!B:B,0)), 0)","v":44712},44712822,{"$f":"IF(COUNTIFS($AJ$3:AJ8, AJ8) > 1, AJ8 + COUNTIFS($AJ$3:AJ8, AJ8) - 1, AJ8)","v":10},10]
{"$rows_left_out":33}