{"text_format":"1","workbook":"xlsx","n_sheets":8,"sheets":["List","Guidance","Cancellations Log","Virtual- F2F","Top 10 Items","OLDEST & OUTSTANDING CASES","MI Summary","MI Graphs"],"not_rendered":{"charts":9,"images":1,"macros":1,"external_links":0,"defined_names":5,"comments":2,"pivot_tables":0},"unopened":[],"bounds":{"document_bytes":16777216,"sheet_cells":100000,"rows_first":2000,"rows_last":500,"rows_between":2000,"halvings":0,"cell_chars":16384,"cell_head_chars":4096},"cells_cut":0,"cells_raw":0,"read":"whole","date_system":"1900"}

{"sheet":"List","index":0,"n_rows":14,"n_cols":11,"rows_kept":14,"cut":false,"hidden":false,"merged":[[0,7,0,10],[0,0,0,3]]}
["Cancellations log",null,null,null,null,"O & O Cases ",null,"Virtual F2F"]
["Contact Method","Reason for Assessment Cancellation","Cancelled By","Rereferral Required ",null,"Reasons for Delay",null,"Change of Method of Contact","Reason for change","Stage in process assessment type changed?","Changed By"]
["Email","Could Not Confirm Assessment ","Customer","Yes",null,"Booked outside KPI due to volume of referrals ",null,"Virtual to F2F","Incorrect assessment type submitted","Incorrect assessment type submitted","Customer"]
["Phone","Forgotten","Employer","No",null,"svsdvs",null,"F2F to Virtual","Customer requested change before booking call","Before Assesment","Assessor"]
["Text","Holiday","Adviser",null,null,null,null,null,"Customer availability","During - Booking","CM"]
["Post","In correct Address","Assessor",null,null,null,null,null,"Customer requested change during booking call","At Assesment"]
["In Person","Medical Appt","No Contact",null,null,null,null,null,"Customer requested change during booking call due to being off work currently"]
[null,"Meeting",null,null,null,null,null,null,"Customer requested change during booking call due to assessor needed on site"]
[null,"No Assessor availability",null,null,null,null,null,null,"Assessor suggested change following discussion"]
[null,"NO SHOW",null,null,null,null,null,null,"Assessor availability"]
{"$rows_left_out":5}
{"sheet":"Guidance","index":1,"n_rows":47,"n_cols":5,"rows_kept":47,"cut":false,"hidden":false,"merged":[[36,1,36,4],[43,1,43,4],[15,2,15,4],[16,1,16,4],[23,1,23,4],[30,1,30,4],[13,1,13,4],[3,2,3,4],[9,1,9,4],[10,1,10,4],[11,1,11,4],[12,1,12,4],[4,1,4,4],[5,1,5,4],[6,1,6,4],[7,1,7,4],[8,1,8,4]]}
[]
[null,null,"Guidance ",null,"Version.1 June 2023"]
[]
[null,null,"Key Points"]
[null,"Key to scheduling the assessment with the customer is to ensure that it takes place as quickly as possible but takes into account the availability of all parties to be involved. We expect you to:"]
[null," Contact the Access to Work customer within two (2) working days of receipt of a Referral Form from DWP (not including weekends or public holidays) to arrange a date and time for the Holistic Assessment"]
[null," Offer the customer at least 5 appointment slots within the timeframe specified in your contract"]
[null," Keep a record of all appointments offered to the customer"]
[null," The Supplier makes at least 2 attempts within the first working day after Referral to contact the Customer to schedule the Assessment. If unsuccessful, a further attempt should be made on the second working day following referral."]
[null," In making these attempts the Supplier will ensure that the attempts to contact the customer are made at different times of the day, to avoid conflicting with regular scheduled commitments the Customer may have (e.g.: school run)"]
{"$rows_left_out":38}
{"sheet":"Cancellations Log","index":2,"n_rows":5,"n_cols":20,"rows_kept":5,"cut":false,"hidden":false,"merged":[[1,1,1,3],[1,5,1,6],[3,18,3,19],[3,9,3,13],[3,3,3,8],[3,14,3,17],[3,1,3,2]]}
[]
[null,"Cancellations Log ",null,null,"Month:","2023-01-01"]
[]
[null,"Referral Details",null,"Contact Attempt Details",null,null,null,null,null,"Assessment Dates Offered",null,null,null,null,"Cancellation Details ",null,null,null,"Re-Referral Details "]
[null,"URN","Referral Date","1st Contact Attempt\n(hh:mm DD/MM/YY)","1st Contact Method","2nd Contact Attempt\n(hh:mm DD/MM/YY)","2nd Contact Method","3rd Contact Attempt\n(hh:mm DD/MM/YY)","3rd Contact Method","1st Assessment Date Offered","2nd Assessment Date Offered","3rd Assessment Date Offered","4th Assessment Date Offered","5th Assessment Date Offered","Reason for Assessment Cancellation","PRaP Cancellation Code","Cancelled By","Cancellation Date","Re-Referral Required ","If no Re-Referral required, Why?"]

{"sheet":"Virtual- F2F","index":3,"n_rows":13,"n_cols":11,"rows_kept":13,"cut":false,"hidden":false,"merged":[[1,1,1,3],[3,1,3,2],[3,3,3,7]]}
[]
[null,"Virtual - F2F",null,null,"Month:",{"$f":"IF('Cancellations Log'!F2=0,\"\",'Cancellations Log'!F2)","v":"2023-01-01"}]
[]
[null,"Referral Details",null,"Change details "]
[null,"URN","Referral Date","Change of Method of Contact","Date of change ","Reason for change","Stage in process assessment type changed?","Change made by",null,"Change reason","Number of times reason used "]
[null,null,null,null,null,null,null,null,null,"Incorrect assessment type submitted",{"$f":"COUNTIF($F$6:$F$106,J6)","v":0}]
[null,null,null,null,null,null,null,null,null,"Customer requested change before booking call",{"$f":"COUNTIF($F$6:$F$106,J7)","v":0}]
[null,null,null,null,null,null,null,null,null,"Customer availability",0]
[null,null,null,null,null,null,null,null,null,"Customer requested change during booking call",0]
[null,null,null,null,null,null,null,null,null,"Customer requested change during booking call due to being off work currently",0]
{"$rows_left_out":4}
{"sheet":"Top 10 Items","index":4,"n_rows":51,"n_cols":25,"rows_kept":51,"cut":false,"hidden":false,"merged":[[1,5,1,6],[1,3,1,4],[3,1,3,11],[3,15,3,24]]}
[]
[null,"Top Ten Items",null,"Aug 21 to ",null,{"$f":"IF('Cancellations Log'!F2=0,\"\",'Cancellations Log'!F2)","v":"2023-01-01"}]
[]
[null,"Details of Top Ten recommended solutions in month and year to date",null,null,null,null,null,null,null,null,null,null,null,null,null,"Amount product have been in this position"]
[null,"Month-Year","Item 1","Item 2","Item 3","Item 4","Item 5","Item 6","Item 7","Item 8","Item 9","Item 10",null,"List ",null,"Item 1","Item 2","Item 3","Item 4","Item 5","Item 6","Item 7","Item 8","Item 9","Item 10"]
[null,"2023-04-01",null,null,null,null,null,null,null,null,null,null,null,"Brain in Hand",null,{"$f":"COUNTIF(C$6:C$29,$N6)","v":0},{"$f":"COUNTIF(D$6:D$29,$N6)","v":0},0,0,0,0,0,0,0,0]
[null,"2023-05-01",null,null,null,null,null,null,null,null,null,null,null,"Chair",null,{"$f":"COUNTIF(C$6:C$29,$N7)","v":0},0,0,0,0,0,0,0,0,0]
[null,"2023-06-01",null,null,null,null,null,null,null,null,null,null,null,"Coping Strategies",null,0,0,0,0,0,0,0,0,0,0]
[null,"2023-07-01",null,null,null,null,null,null,null,null,null,null,null,"Copy AI ",null,0,0,0,0,0,0,0,0,0,0]
[null,"2023-08-01",null,null,null,null,null,null,null,null,null,null,null,"Desk",null,0,0,0,0,0,0,0,0,0,0]
{"$rows_left_out":42}
{"sheet":"OLDEST & OUTSTANDING CASES","index":5,"n_rows":35,"n_cols":6,"rows_kept":35,"cut":false,"hidden":false,"merged":[[101,4,101,5],[102,4,102,5],[103,4,103,5],[104,4,104,5],[96,4,96,5],[97,4,97,5],[98,4,98,5],[99,4,99,5],[100,4,100,5],[91,4,91,5],[92,4,92,5],[93,4,93,5],[94,4,94,5],[95,4,95,5],[86,4,86,5],[87,4,87,5],[88,4,88,5],[89,4,89,5],[90,4,90,5],[81,4,81,5],[82,4,82,5],[83,4,83,5],[84,4,84,5],[85,4,85,5],[76,4,76,5],[77,4,77,5],[78,4,78,5],[79,4,79,5],[80,4,80,5],[71,4,71,5],[72,4,72,5],[73,4,73,5],[74,4,74,5],[75,4,75,5],[66,4,66,5],[67,4,67,5],[68,4,68,5],[69,4,69,5],[70,4,70,5],[61,4,61,5],[62,4,62,5],[63,4,63,5],[64,4,64,5],[65,4,65,5],[56,4,56,5],[57,4,57,5],[58,4,58,5],[59,4,59,5],[60,4,60,5],[51,4,51,5],[52,4,52,5],[53,4,53,5],[54,4,54,5],[55,4,55,5],[46,4,46,5],[47,4,47,5],[48,4,48,5],[49,4,49,5],[50,4,50,5],[41,4,41,5],[42,4,42,5],[43,4,43,5],[44,4,44,5],[45,4,45,5],[36,4,36,5],[37,4,37,5],[38,4,38,5],[39,4,39,5],[40,4,40,5],[31,4,31,5],[32,4,32,5],[33,4,33,5],[34,4,34,5],[35,4,35,5],[26,4,26,5],[27,4,27,5],[28,4,28,5],[29,4,29,5],[30,4,30,5],[21,4,21,5],[22,4,22,5],[23,4,23,5],[24,4,24,5],[25,4,25,5],[16,4,16,5],[17,4,17,5],[18,4,18,5],[19,4,19,5],[20,4,20,5],[3,1,3,3],[4,4,4,5],[5,4,5,5],[1,1,1,3],[11,4,11,5],[12,4,12,5],[13,4,13,5],[14,4,14,5],[15,4,15,5],[6,4,6,5],[7,4,7,5],[8,4,8,5],[9,4,9,5],[10,4,10,5]]}
["2023-01-01"," "]
[null,"Oldest & Outstanding Cases ",null,null,"Completion Date :","2023-10-01"]
[]
[null,"Case Details",null,null,"Total Outstanding Cases:",{"$f":"COUNT(B6:B106)","v":0}]
[null,"URN","Referral Date","Days since Referral date ","Reasons for Delay"]
[]
[]
[]
[]
[]
{"$rows_left_out":26}
{"sheet":"MI Summary","index":6,"n_rows":44,"n_cols":45,"rows_kept":44,"cut":false,"hidden":false,"merged":[[1,7,1,10],[24,1,26,1]]}
[{"$f":"'Cancellations Log'!F2","v":"2023-01-01"}]
[null,"MI Summary Table","Apr - 23 to"]
[]
[null,"MONTHLY MI Headings","2023-04-01","2023-05-01","2023-06-01","2023-07-01","2023-08-01","2023-09-01","2023-10-01","2023-11-01","2023-12-01","2024-01-01","2024-02-01","2024-03-01","2024-04-01","2024-05-01","2024-06-01","2024-07-01","2024-08-01","2024-09-01","2024-10-01","2024-11-01","2024-12-01","2025-01-01","2025-02-01","2025-03-01"]
[null,"Cancellation Log"]
[null,"Total cancellations made in month.",{"$f":"IF(COUNTIFS('Cancellations Log'!$R$6:$R$500,\">=\"&C4,'Cancellations Log'!$R$6:$R$500,\"<=\"&EOMONTH(C4,0))=0,\"\",COUNTIFS('Cancellations Log'!$R$6:$R$500,\">=\"&C4,'Cancellations Log'!$R$6:$R$500,\"<=\"&EOMONTH(C4,0)))","v":""},{"$f":"IF(COUNTIFS('Cancellations Log'!$R$6:$R$500,\">=\"&D4,'Cancellations Log'!$R$6:$R$500,\"<=\"&EOMONTH(D4,0))=0,\"\",COUNTIFS('Cancellations Log'!$R$6:$R$500,\">=\"&D4,'Cancellations Log'!$R$6:$R$500,\"<=\"&EOMONTH(D4,0)))","v":""}]
[]
[null,"Volume of cancellations made by the Provider in month.",{"$f":"IF(COUNTIFS('Cancellations Log'!$R$6:$R$500,\">=\"&C4,'Cancellations Log'!$R$6:$R$500,\"<=\"&EOMONTH(C4,0),'Cancellations Log'!$Q$6:$Q$500,List!$C$5)=0,\"\",COUNTIFS('Cancellations Log'!$R$6:$R$500,\">=\"&C4,'Cancellations Log'!$R$6:$R$500,\"<=\"&EOMONTH(C4,0),'Cancellations Log'!$Q$6:$Q$500,List!$C$5))","v":""},{"$f":"IF(COUNTIFS('Cancellations Log'!$R$6:$R$500,\">=\"&D4,'Cancellations Log'!$R$6:$R$500,\"<=\"&EOMONTH(D4,0),'Cancellations Log'!$Q$6:$Q$500,List!$C$5)=0,\"\",COUNTIFS('Cancellations Log'!$R$6:$R$500,\">=\"&D4,'Cancellations Log'!$R$6:$R$500,\"<=\"&EOMONTH(D4,0),'Cancellations Log'!$Q$6:$Q$500,List!$C$5))","v":""},{"$f":"IF(COUNTIFS('Cancellations Log'!$R$6:$R$500,\">=\"&E4,'Cancellations Log'!$R$6:$R$500,\"<=\"&EOMONTH(E4,0),'Cancellations Log'!$Q$6:$Q$500,List!$C$5)=0,\"\",COUNTIFS('Cancellations Log'!$R$6:$R$500,\">=\"&E4,'Cancellations Log'!$R$6:$R$500,\"<=\"&EOMONTH(E4,0),'Cancellations Log'!$Q$6:$Q$500,List!$C$5))","v":""},{"$f":"IF(COUNTIFS('Cancellations Log'!$R$6:$R$500,\">=\"&F4,'Cancellations Log'!$R$6:$R$500,\"<=\"&EOMONTH(F4,0),'Cancellations Log'!$Q$6:$Q$500,List!$C$5)=0,\"\",COUNTIFS('Cancellations Log'!$R$6:$R$500,\">=\"&F4,'Cancellations Log'!$R$6:$R$500,\"<=\"&EOMONTH(F4,0),'Cancellations Log'!$Q$6:$Q$500,List!$C$5))","v":""},{"$f":"IF(COUNTIFS('Cancellations Log'!$R$6:$R$500,\">=\"&G4,'Cancellations Log'!$R$6:$R$500,\"<=\"&EOMONTH(G4,0),'Cancellations Log'!$Q$6:$Q$500,List!$C$5)=0,\"\",COUNTIFS('Cancellations Log'!$R$6:$R$500,\">=\"&G4,'Cancellations Log'!$R$6:$R$500,\"<=\"&EOMONTH(G4,0),'Cancellations Log'!$Q$6:$Q$500,List!$C$5))","v":""},{"$f":"IF(COUNTIFS('Cancellations Log'!$R$6:$R$500,\">=\"&H4,'Cancellations Log'!$R$6:$R$500,\"<=\"&EOMONTH(H4,0),'Cancellations Log'!$Q$6:$Q$500,List!$C$5)=0,\"\",COUNTIFS('Cancellations Log'!$R$6:$R$500,\">=\"&H4,'Cancellations Log'!$R$6:$R$500,\"<=\"&EOMONTH(H4,0),'Cancellations Log'!$Q$6:$Q$500,List!$C$5))","v":""},{"$f":"IF(COUNTIFS('Cancellations Log'!$R$6:$R$500,\">=\"&I4,'Cancellations Log'!$R$6:$R$500,\"<=\"&EOMONTH(I4,0),'Cancellations Log'!$Q$6:$Q$500,List!$C$5)=0,\"\",COUNTIFS('Cancellations Log'!$R$6:$R$500,\">=\"&I4,'Cancellations Log'!$R$6:$R$500,\"<=\"&EOMONTH(I4,0),'Cancellations Log'!$Q$6:$Q$500,List!$C$5))","v":""},{"$f":"IF(COUNTIFS('Cancellations Log'!$R$6:$R$500,\">=\"&J4,'Cancellations Log'!$R$6:$R$500,\"<=\"&EOMONTH(J4,0),'Cancellations Log'!$Q$6:$Q$500,List!$C$5)=0,\"\",COUNTIFS('Cancellations Log'!$R$6:$R$500,\">=\"&J4,'Cancellations Log'!$R$6:$R$500,\"<=\"&EOMONTH(J4,0),'Cancellations Log'!$Q$6:$Q$500,List!$C$5))","v":""},{"$f":"IF(COUNTIFS('Cancellations Log'!$R$6:$R$500,\">=\"&K4,'Cancellations Log'!$R$6:$R$500,\"<=\"&EOMONTH(K4,0),'Cancellations Log'!$Q$6:$Q$500,List!$C$5)=0,\"\",COUNTIFS('Cancellations Log'!$R$6:$R$500,\">=\"&K4,'Cancellations Log'!$R$6:$R$500,\"<=\"&EOMONTH(K4,0),'Cancellations Log'!$Q$6:$Q$500,List!$C$5))","v":""},{"$f":"IF(COUNTIFS('Cancellations Log'!$R$6:$R$500,\">=\"&L4,'Cancellations Log'!$R$6:$R$500,\"<=\"&EOMONTH(L4,0),'Cancellations Log'!$Q$6:$Q$500,List!$C$5)=0,\"\",COUNTIFS('Cancellations Log'!$R$6:$R$500,\">=\"&L4,'Cancellations Log'!$R$6:$R$500,\"<=\"&EOMONTH(L4,0),'Cancellations Log'!$Q$6:$Q$500,List!$C$5))","v":""},{"$f":"IF(COUNTIFS('Cancellations Log'!$R$6:$R$500,\">=\"&M4,'Cancellations Log'!$R$6:$R$500,\"<=\"&EOMONTH(M4,0),'Cancellations Log'!$Q$6:$Q$500,List!$C$5)=0,\"\",COUNTIFS('Cancellations Log'!$R$6:$R$500,\">=\"&M4,'Cancellations Log'!$R$6:$R$500,\"<=\"&EOMONTH(M4,0),'Cancellations Log'!$Q$6:$Q$500,List!$C$5))","v":""},{"$f":"IF(COUNTIFS('Cancellations Log'!$R$6:$R$500,\">=\"&N4,'Cancellations Log'!$R$6:$R$500,\"<=\"&EOMONTH(N4,0),'Cancellations Log'!$Q$6:$Q$500,List!$C$5)=0,\"\",COUNTIFS('Cancellations Log'!$R$6:$R$500,\">=\"&N4,'Cancellations Log'!$R$6:$R$500,\"<=\"&EOMONTH(N4,0),'Cancellations Log'!$Q$6:$Q$500,List!$C$5))","v":""},{"$f":"IF(COUNTIFS('Cancellations Log'!$R$6:$R$500,\">=\"&O4,'Cancellations Log'!$R$6:$R$500,\"<=\"&EOMONTH(O4,0),'Cancellations Log'!$Q$6:$Q$500,List!$C$5)=0,\"\",COUNTIFS('Cancellations Log'!$R$6:$R$500,\">=\"&O4,'Cancellations Log'!$R$6:$R$500,\"<=\"&EOMONTH(O4,0),'Cancellations Log'!$Q$6:$Q$500,List!$C$5))","v":""},{"$f":"IF(COUNTIFS('Cancellations Log'!$R$6:$R$500,\">=\"&P4,'Cancellations Log'!$R$6:$R$500,\"<=\"&EOMONTH(P4,0),'Cancellations Log'!$Q$6:$Q$500,List!$C$5)=0,\"\",COUNTIFS('Cancellations Log'!$R$6:$R$500,\">=\"&P4,'Cancellations Log'!$R$6:$R$500,\"<=\"&EOMONTH(P4,0),'Cancellations Log'!$Q$6:$Q$500,List!$C$5))","v":""},{"$f":"IF(COUNTIFS('Cancellations Log'!$R$6:$R$500,\">=\"&Q4,'Cancellations Log'!$R$6:$R$500,\"<=\"&EOMONTH(Q4,0),'Cancellations Log'!$Q$6:$Q$500,List!$C$5)=0,\"\",COUNTIFS('Cancellations Log'!$R$6:$R$500,\">=\"&Q4,'Cancellations Log'!$R$6:$R$500,\"<=\"&EOMONTH(Q4,0),'Cancellations Log'!$Q$6:$Q$500,List!$C$5))","v":""},{"$f":"IF(COUNTIFS('Cancellations Log'!$R$6:$R$500,\">=\"&R4,'Cancellations Log'!$R$6:$R$500,\"<=\"&EOMONTH(R4,0),'Cancellations Log'!$Q$6:$Q$500,List!$C$5)=0,\"\",COUNTIFS('Cancellations Log'!$R$6:$R$500,\">=\"&R4,'Cancellations Log'!$R$6:$R$500,\"<=\"&EOMONTH(R4,0),'Cancellations Log'!$Q$6:$Q$500,List!$C$5))","v":""},{"$f":"IF(COUNTIFS('Cancellations Log'!$R$6:$R$500,\">=\"&S4,'Cancellations Log'!$R$6:$R$500,\"<=\"&EOMONTH(S4,0),'Cancellations Log'!$Q$6:$Q$500,List!$C$5)=0,\"\",COUNTIFS('Cancellations Log'!$R$6:$R$500,\">=\"&S4,'Cancellations Log'!$R$6:$R$500,\"<=\"&EOMONTH(S4,0),'Cancellations Log'!$Q$6:$Q$500,List!$C$5))","v":""},{"$f":"IF(COUNTIFS('Cancellations Log'!$R$6:$R$500,\">=\"&T4,'Cancellations Log'!$R$6:$R$500,\"<=\"&EOMONTH(T4,0),'Cancellations Log'!$Q$6:$Q$500,List!$C$5)=0,\"\",COUNTIFS('Cancellations Log'!$R$6:$R$500,\">=\"&T4,'Cancellations Log'!$R$6:$R$500,\"<=\"&EOMONTH(T4,0),'Cancellations Log'!$Q$6:$Q$500,List!$C$5))","v":""},{"$f":"IF(COUNTIFS('Cancellations Log'!$R$6:$R$500,\">=\"&U4,'Cancellations Log'!$R$6:$R$500,\"<=\"&EOMONTH(U4,0),'Cancellations Log'!$Q$6:$Q$500,List!$C$5)=0,\"\",COUNTIFS('Cancellations Log'!$R$6:$R$500,\">=\"&U4,'Cancellations Log'!$R$6:$R$500,\"<=\"&EOMONTH(U4,0),'Cancellations Log'!$Q$6:$Q$500,List!$C$5))","v":""},{"$f":"IF(COUNTIFS('Cancellations Log'!$R$6:$R$500,\">=\"&V4,'Cancellations Log'!$R$6:$R$500,\"<=\"&EOMONTH(V4,0),'Cancellations Log'!$Q$6:$Q$500,List!$C$5)=0,\"\",COUNTIFS('Cancellations Log'!$R$6:$R$500,\">=\"&V4,'Cancellations Log'!$R$6:$R$500,\"<=\"&EOMONTH(V4,0),'Cancellations Log'!$Q$6:$Q$500,List!$C$5))","v":""},{"$f":"IF(COUNTIFS('Cancellations Log'!$R$6:$R$500,\">=\"&W4,'Cancellations Log'!$R$6:$R$500,\"<=\"&EOMONTH(W4,0),'Cancellations Log'!$Q$6:$Q$500,List!$C$5)=0,\"\",COUNTIFS('Cancellations Log'!$R$6:$R$500,\">=\"&W4,'Cancellations Log'!$R$6:$R$500,\"<=\"&EOMONTH(W4,0),'Cancellations Log'!$Q$6:$Q$500,List!$C$5))","v":""},{"$f":"IF(COUNTIFS('Cancellations Log'!$R$6:$R$500,\">=\"&X4,'Cancellations Log'!$R$6:$R$500,\"<=\"&EOMONTH(X4,0),'Cancellations Log'!$Q$6:$Q$500,List!$C$5)=0,\"\",COUNTIFS('Cancellations Log'!$R$6:$R$500,\">=\"&X4,'Cancellations Log'!$R$6:$R$500,\"<=\"&EOMONTH(X4,0),'Cancellations Log'!$Q$6:$Q$500,List!$C$5))","v":""},{"$f":"IF(COUNTIFS('Cancellations Log'!$R$6:$R$500,\">=\"&Y4,'Cancellations Log'!$R$6:$R$500,\"<=\"&EOMONTH(Y4,0),'Cancellations Log'!$Q$6:$Q$500,List!$C$5)=0,\"\",COUNTIFS('Cancellations Log'!$R$6:$R$500,\">=\"&Y4,'Cancellations Log'!$R$6:$R$500,\"<=\"&EOMONTH(Y4,0),'Cancellations Log'!$Q$6:$Q$500,List!$C$5))","v":""},{"$f":"IF(COUNTIFS('Cancellations Log'!$R$6:$R$500,\">=\"&Z4,'Cancellations Log'!$R$6:$R$500,\"<=\"&EOMONTH(Z4,0),'Cancellations Log'!$Q$6:$Q$500,List!$C$5)=0,\"\",COUNTIFS('Cancellations Log'!$R$6:$R$500,\">=\"&Z4,'Cancellations Log'!$R$6:$R$500,\"<=\"&EOMONTH(Z4,0),'Cancellations Log'!$Q$6:$Q$500,List!$C$5))","v":""}]
[null,"Volume of cancellations made by the Provider YTD",{"$f":"IF(C8=\"\",\"\",SUM($C$8:C8))","v":""},{"$f":"IF(D8=\"\",\"\",SUM($C$8:D8))","v":""},{"$f":"IF(E8=\"\",\"\",SUM($C$8:E8))","v":""},{"$f":"IF(F8=\"\",\"\",SUM($C$8:F8))","v":""},{"$f":"IF(G8=\"\",\"\",SUM($C$8:G8))","v":""},{"$f":"IF(H8=\"\",\"\",SUM($C$8:H8))","v":""},{"$f":"IF(I8=\"\",\"\",SUM($C$8:I8))","v":""},{"$f":"IF(J8=\"\",\"\",SUM($C$8:J8))","v":""},{"$f":"IF(K8=\"\",\"\",SUM($C$8:K8))","v":""},{"$f":"IF(L8=\"\",\"\",SUM($C$8:L8))","v":""},{"$f":"IF(M8=\"\",\"\",SUM($C$8:M8))","v":""},{"$f":"IF(N8=\"\",\"\",SUM($C$8:N8))","v":""},{"$f":"IF(O8=\"\",\"\",SUM($C$8:O8))","v":""},{"$f":"IF(P8=\"\",\"\",SUM($C$8:P8))","v":""},{"$f":"IF(Q8=\"\",\"\",SUM($C$8:Q8))","v":""},{"$f":"IF(R8=\"\",\"\",SUM($C$8:R8))","v":""},{"$f":"IF(S8=\"\",\"\",SUM($C$8:S8))","v":""},{"$f":"IF(T8=\"\",\"\",SUM($C$8:T8))","v":""},{"$f":"IF(U8=\"\",\"\",SUM($C$8:U8))","v":""},{"$f":"IF(V8=\"\",\"\",SUM($C$8:V8))","v":""},{"$f":"IF(W8=\"\",\"\",SUM($C$8:W8))","v":""},{"$f":"IF(X8=\"\",\"\",SUM($C$8:X8))","v":""},{"$f":"IF(Y8=\"\",\"\",SUM($C$8:Y8))","v":""},{"$f":"IF(Z8=\"\",\"\",SUM($C$8:Z8))","v":""}]
[]
{"$rows_left_out":35}
{"sheet":"MI Graphs","index":7,"n_rows":92,"n_cols":28,"rows_kept":92,"cut":false,"hidden":false,"merged":[[1,4,1,6],[1,1,1,2],[1,7,1,9],[91,1,91,20],[73,1,73,20],[3,1,3,20],[21,1,21,20],[55,1,55,20]]}
[]
[null,"MI Summary Graphs",null,null,"Jun - 23 to",null,null,{"$f":"IF('Cancellations Log'!F2=0,\"\",'Cancellations Log'!F2)","v":"2023-01-01"}]
[]
[null,"Cancellation Log"]
[]
[]
[null,null,"months",{"$f":"IF('MI Summary'!C4>=TODAY(),NA(),'MI Summary'!C4)","v":"2023-04-01"},{"$f":"IF('MI Summary'!D4>=TODAY(),NA(),'MI Summary'!D4)","v":"2023-05-01"},{"$f":"IF('MI Summary'!E4>=TODAY(),NA(),'MI Summary'!E4)","v":{"$error":"#N/A"}},{"$f":"IF('MI Summary'!F4>=TODAY(),NA(),'MI Summary'!F4)","v":{"$error":"#N/A"}},{"$f":"IF('MI Summary'!G4>=TODAY(),NA(),'MI Summary'!G4)","v":{"$error":"#N/A"}},{"$f":"IF('MI Summary'!H4>=TODAY(),NA(),'MI Summary'!H4)","v":{"$error":"#N/A"}},{"$f":"IF('MI Summary'!I4>=TODAY(),NA(),'MI Summary'!I4)","v":{"$error":"#N/A"}},{"$f":"IF('MI Summary'!J4>=TODAY(),NA(),'MI Summary'!J4)","v":{"$error":"#N/A"}},{"$f":"IF('MI Summary'!K4>=TODAY(),NA(),'MI Summary'!K4)","v":{"$error":"#N/A"}},{"$f":"IF('MI Summary'!L4>=TODAY(),NA(),'MI Summary'!L4)","v":{"$error":"#N/A"}},{"$f":"IF('MI Summary'!M4>=TODAY(),NA(),'MI Summary'!M4)","v":{"$error":"#N/A"}},{"$f":"IF('MI Summary'!N4>=TODAY(),NA(),'MI Summary'!N4)","v":{"$error":"#N/A"}},{"$f":"IF('MI Summary'!O4>=TODAY(),NA(),'MI Summary'!O4)","v":{"$error":"#N/A"}},{"$f":"IF('MI Summary'!P4>=TODAY(),NA(),'MI Summary'!P4)","v":{"$error":"#N/A"}},{"$f":"IF('MI Summary'!Q4>=TODAY(),NA(),'MI Summary'!Q4)","v":{"$error":"#N/A"}},{"$f":"IF('MI Summary'!R4>=TODAY(),NA(),'MI Summary'!R4)","v":{"$error":"#N/A"}},{"$f":"IF('MI Summary'!S4>=TODAY(),NA(),'MI Summary'!S4)","v":{"$error":"#N/A"}},{"$f":"IF('MI Summary'!T4>=TODAY(),NA(),'MI Summary'!T4)","v":{"$error":"#N/A"}},{"$f":"IF('MI Summary'!U4>=TODAY(),NA(),'MI Summary'!U4)","v":{"$error":"#N/A"}},{"$f":"IF('MI Summary'!V4>=TODAY(),NA(),'MI Summary'!V4)","v":{"$error":"#N/A"}},{"$f":"IF('MI Summary'!W4>=TODAY(),NA(),'MI Summary'!W4)","v":{"$error":"#N/A"}},null,{"$f":"IF('MI Summary'!X4>=TODAY(),NA(),'MI Summary'!X4)","v":{"$error":"#N/A"}},{"$f":"IF('MI Summary'!Y4>=TODAY(),NA(),'MI Summary'!Y4)","v":{"$error":"#N/A"}},{"$f":"IF('MI Summary'!Z4>=TODAY(),NA(),'MI Summary'!Z4)","v":{"$error":"#N/A"}}]
[null,null,"By the Provider in month.",{"$f":"'MI Summary'!C8","v":""},{"$f":"'MI Summary'!D8","v":""},{"$f":"'MI Summary'!E8","v":""},{"$f":"'MI Summary'!F8","v":""},{"$f":"'MI Summary'!G8","v":""},{"$f":"'MI Summary'!H8","v":""},{"$f":"'MI Summary'!I8","v":""},{"$f":"'MI Summary'!J8","v":""},{"$f":"'MI Summary'!K8","v":""},{"$f":"'MI Summary'!L8","v":""},{"$f":"'MI Summary'!M8","v":""},{"$f":"'MI Summary'!N8","v":""},{"$f":"'MI Summary'!O8","v":""},{"$f":"'MI Summary'!P8","v":""},{"$f":"'MI Summary'!Q8","v":""},{"$f":"'MI Summary'!R8","v":""},{"$f":"'MI Summary'!S8","v":""},{"$f":"'MI Summary'!T8","v":""},{"$f":"'MI Summary'!U8","v":""},{"$f":"'MI Summary'!V8","v":""},{"$f":"'MI Summary'!W8","v":""},null,{"$f":"'MI Summary'!X8","v":""},{"$f":"'MI Summary'!Y8","v":""},{"$f":"'MI Summary'!Z8","v":""}]
[null,null,"By the Customer in month.",{"$f":"'MI Summary'!C11","v":""},1,{"$f":"'MI Summary'!E11","v":""},{"$f":"'MI Summary'!F11","v":""},{"$f":"'MI Summary'!G11","v":""},{"$f":"'MI Summary'!H11","v":""},{"$f":"'MI Summary'!I11","v":""},{"$f":"'MI Summary'!J11","v":""},{"$f":"'MI Summary'!K11","v":""},{"$f":"'MI Summary'!L11","v":""},{"$f":"'MI Summary'!M11","v":""},{"$f":"'MI Summary'!N11","v":""},{"$f":"'MI Summary'!O11","v":""},{"$f":"'MI Summary'!P11","v":""},{"$f":"'MI Summary'!Q11","v":""},{"$f":"'MI Summary'!R11","v":""},{"$f":"'MI Summary'!S11","v":""},{"$f":"'MI Summary'!T11","v":""},{"$f":"'MI Summary'!U11","v":""},{"$f":"'MI Summary'!V11","v":""},{"$f":"'MI Summary'!W11","v":""},null,{"$f":"'MI Summary'!X11","v":""},{"$f":"'MI Summary'!Y11","v":""},{"$f":"'MI Summary'!Z11","v":""}]
[null,null,"No contact in month.",{"$f":"'MI Summary'!C14","v":""},{"$f":"'MI Summary'!D14","v":""},{"$f":"'MI Summary'!E14","v":""},{"$f":"'MI Summary'!F14","v":""},{"$f":"'MI Summary'!G14","v":""},{"$f":"'MI Summary'!H14","v":""},{"$f":"'MI Summary'!I14","v":""},{"$f":"'MI Summary'!J14","v":""},{"$f":"'MI Summary'!K14","v":""},{"$f":"'MI Summary'!L14","v":""},{"$f":"'MI Summary'!M14","v":""},{"$f":"'MI Summary'!N14","v":""},{"$f":"'MI Summary'!O14","v":""},{"$f":"'MI Summary'!P14","v":""},{"$f":"'MI Summary'!Q14","v":""},{"$f":"'MI Summary'!R14","v":""},{"$f":"'MI Summary'!S14","v":""},{"$f":"'MI Summary'!T14","v":""},{"$f":"'MI Summary'!U14","v":""},{"$f":"'MI Summary'!V14","v":""},{"$f":"'MI Summary'!W14","v":""},null,{"$f":"'MI Summary'!X14","v":""},{"$f":"'MI Summary'!Y14","v":""},{"$f":"'MI Summary'!Z14","v":""}]
{"$rows_left_out":82}