{"text_format":"1","workbook":"xlsx","n_sheets":15,"sheets":["MAIN SCREEN","Basic Fees","PPE Cutoffs","PPE Fees","Trial Length Proxys","Special Prep","Unused Material","Defendant Uplifts","Bill Types","Case Types","Classes","Solicitor Types","Inside or Outside","Yes or No","VAT"],"not_rendered":{"charts":0,"images":5,"macros":1,"external_links":0,"defined_names":55,"comments":0,"pivot_tables":0},"unopened":[],"bounds":{"document_bytes":16777216,"sheet_cells":100000,"rows_first":2000,"rows_last":500,"rows_between":2000,"halvings":0,"cell_chars":16384,"cell_head_chars":4096},"cells_cut":0,"cells_raw":0,"read":"whole","date_system":"1900"}

{"sheet":"MAIN SCREEN","index":0,"n_rows":36,"n_cols":12,"rows_kept":36,"cut":false,"hidden":false,"merged":[]}
[]
["LGFS Scheme 9 Calculator"]
[null,null,null,null,null,null,null,null,null,null,"2016-03-31","2022-12-22"]
[null,null,null,null,null,null,null,null,null,null,"2020-09-17"]
["Rep Order Date","2022-09-30",null,null,null,null,null,null,null,null,"2020-09-16","2022-10-30"]
[null,null,null,null,{"$f":"IF(AND(B5>K3,B5<K6),\"Eligible\",IF(AND(B5>K5),\"Eligible\",\"Ineligible\"))","v":"Eligible"},null,null,null,null,null,"2200-09-17"]
["Last Date of Main Hearing"]
[]
[]
["User Inputs"]
["Offence Class",{"$f":"D11","v":"Homicide and related grave offences"},"A",{"$f":"VLOOKUP(UserInput_ClassCode,Table_Classes,2,FALSE)","v":"Homicide and related grave offences"}]
["Trial type",{"$f":"D12","v":"Trial"},"4",{"$f":"VLOOKUP(UserInput_BillTypeID,Table_BillTypes,2,FALSE)","v":"Trial"}]
["Solicitor Type",{"$f":"D13","v":"Senior Solicitor"},"1",{"$f":"VLOOKUP(UserInput_SolicitorTypeID,Table_SolicitorTypes,2,FALSE)","v":"Senior Solicitor"}]
["Trial length in days"]
["PPE"]
["Number of defendants"]
["Special Preparation (hours)"]
["Unused Material (fixed fee - yes or no)",{"$f":"IF(ISBLANK(C18),\"\",C18)","v":"Yes"},"Yes"]
["Unused Material (total hours)",0,null,"Must include first 3 hours"]
["Inside or Outside London",{"$f":"C20","v":"Outside"},"Outside"]
[]
[null,null,null,null,"Results","2022-09-30"]
["PPE Cut Off",{"$f":"SUMPRODUCT(\n                                    (Column_PpeCutoffs_RegsDate   =   B22)\n                                    *\n                                    (Column_PpeCutoffs_ClassCode   =   UserInput_ClassCode)\n                                    *\n                                    (Column_PpeCutoffs_TrialLen   =   UserInput_TrialLength)\n                                    *\n                                    Column_PpeCutoffs_PpeCutOff\n                                )","v":0},null,null,"PPE Cut Off",{"$f":"SUMPRODUCT(\n                                    (Column_PpeCutoffs_RegsDate   =   F22)\n                                    *\n                                    (Column_PpeCutoffs_ClassCode   =   UserInput_ClassCode)\n                                    *\n                                    (Column_PpeCutoffs_TrialLen   =   UserInput_TrialLength)\n                                    *\n                                    Column_PpeCutoffs_PpeCutOff\n                                )","v":80}]
["Is PPE Above or Below Cut Off",{"$f":"IF(UserInput_PPE > B23, \"Above\", \"Below\")","v":"Below"},null,null,"Is PPE Above or Below Cut Off",{"$f":"IF(UserInput_PPE > F23, \"Above\", \"Below\")","v":"Below"}]
["Basic Fee",{"$f":"SUMPRODUCT(\n                                    (Column_BasicFees_RegsDate   =   B22)\n                                    *\n                                    (Column_BasicFees_CaseTypeID   =  Lookup_CaseTypeID )\n                                    *\n                                    (Column_BasicFees_ClassCode   =  UserInput_ClassCode)\n                                    *\n                                    Column_BasicFees_BasicFee\n                                 )","v":0},null,null,"Basic Fee",{"$f":"SUMPRODUCT(\n                                    (Column_BasicFees_RegsDate   =   F22)\n                                    *\n                                    (Column_BasicFees_CaseTypeID   =  Lookup_CaseTypeID )\n                                    *\n                                    (Column_BasicFees_ClassCode   =  UserInput_ClassCode)\n                                    *\n                                    Column_BasicFees_BasicFee\n                                 )","v":1687.72}]
["Final Fee",{"$f":"SUMPRODUCT(\n                                    (Column_PpeFees_RegsDate   =   B22)\n                                    *\n                                    (Column_PpeFees_CaseTypeID   =   Lookup_CaseTypeID)\n                                    *\n                                    (Column_PpeFees_ClassCode   =   UserInput_ClassCode)\n                                    *\n                                    (Column_PpeFees_PpeLowerLimit   <=   UserInput_PPE)\n                                    *\n                                    (Column_PpeFees_PpeUpperLimit   >=   UserInput_PPE)\n                                    *\n                                    (Column_PpeFees_InitialFee    +     ((UserInput_PPE  -  Column_PpeFees_PpeLowerLimit) * Column_PpeFees_Increment ))\n                                )","v":0},null,null,"Final Fee",{"$f":"SUMPRODUCT(\n                                    (Column_PpeFees_RegsDate   =   F22)\n                                    *\n                                    (Column_PpeFees_CaseTypeID   =   Lookup_CaseTypeID)\n                                    *\n                                    (Column_PpeFees_ClassCode   =   UserInput_ClassCode)\n                                    *\n                                    (Column_PpeFees_PpeLowerLimit   <=   UserInput_PPE)\n                                    *\n                                    (Column_PpeFees_PpeUpperLimit   >=   UserInput_PPE)\n                                    *\n                                    (Column_PpeFees_InitialFee    +     ((UserInput_PPE  -  Column_PpeFees_PpeLowerLimit) * Column_PpeFees_Increment ))\n                                )","v":1687.72}]
["Trial Length Proxy",{"$f":"SUMPRODUCT(\n                                    (Column_TrialLenProxys_ClassCode   =   UserInput_ClassCode)\n                                    *\n                                    (Column_TrialLenProxys_TrialLen   =   UserInput_TrialLength)\n                                    *\n                                    Column_TrialLenProxys_Proxy\n                                )","v":0},null,null,"Trial Length Proxy",{"$f":"SUMPRODUCT(\n                                    (Column_TrialLenProxys_ClassCode   =   UserInput_ClassCode)\n                                    *\n                                    (Column_TrialLenProxys_TrialLen   =   UserInput_TrialLength)\n                                    *\n                                    Column_TrialLenProxys_Proxy\n                                )","v":0}]
[null,null,null,null,"Special Prep",{"$f":"SUMPRODUCT(\n                                    (Column_SpecPrep_RegsDate = F22)\n                                    *\n                                    (Column_SpecPrep_SolicitorTypeID   =   UserInput_SolicitorTypeID)\n                                    *\n                                    (Column_SpecPrep_InsideOrOutside  =  UserInput_InsideOrOutsideLondon)\n                                    *\n                                    (Column_SpecPrep_Rate  *   UserInput_SpecialPrepHours)\n                               )","v":0}]
[null,null,null,null,"Unused Material (fixed fee)",{"$f":"SUMPRODUCT(\n                                    (Column_UnusedMaterial_RegsDate = F22)\n                                    *\n                                    (Column_UnusedMaterial_SolicitorTypeID   =   UserInput_SolicitorTypeID)\n                                    *\n                                   (Column_UnusedMaterial_InsideOrOutside  =  UserInput_InsideOrOutsideLondon)\n                                    *\n                                    (Column_UnusedMaterial_FixedOrHourly = \"Fixed\")\n                                    *\n                                    IF(UserInput_UnusedMaterialFixedFee = \"Yes\",  Column_UnusedMaterial_FixedFeeOrRate)\n                               )","v":74.38}]
[null,null,null,null,"Unused Material (hourly rate)",{"$f":"SUMPRODUCT(\n                                    (Column_UnusedMaterial_RegsDate = F22)\n                                    *\n                                    (Column_UnusedMaterial_SolicitorTypeID   =   UserInput_SolicitorTypeID)\n                                    *\n                                    (Column_UnusedMaterial_HoursGreaterThan   <   UserInput_UnusedMaterialExcessHours)\n                                    *\n                                    (Column_UnusedMaterial_HoursLessThanOrEqualTo   >=   UserInput_UnusedMaterialExcessHours)\n                                    *\n                                    (Column_UnusedMaterial_InsideOrOutside  =  UserInput_InsideOrOutsideLondon)\n                                    *\n                                    (Column_UnusedMaterial_FixedOrHourly = \"Hourly\")\n                                    *\n                                    IF(ISBLANK(UserInput_UnusedMaterialExcessHours), \"\",\n                                            (UserInput_UnusedMaterialExcessHours  -  Column_UnusedMaterial_HoursGreaterThan)  *   Column_UnusedMaterial_FixedFeeOrRate\n                                    )\n                               )","v":0}]
[null,null,null,null,"Defendant Uplift",{"$f":" SUMPRODUCT(\n                                      (Column_DefendantUplifts_LowerLimit   <=   UserInput_NoOfDefendants)\n                                      *\n                                      (Column_DefendantUplifts_UpperLimit   >=   UserInput_NoOfDefendants)\n                                      *\n                                      Column_DefendantUplifts_Uplift\n                                )","v":0}]
[null,null,null,null,"Percentage",{"$f":"Lookup_Percentage","v":1}]
[null,null,null,null,"Total Fee (without VAT)",{"$f":"IF(      (Lookup_CaseTypeID  =  1)  *  (F24 = \"Below\"),        ((F25  +  F27)  *  (1 + F31)  *  Lookup_Percentage)  +  F28  +  F29  +  F30,\n  IF(      (Lookup_CaseTypeID  =  1)  *  (F24 = \"Above\"),        ((F26)  *  (1 + F31)  *  Lookup_Percentage)  +  F28  +  F29  +  F30,\n  IF(      (Lookup_CaseTypeID  =  2)   *  (F24 = \"Below\"),        ((F25)  *  (1 + F31)  *  Lookup_Percentage)  +  F28 +  F29  +  F30,\n  IF(      (Lookup_CaseTypeID  =  2)   *  (F24 = \"Above\"),        ((F26)  *  (1 + F31)  *  Lookup_Percentage)  +  F28 +  F29  +  F30,\n  IF(      (Lookup_CaseTypeID  =  3)   *  (F24 = \"Below\"),        ((F25)  *  (1 + F31)  *  Lookup_Percentage)  +  F28,\n  IF(      (Lookup_CaseTypeID  =  3)   *  (F24 = \"Above\"),        ((F26)  *  (1 + F31)  *  Lookup_Percentage)  +  F28,\n  IF(      (Lookup_CaseTypeID >= 4),                                              F25  *  Lookup_Percentage,\n             0\n      )))))))","v":1762.1}]
[null,null,null,null,"Total Fee (with VAT)",{"$f":"F33*(1 + Lookup_VAT)","v":2114.52}]
[]
[null,null,null,null,"VAT only",{"$f":"F34-F33","v":352.42000000000007}]

{"sheet":"Basic Fees","index":1,"n_rows":221,"n_cols":4,"rows_kept":221,"cut":false,"hidden":true,"merged":[]}
["Regs Date","Case Type ID","Class Code","Basic Fee"]
["2020-09-17",1,"A","1,467.58"]
["2020-09-17",1,"B","1,097.66"]
["2020-09-17",1,"C","739.59"]
["2020-09-17",1,"D","1,394.20"]
["2020-09-17",1,"E","352.72"]
["2020-09-17",1,"F","357.60"]
["2020-09-17",1,"G","357.60"]
["2020-09-17",1,"H","357.75"]
["2020-09-17",1,"I","357.44"]
["2020-09-17",1,"J","1,467.58"]
["2020-09-17",1,"K","1,031.82"]
["2020-09-17",2,"A","904.58"]
["2020-09-17",2,"B","709.15"]
["2020-09-17",2,"C","524.84"]
["2020-09-17",2,"D","859.35"]
["2020-09-17",2,"E","233.03"]
["2020-09-17",2,"F","224.22"]
["2020-09-17",2,"G","224.22"]
["2020-09-17",2,"H","237.00"]
["2020-09-17",2,"I","253.67"]
["2020-09-17",2,"J","904.58"]
["2020-09-17",2,"K","773.86"]
["2020-09-17",3,"A","680.38"]
["2020-09-17",3,"B","556.11"]
["2020-09-17",3,"C","442.91"]
["2020-09-17",3,"D","646.36"]
["2020-09-17",3,"E","184.70"]
["2020-09-17",3,"F","195.81"]
["2020-09-17",3,"G","195.81"]
["2020-09-17",3,"H","190.96"]
["2020-09-17",3,"I","174.60"]
["2020-09-17",3,"J","680.38"]
["2020-09-17",3,"K","640.84"]
["2020-09-17",4,"A","349.47"]
["2020-09-17",4,"B","349.47"]
["2020-09-17",4,"C","349.47"]
["2020-09-17",4,"D","349.47"]
["2020-09-17",4,"E","349.47"]
["2020-09-17",4,"F","349.47"]
["2020-09-17",4,"G","349.47"]
["2020-09-17",4,"H","349.47"]
["2020-09-17",4,"I","349.47"]
["2020-09-17",4,"J","349.47"]
["2020-09-17",4,"K","349.47"]
["2020-09-17",5,"A","155.32"]
["2020-09-17",5,"B","155.32"]
["2020-09-17",5,"C","155.32"]
["2020-09-17",5,"D","155.32"]
["2020-09-17",5,"E","155.32"]
["2020-09-17",5,"F","155.32"]
["2020-09-17",5,"G","155.32"]
["2020-09-17",5,"H","155.32"]
["2020-09-17",5,"I","155.32"]
["2020-09-17",5,"J","155.32"]
["2020-09-17",5,"K","155.32"]
["2020-09-17",6,"A","232.98"]
["2020-09-17",6,"B","232.98"]
["2020-09-17",6,"C","232.98"]
["2020-09-17",6,"D","232.98"]
["2020-09-17",6,"E","232.98"]
["2020-09-17",6,"F","232.98"]
["2020-09-17",6,"G","232.98"]
["2020-09-17",6,"H","232.98"]
["2020-09-17",6,"I","232.98"]
["2020-09-17",6,"J","232.98"]
["2020-09-17",6,"K","232.98"]
["2020-09-17",7,"A","116.49"]
["2020-09-17",7,"B","116.49"]
["2020-09-17",7,"C","116.49"]
["2020-09-17",7,"D","116.49"]
["2020-09-17",7,"E","116.49"]
["2020-09-17",7,"F","116.49"]
["2020-09-17",7,"G","116.49"]
["2020-09-17",7,"H","116.49"]
["2020-09-17",7,"I","116.49"]
["2020-09-17",7,"J","116.49"]
["2020-09-17",7,"K","116.49"]
["2020-09-17",8,"A","77.66"]
["2020-09-17",8,"B","77.66"]
["2020-09-17",8,"C","77.66"]
["2020-09-17",8,"D","77.66"]
["2020-09-17",8,"E","77.66"]
["2020-09-17",8,"F","77.66"]
["2020-09-17",8,"G","77.66"]
["2020-09-17",8,"H","77.66"]
["2020-09-17",8,"I","77.66"]
["2020-09-17",8,"J","77.66"]
["2020-09-17",8,"K","77.66"]
["2020-09-17",9,"A","155.32"]
["2020-09-17",9,"B","155.32"]
["2020-09-17",9,"C","155.32"]
["2020-09-17",9,"D","155.32"]
["2020-09-17",9,"E","155.32"]
["2020-09-17",9,"F","155.32"]
["2020-09-17",9,"G","155.32"]
["2020-09-17",9,"H","155.32"]
["2020-09-17",9,"I","155.32"]
["2020-09-17",9,"J","155.32"]
["2020-09-17",9,"K","155.32"]
["2020-09-17",10,"A","330.33"]
["2020-09-17",10,"B","330.33"]
["2020-09-17",10,"C","330.33"]
["2020-09-17",10,"D","330.33"]
["2020-09-17",10,"E","330.33"]
["2020-09-17",10,"F","330.33"]
["2020-09-17",10,"G","330.33"]
["2020-09-17",10,"H","330.33"]
["2020-09-17",10,"I","330.33"]
["2020-09-17",10,"J","330.33"]
["2020-09-17",10,"K","330.33"]
["2022-09-30",1,"A","1,687.72"]
["2022-09-30",1,"B","1,262.31"]
["2022-09-30",1,"C","850.53"]
["2022-09-30",1,"D","1,603.33"]
["2022-09-30",1,"E","405.63"]
["2022-09-30",1,"F","411.24"]
["2022-09-30",1,"G","411.24"]
["2022-09-30",1,"H","411.41"]
["2022-09-30",1,"I","411.06"]
["2022-09-30",1,"J","1,687.72"]
["2022-09-30",1,"K","1,186.59"]
["2022-09-30",2,"A","1,040.27"]
["2022-09-30",2,"B","815.52"]
["2022-09-30",2,"C","603.55"]
["2022-09-30",2,"D","988.25"]
["2022-09-30",2,"E","267.98"]
["2022-09-30",2,"F","257.86"]
["2022-09-30",2,"G","257.86"]
["2022-09-30",2,"H","272.55"]
["2022-09-30",2,"I","291.72"]
["2022-09-30",2,"J","1,040.27"]
["2022-09-30",2,"K","889.94"]
["2022-09-30",3,"A","782.45"]
["2022-09-30",3,"B","639.53"]
["2022-09-30",3,"C","509.35"]
["2022-09-30",3,"D","743.31"]
["2022-09-30",3,"E","212.40"]
["2022-09-30",3,"F","225.18"]
["2022-09-30",3,"G","225.18"]
["2022-09-30",3,"H","219.62"]
["2022-09-30",3,"I","200.79"]
["2022-09-30",3,"J","782.45"]
["2022-09-30",3,"K","736.97"]
["2022-09-30",4,"A","401.89"]
["2022-09-30",4,"B","401.89"]
["2022-09-30",4,"C","401.89"]
["2022-09-30",4,"D","401.89"]
["2022-09-30",4,"E","401.89"]
["2022-09-30",4,"F","401.89"]
["2022-09-30",4,"G","401.89"]
["2022-09-30",4,"H","401.89"]
["2022-09-30",4,"I","401.89"]
["2022-09-30",4,"J","401.89"]
["2022-09-30",4,"K","401.89"]
["2022-09-30",5,"A","178.62"]
["2022-09-30",5,"B","178.62"]
["2022-09-30",5,"C","178.62"]
["2022-09-30",5,"D","178.62"]
["2022-09-30",5,"E","178.62"]
["2022-09-30",5,"F","178.62"]
["2022-09-30",5,"G","178.62"]
["2022-09-30",5,"H","178.62"]
["2022-09-30",5,"I","178.62"]
["2022-09-30",5,"J","178.62"]
["2022-09-30",5,"K","178.62"]
["2022-09-30",6,"A","267.93"]
["2022-09-30",6,"B","267.93"]
["2022-09-30",6,"C","267.93"]
["2022-09-30",6,"D","267.93"]
["2022-09-30",6,"E","267.93"]
["2022-09-30",6,"F","267.93"]
["2022-09-30",6,"G","267.93"]
["2022-09-30",6,"H","267.93"]
["2022-09-30",6,"I","267.93"]
["2022-09-30",6,"J","267.93"]
["2022-09-30",6,"K","267.93"]
["2022-09-30",7,"A","133.96"]
["2022-09-30",7,"B","133.96"]
["2022-09-30",7,"C","133.96"]
["2022-09-30",7,"D","133.96"]
["2022-09-30",7,"E","133.96"]
["2022-09-30",7,"F","133.96"]
["2022-09-30",7,"G","133.96"]
["2022-09-30",7,"H","133.96"]
["2022-09-30",7,"I","133.96"]
["2022-09-30",7,"J","133.96"]
["2022-09-30",7,"K","133.96"]
["2022-09-30",8,"A","89.31"]
["2022-09-30",8,"B","89.31"]
["2022-09-30",8,"C","89.31"]
["2022-09-30",8,"D","89.31"]
["2022-09-30",8,"E","89.31"]
["2022-09-30",8,"F","89.31"]
["2022-09-30",8,"G","89.31"]
["2022-09-30",8,"H","89.31"]
["2022-09-30",8,"I","89.31"]
["2022-09-30",8,"J","89.31"]
["2022-09-30",8,"K","89.31"]
["2022-09-30",9,"A","178.62"]
["2022-09-30",9,"B","178.62"]
["2022-09-30",9,"C","178.62"]
["2022-09-30",9,"D","178.62"]
["2022-09-30",9,"E","178.62"]
["2022-09-30",9,"F","178.62"]
["2022-09-30",9,"G","178.62"]
["2022-09-30",9,"H","178.62"]
["2022-09-30",9,"I","178.62"]
["2022-09-30",9,"J","178.62"]
["2022-09-30",9,"K","178.62"]
["2022-09-30",10,"A","0.00"]
["2022-09-30",10,"B","0.00"]
["2022-09-30",10,"C","0.00"]
["2022-09-30",10,"D","0.00"]
["2022-09-30",10,"E","0.00"]
["2022-09-30",10,"F","0.00"]
["2022-09-30",10,"G","0.00"]
["2022-09-30",10,"H","0.00"]
["2022-09-30",10,"I","0.00"]
["2022-09-30",10,"J","0.00"]
["2022-09-30",10,"K","0.00"]

{"sheet":"PPE Cutoffs","index":2,"n_rows":4423,"n_cols":10,"rows_kept":4423,"cut":false,"hidden":true,"merged":[]}
["Regs Date","Class Code","Length of Trial in Days","PPE Cut Off",null,"Cracked trials and guilty pleas",null,null,null,"Trials"]
["2020-09-17","A",0,80]
["2020-09-17","B",0,70]
["2020-09-17","C",0,40]
["2020-09-17","D",0,80]
["2020-09-17","E",0,40]
["2020-09-17","F",0,50]
["2020-09-17","G",0,50]
["2020-09-17","H",0,40]
["2020-09-17","I",0,40]
["2020-09-17","J",0,80]
["2020-09-17","K",0,120]
["2022-09-30","A",0,80]
["2022-09-30","B",0,70]
["2022-09-30","C",0,40]
["2022-09-30","D",0,80]
["2022-09-30","E",0,40]
["2022-09-30","F",0,50]
["2022-09-30","G",0,50]
["2022-09-30","H",0,40]
["2022-09-30","I",0,40]
["2022-09-30","J",0,80]
["2022-09-30","K",0,120]
["2020-09-17","A",1,80]
["2020-09-17","A",2,80]
["2020-09-17","A",3,95]
["2020-09-17","A",4,126]
["2020-09-17","A",5,156]
["2020-09-17","A",6,186]
["2020-09-17","A",7,218]
["2020-09-17","A",8,257]
["2020-09-17","A",9,293]
["2020-09-17","A",10,330]
["2020-09-17","A",11,367]
["2020-09-17","A",12,404]
["2020-09-17","A",13,440]
["2020-09-17","A",14,477]
["2020-09-17","A",15,514]
["2020-09-17","A",16,551]
["2020-09-17","A",17,587]
["2020-09-17","A",18,624]
["2020-09-17","A",19,661]
["2020-09-17","A",20,697]
["2020-09-17","A",21,742]
["2020-09-17","A",22,786]
["2020-09-17","A",23,830]
["2020-09-17","A",24,874]
["2020-09-17","A",25,917]
["2020-09-17","A",26,961]
["2020-09-17","A",27,1005]
["2020-09-17","A",28,1049]
["2020-09-17","A",29,1099]
["2020-09-17","A",30,1150]
["2020-09-17","A",31,1200]
["2020-09-17","A",32,1251]
["2020-09-17","A",33,1301]
["2020-09-17","A",34,1352]
["2020-09-17","A",35,1402]
["2020-09-17","A",36,1453]
["2020-09-17","A",37,1503]
["2020-09-17","A",38,1554]
["2020-09-17","A",39,1604]
["2020-09-17","A",40,1652]
["2020-09-17","A",41,1700]
["2020-09-17","A",42,1748]
["2020-09-17","A",43,1796]
["2020-09-17","A",44,1844]
["2020-09-17","A",45,1892]
["2020-09-17","A",46,1939]
["2020-09-17","A",47,1987]
["2020-09-17","A",48,2039]
["2020-09-17","A",49,2091]
["2020-09-17","A",50,2144]
["2020-09-17","A",51,2196]
["2020-09-17","A",52,2249]
["2020-09-17","A",53,2301]
["2020-09-17","A",54,2354]
["2020-09-17","A",55,2406]
["2020-09-17","A",56,2459]
["2020-09-17","A",57,2512]
["2020-09-17","A",58,2564]
["2020-09-17","A",59,2617]
["2020-09-17","A",60,2669]
["2020-09-17","A",61,2722]
["2020-09-17","A",62,2775]
["2020-09-17","A",63,2827]
["2020-09-17","A",64,2880]
["2020-09-17","A",65,2933]
["2020-09-17","A",66,2985]
["2020-09-17","A",67,3038]
["2020-09-17","A",68,3091]
["2020-09-17","A",69,3144]
["2020-09-17","A",70,3196]
["2020-09-17","A",71,3249]
["2020-09-17","A",72,3302]
["2020-09-17","A",73,3355]
["2020-09-17","A",74,3407]
["2020-09-17","A",75,3460]
["2020-09-17","A",76,3513]
["2020-09-17","A",77,3566]
["2020-09-17","A",78,3619]
["2020-09-17","A",79,3672]
["2020-09-17","A",80,3724]
["2020-09-17","A",81,3777]
["2020-09-17","A",82,3830]
["2020-09-17","A",83,3883]
["2020-09-17","A",84,3936]
["2020-09-17","A",85,3989]
["2020-09-17","A",86,4042]
["2020-09-17","A",87,4095]
["2020-09-17","A",88,4148]
["2020-09-17","A",89,4201]
["2020-09-17","A",90,4254]
["2020-09-17","A",91,4307]
["2020-09-17","A",92,4360]
["2020-09-17","A",93,4413]
["2020-09-17","A",94,4466]
["2020-09-17","A",95,4519]
["2020-09-17","A",96,4572]
["2020-09-17","A",97,4625]
["2020-09-17","A",98,4679]
["2020-09-17","A",99,4732]
["2020-09-17","A",100,4785]
["2020-09-17","A",101,4838]
["2020-09-17","A",102,4891]
["2020-09-17","A",103,4944]
["2020-09-17","A",104,4997]
["2020-09-17","A",105,5051]
["2020-09-17","A",106,5104]
["2020-09-17","A",107,5157]
["2020-09-17","A",108,5210]
["2020-09-17","A",109,5264]
["2020-09-17","A",110,5317]
["2020-09-17","A",111,5370]
["2020-09-17","A",112,5423]
["2020-09-17","A",113,5477]
["2020-09-17","A",114,5530]
["2020-09-17","A",115,5583]
["2020-09-17","A",116,5637]
["2020-09-17","A",117,5690]
["2020-09-17","A",118,5743]
["2020-09-17","A",119,5797]
["2020-09-17","A",120,5850]
["2020-09-17","A",121,5904]
["2020-09-17","A",122,5956]
["2020-09-17","A",123,6009]
["2020-09-17","A",124,6061]
["2020-09-17","A",125,6114]
["2020-09-17","A",126,6167]
["2020-09-17","A",127,6219]
["2020-09-17","A",128,6272]
["2020-09-17","A",129,6324]
["2020-09-17","A",130,6377]
["2020-09-17","A",131,6430]
["2020-09-17","A",132,6482]
["2020-09-17","A",133,6535]
["2020-09-17","A",134,6588]
["2020-09-17","A",135,6640]
["2020-09-17","A",136,6693]
["2020-09-17","A",137,6745]
["2020-09-17","A",138,6798]
["2020-09-17","A",139,6851]
["2020-09-17","A",140,6903]
["2020-09-17","A",141,6956]
["2020-09-17","A",142,7008]
["2020-09-17","A",143,7061]
["2020-09-17","A",144,7114]
["2020-09-17","A",145,7166]
["2020-09-17","A",146,7219]
["2020-09-17","A",147,7272]
["2020-09-17","A",148,7324]
["2020-09-17","A",149,7377]
["2020-09-17","A",150,7429]
["2020-09-17","A",151,7482]
["2020-09-17","A",152,7535]
["2020-09-17","A",153,7587]
["2020-09-17","A",154,7640]
["2020-09-17","A",155,7692]
["2020-09-17","A",156,7745]
["2020-09-17","A",157,7798]
["2020-09-17","A",158,7850]
["2020-09-17","A",159,7903]
["2020-09-17","A",160,7956]
["2020-09-17","A",161,8008]
["2020-09-17","A",162,8061]
["2020-09-17","A",163,8113]
["2020-09-17","A",164,8166]
["2020-09-17","A",165,8219]
["2020-09-17","A",166,8271]
["2020-09-17","A",167,8324]
["2020-09-17","A",168,8376]
["2020-09-17","A",169,8429]
["2020-09-17","A",170,8482]
["2020-09-17","A",171,8534]
["2020-09-17","A",172,8587]
["2020-09-17","A",173,8639]
["2020-09-17","A",174,8692]
["2020-09-17","A",175,8745]
["2020-09-17","A",176,8797]
["2020-09-17","A",177,8850]
["2020-09-17","A",178,8903]
["2020-09-17","A",179,8955]
["2020-09-17","A",180,9008]
["2020-09-17","A",181,9060]
["2020-09-17","A",182,9113]
["2020-09-17","A",183,9166]
["2020-09-17","A",184,9218]
["2020-09-17","A",185,9271]
["2020-09-17","A",186,9323]
["2020-09-17","A",187,9376]
["2020-09-17","A",188,9429]
["2020-09-17","A",189,9481]
["2020-09-17","A",190,9534]
["2020-09-17","A",191,9587]
["2020-09-17","A",192,9639]
["2020-09-17","A",193,9692]
["2020-09-17","A",194,9744]
["2020-09-17","A",195,9797]
["2020-09-17","A",196,9850]
["2020-09-17","A",197,9902]
["2020-09-17","A",198,9955]
["2020-09-17","A",199,10007]
["2020-09-17","A",200,10060]
["2020-09-17","B",1,70]
["2020-09-17","B",2,70]
["2020-09-17","B",3,105]
["2020-09-17","B",4,139]
["2020-09-17","B",5,170]
["2020-09-17","B",6,203]
["2020-09-17","B",7,238]
["2020-09-17","B",8,274]
["2020-09-17","B",9,306]
["2020-09-17","B",10,338]
["2020-09-17","B",11,370]
["2020-09-17","B",12,402]
["2020-09-17","B",13,434]
["2020-09-17","B",14,465]
["2020-09-17","B",15,497]
["2020-09-17","B",16,535]
["2020-09-17","B",17,573]
["2020-09-17","B",18,611]
["2020-09-17","B",19,649]
["2020-09-17","B",20,687]
["2020-09-17","B",21,722]
["2020-09-17","B",22,757]
["2020-09-17","B",23,792]
["2020-09-17","B",24,826]
["2020-09-17","B",25,860]
["2020-09-17","B",26,895]
["2020-09-17","B",27,935]
["2020-09-17","B",28,975]
["2020-09-17","B",29,1016]
["2020-09-17","B",30,1057]
["2020-09-17","B",31,1098]
["2020-09-17","B",32,1138]
["2020-09-17","B",33,1179]
["2020-09-17","B",34,1220]
["2020-09-17","B",35,1261]
["2020-09-17","B",36,1302]
["2020-09-17","B",37,1348]
["2020-09-17","B",38,1395]
["2020-09-17","B",39,1441]
["2020-09-17","B",40,1484]
["2020-09-17","B",41,1527]
["2020-09-17","B",42,1570]
["2020-09-17","B",43,1613]
["2020-09-17","B",44,1656]
["2020-09-17","B",45,1699]
["2020-09-17","B",46,1742]
["2020-09-17","B",47,1785]
["2020-09-17","B",48,1828]
["2020-09-17","B",49,1871]
["2020-09-17","B",50,1914]
["2020-09-17","B",51,1957]
["2020-09-17","B",52,2000]
["2020-09-17","B",53,2043]
["2020-09-17","B",54,2086]
["2020-09-17","B",55,2129]
["2020-09-17","B",56,2172]
["2020-09-17","B",57,2215]
["2020-09-17","B",58,2258]
["2020-09-17","B",59,2301]
["2020-09-17","B",60,2345]
["2020-09-17","B",61,2388]
["2020-09-17","B",62,2431]
["2020-09-17","B",63,2474]
["2020-09-17","B",64,2517]
["2020-09-17","B",65,2561]
["2020-09-17","B",66,2604]
["2020-09-17","B",67,2647]
["2020-09-17","B",68,2690]
["2020-09-17","B",69,2734]
["2020-09-17","B",70,2777]
["2020-09-17","B",71,2820]
["2020-09-17","B",72,2864]
["2020-09-17","B",73,2907]
["2020-09-17","B",74,2950]
["2020-09-17","B",75,2994]
["2020-09-17","B",76,3037]
["2020-09-17","B",77,3080]
["2020-09-17","B",78,3124]
["2020-09-17","B",79,3167]
["2020-09-17","B",80,3211]
["2020-09-17","B",81,3254]
["2020-09-17","B",82,3297]
["2020-09-17","B",83,3341]
["2020-09-17","B",84,3384]
["2020-09-17","B",85,3428]
["2020-09-17","B",86,3471]
["2020-09-17","B",87,3515]
["2020-09-17","B",88,3558]
["2020-09-17","B",89,3602]
["2020-09-17","B",90,3645]
["2020-09-17","B",91,3689]
["2020-09-17","B",92,3733]
["2020-09-17","B",93,3776]
["2020-09-17","B",94,3820]
["2020-09-17","B",95,3863]
["2020-09-17","B",96,3907]
["2020-09-17","B",97,3951]
["2020-09-17","B",98,3994]
["2020-09-17","B",99,4038]
["2020-09-17","B",100,4082]
["2020-09-17","B",101,4125]
["2020-09-17","B",102,4169]
["2020-09-17","B",103,4213]
["2020-09-17","B",104,4257]
["2020-09-17","B",105,4300]
["2020-09-17","B",106,4344]
["2020-09-17","B",107,4388]
["2020-09-17","B",108,4432]
["2020-09-17","B",109,4475]
["2020-09-17","B",110,4519]
["2020-09-17","B",111,4563]
["2020-09-17","B",112,4607]
["2020-09-17","B",113,4650]
["2020-09-17","B",114,4694]
["2020-09-17","B",115,4738]
["2020-09-17","B",116,4782]
["2020-09-17","B",117,4826]
["2020-09-17","B",118,4869]
["2020-09-17","B",119,4913]
["2020-09-17","B",120,4957]
["2020-09-17","B",121,5001]
["2020-09-17","B",122,5044]
["2020-09-17","B",123,5088]
["2020-09-17","B",124,5131]
["2020-09-17","B",125,5175]
["2020-09-17","B",126,5218]
["2020-09-17","B",127,5261]
["2020-09-17","B",128,5304]
["2020-09-17","B",129,5347]
["2020-09-17","B",130,5390]
["2020-09-17","B",131,5433]
["2020-09-17","B",132,5476]
["2020-09-17","B",133,5520]
["2020-09-17","B",134,5563]
["2020-09-17","B",135,5606]
["2020-09-17","B",136,5649]
["2020-09-17","B",137,5692]
["2020-09-17","B",138,5735]
["2020-09-17","B",139,5778]
["2020-09-17","B",140,5821]
["2020-09-17","B",141,5864]
["2020-09-17","B",142,5908]
["2020-09-17","B",143,5951]
["2020-09-17","B",144,5994]
["2020-09-17","B",145,6037]
["2020-09-17","B",146,6080]
["2020-09-17","B",147,6123]
["2020-09-17","B",148,6166]
["2020-09-17","B",149,6209]
["2020-09-17","B",150,6252]
["2020-09-17","B",151,6296]
["2020-09-17","B",152,6339]
["2020-09-17","B",153,6382]
["2020-09-17","B",154,6425]
["2020-09-17","B",155,6468]
["2020-09-17","B",156,6511]
["2020-09-17","B",157,6554]
["2020-09-17","B",158,6597]
["2020-09-17","B",159,6641]
["2020-09-17","B",160,6684]
["2020-09-17","B",161,6727]
["2020-09-17","B",162,6770]
["2020-09-17","B",163,6813]
["2020-09-17","B",164,6856]
["2020-09-17","B",165,6899]
["2020-09-17","B",166,6942]
["2020-09-17","B",167,6985]
["2020-09-17","B",168,7029]
["2020-09-17","B",169,7072]
["2020-09-17","B",170,7115]
["2020-09-17","B",171,7158]
["2020-09-17","B",172,7201]
["2020-09-17","B",173,7244]
["2020-09-17","B",174,7287]
["2020-09-17","B",175,7330]
["2020-09-17","B",176,7373]
["2020-09-17","B",177,7417]
["2020-09-17","B",178,7460]
["2020-09-17","B",179,7503]
["2020-09-17","B",180,7546]
["2020-09-17","B",181,7589]
["2020-09-17","B",182,7632]
["2020-09-17","B",183,7675]
["2020-09-17","B",184,7718]
["2020-09-17","B",185,7762]
["2020-09-17","B",186,7805]
["2020-09-17","B",187,7848]
["2020-09-17","B",188,7891]
["2020-09-17","B",189,7934]
["2020-09-17","B",190,7977]
["2020-09-17","B",191,8020]
["2020-09-17","B",192,8063]
["2020-09-17","B",193,8106]
["2020-09-17","B",194,8150]
["2020-09-17","B",195,8193]
["2020-09-17","B",196,8236]
["2020-09-17","B",197,8279]
["2020-09-17","B",198,8322]
["2020-09-17","B",199,8365]
["2020-09-17","B",200,8408]
["2020-09-17","C",1,40]
["2020-09-17","C",2,40]
["2020-09-17","C",3,81]
["2020-09-17","C",4,120]
["2020-09-17","C",5,157]
["2020-09-17","C",6,193]
["2020-09-17","C",7,230]
["2020-09-17","C",8,267]
["2020-09-17","C",9,301]
["2020-09-17","C",10,339]
["2020-09-17","C",11,378]
["2020-09-17","C",12,417]
["2020-09-17","C",13,455]
["2020-09-17","C",14,493]
["2020-09-17","C",15,531]
["2020-09-17","C",16,569]
["2020-09-17","C",17,607]
["2020-09-17","C",18,646]
["2020-09-17","C",19,684]
["2020-09-17","C",20,722]
["2020-09-17","C",21,753]
["2020-09-17","C",22,785]
["2020-09-17","C",23,819]
["2020-09-17","C",24,857]
["2020-09-17","C",25,894]
["2020-09-17","C",26,931]
["2020-09-17","C",27,967]
["2020-09-17","C",28,1004]
["2020-09-17","C",29,1041]
["2020-09-17","C",30,1077]
["2020-09-17","C",31,1114]
["2020-09-17","C",32,1151]
["2020-09-17","C",33,1187]
["2020-09-17","C",34,1224]
["2020-09-17","C",35,1262]
["2020-09-17","C",36,1303]
["2020-09-17","C",37,1345]
["2020-09-17","C",38,1386]
["2020-09-17","C",39,1428]
["2020-09-17","C",40,1444]
["2020-09-17","C",41,1461]
["2020-09-17","C",42,1477]
["2020-09-17","C",43,1494]
["2020-09-17","C",44,1511]
["2020-09-17","C",45,1527]
["2020-09-17","C",46,1544]
["2020-09-17","C",47,1560]
["2020-09-17","C",48,1577]
["2020-09-17","C",49,1594]
["2020-09-17","C",50,1610]
["2020-09-17","C",51,1627]
["2020-09-17","C",52,1644]
["2020-09-17","C",53,1660]
["2020-09-17","C",54,1677]
["2020-09-17","C",55,1694]
["2020-09-17","C",56,1710]
["2020-09-17","C",57,1727]
["2020-09-17","C",58,1744]
["2020-09-17","C",59,1760]
["2020-09-17","C",60,1777]
["2020-09-17","C",61,1794]
["2020-09-17","C",62,1811]
["2020-09-17","C",63,1827]
["2020-09-17","C",64,1844]
["2020-09-17","C",65,1861]
["2020-09-17","C",66,1877]
["2020-09-17","C",67,1894]
["2020-09-17","C",68,1911]
["2020-09-17","C",69,1927]
["2020-09-17","C",70,1944]
["2020-09-17","C",71,1961]
["2020-09-17","C",72,1978]
["2020-09-17","C",73,1994]
["2020-09-17","C",74,2016]
["2020-09-17","C",75,2040]
["2020-09-17","C",76,2064]
["2020-09-17","C",77,2089]
["2020-09-17","C",78,2113]
["2020-09-17","C",79,2137]
["2020-09-17","C",80,2161]
["2020-09-17","C",81,2185]
["2020-09-17","C",82,2210]
["2020-09-17","C",83,2234]
["2020-09-17","C",84,2258]
["2020-09-17","C",85,2282]
["2020-09-17","C",86,2307]
["2020-09-17","C",87,2331]
["2020-09-17","C",88,2355]
["2020-09-17","C",89,2379]
["2020-09-17","C",90,2404]
["2020-09-17","C",91,2428]
["2020-09-17","C",92,2452]
["2020-09-17","C",93,2477]
["2020-09-17","C",94,2501]
["2020-09-17","C",95,2525]
["2020-09-17","C",96,2549]
["2020-09-17","C",97,2574]
["2020-09-17","C",98,2598]
["2020-09-17","C",99,2622]
["2020-09-17","C",100,2647]
["2020-09-17","C",101,2671]
["2020-09-17","C",102,2695]
["2020-09-17","C",103,2720]
["2020-09-17","C",104,2744]
["2020-09-17","C",105,2768]
["2020-09-17","C",106,2793]
["2020-09-17","C",107,2817]
["2020-09-17","C",108,2841]
["2020-09-17","C",109,2866]
["2020-09-17","C",110,2890]
["2020-09-17","C",111,2914]
["2020-09-17","C",112,2939]
["2020-09-17","C",113,2963]
["2020-09-17","C",114,2987]
["2020-09-17","C",115,3012]
["2020-09-17","C",116,3036]
["2020-09-17","C",117,3060]
["2020-09-17","C",118,3085]
["2020-09-17","C",119,3109]
["2020-09-17","C",120,3133]
["2020-09-17","C",121,3158]
["2020-09-17","C",122,3182]
["2020-09-17","C",123,3206]
["2020-09-17","C",124,3230]
["2020-09-17","C",125,3254]
["2020-09-17","C",126,3278]
["2020-09-17","C",127,3302]
["2020-09-17","C",128,3326]
["2020-09-17","C",129,3350]
["2020-09-17","C",130,3374]
["2020-09-17","C",131,3398]
["2020-09-17","C",132,3422]
["2020-09-17","C",133,3446]
["2020-09-17","C",134,3470]
["2020-09-17","C",135,3494]
["2020-09-17","C",136,3518]
["2020-09-17","C",137,3542]
["2020-09-17","C",138,3566]
["2020-09-17","C",139,3590]
["2020-09-17","C",140,3614]
["2020-09-17","C",141,3638]
["2020-09-17","C",142,3662]
["2020-09-17","C",143,3686]
["2020-09-17","C",144,3709]
["2020-09-17","C",145,3733]
["2020-09-17","C",146,3757]
["2020-09-17","C",147,3781]
["2020-09-17","C",148,3805]
["2020-09-17","C",149,3829]
["2020-09-17","C",150,3853]
["2020-09-17","C",151,3877]
["2020-09-17","C",152,3901]
["2020-09-17","C",153,3925]
["2020-09-17","C",154,3949]
["2020-09-17","C",155,3973]
["2020-09-17","C",156,3997]
["2020-09-17","C",157,4021]
["2020-09-17","C",158,4045]
["2020-09-17","C",159,4069]
["2020-09-17","C",160,4093]
["2020-09-17","C",161,4117]
["2020-09-17","C",162,4141]
["2020-09-17","C",163,4165]
["2020-09-17","C",164,4189]
["2020-09-17","C",165,4213]
["2020-09-17","C",166,4237]
["2020-09-17","C",167,4261]
["2020-09-17","C",168,4285]
["2020-09-17","C",169,4309]
["2020-09-17","C",170,4333]
["2020-09-17","C",171,4357]
["2020-09-17","C",172,4380]
["2020-09-17","C",173,4404]
["2020-09-17","C",174,4428]
["2020-09-17","C",175,4452]
["2020-09-17","C",176,4476]
["2020-09-17","C",177,4500]
["2020-09-17","C",178,4524]
["2020-09-17","C",179,4548]
["2020-09-17","C",180,4572]
["2020-09-17","C",181,4596]
["2020-09-17","C",182,4620]
["2020-09-17","C",183,4644]
["2020-09-17","C",184,4668]
["2020-09-17","C",185,4692]
["2020-09-17","C",186,4716]
["2020-09-17","C",187,4740]
["2020-09-17","C",188,4764]
["2020-09-17","C",189,4788]
["2020-09-17","C",190,4812]
["2020-09-17","C",191,4836]
["2020-09-17","C",192,4860]
["2020-09-17","C",193,4884]
["2020-09-17","C",194,4908]
["2020-09-17","C",195,4932]
["2020-09-17","C",196,4956]
["2020-09-17","C",197,4980]
["2020-09-17","C",198,5004]
["2020-09-17","C",199,5028]
["2020-09-17","C",200,5051]
["2020-09-17","D",1,80]
["2020-09-17","D",2,80]
["2020-09-17","D",3,95]
["2020-09-17","D",4,126]
["2020-09-17","D",5,156]
["2020-09-17","D",6,186]
["2020-09-17","D",7,218]
["2020-09-17","D",8,257]
["2020-09-17","D",9,293]
["2020-09-17","D",10,330]
["2020-09-17","D",11,367]
["2020-09-17","D",12,404]
["2020-09-17","D",13,440]
["2020-09-17","D",14,477]
["2020-09-17","D",15,514]
["2020-09-17","D",16,551]
["2020-09-17","D",17,587]
["2020-09-17","D",18,624]
["2020-09-17","D",19,661]
["2020-09-17","D",20,697]
["2020-09-17","D",21,742]
["2020-09-17","D",22,786]
["2020-09-17","D",23,830]
["2020-09-17","D",24,874]
["2020-09-17","D",25,917]
["2020-09-17","D",26,961]
["2020-09-17","D",27,1005]
["2020-09-17","D",28,1049]
["2020-09-17","D",29,1099]
["2020-09-17","D",30,1150]
["2020-09-17","D",31,1200]
["2020-09-17","D",32,1251]
["2020-09-17","D",33,1301]
["2020-09-17","D",34,1352]
["2020-09-17","D",35,1402]
["2020-09-17","D",36,1453]
["2020-09-17","D",37,1503]
["2020-09-17","D",38,1554]
["2020-09-17","D",39,1604]
["2020-09-17","D",40,1652]
["2020-09-17","D",41,1700]
["2020-09-17","D",42,1748]
["2020-09-17","D",43,1796]
["2020-09-17","D",44,1844]
["2020-09-17","D",45,1892]
["2020-09-17","D",46,1939]
["2020-09-17","D",47,1987]
["2020-09-17","D",48,2039]
["2020-09-17","D",49,2091]
["2020-09-17","D",50,2144]
["2020-09-17","D",51,2196]
["2020-09-17","D",52,2249]
["2020-09-17","D",53,2301]
["2020-09-17","D",54,2354]
["2020-09-17","D",55,2406]
["2020-09-17","D",56,2459]
["2020-09-17","D",57,2512]
["2020-09-17","D",58,2564]
["2020-09-17","D",59,2617]
["2020-09-17","D",60,2669]
["2020-09-17","D",61,2722]
["2020-09-17","D",62,2775]
["2020-09-17","D",63,2827]
["2020-09-17","D",64,2880]
["2020-09-17","D",65,2933]
["2020-09-17","D",66,2985]
["2020-09-17","D",67,3038]
["2020-09-17","D",68,3091]
["2020-09-17","D",69,3144]
["2020-09-17","D",70,3196]
["2020-09-17","D",71,3249]
["2020-09-17","D",72,3302]
["2020-09-17","D",73,3355]
["2020-09-17","D",74,3407]
["2020-09-17","D",75,3460]
["2020-09-17","D",76,3513]
["2020-09-17","D",77,3566]
["2020-09-17","D",78,3619]
["2020-09-17","D",79,3672]
["2020-09-17","D",80,3724]
["2020-09-17","D",81,3777]
["2020-09-17","D",82,3830]
["2020-09-17","D",83,3883]
["2020-09-17","D",84,3936]
["2020-09-17","D",85,3989]
["2020-09-17","D",86,4042]
["2020-09-17","D",87,4095]
["2020-09-17","D",88,4148]
["2020-09-17","D",89,4201]
["2020-09-17","D",90,4254]
["2020-09-17","D",91,4307]
["2020-09-17","D",92,4360]
["2020-09-17","D",93,4413]
["2020-09-17","D",94,4466]
["2020-09-17","D",95,4519]
["2020-09-17","D",96,4572]
["2020-09-17","D",97,4625]
["2020-09-17","D",98,4679]
["2020-09-17","D",99,4732]
["2020-09-17","D",100,4785]
["2020-09-17","D",101,4838]
["2020-09-17","D",102,4891]
["2020-09-17","D",103,4944]
["2020-09-17","D",104,4997]
["2020-09-17","D",105,5051]
["2020-09-17","D",106,5104]
["2020-09-17","D",107,5157]
["2020-09-17","D",108,5210]
["2020-09-17","D",109,5264]
["2020-09-17","D",110,5317]
["2020-09-17","D",111,5370]
["2020-09-17","D",112,5423]
["2020-09-17","D",113,5477]
["2020-09-17","D",114,5530]
["2020-09-17","D",115,5583]
["2020-09-17","D",116,5637]
["2020-09-17","D",117,5690]
["2020-09-17","D",118,5743]
["2020-09-17","D",119,5797]
["2020-09-17","D",120,5850]
["2020-09-17","D",121,5904]
["2020-09-17","D",122,5956]
["2020-09-17","D",123,6009]
["2020-09-17","D",124,6061]
["2020-09-17","D",125,6114]
["2020-09-17","D",126,6167]
["2020-09-17","D",127,6219]
["2020-09-17","D",128,6272]
["2020-09-17","D",129,6324]
["2020-09-17","D",130,6377]
["2020-09-17","D",131,6430]
["2020-09-17","D",132,6482]
["2020-09-17","D",133,6535]
["2020-09-17","D",134,6588]
["2020-09-17","D",135,6640]
["2020-09-17","D",136,6693]
["2020-09-17","D",137,6745]
["2020-09-17","D",138,6798]
["2020-09-17","D",139,6851]
["2020-09-17","D",140,6903]
["2020-09-17","D",141,6956]
["2020-09-17","D",142,7008]
["2020-09-17","D",143,7061]
["2020-09-17","D",144,7114]
["2020-09-17","D",145,7166]
["2020-09-17","D",146,7219]
["2020-09-17","D",147,7272]
["2020-09-17","D",148,7324]
["2020-09-17","D",149,7377]
["2020-09-17","D",150,7429]
["2020-09-17","D",151,7482]
["2020-09-17","D",152,7535]
["2020-09-17","D",153,7587]
["2020-09-17","D",154,7640]
["2020-09-17","D",155,7692]
["2020-09-17","D",156,7745]
["2020-09-17","D",157,7798]
["2020-09-17","D",158,7850]
["2020-09-17","D",159,7903]
["2020-09-17","D",160,7956]
["2020-09-17","D",161,8008]
["2020-09-17","D",162,8061]
["2020-09-17","D",163,8113]
["2020-09-17","D",164,8166]
["2020-09-17","D",165,8219]
["2020-09-17","D",166,8271]
["2020-09-17","D",167,8324]
["2020-09-17","D",168,8376]
["2020-09-17","D",169,8429]
["2020-09-17","D",170,8482]
["2020-09-17","D",171,8534]
["2020-09-17","D",172,8587]
["2020-09-17","D",173,8639]
["2020-09-17","D",174,8692]
["2020-09-17","D",175,8745]
["2020-09-17","D",176,8797]
["2020-09-17","D",177,8850]
["2020-09-17","D",178,8903]
["2020-09-17","D",179,8955]
["2020-09-17","D",180,9008]
["2020-09-17","D",181,9060]
["2020-09-17","D",182,9113]
["2020-09-17","D",183,9166]
["2020-09-17","D",184,9218]
["2020-09-17","D",185,9271]
["2020-09-17","D",186,9323]
["2020-09-17","D",187,9376]
["2020-09-17","D",188,9429]
["2020-09-17","D",189,9481]
["2020-09-17","D",190,9534]
["2020-09-17","D",191,9587]
["2020-09-17","D",192,9639]
["2020-09-17","D",193,9692]
["2020-09-17","D",194,9744]
["2020-09-17","D",195,9797]
["2020-09-17","D",196,9850]
["2020-09-17","D",197,9902]
["2020-09-17","D",198,9955]
["2020-09-17","D",199,10007]
["2020-09-17","D",200,10060]
["2020-09-17","E",1,40]
["2020-09-17","E",2,40]
["2020-09-17","E",3,120]
["2020-09-17","E",4,158]
["2020-09-17","E",5,195]
["2020-09-17","E",6,229]
["2020-09-17","E",7,265]
["2020-09-17","E",8,301]
["2020-09-17","E",9,333]
["2020-09-17","E",10,365]
["2020-09-17","E",11,399]
["2020-09-17","E",12,433]
["2020-09-17","E",13,467]
["2020-09-17","E",14,500]
["2020-09-17","E",15,532]
["2020-09-17","E",16,565]
["2020-09-17","E",17,598]
["2020-09-17","E",18,646]
["2020-09-17","E",19,696]
["2020-09-17","E",20,746]
["2020-09-17","E",21,787]
["2020-09-17","E",22,828]
["2020-09-17","E",23,868]
["2020-09-17","E",24,908]
["2020-09-17","E",25,948]
["2020-09-17","E",26,988]
["2020-09-17","E",27,1028]
["2020-09-17","E",28,1068]
["2020-09-17","E",29,1108]
["2020-09-17","E",30,1148]
["2020-09-17","E",31,1188]
["2020-09-17","E",32,1228]
["2020-09-17","E",33,1268]
["2020-09-17","E",34,1308]
["2020-09-17","E",35,1347]
["2020-09-17","E",36,1435]
["2020-09-17","E",37,1526]
["2020-09-17","E",38,1617]
["2020-09-17","E",39,1708]
["2020-09-17","E",40,1745]
["2020-09-17","E",41,1782]
["2020-09-17","E",42,1820]
["2020-09-17","E",43,1857]
["2020-09-17","E",44,1895]
["2020-09-17","E",45,1932]
["2020-09-17","E",46,1970]
["2020-09-17","E",47,2007]
["2020-09-17","E",48,2045]
["2020-09-17","E",49,2082]
["2020-09-17","E",50,2120]
["2020-09-17","E",51,2158]
["2020-09-17","E",52,2195]
["2020-09-17","E",53,2233]
["2020-09-17","E",54,2271]
["2020-09-17","E",55,2308]
["2020-09-17","E",56,2346]
["2020-09-17","E",57,2384]
["2020-09-17","E",58,2422]
["2020-09-17","E",59,2459]
["2020-09-17","E",60,2497]
["2020-09-17","E",61,2535]
["2020-09-17","E",62,2572]
["2020-09-17","E",63,2610]
["2020-09-17","E",64,2648]
["2020-09-17","E",65,2686]
["2020-09-17","E",66,2723]
["2020-09-17","E",67,2761]
["2020-09-17","E",68,2799]
["2020-09-17","E",69,2836]
["2020-09-17","E",70,2874]
["2020-09-17","E",71,2912]
["2020-09-17","E",72,2950]
["2020-09-17","E",73,2987]
["2020-09-17","E",74,3025]
["2020-09-17","E",75,3063]
["2020-09-17","E",76,3101]
["2020-09-17","E",77,3138]
["2020-09-17","E",78,3176]
["2020-09-17","E",79,3214]
["2020-09-17","E",80,3251]
["2020-09-17","E",81,3289]
["2020-09-17","E",82,3327]
["2020-09-17","E",83,3365]
["2020-09-17","E",84,3402]
["2020-09-17","E",85,3440]
["2020-09-17","E",86,3478]
["2020-09-17","E",87,3516]
["2020-09-17","E",88,3553]
["2020-09-17","E",89,3591]
["2020-09-17","E",90,3629]
["2020-09-17","E",91,3666]
["2020-09-17","E",92,3704]
["2020-09-17","E",93,3742]
["2020-09-17","E",94,3780]
["2020-09-17","E",95,3817]
["2020-09-17","E",96,3855]
["2020-09-17","E",97,3893]
["2020-09-17","E",98,3930]
["2020-09-17","E",99,3968]
["2020-09-17","E",100,4006]
["2020-09-17","E",101,4044]
["2020-09-17","E",102,4081]
["2020-09-17","E",103,4119]
["2020-09-17","E",104,4157]
["2020-09-17","E",105,4195]
["2020-09-17","E",106,4232]
["2020-09-17","E",107,4270]
["2020-09-17","E",108,4308]
["2020-09-17","E",109,4345]
["2020-09-17","E",110,4383]
["2020-09-17","E",111,4421]
["2020-09-17","E",112,4459]
["2020-09-17","E",113,4496]
["2020-09-17","E",114,4534]
["2020-09-17","E",115,4572]
["2020-09-17","E",116,4610]
["2020-09-17","E",117,4647]
["2020-09-17","E",118,4685]
["2020-09-17","E",119,4723]
["2020-09-17","E",120,4760]
["2020-09-17","E",121,4798]
["2020-09-17","E",122,4836]
["2020-09-17","E",123,4874]
["2020-09-17","E",124,4911]
["2020-09-17","E",125,4949]
["2020-09-17","E",126,4987]
["2020-09-17","E",127,5025]
["2020-09-17","E",128,5062]
["2020-09-17","E",129,5100]
["2020-09-17","E",130,5138]
["2020-09-17","E",131,5175]
["2020-09-17","E",132,5213]
["2020-09-17","E",133,5251]
["2020-09-17","E",134,5289]
["2020-09-17","E",135,5326]
["2020-09-17","E",136,5364]
["2020-09-17","E",137,5402]
["2020-09-17","E",138,5439]
["2020-09-17","E",139,5477]
["2020-09-17","E",140,5515]
["2020-09-17","E",141,5553]
["2020-09-17","E",142,5590]
["2020-09-17","E",143,5628]
["2020-09-17","E",144,5666]
["2020-09-17","E",145,5704]
["2020-09-17","E",146,5741]
["2020-09-17","E",147,5779]
["2020-09-17","E",148,5817]
["2020-09-17","E",149,5854]
["2020-09-17","E",150,5892]
["2020-09-17","E",151,5930]
["2020-09-17","E",152,5968]
["2020-09-17","E",153,6005]
["2020-09-17","E",154,6043]
["2020-09-17","E",155,6081]
["2020-09-17","E",156,6119]
["2020-09-17","E",157,6156]
["2020-09-17","E",158,6194]
["2020-09-17","E",159,6232]
["2020-09-17","E",160,6269]
["2020-09-17","E",161,6307]
["2020-09-17","E",162,6345]
["2020-09-17","E",163,6383]
["2020-09-17","E",164,6420]
["2020-09-17","E",165,6458]
["2020-09-17","E",166,6496]
["2020-09-17","E",167,6534]
["2020-09-17","E",168,6571]
["2020-09-17","E",169,6609]
["2020-09-17","E",170,6647]
["2020-09-17","E",171,6684]
["2020-09-17","E",172,6722]
["2020-09-17","E",173,6760]
["2020-09-17","E",174,6798]
["2020-09-17","E",175,6835]
["2020-09-17","E",176,6873]
["2020-09-17","E",177,6911]
["2020-09-17","E",178,6948]
["2020-09-17","E",179,6986]
["2020-09-17","E",180,7024]
["2020-09-17","E",181,7062]
["2020-09-17","E",182,7099]
["2020-09-17","E",183,7137]
["2020-09-17","E",184,7174]
["2020-09-17","E",185,7211]
["2020-09-17","E",186,7248]
["2020-09-17","E",187,7285]
["2020-09-17","E",188,7322]
["2020-09-17","E",189,7360]
["2020-09-17","E",190,7397]
["2020-09-17","E",191,7434]
["2020-09-17","E",192,7471]
["2020-09-17","E",193,7508]
["2020-09-17","E",194,7545]
["2020-09-17","E",195,7582]
["2020-09-17","E",196,7620]
["2020-09-17","E",197,7657]
["2020-09-17","E",198,7694]
["2020-09-17","E",199,7731]
["2020-09-17","E",200,7768]
["2020-09-17","F",1,50]
["2020-09-17","F",2,50]
["2020-09-17","F",3,138]
["2020-09-17","F",4,173]
["2020-09-17","F",5,206]
["2020-09-17","F",6,240]
["2020-09-17","F",7,276]
["2020-09-17","F",8,310]
["2020-09-17","F",9,342]
["2020-09-17","F",10,373]
["2020-09-17","F",11,405]
["2020-09-17","F",12,437]
["2020-09-17","F",13,470]
["2020-09-17","F",14,501]
["2020-09-17","F",15,533]
["2020-09-17","F",16,564]
["2020-09-17","F",17,596]
["2020-09-17","F",18,627]
["2020-09-17","F",19,659]
["2020-09-17","F",20,690]
["2020-09-17","F",21,720]
["2020-09-17","F",22,752]
["2020-09-17","F",23,784]
["2020-09-17","F",24,816]
["2020-09-17","F",25,848]
["2020-09-17","F",26,880]
["2020-09-17","F",27,912]
["2020-09-17","F",28,944]
["2020-09-17","F",29,976]
["2020-09-17","F",30,1007]
["2020-09-17","F",31,1039]
["2020-09-17","F",32,1070]
["2020-09-17","F",33,1102]
["2020-09-17","F",34,1133]
["2020-09-17","F",35,1165]
["2020-09-17","F",36,1196]
["2020-09-17","F",37,1228]
["2020-09-17","F",38,1259]
["2020-09-17","F",39,1291]
["2020-09-17","F",40,1314]
["2020-09-17","F",41,1338]
["2020-09-17","F",42,1361]
["2020-09-17","F",43,1384]
["2020-09-17","F",44,1410]
["2020-09-17","F",45,1440]
["2020-09-17","F",46,1470]
["2020-09-17","F",47,1501]
["2020-09-17","F",48,1531]
["2020-09-17","F",49,1561]
["2020-09-17","F",50,1591]
["2020-09-17","F",51,1622]
["2020-09-17","F",52,1652]
["2020-09-17","F",53,1682]
["2020-09-17","F",54,1712]
["2020-09-17","F",55,1743]
["2020-09-17","F",56,1773]
["2020-09-17","F",57,1803]
["2020-09-17","F",58,1833]
["2020-09-17","F",59,1864]
["2020-09-17","F",60,1894]
["2020-09-17","F",61,1924]
["2020-09-17","F",62,1959]
["2020-09-17","F",63,2020]
["2020-09-17","F",64,2081]
["2020-09-17","F",65,2141]
["2020-09-17","F",66,2202]
["2020-09-17","F",67,2263]
["2020-09-17","F",68,2323]
["2020-09-17","F",69,2384]
["2020-09-17","F",70,2445]
["2020-09-17","F",71,2506]
["2020-09-17","F",72,2566]
["2020-09-17","F",73,2627]
["2020-09-17","F",74,2688]
["2020-09-17","F",75,2749]
["2020-09-17","F",76,2809]
["2020-09-17","F",77,2870]
["2020-09-17","F",78,2931]
["2020-09-17","F",79,2992]
["2020-09-17","F",80,3052]
["2020-09-17","F",81,3113]
["2020-09-17","F",82,3174]
["2020-09-17","F",83,3235]
["2020-09-17","F",84,3295]
["2020-09-17","F",85,3356]
["2020-09-17","F",86,3417]
["2020-09-17","F",87,3478]
["2020-09-17","F",88,3539]
["2020-09-17","F",89,3599]
["2020-09-17","F",90,3660]
["2020-09-17","F",91,3721]
["2020-09-17","F",92,3782]
["2020-09-17","F",93,3843]
["2020-09-17","F",94,3903]
["2020-09-17","F",95,3964]
["2020-09-17","F",96,4025]
["2020-09-17","F",97,4086]
["2020-09-17","F",98,4147]
["2020-09-17","F",99,4207]
["2020-09-17","F",100,4268]
["2020-09-17","F",101,4329]
["2020-09-17","F",102,4390]
["2020-09-17","F",103,4451]
["2020-09-17","F",104,4512]
["2020-09-17","F",105,4573]
["2020-09-17","F",106,4633]
["2020-09-17","F",107,4694]
["2020-09-17","F",108,4755]
["2020-09-17","F",109,4816]
["2020-09-17","F",110,4877]
["2020-09-17","F",111,4938]
["2020-09-17","F",112,4999]
["2020-09-17","F",113,5059]
["2020-09-17","F",114,5120]
["2020-09-17","F",115,5181]
["2020-09-17","F",116,5242]
["2020-09-17","F",117,5303]
["2020-09-17","F",118,5364]
["2020-09-17","F",119,5425]
["2020-09-17","F",120,5486]
["2020-09-17","F",121,5547]
["2020-09-17","F",122,5607]
["2020-09-17","F",123,5668]
["2020-09-17","F",124,5729]
["2020-09-17","F",125,5789]
["2020-09-17","F",126,5850]
["2020-09-17","F",127,5911]
["2020-09-17","F",128,5971]
["2020-09-17","F",129,6032]
["2020-09-17","F",130,6093]
["2020-09-17","F",131,6153]
["2020-09-17","F",132,6214]
["2020-09-17","F",133,6274]
["2020-09-17","F",134,6335]
["2020-09-17","F",135,6396]
["2020-09-17","F",136,6456]
["2020-09-17","F",137,6517]
["2020-09-17","F",138,6578]
["2020-09-17","F",139,6638]
["2020-09-17","F",140,6699]
["2020-09-17","F",141,6760]
["2020-09-17","F",142,6820]
["2020-09-17","F",143,6881]
["2020-09-17","F",144,6942]
["2020-09-17","F",145,7002]
["2020-09-17","F",146,7063]
["2020-09-17","F",147,7124]
["2020-09-17","F",148,7184]
["2020-09-17","F",149,7245]
["2020-09-17","F",150,7305]
["2020-09-17","F",151,7366]
["2020-09-17","F",152,7427]
["2020-09-17","F",153,7487]
["2020-09-17","F",154,7548]
["2020-09-17","F",155,7609]
["2020-09-17","F",156,7669]
["2020-09-17","F",157,7730]
["2020-09-17","F",158,7791]
["2020-09-17","F",159,7851]
["2020-09-17","F",160,7912]
["2020-09-17","F",161,7973]
["2020-09-17","F",162,8033]
["2020-09-17","F",163,8094]
["2020-09-17","F",164,8155]
["2020-09-17","F",165,8215]
["2020-09-17","F",166,8276]
["2020-09-17","F",167,8337]
["2020-09-17","F",168,8397]
["2020-09-17","F",169,8458]
["2020-09-17","F",170,8518]
["2020-09-17","F",171,8579]
["2020-09-17","F",172,8640]
["2020-09-17","F",173,8700]
["2020-09-17","F",174,8761]
["2020-09-17","F",175,8822]
["2020-09-17","F",176,8882]
["2020-09-17","F",177,8943]
["2020-09-17","F",178,9004]
["2020-09-17","F",179,9064]
["2020-09-17","F",180,9125]
["2020-09-17","F",181,9186]
["2020-09-17","F",182,9246]
["2020-09-17","F",183,9307]
["2020-09-17","F",184,9368]
["2020-09-17","F",185,9428]
["2020-09-17","F",186,9489]
["2020-09-17","F",187,9549]
["2020-09-17","F",188,9610]
["2020-09-17","F",189,9671]
["2020-09-17","F",190,9731]
["2020-09-17","F",191,9792]
["2020-09-17","F",192,9853]
["2020-09-17","F",193,9913]
["2020-09-17","F",194,9974]
["2020-09-17","F",195,10035]
["2020-09-17","F",196,10095]
["2020-09-17","F",197,10156]
["2020-09-17","F",198,10217]
["2020-09-17","F",199,10277]
["2020-09-17","F",200,10338]
["2020-09-17","G",1,50]
["2020-09-17","G",2,50]
["2020-09-17","G",3,138]
["2020-09-17","G",4,173]
["2020-09-17","G",5,206]
["2020-09-17","G",6,240]
["2020-09-17","G",7,276]
["2020-09-17","G",8,310]
["2020-09-17","G",9,342]
["2020-09-17","G",10,373]
["2020-09-17","G",11,405]
["2020-09-17","G",12,437]
["2020-09-17","G",13,470]
["2020-09-17","G",14,501]
["2020-09-17","G",15,533]
["2020-09-17","G",16,564]
["2020-09-17","G",17,596]
["2020-09-17","G",18,627]
["2020-09-17","G",19,659]
["2020-09-17","G",20,690]
["2020-09-17","G",21,720]
["2020-09-17","G",22,752]
["2020-09-17","G",23,784]
["2020-09-17","G",24,816]
["2020-09-17","G",25,848]
["2020-09-17","G",26,880]
["2020-09-17","G",27,912]
["2020-09-17","G",28,944]
["2020-09-17","G",29,976]
["2020-09-17","G",30,1007]
["2020-09-17","G",31,1039]
["2020-09-17","G",32,1070]
["2020-09-17","G",33,1102]
["2020-09-17","G",34,1133]
["2020-09-17","G",35,1165]
["2020-09-17","G",36,1196]
["2020-09-17","G",37,1228]
["2020-09-17","G",38,1259]
["2020-09-17","G",39,1291]
["2020-09-17","G",40,1314]
["2020-09-17","G",41,1338]
["2020-09-17","G",42,1361]
["2020-09-17","G",43,1384]
["2020-09-17","G",44,1410]
["2020-09-17","G",45,1440]
["2020-09-17","G",46,1470]
["2020-09-17","G",47,1501]
["2020-09-17","G",48,1531]
["2020-09-17","G",49,1561]
["2020-09-17","G",50,1591]
["2020-09-17","G",51,1622]
["2020-09-17","G",52,1652]
["2020-09-17","G",53,1682]
["2020-09-17","G",54,1712]
["2020-09-17","G",55,1743]
["2020-09-17","G",56,1773]
["2020-09-17","G",57,1803]
["2020-09-17","G",58,1833]
["2020-09-17","G",59,1864]
["2020-09-17","G",60,1894]
["2020-09-17","G",61,1924]
["2020-09-17","G",62,1959]
["2020-09-17","G",63,2020]
["2020-09-17","G",64,2081]
["2020-09-17","G",65,2141]
["2020-09-17","G",66,2202]
["2020-09-17","G",67,2263]
["2020-09-17","G",68,2323]
["2020-09-17","G",69,2384]
["2020-09-17","G",70,2445]
["2020-09-17","G",71,2506]
["2020-09-17","G",72,2566]
["2020-09-17","G",73,2627]
["2020-09-17","G",74,2688]
["2020-09-17","G",75,2749]
["2020-09-17","G",76,2809]
["2020-09-17","G",77,2870]
["2020-09-17","G",78,2931]
["2020-09-17","G",79,2992]
["2020-09-17","G",80,3052]
["2020-09-17","G",81,3113]
["2020-09-17","G",82,3174]
["2020-09-17","G",83,3235]
["2020-09-17","G",84,3295]
["2020-09-17","G",85,3356]
["2020-09-17","G",86,3417]
["2020-09-17","G",87,3478]
["2020-09-17","G",88,3539]
["2020-09-17","G",89,3599]
["2020-09-17","G",90,3660]
["2020-09-17","G",91,3721]
["2020-09-17","G",92,3782]
["2020-09-17","G",93,3843]
["2020-09-17","G",94,3903]
["2020-09-17","G",95,3964]
["2020-09-17","G",96,4025]
["2020-09-17","G",97,4086]
["2020-09-17","G",98,4147]
["2020-09-17","G",99,4207]
["2020-09-17","G",100,4268]
["2020-09-17","G",101,4329]
["2020-09-17","G",102,4390]
["2020-09-17","G",103,4451]
["2020-09-17","G",104,4512]
["2020-09-17","G",105,4573]
["2020-09-17","G",106,4633]
["2020-09-17","G",107,4694]
["2020-09-17","G",108,4755]
["2020-09-17","G",109,4816]
["2020-09-17","G",110,4877]
["2020-09-17","G",111,4938]
["2020-09-17","G",112,4999]
["2020-09-17","G",113,5059]
["2020-09-17","G",114,5120]
["2020-09-17","G",115,5181]
["2020-09-17","G",116,5242]
["2020-09-17","G",117,5303]
["2020-09-17","G",118,5364]
["2020-09-17","G",119,5425]
["2020-09-17","G",120,5486]
["2020-09-17","G",121,5547]
["2020-09-17","G",122,5607]
["2020-09-17","G",123,5668]
["2020-09-17","G",124,5729]
["2020-09-17","G",125,5789]
["2020-09-17","G",126,5850]
["2020-09-17","G",127,5911]
["2020-09-17","G",128,5971]
["2020-09-17","G",129,6032]
["2020-09-17","G",130,6093]
["2020-09-17","G",131,6153]
["2020-09-17","G",132,6214]
["2020-09-17","G",133,6274]
["2020-09-17","G",134,6335]
["2020-09-17","G",135,6396]
["2020-09-17","G",136,6456]
["2020-09-17","G",137,6517]
["2020-09-17","G",138,6578]
["2020-09-17","G",139,6638]
["2020-09-17","G",140,6699]
["2020-09-17","G",141,6760]
["2020-09-17","G",142,6820]
["2020-09-17","G",143,6881]
["2020-09-17","G",144,6942]
["2020-09-17","G",145,7002]
["2020-09-17","G",146,7063]
["2020-09-17","G",147,7124]
["2020-09-17","G",148,7184]
["2020-09-17","G",149,7245]
["2020-09-17","G",150,7305]
["2020-09-17","G",151,7366]
["2020-09-17","G",152,7427]
["2020-09-17","G",153,7487]
["2020-09-17","G",154,7548]
["2020-09-17","G",155,7609]
["2020-09-17","G",156,7669]
["2020-09-17","G",157,7730]
["2020-09-17","G",158,7791]
["2020-09-17","G",159,7851]
["2020-09-17","G",160,7912]
["2020-09-17","G",161,7973]
["2020-09-17","G",162,8033]
["2020-09-17","G",163,8094]
["2020-09-17","G",164,8155]
["2020-09-17","G",165,8215]
["2020-09-17","G",166,8276]
["2020-09-17","G",167,8337]
["2020-09-17","G",168,8397]
["2020-09-17","G",169,8458]
["2020-09-17","G",170,8518]
["2020-09-17","G",171,8579]
["2020-09-17","G",172,8640]
["2020-09-17","G",173,8700]
["2020-09-17","G",174,8761]
["2020-09-17","G",175,8822]
["2020-09-17","G",176,8882]
["2020-09-17","G",177,8943]
["2020-09-17","G",178,9004]
["2020-09-17","G",179,9064]
["2020-09-17","G",180,9125]
["2020-09-17","G",181,9186]
["2020-09-17","G",182,9246]
["2020-09-17","G",183,9307]
["2020-09-17","G",184,9368]
["2020-09-17","G",185,9428]
["2020-09-17","G",186,9489]
["2020-09-17","G",187,9549]
["2020-09-17","G",188,9610]
["2020-09-17","G",189,9671]
["2020-09-17","G",190,9731]
["2020-09-17","G",191,9792]
["2020-09-17","G",192,9853]
["2020-09-17","G",193,9913]
["2020-09-17","G",194,9974]
["2020-09-17","G",195,10035]
["2020-09-17","G",196,10095]
["2020-09-17","G",197,10156]
["2020-09-17","G",198,10217]
["2020-09-17","G",199,10277]
["2020-09-17","G",200,10338]
["2020-09-17","H",1,40]
["2020-09-17","H",2,40]
["2020-09-17","H",3,122]
["2020-09-17","H",4,157]
["2020-09-17","H",5,191]
["2020-09-17","H",6,225]
["2020-09-17","H",7,260]
["2020-09-17","H",8,301]
["2020-09-17","H",9,338]
["2020-09-17","H",10,374]
["2020-09-17","H",11,412]
["2020-09-17","H",12,449]
["2020-09-17","H",13,486]
["2020-09-17","H",14,523]
["2020-09-17","H",15,559]
["2020-09-17","H",16,596]
["2020-09-17","H",17,637]
["2020-09-17","H",18,687]
["2020-09-17","H",19,736]
["2020-09-17","H",20,786]
["2020-09-17","H",21,826]
["2020-09-17","H",22,867]
["2020-09-17","H",23,908]
["2020-09-17","H",24,948]
["2020-09-17","H",25,988]
["2020-09-17","H",26,1028]
["2020-09-17","H",27,1068]
["2020-09-17","H",28,1107]
["2020-09-17","H",29,1147]
["2020-09-17","H",30,1187]
["2020-09-17","H",31,1226]
["2020-09-17","H",32,1266]
["2020-09-17","H",33,1307]
["2020-09-17","H",34,1357]
["2020-09-17","H",35,1407]
["2020-09-17","H",36,1457]
["2020-09-17","H",37,1507]
["2020-09-17","H",38,1557]
["2020-09-17","H",39,1607]
["2020-09-17","H",40,1629]
["2020-09-17","H",41,1651]
["2020-09-17","H",42,1673]
["2020-09-17","H",43,1695]
["2020-09-17","H",44,1716]
["2020-09-17","H",45,1738]
["2020-09-17","H",46,1760]
["2020-09-17","H",47,1782]
["2020-09-17","H",48,1804]
["2020-09-17","H",49,1826]
["2020-09-17","H",50,1848]
["2020-09-17","H",51,1870]
["2020-09-17","H",52,1892]
["2020-09-17","H",53,1914]
["2020-09-17","H",54,1936]
["2020-09-17","H",55,1958]
["2020-09-17","H",56,1980]
["2020-09-17","H",57,2002]
["2020-09-17","H",58,2024]
["2020-09-17","H",59,2046]
["2020-09-17","H",60,2068]
["2020-09-17","H",61,2090]
["2020-09-17","H",62,2112]
["2020-09-17","H",63,2134]
["2020-09-17","H",64,2156]
["2020-09-17","H",65,2178]
["2020-09-17","H",66,2200]
["2020-09-17","H",67,2222]
["2020-09-17","H",68,2244]
["2020-09-17","H",69,2266]
["2020-09-17","H",70,2288]
["2020-09-17","H",71,2310]
["2020-09-17","H",72,2332]
["2020-09-17","H",73,2354]
["2020-09-17","H",74,2376]
["2020-09-17","H",75,2398]
["2020-09-17","H",76,2420]
["2020-09-17","H",77,2442]
["2020-09-17","H",78,2464]
["2020-09-17","H",79,2486]
["2020-09-17","H",80,2508]
["2020-09-17","H",81,2530]
["2020-09-17","H",82,2552]
["2020-09-17","H",83,2575]
["2020-09-17","H",84,2597]
["2020-09-17","H",85,2619]
["2020-09-17","H",86,2641]
["2020-09-17","H",87,2663]
["2020-09-17","H",88,2685]
["2020-09-17","H",89,2707]
["2020-09-17","H",90,2729]
["2020-09-17","H",91,2751]
["2020-09-17","H",92,2774]
["2020-09-17","H",93,2796]
["2020-09-17","H",94,2818]
["2020-09-17","H",95,2840]
["2020-09-17","H",96,2862]
["2020-09-17","H",97,2884]
["2020-09-17","H",98,2906]
["2020-09-17","H",99,2929]
["2020-09-17","H",100,2951]
["2020-09-17","H",101,2973]
["2020-09-17","H",102,2995]
["2020-09-17","H",103,3032]
["2020-09-17","H",104,3073]
["2020-09-17","H",105,3114]
["2020-09-17","H",106,3155]
["2020-09-17","H",107,3196]
["2020-09-17","H",108,3237]
["2020-09-17","H",109,3278]
["2020-09-17","H",110,3319]
["2020-09-17","H",111,3361]
["2020-09-17","H",112,3402]
["2020-09-17","H",113,3443]
["2020-09-17","H",114,3484]
["2020-09-17","H",115,3525]
["2020-09-17","H",116,3566]
["2020-09-17","H",117,3607]
["2020-09-17","H",118,3648]
["2020-09-17","H",119,3689]
["2020-09-17","H",120,3730]
["2020-09-17","H",121,3771]
["2020-09-17","H",122,3812]
["2020-09-17","H",123,3853]
["2020-09-17","H",124,3895]
["2020-09-17","H",125,3936]
["2020-09-17","H",126,3977]
["2020-09-17","H",127,4017]
["2020-09-17","H",128,4058]
["2020-09-17","H",129,4098]
["2020-09-17","H",130,4139]
["2020-09-17","H",131,4179]
["2020-09-17","H",132,4219]
["2020-09-17","H",133,4260]
["2020-09-17","H",134,4300]
["2020-09-17","H",135,4341]
["2020-09-17","H",136,4381]
["2020-09-17","H",137,4422]
["2020-09-17","H",138,4462]
["2020-09-17","H",139,4503]
["2020-09-17","H",140,4543]
["2020-09-17","H",141,4584]
["2020-09-17","H",142,4624]
["2020-09-17","H",143,4664]
["2020-09-17","H",144,4705]
["2020-09-17","H",145,4745]
["2020-09-17","H",146,4786]
["2020-09-17","H",147,4826]
["2020-09-17","H",148,4867]
["2020-09-17","H",149,4907]
["2020-09-17","H",150,4948]
["2020-09-17","H",151,4988]
["2020-09-17","H",152,5029]
["2020-09-17","H",153,5069]
["2020-09-17","H",154,5110]
["2020-09-17","H",155,5150]
["2020-09-17","H",156,5190]
["2020-09-17","H",157,5231]
["2020-09-17","H",158,5271]
["2020-09-17","H",159,5312]
["2020-09-17","H",160,5352]
["2020-09-17","H",161,5393]
["2020-09-17","H",162,5433]
["2020-09-17","H",163,5474]
["2020-09-17","H",164,5514]
["2020-09-17","H",165,5555]
["2020-09-17","H",166,5595]
["2020-09-17","H",167,5636]
["2020-09-17","H",168,5676]
["2020-09-17","H",169,5716]
["2020-09-17","H",170,5757]
["2020-09-17","H",171,5797]
["2020-09-17","H",172,5838]
["2020-09-17","H",173,5878]
["2020-09-17","H",174,5919]
["2020-09-17","H",175,5959]
["2020-09-17","H",176,6000]
["2020-09-17","H",177,6040]
["2020-09-17","H",178,6081]
["2020-09-17","H",179,6121]
["2020-09-17","H",180,6162]
["2020-09-17","H",181,6202]
["2020-09-17","H",182,6242]
["2020-09-17","H",183,6283]
["2020-09-17","H",184,6323]
["2020-09-17","H",185,6364]
["2020-09-17","H",186,6404]
["2020-09-17","H",187,6445]
["2020-09-17","H",188,6485]
["2020-09-17","H",189,6526]
["2020-09-17","H",190,6566]
["2020-09-17","H",191,6607]
["2020-09-17","H",192,6647]
["2020-09-17","H",193,6687]
["2020-09-17","H",194,6728]
["2020-09-17","H",195,6768]
["2020-09-17","H",196,6809]
["2020-09-17","H",197,6849]
["2020-09-17","H",198,6890]
["2020-09-17","H",199,6930]
["2020-09-17","H",200,6971]
["2020-09-17","I",1,40]
["2020-09-17","I",2,40]
["2020-09-17","I",3,134]
["2020-09-17","I",4,185]
["2020-09-17","I",5,232]
["2020-09-17","I",6,281]
["2020-09-17","I",7,329]
["2020-09-17","I",8,376]
["2020-09-17","I",9,420]
["2020-09-17","I",10,464]
["2020-09-17","I",11,509]
["2020-09-17","I",12,554]
["2020-09-17","I",13,598]
["2020-09-17","I",14,642]
["2020-09-17","I",15,686]
["2020-09-17","I",16,730]
["2020-09-17","I",17,774]
["2020-09-17","I",18,818]
["2020-09-17","I",19,862]
["2020-09-17","I",20,907]
["2020-09-17","I",21,943]
["2020-09-17","I",22,980]
["2020-09-17","I",23,1017]
["2020-09-17","I",24,1053]
["2020-09-17","I",25,1088]
["2020-09-17","I",26,1124]
["2020-09-17","I",27,1160]
["2020-09-17","I",28,1196]
["2020-09-17","I",29,1231]
["2020-09-17","I",30,1267]
["2020-09-17","I",31,1303]
["2020-09-17","I",32,1349]
["2020-09-17","I",33,1394]
["2020-09-17","I",34,1439]
["2020-09-17","I",35,1485]
["2020-09-17","I",36,1530]
["2020-09-17","I",37,1575]
["2020-09-17","I",38,1621]
["2020-09-17","I",39,1666]
["2020-09-17","I",40,1704]
["2020-09-17","I",41,1742]
["2020-09-17","I",42,1780]
["2020-09-17","I",43,1818]
["2020-09-17","I",44,1856]
["2020-09-17","I",45,1894]
["2020-09-17","I",46,1932]
["2020-09-17","I",47,1970]
["2020-09-17","I",48,2008]
["2020-09-17","I",49,2046]
["2020-09-17","I",50,2084]
["2020-09-17","I",51,2122]
["2020-09-17","I",52,2160]
["2020-09-17","I",53,2198]
["2020-09-17","I",54,2236]
["2020-09-17","I",55,2275]
["2020-09-17","I",56,2313]
["2020-09-17","I",57,2351]
["2020-09-17","I",58,2389]
["2020-09-17","I",59,2427]
["2020-09-17","I",60,2465]
["2020-09-17","I",61,2503]
["2020-09-17","I",62,2542]
["2020-09-17","I",63,2580]
["2020-09-17","I",64,2618]
["2020-09-17","I",65,2656]
["2020-09-17","I",66,2694]
["2020-09-17","I",67,2776]
["2020-09-17","I",68,2865]
["2020-09-17","I",69,2954]
["2020-09-17","I",70,3043]
["2020-09-17","I",71,3132]
["2020-09-17","I",72,3221]
["2020-09-17","I",73,3310]
["2020-09-17","I",74,3399]
["2020-09-17","I",75,3488]
["2020-09-17","I",76,3577]
["2020-09-17","I",77,3666]
["2020-09-17","I",78,3755]
["2020-09-17","I",79,3844]
["2020-09-17","I",80,3933]
["2020-09-17","I",81,4023]
["2020-09-17","I",82,4112]
["2020-09-17","I",83,4201]
["2020-09-17","I",84,4290]
["2020-09-17","I",85,4379]
["2020-09-17","I",86,4469]
["2020-09-17","I",87,4558]
["2020-09-17","I",88,4647]
["2020-09-17","I",89,4737]
["2020-09-17","I",90,4826]
["2020-09-17","I",91,4915]
["2020-09-17","I",92,5005]
["2020-09-17","I",93,5094]
["2020-09-17","I",94,5183]
["2020-09-17","I",95,5273]
["2020-09-17","I",96,5362]
["2020-09-17","I",97,5452]
["2020-09-17","I",98,5541]
["2020-09-17","I",99,5631]
["2020-09-17","I",100,5720]
["2020-09-17","I",101,5810]
["2020-09-17","I",102,5899]
["2020-09-17","I",103,5989]
["2020-09-17","I",104,6079]
["2020-09-17","I",105,6168]
["2020-09-17","I",106,6258]
["2020-09-17","I",107,6348]
["2020-09-17","I",108,6437]
["2020-09-17","I",109,6527]
["2020-09-17","I",110,6617]
["2020-09-17","I",111,6706]
["2020-09-17","I",112,6796]
["2020-09-17","I",113,6886]
["2020-09-17","I",114,6976]
["2020-09-17","I",115,7066]
["2020-09-17","I",116,7155]
["2020-09-17","I",117,7245]
["2020-09-17","I",118,7335]
["2020-09-17","I",119,7425]
["2020-09-17","I",120,7515]
["2020-09-17","I",121,7605]
["2020-09-17","I",122,7693]
["2020-09-17","I",123,7782]
["2020-09-17","I",124,7871]
["2020-09-17","I",125,7959]
["2020-09-17","I",126,8048]
["2020-09-17","I",127,8137]
["2020-09-17","I",128,8225]
["2020-09-17","I",129,8314]
["2020-09-17","I",130,8403]
["2020-09-17","I",131,8491]
["2020-09-17","I",132,8580]
["2020-09-17","I",133,8669]
["2020-09-17","I",134,8757]
["2020-09-17","I",135,8846]
["2020-09-17","I",136,8935]
["2020-09-17","I",137,9023]
["2020-09-17","I",138,9112]
["2020-09-17","I",139,9201]
["2020-09-17","I",140,9289]
["2020-09-17","I",141,9378]
["2020-09-17","I",142,9467]
["2020-09-17","I",143,9555]
["2020-09-17","I",144,9644]
["2020-09-17","I",145,9733]
["2020-09-17","I",146,9821]
["2020-09-17","I",147,9910]
["2020-09-17","I",148,9999]
["2020-09-17","I",149,10087]
["2020-09-17","I",150,10176]
["2020-09-17","I",151,10265]
["2020-09-17","I",152,10353]
["2020-09-17","I",153,10442]
["2020-09-17","I",154,10531]
["2020-09-17","I",155,10619]
["2020-09-17","I",156,10708]
["2020-09-17","I",157,10797]
["2020-09-17","I",158,10885]
["2020-09-17","I",159,10974]
["2020-09-17","I",160,11063]
["2020-09-17","I",161,11151]
["2020-09-17","I",162,11240]
["2020-09-17","I",163,11329]
["2020-09-17","I",164,11417]
["2020-09-17","I",165,11506]
["2020-09-17","I",166,11595]
["2020-09-17","I",167,11683]
["2020-09-17","I",168,11772]
["2020-09-17","I",169,11861]
["2020-09-17","I",170,11949]
["2020-09-17","I",171,12038]
["2020-09-17","I",172,12127]
["2020-09-17","I",173,12215]
["2020-09-17","I",174,12304]
["2020-09-17","I",175,12393]
["2020-09-17","I",176,12481]
["2020-09-17","I",177,12570]
["2020-09-17","I",178,12659]
["2020-09-17","I",179,12747]
["2020-09-17","I",180,12836]
["2020-09-17","I",181,12925]
["2020-09-17","I",182,13013]
["2020-09-17","I",183,13102]
["2020-09-17","I",184,13191]
["2020-09-17","I",185,13279]
["2020-09-17","I",186,13368]
["2020-09-17","I",187,13457]
["2020-09-17","I",188,13545]
["2020-09-17","I",189,13634]
["2020-09-17","I",190,13723]
["2020-09-17","I",191,13811]
["2020-09-17","I",192,13900]
["2020-09-17","I",193,13988]
["2020-09-17","I",194,14077]
["2020-09-17","I",195,14166]
["2020-09-17","I",196,14254]
["2020-09-17","I",197,14343]
["2020-09-17","I",198,14432]
["2020-09-17","I",199,14520]
["2020-09-17","I",200,14609]
["2020-09-17","J",1,80]
["2020-09-17","J",2,80]
["2020-09-17","J",3,95]
["2020-09-17","J",4,126]
["2020-09-17","J",5,156]
["2020-09-17","J",6,186]
["2020-09-17","J",7,218]
["2020-09-17","J",8,257]
["2020-09-17","J",9,293]
["2020-09-17","J",10,330]
["2020-09-17","J",11,367]
["2020-09-17","J",12,404]
["2020-09-17","J",13,440]
["2020-09-17","J",14,477]
["2020-09-17","J",15,514]
["2020-09-17","J",16,551]
["2020-09-17","J",17,587]
["2020-09-17","J",18,624]
["2020-09-17","J",19,661]
["2020-09-17","J",20,697]
["2020-09-17","J",21,742]
["2020-09-17","J",22,786]
["2020-09-17","J",23,830]
["2020-09-17","J",24,874]
["2020-09-17","J",25,917]
["2020-09-17","J",26,961]
["2020-09-17","J",27,1005]
["2020-09-17","J",28,1049]
["2020-09-17","J",29,1099]
["2020-09-17","J",30,1150]
["2020-09-17","J",31,1200]
["2020-09-17","J",32,1251]
["2020-09-17","J",33,1301]
["2020-09-17","J",34,1352]
["2020-09-17","J",35,1402]
["2020-09-17","J",36,1453]
["2020-09-17","J",37,1503]
["2020-09-17","J",38,1554]
["2020-09-17","J",39,1604]
["2020-09-17","J",40,1652]
["2020-09-17","J",41,1700]
["2020-09-17","J",42,1748]
["2020-09-17","J",43,1796]
["2020-09-17","J",44,1844]
["2020-09-17","J",45,1892]
["2020-09-17","J",46,1939]
["2020-09-17","J",47,1987]
["2020-09-17","J",48,2039]
["2020-09-17","J",49,2091]
["2020-09-17","J",50,2144]
["2020-09-17","J",51,2196]
["2020-09-17","J",52,2249]
["2020-09-17","J",53,2301]
["2020-09-17","J",54,2354]
["2020-09-17","J",55,2406]
["2020-09-17","J",56,2459]
["2020-09-17","J",57,2512]
["2020-09-17","J",58,2564]
["2020-09-17","J",59,2617]
["2020-09-17","J",60,2669]
["2020-09-17","J",61,2722]
["2020-09-17","J",62,2775]
["2020-09-17","J",63,2827]
["2020-09-17","J",64,2880]
["2020-09-17","J",65,2933]
["2020-09-17","J",66,2985]
["2020-09-17","J",67,3038]
["2020-09-17","J",68,3091]
["2020-09-17","J",69,3144]
["2020-09-17","J",70,3196]
["2020-09-17","J",71,3249]
["2020-09-17","J",72,3302]
["2020-09-17","J",73,3355]
["2020-09-17","J",74,3407]
["2020-09-17","J",75,3460]
["2020-09-17","J",76,3513]
["2020-09-17","J",77,3566]
["2020-09-17","J",78,3619]
["2020-09-17","J",79,3672]
["2020-09-17","J",80,3724]
["2020-09-17","J",81,3777]
["2020-09-17","J",82,3830]
["2020-09-17","J",83,3883]
["2020-09-17","J",84,3936]
["2020-09-17","J",85,3989]
["2020-09-17","J",86,4042]
["2020-09-17","J",87,4095]
["2020-09-17","J",88,4148]
["2020-09-17","J",89,4201]
["2020-09-17","J",90,4254]
["2020-09-17","J",91,4307]
["2020-09-17","J",92,4360]
["2020-09-17","J",93,4413]
["2020-09-17","J",94,4466]
["2020-09-17","J",95,4519]
["2020-09-17","J",96,4572]
["2020-09-17","J",97,4625]
["2020-09-17","J",98,4679]
["2020-09-17","J",99,4732]
["2020-09-17","J",100,4785]
["2020-09-17","J",101,4838]
["2020-09-17","J",102,4891]
["2020-09-17","J",103,4944]
["2020-09-17","J",104,4997]
["2020-09-17","J",105,5051]
["2020-09-17","J",106,5104]
["2020-09-17","J",107,5157]
["2020-09-17","J",108,5210]
["2020-09-17","J",109,5264]
["2020-09-17","J",110,5317]
["2020-09-17","J",111,5370]
["2020-09-17","J",112,5423]
["2020-09-17","J",113,5477]
["2020-09-17","J",114,5530]
["2020-09-17","J",115,5583]
["2020-09-17","J",116,5637]
["2020-09-17","J",117,5690]
["2020-09-17","J",118,5743]
["2020-09-17","J",119,5797]
["2020-09-17","J",120,5850]
["2020-09-17","J",121,5904]
["2020-09-17","J",122,5956]
["2020-09-17","J",123,6009]
["2020-09-17","J",124,6061]
["2020-09-17","J",125,6114]
["2020-09-17","J",126,6167]
["2020-09-17","J",127,6219]
["2020-09-17","J",128,6272]
["2020-09-17","J",129,6324]
["2020-09-17","J",130,6377]
["2020-09-17","J",131,6430]
["2020-09-17","J",132,6482]
["2020-09-17","J",133,6535]
["2020-09-17","J",134,6588]
["2020-09-17","J",135,6640]
["2020-09-17","J",136,6693]
["2020-09-17","J",137,6745]
["2020-09-17","J",138,6798]
["2020-09-17","J",139,6851]
["2020-09-17","J",140,6903]
["2020-09-17","J",141,6956]
["2020-09-17","J",142,7008]
["2020-09-17","J",143,7061]
["2020-09-17","J",144,7114]
["2020-09-17","J",145,7166]
["2020-09-17","J",146,7219]
["2020-09-17","J",147,7272]
["2020-09-17","J",148,7324]
["2020-09-17","J",149,7377]
["2020-09-17","J",150,7429]
["2020-09-17","J",151,7482]
["2020-09-17","J",152,7535]
["2020-09-17","J",153,7587]
["2020-09-17","J",154,7640]
["2020-09-17","J",155,7692]
["2020-09-17","J",156,7745]
["2020-09-17","J",157,7798]
["2020-09-17","J",158,7850]
["2020-09-17","J",159,7903]
["2020-09-17","J",160,7956]
["2020-09-17","J",161,8008]
["2020-09-17","J",162,8061]
["2020-09-17","J",163,8113]
["2020-09-17","J",164,8166]
["2020-09-17","J",165,8219]
["2020-09-17","J",166,8271]
["2020-09-17","J",167,8324]
["2020-09-17","J",168,8376]
["2020-09-17","J",169,8429]
["2020-09-17","J",170,8482]
["2020-09-17","J",171,8534]
["2020-09-17","J",172,8587]
["2020-09-17","J",173,8639]
["2020-09-17","J",174,8692]
["2020-09-17","J",175,8745]
["2020-09-17","J",176,8797]
["2020-09-17","J",177,8850]
["2020-09-17","J",178,8903]
["2020-09-17","J",179,8955]
["2020-09-17","J",180,9008]
["2020-09-17","J",181,9060]
["2020-09-17","J",182,9113]
["2020-09-17","J",183,9166]
["2020-09-17","J",184,9218]
["2020-09-17","J",185,9271]
["2020-09-17","J",186,9323]
["2020-09-17","J",187,9376]
["2020-09-17","J",188,9429]
["2020-09-17","J",189,9481]
["2020-09-17","J",190,9534]
["2020-09-17","J",191,9587]
["2020-09-17","J",192,9639]
["2020-09-17","J",193,9692]
["2020-09-17","J",194,9744]
["2020-09-17","J",195,9797]
["2020-09-17","J",196,9850]
["2020-09-17","J",197,9902]
["2020-09-17","J",198,9955]
["2020-09-17","J",199,10007]
["2020-09-17","J",200,10060]
["2020-09-17","K",1,120]
["2020-09-17","K",2,120]
["2020-09-17","K",3,186]
["2020-09-17","K",4,252]
["2020-09-17","K",5,314]
["2020-09-17","K",6,372]
["2020-09-17","K",7,433]
["2020-09-17","K",8,495]
["2020-09-17","K",9,550]
["2020-09-17","K",10,606]
["2020-09-17","K",11,663]
["2020-09-17","K",12,721]
["2020-09-17","K",13,779]
["2020-09-17","K",14,836]
["2020-09-17","K",15,894]
["2020-09-17","K",16,951]
["2020-09-17","K",17,1007]
["2020-09-17","K",18,1063]
["2020-09-17","K",19,1119]
["2020-09-17","K",20,1174]
["2020-09-17","K",21,1230]
["2020-09-17","K",22,1286]
["2020-09-17","K",23,1341]
["2020-09-17","K",24,1396]
["2020-09-17","K",25,1451]
["2020-09-17","K",26,1505]
["2020-09-17","K",27,1560]
["2020-09-17","K",28,1615]
["2020-09-17","K",29,1670]
["2020-09-17","K",30,1725]
["2020-09-17","K",31,1780]
["2020-09-17","K",32,1835]
["2020-09-17","K",33,1889]
["2020-09-17","K",34,1944]
["2020-09-17","K",35,1999]
["2020-09-17","K",36,2054]
["2020-09-17","K",37,2109]
["2020-09-17","K",38,2164]
["2020-09-17","K",39,2219]
["2020-09-17","K",40,2271]
["2020-09-17","K",41,2324]
["2020-09-17","K",42,2377]
["2020-09-17","K",43,2430]
["2020-09-17","K",44,2483]
["2020-09-17","K",45,2536]
["2020-09-17","K",46,2589]
["2020-09-17","K",47,2642]
["2020-09-17","K",48,2695]
["2020-09-17","K",49,2749]
["2020-09-17","K",50,2802]
["2020-09-17","K",51,2855]
["2020-09-17","K",52,2908]
["2020-09-17","K",53,2962]
["2020-09-17","K",54,3015]
["2020-09-17","K",55,3068]
["2020-09-17","K",56,3121]
["2020-09-17","K",57,3175]
["2020-09-17","K",58,3228]
["2020-09-17","K",59,3281]
["2020-09-17","K",60,3335]
["2020-09-17","K",61,3388]
["2020-09-17","K",62,3442]
["2020-09-17","K",63,3495]
["2020-09-17","K",64,3549]
["2020-09-17","K",65,3602]
["2020-09-17","K",66,3656]
["2020-09-17","K",67,3709]
["2020-09-17","K",68,3763]
["2020-09-17","K",69,3816]
["2020-09-17","K",70,3870]
["2020-09-17","K",71,3923]
["2020-09-17","K",72,3977]
["2020-09-17","K",73,4031]
["2020-09-17","K",74,4084]
["2020-09-17","K",75,4138]
["2020-09-17","K",76,4192]
["2020-09-17","K",77,4245]
["2020-09-17","K",78,4299]
["2020-09-17","K",79,4353]
["2020-09-17","K",80,4406]
["2020-09-17","K",81,4460]
["2020-09-17","K",82,4514]
["2020-09-17","K",83,4568]
["2020-09-17","K",84,4622]
["2020-09-17","K",85,4675]
["2020-09-17","K",86,4729]
["2020-09-17","K",87,4783]
["2020-09-17","K",88,4837]
["2020-09-17","K",89,4891]
["2020-09-17","K",90,4945]
["2020-09-17","K",91,4999]
["2020-09-17","K",92,5053]
["2020-09-17","K",93,5107]
["2020-09-17","K",94,5161]
["2020-09-17","K",95,5215]
["2020-09-17","K",96,5269]
["2020-09-17","K",97,5323]
["2020-09-17","K",98,5377]
["2020-09-17","K",99,5431]
["2020-09-17","K",100,5485]
["2020-09-17","K",101,5539]
["2020-09-17","K",102,5593]
["2020-09-17","K",103,5647]
["2020-09-17","K",104,5702]
["2020-09-17","K",105,5756]
["2020-09-17","K",106,5810]
["2020-09-17","K",107,5864]
["2020-09-17","K",108,5918]
["2020-09-17","K",109,5973]
["2020-09-17","K",110,6027]
["2020-09-17","K",111,6081]
["2020-09-17","K",112,6135]
["2020-09-17","K",113,6189]
["2020-09-17","K",114,6244]
["2020-09-17","K",115,6298]
["2020-09-17","K",116,6352]
["2020-09-17","K",117,6406]
["2020-09-17","K",118,6460]
["2020-09-17","K",119,6514]
["2020-09-17","K",120,6569]
["2020-09-17","K",121,6623]
["2020-09-17","K",122,6677]
["2020-09-17","K",123,6731]
["2020-09-17","K",124,6785]
["2020-09-17","K",125,6839]
["2020-09-17","K",126,6892]
["2020-09-17","K",127,6945]
["2020-09-17","K",128,6999]
["2020-09-17","K",129,7052]
["2020-09-17","K",130,7106]
["2020-09-17","K",131,7159]
["2020-09-17","K",132,7212]
["2020-09-17","K",133,7266]
["2020-09-17","K",134,7319]
["2020-09-17","K",135,7373]
["2020-09-17","K",136,7426]
["2020-09-17","K",137,7479]
["2020-09-17","K",138,7533]
["2020-09-17","K",139,7586]
["2020-09-17","K",140,7639]
["2020-09-17","K",141,7693]
["2020-09-17","K",142,7746]
["2020-09-17","K",143,7800]
["2020-09-17","K",144,7853]
["2020-09-17","K",145,7906]
["2020-09-17","K",146,7960]
["2020-09-17","K",147,8013]
["2020-09-17","K",148,8067]
["2020-09-17","K",149,8120]
["2020-09-17","K",150,8173]
["2020-09-17","K",151,8227]
["2020-09-17","K",152,8280]
["2020-09-17","K",153,8333]
["2020-09-17","K",154,8387]
["2020-09-17","K",155,8440]
["2020-09-17","K",156,8494]
["2020-09-17","K",157,8547]
["2020-09-17","K",158,8600]
["2020-09-17","K",159,8654]
["2020-09-17","K",160,8707]
["2020-09-17","K",161,8760]
["2020-09-17","K",162,8814]
["2020-09-17","K",163,8867]
["2020-09-17","K",164,8921]
["2020-09-17","K",165,8974]
["2020-09-17","K",166,9027]
["2020-09-17","K",167,9081]
["2020-09-17","K",168,9134]
["2020-09-17","K",169,9188]
["2020-09-17","K",170,9241]
["2020-09-17","K",171,9294]
["2020-09-17","K",172,9348]
["2020-09-17","K",173,9401]
["2020-09-17","K",174,9454]
["2020-09-17","K",175,9508]
["2020-09-17","K",176,9561]
["2020-09-17","K",177,9615]
["2020-09-17","K",178,9668]
["2020-09-17","K",179,9721]
["2020-09-17","K",180,9775]
["2020-09-17","K",181,9828]
["2020-09-17","K",182,9881]
["2020-09-17","K",183,9935]
["2020-09-17","K",184,9988]
["2020-09-17","K",185,10042]
["2020-09-17","K",186,10095]
["2020-09-17","K",187,10148]
["2020-09-17","K",188,10202]
["2020-09-17","K",189,10255]
["2020-09-17","K",190,10309]
["2020-09-17","K",191,10362]
["2020-09-17","K",192,10415]
["2020-09-17","K",193,10469]
["2020-09-17","K",194,10522]
["2020-09-17","K",195,10575]
["2020-09-17","K",196,10629]
["2020-09-17","K",197,10682]
["2020-09-17","K",198,10736]
["2020-09-17","K",199,10789]
["2020-09-17","K",200,10842]
["2022-09-30","A",1,80]
["2022-09-30","A",2,80]
["2022-09-30","A",3,95]
["2022-09-30","A",4,126]
["2022-09-30","A",5,156]
["2022-09-30","A",6,186]
["2022-09-30","A",7,218]
["2022-09-30","A",8,257]
["2022-09-30","A",9,293]
["2022-09-30","A",10,330]
["2022-09-30","A",11,367]
["2022-09-30","A",12,404]
["2022-09-30","A",13,440]
["2022-09-30","A",14,477]
["2022-09-30","A",15,514]
["2022-09-30","A",16,551]
["2022-09-30","A",17,587]
["2022-09-30","A",18,624]
["2022-09-30","A",19,661]
["2022-09-30","A",20,697]
["2022-09-30","A",21,742]
["2022-09-30","A",22,786]
["2022-09-30","A",23,830]
["2022-09-30","A",24,874]
["2022-09-30","A",25,917]
["2022-09-30","A",26,961]
["2022-09-30","A",27,1005]
["2022-09-30","A",28,1049]
["2022-09-30","A",29,1099]
["2022-09-30","A",30,1150]
["2022-09-30","A",31,1200]
["2022-09-30","A",32,1251]
["2022-09-30","A",33,1301]
["2022-09-30","A",34,1352]
["2022-09-30","A",35,1402]
["2022-09-30","A",36,1453]
["2022-09-30","A",37,1503]
["2022-09-30","A",38,1554]
["2022-09-30","A",39,1604]
["2022-09-30","A",40,1652]
["2022-09-30","A",41,1700]
["2022-09-30","A",42,1748]
["2022-09-30","A",43,1796]
["2022-09-30","A",44,1844]
["2022-09-30","A",45,1892]
["2022-09-30","A",46,1939]
["2022-09-30","A",47,1987]
["2022-09-30","A",48,2039]
["2022-09-30","A",49,2091]
["2022-09-30","A",50,2144]
["2022-09-30","A",51,2196]
["2022-09-30","A",52,2249]
["2022-09-30","A",53,2301]
["2022-09-30","A",54,2354]
["2022-09-30","A",55,2406]
["2022-09-30","A",56,2459]
["2022-09-30","A",57,2512]
["2022-09-30","A",58,2564]
["2022-09-30","A",59,2617]
["2022-09-30","A",60,2669]
["2022-09-30","A",61,2722]
["2022-09-30","A",62,2775]
["2022-09-30","A",63,2827]
["2022-09-30","A",64,2880]
["2022-09-30","A",65,2933]
["2022-09-30","A",66,2985]
["2022-09-30","A",67,3038]
["2022-09-30","A",68,3091]
["2022-09-30","A",69,3144]
["2022-09-30","A",70,3196]
["2022-09-30","A",71,3249]
["2022-09-30","A",72,3302]
["2022-09-30","A",73,3355]
["2022-09-30","A",74,3407]
["2022-09-30","A",75,3460]
["2022-09-30","A",76,3513]
["2022-09-30","A",77,3566]
["2022-09-30","A",78,3619]
["2022-09-30","A",79,3672]
["2022-09-30","A",80,3724]
["2022-09-30","A",81,3777]
["2022-09-30","A",82,3830]
["2022-09-30","A",83,3883]
["2022-09-30","A",84,3936]
["2022-09-30","A",85,3989]
["2022-09-30","A",86,4042]
["2022-09-30","A",87,4095]
["2022-09-30","A",88,4148]
["2022-09-30","A",89,4201]
["2022-09-30","A",90,4254]
["2022-09-30","A",91,4307]
["2022-09-30","A",92,4360]
["2022-09-30","A",93,4413]
["2022-09-30","A",94,4466]
["2022-09-30","A",95,4519]
["2022-09-30","A",96,4572]
["2022-09-30","A",97,4625]
["2022-09-30","A",98,4679]
["2022-09-30","A",99,4732]
["2022-09-30","A",100,4785]
["2022-09-30","A",101,4838]
["2022-09-30","A",102,4891]
["2022-09-30","A",103,4944]
["2022-09-30","A",104,4997]
["2022-09-30","A",105,5051]
["2022-09-30","A",106,5104]
["2022-09-30","A",107,5157]
["2022-09-30","A",108,5210]
["2022-09-30","A",109,5264]
["2022-09-30","A",110,5317]
["2022-09-30","A",111,5370]
["2022-09-30","A",112,5423]
["2022-09-30","A",113,5477]
["2022-09-30","A",114,5530]
["2022-09-30","A",115,5583]
["2022-09-30","A",116,5637]
["2022-09-30","A",117,5690]
["2022-09-30","A",118,5743]
["2022-09-30","A",119,5797]
["2022-09-30","A",120,5850]
["2022-09-30","A",121,5904]
["2022-09-30","A",122,5956]
["2022-09-30","A",123,6009]
["2022-09-30","A",124,6061]
["2022-09-30","A",125,6114]
["2022-09-30","A",126,6167]
["2022-09-30","A",127,6219]
["2022-09-30","A",128,6272]
["2022-09-30","A",129,6324]
["2022-09-30","A",130,6377]
["2022-09-30","A",131,6430]
["2022-09-30","A",132,6482]
["2022-09-30","A",133,6535]
["2022-09-30","A",134,6588]
["2022-09-30","A",135,6640]
["2022-09-30","A",136,6693]
["2022-09-30","A",137,6745]
["2022-09-30","A",138,6798]
["2022-09-30","A",139,6851]
["2022-09-30","A",140,6903]
["2022-09-30","A",141,6956]
["2022-09-30","A",142,7008]
["2022-09-30","A",143,7061]
["2022-09-30","A",144,7114]
["2022-09-30","A",145,7166]
["2022-09-30","A",146,7219]
["2022-09-30","A",147,7272]
["2022-09-30","A",148,7324]
["2022-09-30","A",149,7377]
["2022-09-30","A",150,7429]
["2022-09-30","A",151,7482]
["2022-09-30","A",152,7535]
["2022-09-30","A",153,7587]
["2022-09-30","A",154,7640]
["2022-09-30","A",155,7692]
["2022-09-30","A",156,7745]
["2022-09-30","A",157,7798]
["2022-09-30","A",158,7850]
["2022-09-30","A",159,7903]
["2022-09-30","A",160,7956]
["2022-09-30","A",161,8008]
["2022-09-30","A",162,8061]
["2022-09-30","A",163,8113]
["2022-09-30","A",164,8166]
["2022-09-30","A",165,8219]
["2022-09-30","A",166,8271]
["2022-09-30","A",167,8324]
["2022-09-30","A",168,8376]
["2022-09-30","A",169,8429]
["2022-09-30","A",170,8482]
["2022-09-30","A",171,8534]
["2022-09-30","A",172,8587]
["2022-09-30","A",173,8639]
["2022-09-30","A",174,8692]
["2022-09-30","A",175,8745]
["2022-09-30","A",176,8797]
["2022-09-30","A",177,8850]
["2022-09-30","A",178,8903]
["2022-09-30","A",179,8955]
["2022-09-30","A",180,9008]
["2022-09-30","A",181,9060]
["2022-09-30","A",182,9113]
["2022-09-30","A",183,9166]
["2022-09-30","A",184,9218]
["2022-09-30","A",185,9271]
["2022-09-30","A",186,9323]
["2022-09-30","A",187,9376]
["2022-09-30","A",188,9429]
["2022-09-30","A",189,9481]
["2022-09-30","A",190,9534]
["2022-09-30","A",191,9587]
["2022-09-30","A",192,9639]
["2022-09-30","A",193,9692]
["2022-09-30","A",194,9744]
["2022-09-30","A",195,9797]
["2022-09-30","A",196,9850]
["2022-09-30","A",197,9902]
["2022-09-30","A",198,9955]
["2022-09-30","A",199,10007]
["2022-09-30","A",200,10060]
["2022-09-30","B",1,70]
["2022-09-30","B",2,70]
["2022-09-30","B",3,105]
["2022-09-30","B",4,139]
["2022-09-30","B",5,170]
["2022-09-30","B",6,203]
["2022-09-30","B",7,238]
["2022-09-30","B",8,274]
["2022-09-30","B",9,306]
["2022-09-30","B",10,338]
["2022-09-30","B",11,370]
["2022-09-30","B",12,402]
["2022-09-30","B",13,434]
["2022-09-30","B",14,465]
["2022-09-30","B",15,497]
["2022-09-30","B",16,535]
["2022-09-30","B",17,573]
["2022-09-30","B",18,611]
["2022-09-30","B",19,649]
["2022-09-30","B",20,687]
["2022-09-30","B",21,722]
["2022-09-30","B",22,757]
["2022-09-30","B",23,792]
["2022-09-30","B",24,826]
["2022-09-30","B",25,860]
["2022-09-30","B",26,895]
["2022-09-30","B",27,935]
["2022-09-30","B",28,975]
["2022-09-30","B",29,1016]
["2022-09-30","B",30,1057]
["2022-09-30","B",31,1098]
["2022-09-30","B",32,1138]
["2022-09-30","B",33,1179]
["2022-09-30","B",34,1220]
["2022-09-30","B",35,1261]
["2022-09-30","B",36,1302]
["2022-09-30","B",37,1348]
["2022-09-30","B",38,1395]
["2022-09-30","B",39,1441]
["2022-09-30","B",40,1484]
["2022-09-30","B",41,1527]
["2022-09-30","B",42,1570]
["2022-09-30","B",43,1613]
["2022-09-30","B",44,1656]
["2022-09-30","B",45,1699]
["2022-09-30","B",46,1742]
["2022-09-30","B",47,1785]
["2022-09-30","B",48,1828]
["2022-09-30","B",49,1871]
["2022-09-30","B",50,1914]
["2022-09-30","B",51,1957]
["2022-09-30","B",52,2000]
["2022-09-30","B",53,2043]
["2022-09-30","B",54,2086]
["2022-09-30","B",55,2129]
["2022-09-30","B",56,2172]
["2022-09-30","B",57,2215]
["2022-09-30","B",58,2258]
["2022-09-30","B",59,2301]
["2022-09-30","B",60,2345]
["2022-09-30","B",61,2388]
["2022-09-30","B",62,2431]
["2022-09-30","B",63,2474]
["2022-09-30","B",64,2517]
["2022-09-30","B",65,2561]
["2022-09-30","B",66,2604]
["2022-09-30","B",67,2647]
["2022-09-30","B",68,2690]
["2022-09-30","B",69,2734]
["2022-09-30","B",70,2777]
["2022-09-30","B",71,2820]
["2022-09-30","B",72,2864]
["2022-09-30","B",73,2907]
["2022-09-30","B",74,2950]
["2022-09-30","B",75,2994]
["2022-09-30","B",76,3037]
["2022-09-30","B",77,3080]
["2022-09-30","B",78,3124]
["2022-09-30","B",79,3167]
["2022-09-30","B",80,3211]
["2022-09-30","B",81,3254]
["2022-09-30","B",82,3297]
["2022-09-30","B",83,3341]
["2022-09-30","B",84,3384]
["2022-09-30","B",85,3428]
["2022-09-30","B",86,3471]
["2022-09-30","B",87,3515]
["2022-09-30","B",88,3558]
["2022-09-30","B",89,3602]
["2022-09-30","B",90,3645]
["2022-09-30","B",91,3689]
["2022-09-30","B",92,3733]
["2022-09-30","B",93,3776]
["2022-09-30","B",94,3820]
["2022-09-30","B",95,3863]
["2022-09-30","B",96,3907]
["2022-09-30","B",97,3951]
["2022-09-30","B",98,3994]
["2022-09-30","B",99,4038]
["2022-09-30","B",100,4082]
["2022-09-30","B",101,4125]
["2022-09-30","B",102,4169]
["2022-09-30","B",103,4213]
["2022-09-30","B",104,4257]
["2022-09-30","B",105,4300]
["2022-09-30","B",106,4344]
["2022-09-30","B",107,4388]
["2022-09-30","B",108,4432]
["2022-09-30","B",109,4475]
["2022-09-30","B",110,4519]
["2022-09-30","B",111,4563]
["2022-09-30","B",112,4607]
["2022-09-30","B",113,4650]
["2022-09-30","B",114,4694]
["2022-09-30","B",115,4738]
["2022-09-30","B",116,4782]
["2022-09-30","B",117,4826]
["2022-09-30","B",118,4869]
["2022-09-30","B",119,4913]
["2022-09-30","B",120,4957]
["2022-09-30","B",121,5001]
["2022-09-30","B",122,5044]
["2022-09-30","B",123,5088]
["2022-09-30","B",124,5131]
["2022-09-30","B",125,5175]
["2022-09-30","B",126,5218]
["2022-09-30","B",127,5261]
["2022-09-30","B",128,5304]
["2022-09-30","B",129,5347]
["2022-09-30","B",130,5390]
["2022-09-30","B",131,5433]
["2022-09-30","B",132,5476]
["2022-09-30","B",133,5520]
["2022-09-30","B",134,5563]
["2022-09-30","B",135,5606]
["2022-09-30","B",136,5649]
["2022-09-30","B",137,5692]
["2022-09-30","B",138,5735]
["2022-09-30","B",139,5778]
["2022-09-30","B",140,5821]
["2022-09-30","B",141,5864]
["2022-09-30","B",142,5908]
["2022-09-30","B",143,5951]
["2022-09-30","B",144,5994]
["2022-09-30","B",145,6037]
["2022-09-30","B",146,6080]
["2022-09-30","B",147,6123]
["2022-09-30","B",148,6166]
["2022-09-30","B",149,6209]
["2022-09-30","B",150,6252]
["2022-09-30","B",151,6296]
["2022-09-30","B",152,6339]
["2022-09-30","B",153,6382]
["2022-09-30","B",154,6425]
["2022-09-30","B",155,6468]
["2022-09-30","B",156,6511]
["2022-09-30","B",157,6554]
["2022-09-30","B",158,6597]
["2022-09-30","B",159,6641]
["2022-09-30","B",160,6684]
["2022-09-30","B",161,6727]
["2022-09-30","B",162,6770]
["2022-09-30","B",163,6813]
["2022-09-30","B",164,6856]
["2022-09-30","B",165,6899]
["2022-09-30","B",166,6942]
["2022-09-30","B",167,6985]
["2022-09-30","B",168,7029]
["2022-09-30","B",169,7072]
["2022-09-30","B",170,7115]
["2022-09-30","B",171,7158]
["2022-09-30","B",172,7201]
["2022-09-30","B",173,7244]
["2022-09-30","B",174,7287]
["2022-09-30","B",175,7330]
["2022-09-30","B",176,7373]
["2022-09-30","B",177,7417]
["2022-09-30","B",178,7460]
["2022-09-30","B",179,7503]
["2022-09-30","B",180,7546]
["2022-09-30","B",181,7589]
["2022-09-30","B",182,7632]
["2022-09-30","B",183,7675]
["2022-09-30","B",184,7718]
["2022-09-30","B",185,7762]
["2022-09-30","B",186,7805]
["2022-09-30","B",187,7848]
["2022-09-30","B",188,7891]
["2022-09-30","B",189,7934]
["2022-09-30","B",190,7977]
["2022-09-30","B",191,8020]
["2022-09-30","B",192,8063]
["2022-09-30","B",193,8106]
["2022-09-30","B",194,8150]
["2022-09-30","B",195,8193]
["2022-09-30","B",196,8236]
["2022-09-30","B",197,8279]
["2022-09-30","B",198,8322]
["2022-09-30","B",199,8365]
["2022-09-30","B",200,8408]
["2022-09-30","C",1,40]
["2022-09-30","C",2,40]
["2022-09-30","C",3,81]
["2022-09-30","C",4,120]
["2022-09-30","C",5,157]
["2022-09-30","C",6,193]
["2022-09-30","C",7,230]
["2022-09-30","C",8,267]
["2022-09-30","C",9,301]
["2022-09-30","C",10,339]
["2022-09-30","C",11,378]
["2022-09-30","C",12,417]
["2022-09-30","C",13,455]
["2022-09-30","C",14,493]
["2022-09-30","C",15,531]
["2022-09-30","C",16,569]
["2022-09-30","C",17,607]
["2022-09-30","C",18,646]
["2022-09-30","C",19,684]
["2022-09-30","C",20,722]
["2022-09-30","C",21,753]
["2022-09-30","C",22,785]
["2022-09-30","C",23,819]
["2022-09-30","C",24,857]
["2022-09-30","C",25,894]
["2022-09-30","C",26,931]
["2022-09-30","C",27,967]
["2022-09-30","C",28,1004]
["2022-09-30","C",29,1041]
["2022-09-30","C",30,1077]
["2022-09-30","C",31,1114]
["2022-09-30","C",32,1151]
["2022-09-30","C",33,1187]
["2022-09-30","C",34,1224]
["2022-09-30","C",35,1262]
["2022-09-30","C",36,1303]
["2022-09-30","C",37,1345]
["2022-09-30","C",38,1386]
["2022-09-30","C",39,1428]
["2022-09-30","C",40,1444]
["2022-09-30","C",41,1461]
["2022-09-30","C",42,1477]
["2022-09-30","C",43,1494]
["2022-09-30","C",44,1511]
["2022-09-30","C",45,1527]
["2022-09-30","C",46,1544]
["2022-09-30","C",47,1560]
["2022-09-30","C",48,1577]
["2022-09-30","C",49,1594]
["2022-09-30","C",50,1610]
["2022-09-30","C",51,1627]
["2022-09-30","C",52,1644]
["2022-09-30","C",53,1660]
["2022-09-30","C",54,1677]
["2022-09-30","C",55,1694]
["2022-09-30","C",56,1710]
["2022-09-30","C",57,1727]
["2022-09-30","C",58,1744]
["2022-09-30","C",59,1760]
["2022-09-30","C",60,1777]
["2022-09-30","C",61,1794]
["2022-09-30","C",62,1811]
["2022-09-30","C",63,1827]
["2022-09-30","C",64,1844]
["2022-09-30","C",65,1861]
["2022-09-30","C",66,1877]
["2022-09-30","C",67,1894]
["2022-09-30","C",68,1911]
["2022-09-30","C",69,1927]
["2022-09-30","C",70,1944]
["2022-09-30","C",71,1961]
["2022-09-30","C",72,1978]
["2022-09-30","C",73,1994]
["2022-09-30","C",74,2016]
["2022-09-30","C",75,2040]
["2022-09-30","C",76,2064]
["2022-09-30","C",77,2089]
["2022-09-30","C",78,2113]
["2022-09-30","C",79,2137]
["2022-09-30","C",80,2161]
["2022-09-30","C",81,2185]
["2022-09-30","C",82,2210]
["2022-09-30","C",83,2234]
["2022-09-30","C",84,2258]
["2022-09-30","C",85,2282]
["2022-09-30","C",86,2307]
["2022-09-30","C",87,2331]
["2022-09-30","C",88,2355]
["2022-09-30","C",89,2379]
["2022-09-30","C",90,2404]
["2022-09-30","C",91,2428]
["2022-09-30","C",92,2452]
["2022-09-30","C",93,2477]
["2022-09-30","C",94,2501]
["2022-09-30","C",95,2525]
["2022-09-30","C",96,2549]
["2022-09-30","C",97,2574]
["2022-09-30","C",98,2598]
["2022-09-30","C",99,2622]
["2022-09-30","C",100,2647]
["2022-09-30","C",101,2671]
["2022-09-30","C",102,2695]
["2022-09-30","C",103,2720]
["2022-09-30","C",104,2744]
["2022-09-30","C",105,2768]
["2022-09-30","C",106,2793]
["2022-09-30","C",107,2817]
["2022-09-30","C",108,2841]
["2022-09-30","C",109,2866]
["2022-09-30","C",110,2890]
["2022-09-30","C",111,2914]
["2022-09-30","C",112,2939]
["2022-09-30","C",113,2963]
["2022-09-30","C",114,2987]
["2022-09-30","C",115,3012]
["2022-09-30","C",116,3036]
["2022-09-30","C",117,3060]
["2022-09-30","C",118,3085]
["2022-09-30","C",119,3109]
["2022-09-30","C",120,3133]
["2022-09-30","C",121,3158]
["2022-09-30","C",122,3182]
["2022-09-30","C",123,3206]
["2022-09-30","C",124,3230]
["2022-09-30","C",125,3254]
["2022-09-30","C",126,3278]
["2022-09-30","C",127,3302]
["2022-09-30","C",128,3326]
["2022-09-30","C",129,3350]
["2022-09-30","C",130,3374]
["2022-09-30","C",131,3398]
["2022-09-30","C",132,3422]
["2022-09-30","C",133,3446]
["2022-09-30","C",134,3470]
["2022-09-30","C",135,3494]
["2022-09-30","C",136,3518]
["2022-09-30","C",137,3542]
["2022-09-30","C",138,3566]
["2022-09-30","C",139,3590]
["2022-09-30","C",140,3614]
["2022-09-30","C",141,3638]
["2022-09-30","C",142,3662]
["2022-09-30","C",143,3686]
["2022-09-30","C",144,3709]
["2022-09-30","C",145,3733]
["2022-09-30","C",146,3757]
["2022-09-30","C",147,3781]
["2022-09-30","C",148,3805]
["2022-09-30","C",149,3829]
["2022-09-30","C",150,3853]
["2022-09-30","C",151,3877]
["2022-09-30","C",152,3901]
["2022-09-30","C",153,3925]
["2022-09-30","C",154,3949]
["2022-09-30","C",155,3973]
["2022-09-30","C",156,3997]
["2022-09-30","C",157,4021]
["2022-09-30","C",158,4045]
["2022-09-30","C",159,4069]
["2022-09-30","C",160,4093]
["2022-09-30","C",161,4117]
["2022-09-30","C",162,4141]
["2022-09-30","C",163,4165]
["2022-09-30","C",164,4189]
["2022-09-30","C",165,4213]
["2022-09-30","C",166,4237]
["2022-09-30","C",167,4261]
["2022-09-30","C",168,4285]
["2022-09-30","C",169,4309]
["2022-09-30","C",170,4333]
["2022-09-30","C",171,4357]
["2022-09-30","C",172,4380]
["2022-09-30","C",173,4404]
["2022-09-30","C",174,4428]
["2022-09-30","C",175,4452]
["2022-09-30","C",176,4476]
["2022-09-30","C",177,4500]
["2022-09-30","C",178,4524]
["2022-09-30","C",179,4548]
["2022-09-30","C",180,4572]
["2022-09-30","C",181,4596]
["2022-09-30","C",182,4620]
["2022-09-30","C",183,4644]
["2022-09-30","C",184,4668]
["2022-09-30","C",185,4692]
["2022-09-30","C",186,4716]
["2022-09-30","C",187,4740]
["2022-09-30","C",188,4764]
["2022-09-30","C",189,4788]
["2022-09-30","C",190,4812]
["2022-09-30","C",191,4836]
["2022-09-30","C",192,4860]
["2022-09-30","C",193,4884]
["2022-09-30","C",194,4908]
["2022-09-30","C",195,4932]
["2022-09-30","C",196,4956]
["2022-09-30","C",197,4980]
["2022-09-30","C",198,5004]
["2022-09-30","C",199,5028]
["2022-09-30","C",200,5051]
["2022-09-30","D",1,80]
["2022-09-30","D",2,80]
["2022-09-30","D",3,95]
["2022-09-30","D",4,126]
["2022-09-30","D",5,156]
["2022-09-30","D",6,186]
["2022-09-30","D",7,218]
["2022-09-30","D",8,257]
["2022-09-30","D",9,293]
["2022-09-30","D",10,330]
["2022-09-30","D",11,367]
["2022-09-30","D",12,404]
["2022-09-30","D",13,440]
["2022-09-30","D",14,477]
["2022-09-30","D",15,514]
["2022-09-30","D",16,551]
["2022-09-30","D",17,587]
["2022-09-30","D",18,624]
["2022-09-30","D",19,661]
["2022-09-30","D",20,697]
["2022-09-30","D",21,742]
["2022-09-30","D",22,786]
["2022-09-30","D",23,830]
["2022-09-30","D",24,874]
["2022-09-30","D",25,917]
["2022-09-30","D",26,961]
["2022-09-30","D",27,1005]
["2022-09-30","D",28,1049]
["2022-09-30","D",29,1099]
["2022-09-30","D",30,1150]
["2022-09-30","D",31,1200]
["2022-09-30","D",32,1251]
["2022-09-30","D",33,1301]
["2022-09-30","D",34,1352]
["2022-09-30","D",35,1402]
["2022-09-30","D",36,1453]
["2022-09-30","D",37,1503]
["2022-09-30","D",38,1554]
["2022-09-30","D",39,1604]
["2022-09-30","D",40,1652]
["2022-09-30","D",41,1700]
["2022-09-30","D",42,1748]
["2022-09-30","D",43,1796]
["2022-09-30","D",44,1844]
["2022-09-30","D",45,1892]
["2022-09-30","D",46,1939]
["2022-09-30","D",47,1987]
["2022-09-30","D",48,2039]
["2022-09-30","D",49,2091]
["2022-09-30","D",50,2144]
["2022-09-30","D",51,2196]
["2022-09-30","D",52,2249]
["2022-09-30","D",53,2301]
["2022-09-30","D",54,2354]
["2022-09-30","D",55,2406]
["2022-09-30","D",56,2459]
["2022-09-30","D",57,2512]
["2022-09-30","D",58,2564]
["2022-09-30","D",59,2617]
["2022-09-30","D",60,2669]
["2022-09-30","D",61,2722]
["2022-09-30","D",62,2775]
["2022-09-30","D",63,2827]
["2022-09-30","D",64,2880]
["2022-09-30","D",65,2933]
["2022-09-30","D",66,2985]
["2022-09-30","D",67,3038]
["2022-09-30","D",68,3091]
["2022-09-30","D",69,3144]
["2022-09-30","D",70,3196]
["2022-09-30","D",71,3249]
["2022-09-30","D",72,3302]
["2022-09-30","D",73,3355]
["2022-09-30","D",74,3407]
["2022-09-30","D",75,3460]
["2022-09-30","D",76,3513]
["2022-09-30","D",77,3566]
["2022-09-30","D",78,3619]
["2022-09-30","D",79,3672]
["2022-09-30","D",80,3724]
["2022-09-30","D",81,3777]
["2022-09-30","D",82,3830]
["2022-09-30","D",83,3883]
["2022-09-30","D",84,3936]
["2022-09-30","D",85,3989]
["2022-09-30","D",86,4042]
["2022-09-30","D",87,4095]
["2022-09-30","D",88,4148]
["2022-09-30","D",89,4201]
["2022-09-30","D",90,4254]
["2022-09-30","D",91,4307]
["2022-09-30","D",92,4360]
["2022-09-30","D",93,4413]
["2022-09-30","D",94,4466]
["2022-09-30","D",95,4519]
["2022-09-30","D",96,4572]
["2022-09-30","D",97,4625]
["2022-09-30","D",98,4679]
["2022-09-30","D",99,4732]
["2022-09-30","D",100,4785]
["2022-09-30","D",101,4838]
["2022-09-30","D",102,4891]
["2022-09-30","D",103,4944]
["2022-09-30","D",104,4997]
["2022-09-30","D",105,5051]
["2022-09-30","D",106,5104]
["2022-09-30","D",107,5157]
["2022-09-30","D",108,5210]
["2022-09-30","D",109,5264]
["2022-09-30","D",110,5317]
["2022-09-30","D",111,5370]
["2022-09-30","D",112,5423]
["2022-09-30","D",113,5477]
["2022-09-30","D",114,5530]
["2022-09-30","D",115,5583]
["2022-09-30","D",116,5637]
["2022-09-30","D",117,5690]
["2022-09-30","D",118,5743]
["2022-09-30","D",119,5797]
["2022-09-30","D",120,5850]
["2022-09-30","D",121,5904]
["2022-09-30","D",122,5956]
["2022-09-30","D",123,6009]
["2022-09-30","D",124,6061]
["2022-09-30","D",125,6114]
["2022-09-30","D",126,6167]
["2022-09-30","D",127,6219]
["2022-09-30","D",128,6272]
["2022-09-30","D",129,6324]
["2022-09-30","D",130,6377]
["2022-09-30","D",131,6430]
["2022-09-30","D",132,6482]
["2022-09-30","D",133,6535]
["2022-09-30","D",134,6588]
["2022-09-30","D",135,6640]
["2022-09-30","D",136,6693]
["2022-09-30","D",137,6745]
["2022-09-30","D",138,6798]
["2022-09-30","D",139,6851]
["2022-09-30","D",140,6903]
["2022-09-30","D",141,6956]
["2022-09-30","D",142,7008]
["2022-09-30","D",143,7061]
["2022-09-30","D",144,7114]
["2022-09-30","D",145,7166]
["2022-09-30","D",146,7219]
["2022-09-30","D",147,7272]
["2022-09-30","D",148,7324]
["2022-09-30","D",149,7377]
["2022-09-30","D",150,7429]
["2022-09-30","D",151,7482]
["2022-09-30","D",152,7535]
["2022-09-30","D",153,7587]
["2022-09-30","D",154,7640]
["2022-09-30","D",155,7692]
["2022-09-30","D",156,7745]
["2022-09-30","D",157,7798]
["2022-09-30","D",158,7850]
["2022-09-30","D",159,7903]
["2022-09-30","D",160,7956]
["2022-09-30","D",161,8008]
["2022-09-30","D",162,8061]
["2022-09-30","D",163,8113]
["2022-09-30","D",164,8166]
["2022-09-30","D",165,8219]
["2022-09-30","D",166,8271]
["2022-09-30","D",167,8324]
["2022-09-30","D",168,8376]
["2022-09-30","D",169,8429]
["2022-09-30","D",170,8482]
["2022-09-30","D",171,8534]
["2022-09-30","D",172,8587]
["2022-09-30","D",173,8639]
["2022-09-30","D",174,8692]
["2022-09-30","D",175,8745]
["2022-09-30","D",176,8797]
["2022-09-30","D",177,8850]
["2022-09-30","D",178,8903]
["2022-09-30","D",179,8955]
["2022-09-30","D",180,9008]
["2022-09-30","D",181,9060]
["2022-09-30","D",182,9113]
["2022-09-30","D",183,9166]
["2022-09-30","D",184,9218]
["2022-09-30","D",185,9271]
["2022-09-30","D",186,9323]
["2022-09-30","D",187,9376]
["2022-09-30","D",188,9429]
["2022-09-30","D",189,9481]
["2022-09-30","D",190,9534]
["2022-09-30","D",191,9587]
["2022-09-30","D",192,9639]
["2022-09-30","D",193,9692]
["2022-09-30","D",194,9744]
["2022-09-30","D",195,9797]
["2022-09-30","D",196,9850]
["2022-09-30","D",197,9902]
["2022-09-30","D",198,9955]
["2022-09-30","D",199,10007]
["2022-09-30","D",200,10060]
["2022-09-30","E",1,40]
["2022-09-30","E",2,40]
["2022-09-30","E",3,120]
["2022-09-30","E",4,158]
["2022-09-30","E",5,195]
["2022-09-30","E",6,229]
["2022-09-30","E",7,265]
["2022-09-30","E",8,301]
["2022-09-30","E",9,333]
["2022-09-30","E",10,365]
["2022-09-30","E",11,399]
["2022-09-30","E",12,433]
["2022-09-30","E",13,467]
["2022-09-30","E",14,500]
["2022-09-30","E",15,532]
["2022-09-30","E",16,565]
["2022-09-30","E",17,598]
["2022-09-30","E",18,646]
["2022-09-30","E",19,696]
["2022-09-30","E",20,746]
["2022-09-30","E",21,787]
["2022-09-30","E",22,828]
["2022-09-30","E",23,868]
["2022-09-30","E",24,908]
["2022-09-30","E",25,948]
["2022-09-30","E",26,988]
["2022-09-30","E",27,1028]
["2022-09-30","E",28,1068]
["2022-09-30","E",29,1108]
["2022-09-30","E",30,1148]
["2022-09-30","E",31,1188]
["2022-09-30","E",32,1228]
["2022-09-30","E",33,1268]
["2022-09-30","E",34,1308]
["2022-09-30","E",35,1347]
["2022-09-30","E",36,1435]
["2022-09-30","E",37,1526]
["2022-09-30","E",38,1617]
["2022-09-30","E",39,1708]
["2022-09-30","E",40,1745]
["2022-09-30","E",41,1782]
["2022-09-30","E",42,1820]
["2022-09-30","E",43,1857]
["2022-09-30","E",44,1895]
["2022-09-30","E",45,1932]
["2022-09-30","E",46,1970]
["2022-09-30","E",47,2007]
["2022-09-30","E",48,2045]
["2022-09-30","E",49,2082]
["2022-09-30","E",50,2120]
["2022-09-30","E",51,2158]
["2022-09-30","E",52,2195]
["2022-09-30","E",53,2233]
["2022-09-30","E",54,2271]
["2022-09-30","E",55,2308]
["2022-09-30","E",56,2346]
["2022-09-30","E",57,2384]
["2022-09-30","E",58,2422]
["2022-09-30","E",59,2459]
["2022-09-30","E",60,2497]
["2022-09-30","E",61,2535]
["2022-09-30","E",62,2572]
["2022-09-30","E",63,2610]
["2022-09-30","E",64,2648]
["2022-09-30","E",65,2686]
["2022-09-30","E",66,2723]
["2022-09-30","E",67,2761]
["2022-09-30","E",68,2799]
["2022-09-30","E",69,2836]
["2022-09-30","E",70,2874]
["2022-09-30","E",71,2912]
["2022-09-30","E",72,2950]
["2022-09-30","E",73,2987]
["2022-09-30","E",74,3025]
["2022-09-30","E",75,3063]
["2022-09-30","E",76,3101]
["2022-09-30","E",77,3138]
["2022-09-30","E",78,3176]
["2022-09-30","E",79,3214]
["2022-09-30","E",80,3251]
["2022-09-30","E",81,3289]
["2022-09-30","E",82,3327]
["2022-09-30","E",83,3365]
["2022-09-30","E",84,3402]
["2022-09-30","E",85,3440]
["2022-09-30","E",86,3478]
["2022-09-30","E",87,3516]
["2022-09-30","E",88,3553]
["2022-09-30","E",89,3591]
["2022-09-30","E",90,3629]
["2022-09-30","E",91,3666]
["2022-09-30","E",92,3704]
["2022-09-30","E",93,3742]
["2022-09-30","E",94,3780]
["2022-09-30","E",95,3817]
["2022-09-30","E",96,3855]
["2022-09-30","E",97,3893]
["2022-09-30","E",98,3930]
["2022-09-30","E",99,3968]
["2022-09-30","E",100,4006]
["2022-09-30","E",101,4044]
["2022-09-30","E",102,4081]
["2022-09-30","E",103,4119]
["2022-09-30","E",104,4157]
["2022-09-30","E",105,4195]
["2022-09-30","E",106,4232]
["2022-09-30","E",107,4270]
["2022-09-30","E",108,4308]
["2022-09-30","E",109,4345]
["2022-09-30","E",110,4383]
["2022-09-30","E",111,4421]
["2022-09-30","E",112,4459]
["2022-09-30","E",113,4496]
["2022-09-30","E",114,4534]
["2022-09-30","E",115,4572]
["2022-09-30","E",116,4610]
["2022-09-30","E",117,4647]
["2022-09-30","E",118,4685]
["2022-09-30","E",119,4723]
["2022-09-30","E",120,4760]
["2022-09-30","E",121,4798]
["2022-09-30","E",122,4836]
["2022-09-30","E",123,4874]
["2022-09-30","E",124,4911]
["2022-09-30","E",125,4949]
["2022-09-30","E",126,4987]
["2022-09-30","E",127,5025]
["2022-09-30","E",128,5062]
["2022-09-30","E",129,5100]
["2022-09-30","E",130,5138]
["2022-09-30","E",131,5175]
["2022-09-30","E",132,5213]
["2022-09-30","E",133,5251]
["2022-09-30","E",134,5289]
["2022-09-30","E",135,5326]
["2022-09-30","E",136,5364]
["2022-09-30","E",137,5402]
["2022-09-30","E",138,5439]
["2022-09-30","E",139,5477]
["2022-09-30","E",140,5515]
["2022-09-30","E",141,5553]
["2022-09-30","E",142,5590]
["2022-09-30","E",143,5628]
["2022-09-30","E",144,5666]
["2022-09-30","E",145,5704]
["2022-09-30","E",146,5741]
["2022-09-30","E",147,5779]
["2022-09-30","E",148,5817]
["2022-09-30","E",149,5854]
["2022-09-30","E",150,5892]
["2022-09-30","E",151,5930]
["2022-09-30","E",152,5968]
["2022-09-30","E",153,6005]
["2022-09-30","E",154,6043]
["2022-09-30","E",155,6081]
["2022-09-30","E",156,6119]
["2022-09-30","E",157,6156]
["2022-09-30","E",158,6194]
["2022-09-30","E",159,6232]
["2022-09-30","E",160,6269]
["2022-09-30","E",161,6307]
["2022-09-30","E",162,6345]
["2022-09-30","E",163,6383]
["2022-09-30","E",164,6420]
["2022-09-30","E",165,6458]
["2022-09-30","E",166,6496]
["2022-09-30","E",167,6534]
["2022-09-30","E",168,6571]
["2022-09-30","E",169,6609]
["2022-09-30","E",170,6647]
["2022-09-30","E",171,6684]
["2022-09-30","E",172,6722]
["2022-09-30","E",173,6760]
["2022-09-30","E",174,6798]
["2022-09-30","E",175,6835]
["2022-09-30","E",176,6873]
["2022-09-30","E",177,6911]
["2022-09-30","E",178,6948]
["2022-09-30","E",179,6986]
["2022-09-30","E",180,7024]
["2022-09-30","E",181,7062]
["2022-09-30","E",182,7099]
["2022-09-30","E",183,7137]
["2022-09-30","E",184,7174]
["2022-09-30","E",185,7211]
["2022-09-30","E",186,7248]
["2022-09-30","E",187,7285]
["2022-09-30","E",188,7322]
["2022-09-30","E",189,7360]
["2022-09-30","E",190,7397]
["2022-09-30","E",191,7434]
["2022-09-30","E",192,7471]
["2022-09-30","E",193,7508]
["2022-09-30","E",194,7545]
["2022-09-30","E",195,7582]
["2022-09-30","E",196,7620]
["2022-09-30","E",197,7657]
["2022-09-30","E",198,7694]
["2022-09-30","E",199,7731]
["2022-09-30","E",200,7768]
["2022-09-30","F",1,50]
["2022-09-30","F",2,50]
["2022-09-30","F",3,138]
["2022-09-30","F",4,173]
["2022-09-30","F",5,206]
["2022-09-30","F",6,240]
["2022-09-30","F",7,276]
["2022-09-30","F",8,310]
["2022-09-30","F",9,342]
["2022-09-30","F",10,373]
["2022-09-30","F",11,405]
["2022-09-30","F",12,437]
["2022-09-30","F",13,470]
["2022-09-30","F",14,501]
["2022-09-30","F",15,533]
["2022-09-30","F",16,564]
["2022-09-30","F",17,596]
["2022-09-30","F",18,627]
["2022-09-30","F",19,659]
["2022-09-30","F",20,690]
["2022-09-30","F",21,720]
["2022-09-30","F",22,752]
["2022-09-30","F",23,784]
["2022-09-30","F",24,816]
["2022-09-30","F",25,848]
["2022-09-30","F",26,880]
["2022-09-30","F",27,912]
["2022-09-30","F",28,944]
["2022-09-30","F",29,976]
["2022-09-30","F",30,1007]
["2022-09-30","F",31,1039]
["2022-09-30","F",32,1070]
["2022-09-30","F",33,1102]
["2022-09-30","F",34,1133]
["2022-09-30","F",35,1165]
["2022-09-30","F",36,1196]
["2022-09-30","F",37,1228]
["2022-09-30","F",38,1259]
["2022-09-30","F",39,1291]
["2022-09-30","F",40,1314]
["2022-09-30","F",41,1338]
["2022-09-30","F",42,1361]
["2022-09-30","F",43,1384]
["2022-09-30","F",44,1410]
["2022-09-30","F",45,1440]
["2022-09-30","F",46,1470]
["2022-09-30","F",47,1501]
["2022-09-30","F",48,1531]
["2022-09-30","F",49,1561]
["2022-09-30","F",50,1591]
["2022-09-30","F",51,1622]
["2022-09-30","F",52,1652]
["2022-09-30","F",53,1682]
["2022-09-30","F",54,1712]
["2022-09-30","F",55,1743]
["2022-09-30","F",56,1773]
["2022-09-30","F",57,1803]
["2022-09-30","F",58,1833]
["2022-09-30","F",59,1864]
["2022-09-30","F",60,1894]
["2022-09-30","F",61,1924]
["2022-09-30","F",62,1959]
["2022-09-30","F",63,2020]
["2022-09-30","F",64,2081]
["2022-09-30","F",65,2141]
["2022-09-30","F",66,2202]
["2022-09-30","F",67,2263]
["2022-09-30","F",68,2323]
["2022-09-30","F",69,2384]
["2022-09-30","F",70,2445]
["2022-09-30","F",71,2506]
["2022-09-30","F",72,2566]
["2022-09-30","F",73,2627]
["2022-09-30","F",74,2688]
["2022-09-30","F",75,2749]
["2022-09-30","F",76,2809]
["2022-09-30","F",77,2870]
["2022-09-30","F",78,2931]
["2022-09-30","F",79,2992]
["2022-09-30","F",80,3052]
["2022-09-30","F",81,3113]
["2022-09-30","F",82,3174]
["2022-09-30","F",83,3235]
["2022-09-30","F",84,3295]
["2022-09-30","F",85,3356]
["2022-09-30","F",86,3417]
["2022-09-30","F",87,3478]
["2022-09-30","F",88,3539]
["2022-09-30","F",89,3599]
["2022-09-30","F",90,3660]
["2022-09-30","F",91,3721]
["2022-09-30","F",92,3782]
["2022-09-30","F",93,3843]
["2022-09-30","F",94,3903]
["2022-09-30","F",95,3964]
["2022-09-30","F",96,4025]
["2022-09-30","F",97,4086]
["2022-09-30","F",98,4147]
["2022-09-30","F",99,4207]
["2022-09-30","F",100,4268]
["2022-09-30","F",101,4329]
["2022-09-30","F",102,4390]
["2022-09-30","F",103,4451]
["2022-09-30","F",104,4512]
["2022-09-30","F",105,4573]
["2022-09-30","F",106,4633]
["2022-09-30","F",107,4694]
["2022-09-30","F",108,4755]
["2022-09-30","F",109,4816]
["2022-09-30","F",110,4877]
["2022-09-30","F",111,4938]
["2022-09-30","F",112,4999]
["2022-09-30","F",113,5059]
["2022-09-30","F",114,5120]
["2022-09-30","F",115,5181]
["2022-09-30","F",116,5242]
["2022-09-30","F",117,5303]
["2022-09-30","F",118,5364]
["2022-09-30","F",119,5425]
["2022-09-30","F",120,5486]
["2022-09-30","F",121,5547]
["2022-09-30","F",122,5607]
["2022-09-30","F",123,5668]
["2022-09-30","F",124,5729]
["2022-09-30","F",125,5789]
["2022-09-30","F",126,5850]
["2022-09-30","F",127,5911]
["2022-09-30","F",128,5971]
["2022-09-30","F",129,6032]
["2022-09-30","F",130,6093]
["2022-09-30","F",131,6153]
["2022-09-30","F",132,6214]
["2022-09-30","F",133,6274]
["2022-09-30","F",134,6335]
["2022-09-30","F",135,6396]
["2022-09-30","F",136,6456]
["2022-09-30","F",137,6517]
["2022-09-30","F",138,6578]
["2022-09-30","F",139,6638]
["2022-09-30","F",140,6699]
["2022-09-30","F",141,6760]
["2022-09-30","F",142,6820]
["2022-09-30","F",143,6881]
["2022-09-30","F",144,6942]
["2022-09-30","F",145,7002]
["2022-09-30","F",146,7063]
["2022-09-30","F",147,7124]
["2022-09-30","F",148,7184]
["2022-09-30","F",149,7245]
["2022-09-30","F",150,7305]
["2022-09-30","F",151,7366]
["2022-09-30","F",152,7427]
["2022-09-30","F",153,7487]
["2022-09-30","F",154,7548]
["2022-09-30","F",155,7609]
["2022-09-30","F",156,7669]
["2022-09-30","F",157,7730]
["2022-09-30","F",158,7791]
["2022-09-30","F",159,7851]
["2022-09-30","F",160,7912]
["2022-09-30","F",161,7973]
["2022-09-30","F",162,8033]
["2022-09-30","F",163,8094]
["2022-09-30","F",164,8155]
["2022-09-30","F",165,8215]
["2022-09-30","F",166,8276]
["2022-09-30","F",167,8337]
["2022-09-30","F",168,8397]
["2022-09-30","F",169,8458]
["2022-09-30","F",170,8518]
["2022-09-30","F",171,8579]
["2022-09-30","F",172,8640]
["2022-09-30","F",173,8700]
["2022-09-30","F",174,8761]
["2022-09-30","F",175,8822]
["2022-09-30","F",176,8882]
["2022-09-30","F",177,8943]
["2022-09-30","F",178,9004]
["2022-09-30","F",179,9064]
["2022-09-30","F",180,9125]
["2022-09-30","F",181,9186]
["2022-09-30","F",182,9246]
["2022-09-30","F",183,9307]
["2022-09-30","F",184,9368]
["2022-09-30","F",185,9428]
["2022-09-30","F",186,9489]
["2022-09-30","F",187,9549]
["2022-09-30","F",188,9610]
["2022-09-30","F",189,9671]
["2022-09-30","F",190,9731]
["2022-09-30","F",191,9792]
["2022-09-30","F",192,9853]
["2022-09-30","F",193,9913]
["2022-09-30","F",194,9974]
["2022-09-30","F",195,10035]
["2022-09-30","F",196,10095]
["2022-09-30","F",197,10156]
["2022-09-30","F",198,10217]
["2022-09-30","F",199,10277]
["2022-09-30","F",200,10338]
["2022-09-30","G",1,50]
["2022-09-30","G",2,50]
["2022-09-30","G",3,138]
["2022-09-30","G",4,173]
["2022-09-30","G",5,206]
["2022-09-30","G",6,240]
["2022-09-30","G",7,276]
["2022-09-30","G",8,310]
["2022-09-30","G",9,342]
["2022-09-30","G",10,373]
["2022-09-30","G",11,405]
["2022-09-30","G",12,437]
["2022-09-30","G",13,470]
["2022-09-30","G",14,501]
["2022-09-30","G",15,533]
["2022-09-30","G",16,564]
["2022-09-30","G",17,596]
["2022-09-30","G",18,627]
["2022-09-30","G",19,659]
["2022-09-30","G",20,690]
["2022-09-30","G",21,720]
["2022-09-30","G",22,752]
["2022-09-30","G",23,784]
["2022-09-30","G",24,816]
["2022-09-30","G",25,848]
["2022-09-30","G",26,880]
["2022-09-30","G",27,912]
["2022-09-30","G",28,944]
["2022-09-30","G",29,976]
["2022-09-30","G",30,1007]
["2022-09-30","G",31,1039]
["2022-09-30","G",32,1070]
["2022-09-30","G",33,1102]
["2022-09-30","G",34,1133]
["2022-09-30","G",35,1165]
["2022-09-30","G",36,1196]
["2022-09-30","G",37,1228]
["2022-09-30","G",38,1259]
["2022-09-30","G",39,1291]
["2022-09-30","G",40,1314]
["2022-09-30","G",41,1338]
["2022-09-30","G",42,1361]
["2022-09-30","G",43,1384]
["2022-09-30","G",44,1410]
["2022-09-30","G",45,1440]
["2022-09-30","G",46,1470]
["2022-09-30","G",47,1501]
["2022-09-30","G",48,1531]
["2022-09-30","G",49,1561]
["2022-09-30","G",50,1591]
["2022-09-30","G",51,1622]
["2022-09-30","G",52,1652]
["2022-09-30","G",53,1682]
["2022-09-30","G",54,1712]
["2022-09-30","G",55,1743]
["2022-09-30","G",56,1773]
["2022-09-30","G",57,1803]
["2022-09-30","G",58,1833]
["2022-09-30","G",59,1864]
["2022-09-30","G",60,1894]
["2022-09-30","G",61,1924]
["2022-09-30","G",62,1959]
["2022-09-30","G",63,2020]
["2022-09-30","G",64,2081]
["2022-09-30","G",65,2141]
["2022-09-30","G",66,2202]
["2022-09-30","G",67,2263]
["2022-09-30","G",68,2323]
["2022-09-30","G",69,2384]
["2022-09-30","G",70,2445]
["2022-09-30","G",71,2506]
["2022-09-30","G",72,2566]
["2022-09-30","G",73,2627]
["2022-09-30","G",74,2688]
["2022-09-30","G",75,2749]
["2022-09-30","G",76,2809]
["2022-09-30","G",77,2870]
["2022-09-30","G",78,2931]
["2022-09-30","G",79,2992]
["2022-09-30","G",80,3052]
["2022-09-30","G",81,3113]
["2022-09-30","G",82,3174]
["2022-09-30","G",83,3235]
["2022-09-30","G",84,3295]
["2022-09-30","G",85,3356]
["2022-09-30","G",86,3417]
["2022-09-30","G",87,3478]
["2022-09-30","G",88,3539]
["2022-09-30","G",89,3599]
["2022-09-30","G",90,3660]
["2022-09-30","G",91,3721]
["2022-09-30","G",92,3782]
["2022-09-30","G",93,3843]
["2022-09-30","G",94,3903]
["2022-09-30","G",95,3964]
["2022-09-30","G",96,4025]
["2022-09-30","G",97,4086]
["2022-09-30","G",98,4147]
["2022-09-30","G",99,4207]
["2022-09-30","G",100,4268]
["2022-09-30","G",101,4329]
["2022-09-30","G",102,4390]
["2022-09-30","G",103,4451]
["2022-09-30","G",104,4512]
["2022-09-30","G",105,4573]
["2022-09-30","G",106,4633]
["2022-09-30","G",107,4694]
["2022-09-30","G",108,4755]
["2022-09-30","G",109,4816]
["2022-09-30","G",110,4877]
["2022-09-30","G",111,4938]
["2022-09-30","G",112,4999]
["2022-09-30","G",113,5059]
["2022-09-30","G",114,5120]
["2022-09-30","G",115,5181]
["2022-09-30","G",116,5242]
["2022-09-30","G",117,5303]
["2022-09-30","G",118,5364]
["2022-09-30","G",119,5425]
["2022-09-30","G",120,5486]
["2022-09-30","G",121,5547]
["2022-09-30","G",122,5607]
["2022-09-30","G",123,5668]
["2022-09-30","G",124,5729]
["2022-09-30","G",125,5789]
["2022-09-30","G",126,5850]
["2022-09-30","G",127,5911]
["2022-09-30","G",128,5971]
["2022-09-30","G",129,6032]
["2022-09-30","G",130,6093]
["2022-09-30","G",131,6153]
["2022-09-30","G",132,6214]
["2022-09-30","G",133,6274]
["2022-09-30","G",134,6335]
["2022-09-30","G",135,6396]
["2022-09-30","G",136,6456]
["2022-09-30","G",137,6517]
["2022-09-30","G",138,6578]
["2022-09-30","G",139,6638]
["2022-09-30","G",140,6699]
["2022-09-30","G",141,6760]
["2022-09-30","G",142,6820]
["2022-09-30","G",143,6881]
["2022-09-30","G",144,6942]
["2022-09-30","G",145,7002]
["2022-09-30","G",146,7063]
["2022-09-30","G",147,7124]
["2022-09-30","G",148,7184]
["2022-09-30","G",149,7245]
["2022-09-30","G",150,7305]
["2022-09-30","G",151,7366]
["2022-09-30","G",152,7427]
["2022-09-30","G",153,7487]
["2022-09-30","G",154,7548]
["2022-09-30","G",155,7609]
["2022-09-30","G",156,7669]
["2022-09-30","G",157,7730]
["2022-09-30","G",158,7791]
["2022-09-30","G",159,7851]
["2022-09-30","G",160,7912]
["2022-09-30","G",161,7973]
["2022-09-30","G",162,8033]
["2022-09-30","G",163,8094]
["2022-09-30","G",164,8155]
["2022-09-30","G",165,8215]
["2022-09-30","G",166,8276]
["2022-09-30","G",167,8337]
["2022-09-30","G",168,8397]
["2022-09-30","G",169,8458]
["2022-09-30","G",170,8518]
["2022-09-30","G",171,8579]
["2022-09-30","G",172,8640]
["2022-09-30","G",173,8700]
["2022-09-30","G",174,8761]
["2022-09-30","G",175,8822]
["2022-09-30","G",176,8882]
["2022-09-30","G",177,8943]
["2022-09-30","G",178,9004]
["2022-09-30","G",179,9064]
["2022-09-30","G",180,9125]
["2022-09-30","G",181,9186]
["2022-09-30","G",182,9246]
["2022-09-30","G",183,9307]
["2022-09-30","G",184,9368]
["2022-09-30","G",185,9428]
["2022-09-30","G",186,9489]
["2022-09-30","G",187,9549]
["2022-09-30","G",188,9610]
["2022-09-30","G",189,9671]
["2022-09-30","G",190,9731]
["2022-09-30","G",191,9792]
["2022-09-30","G",192,9853]
["2022-09-30","G",193,9913]
["2022-09-30","G",194,9974]
["2022-09-30","G",195,10035]
["2022-09-30","G",196,10095]
["2022-09-30","G",197,10156]
["2022-09-30","G",198,10217]
["2022-09-30","G",199,10277]
["2022-09-30","G",200,10338]
["2022-09-30","H",1,40]
["2022-09-30","H",2,40]
["2022-09-30","H",3,122]
["2022-09-30","H",4,157]
["2022-09-30","H",5,191]
["2022-09-30","H",6,225]
["2022-09-30","H",7,260]
["2022-09-30","H",8,301]
["2022-09-30","H",9,338]
["2022-09-30","H",10,374]
["2022-09-30","H",11,412]
["2022-09-30","H",12,449]
["2022-09-30","H",13,486]
["2022-09-30","H",14,523]
["2022-09-30","H",15,559]
["2022-09-30","H",16,596]
["2022-09-30","H",17,637]
["2022-09-30","H",18,687]
["2022-09-30","H",19,736]
["2022-09-30","H",20,786]
["2022-09-30","H",21,826]
["2022-09-30","H",22,867]
["2022-09-30","H",23,908]
["2022-09-30","H",24,948]
["2022-09-30","H",25,988]
["2022-09-30","H",26,1028]
["2022-09-30","H",27,1068]
["2022-09-30","H",28,1107]
["2022-09-30","H",29,1147]
["2022-09-30","H",30,1187]
["2022-09-30","H",31,1226]
["2022-09-30","H",32,1266]
["2022-09-30","H",33,1307]
["2022-09-30","H",34,1357]
["2022-09-30","H",35,1407]
["2022-09-30","H",36,1457]
["2022-09-30","H",37,1507]
["2022-09-30","H",38,1557]
["2022-09-30","H",39,1607]
["2022-09-30","H",40,1629]
["2022-09-30","H",41,1651]
["2022-09-30","H",42,1673]
["2022-09-30","H",43,1695]
["2022-09-30","H",44,1716]
["2022-09-30","H",45,1738]
["2022-09-30","H",46,1760]
["2022-09-30","H",47,1782]
["2022-09-30","H",48,1804]
["2022-09-30","H",49,1826]
["2022-09-30","H",50,1848]
["2022-09-30","H",51,1870]
["2022-09-30","H",52,1892]
["2022-09-30","H",53,1914]
["2022-09-30","H",54,1936]
["2022-09-30","H",55,1958]
["2022-09-30","H",56,1980]
["2022-09-30","H",57,2002]
["2022-09-30","H",58,2024]
["2022-09-30","H",59,2046]
["2022-09-30","H",60,2068]
["2022-09-30","H",61,2090]
["2022-09-30","H",62,2112]
["2022-09-30","H",63,2134]
["2022-09-30","H",64,2156]
["2022-09-30","H",65,2178]
["2022-09-30","H",66,2200]
["2022-09-30","H",67,2222]
["2022-09-30","H",68,2244]
["2022-09-30","H",69,2266]
["2022-09-30","H",70,2288]
["2022-09-30","H",71,2310]
["2022-09-30","H",72,2332]
["2022-09-30","H",73,2354]
["2022-09-30","H",74,2376]
["2022-09-30","H",75,2398]
["2022-09-30","H",76,2420]
["2022-09-30","H",77,2442]
["2022-09-30","H",78,2464]
["2022-09-30","H",79,2486]
["2022-09-30","H",80,2508]
["2022-09-30","H",81,2530]
["2022-09-30","H",82,2552]
["2022-09-30","H",83,2575]
["2022-09-30","H",84,2597]
["2022-09-30","H",85,2619]
["2022-09-30","H",86,2641]
["2022-09-30","H",87,2663]
["2022-09-30","H",88,2685]
["2022-09-30","H",89,2707]
["2022-09-30","H",90,2729]
["2022-09-30","H",91,2751]
["2022-09-30","H",92,2774]
["2022-09-30","H",93,2796]
["2022-09-30","H",94,2818]
["2022-09-30","H",95,2840]
["2022-09-30","H",96,2862]
["2022-09-30","H",97,2884]
["2022-09-30","H",98,2906]
["2022-09-30","H",99,2929]
["2022-09-30","H",100,2951]
["2022-09-30","H",101,2973]
["2022-09-30","H",102,2995]
["2022-09-30","H",103,3032]
["2022-09-30","H",104,3073]
["2022-09-30","H",105,3114]
["2022-09-30","H",106,3155]
["2022-09-30","H",107,3196]
["2022-09-30","H",108,3237]
["2022-09-30","H",109,3278]
["2022-09-30","H",110,3319]
["2022-09-30","H",111,3361]
["2022-09-30","H",112,3402]
["2022-09-30","H",113,3443]
["2022-09-30","H",114,3484]
["2022-09-30","H",115,3525]
["2022-09-30","H",116,3566]
["2022-09-30","H",117,3607]
["2022-09-30","H",118,3648]
["2022-09-30","H",119,3689]
["2022-09-30","H",120,3730]
["2022-09-30","H",121,3771]
["2022-09-30","H",122,3812]
["2022-09-30","H",123,3853]
["2022-09-30","H",124,3895]
["2022-09-30","H",125,3936]
["2022-09-30","H",126,3977]
["2022-09-30","H",127,4017]
["2022-09-30","H",128,4058]
["2022-09-30","H",129,4098]
["2022-09-30","H",130,4139]
["2022-09-30","H",131,4179]
["2022-09-30","H",132,4219]
["2022-09-30","H",133,4260]
["2022-09-30","H",134,4300]
["2022-09-30","H",135,4341]
["2022-09-30","H",136,4381]
["2022-09-30","H",137,4422]
["2022-09-30","H",138,4462]
["2022-09-30","H",139,4503]
["2022-09-30","H",140,4543]
["2022-09-30","H",141,4584]
["2022-09-30","H",142,4624]
["2022-09-30","H",143,4664]
["2022-09-30","H",144,4705]
["2022-09-30","H",145,4745]
["2022-09-30","H",146,4786]
["2022-09-30","H",147,4826]
["2022-09-30","H",148,4867]
["2022-09-30","H",149,4907]
["2022-09-30","H",150,4948]
["2022-09-30","H",151,4988]
["2022-09-30","H",152,5029]
["2022-09-30","H",153,5069]
["2022-09-30","H",154,5110]
["2022-09-30","H",155,5150]
["2022-09-30","H",156,5190]
["2022-09-30","H",157,5231]
["2022-09-30","H",158,5271]
["2022-09-30","H",159,5312]
["2022-09-30","H",160,5352]
["2022-09-30","H",161,5393]
["2022-09-30","H",162,5433]
["2022-09-30","H",163,5474]
["2022-09-30","H",164,5514]
["2022-09-30","H",165,5555]
["2022-09-30","H",166,5595]
["2022-09-30","H",167,5636]
["2022-09-30","H",168,5676]
["2022-09-30","H",169,5716]
["2022-09-30","H",170,5757]
["2022-09-30","H",171,5797]
["2022-09-30","H",172,5838]
["2022-09-30","H",173,5878]
["2022-09-30","H",174,5919]
["2022-09-30","H",175,5959]
["2022-09-30","H",176,6000]
["2022-09-30","H",177,6040]
["2022-09-30","H",178,6081]
["2022-09-30","H",179,6121]
["2022-09-30","H",180,6162]
["2022-09-30","H",181,6202]
["2022-09-30","H",182,6242]
["2022-09-30","H",183,6283]
["2022-09-30","H",184,6323]
["2022-09-30","H",185,6364]
["2022-09-30","H",186,6404]
["2022-09-30","H",187,6445]
["2022-09-30","H",188,6485]
["2022-09-30","H",189,6526]
["2022-09-30","H",190,6566]
["2022-09-30","H",191,6607]
["2022-09-30","H",192,6647]
["2022-09-30","H",193,6687]
["2022-09-30","H",194,6728]
["2022-09-30","H",195,6768]
["2022-09-30","H",196,6809]
["2022-09-30","H",197,6849]
["2022-09-30","H",198,6890]
["2022-09-30","H",199,6930]
["2022-09-30","H",200,6971]
["2022-09-30","I",1,40]
["2022-09-30","I",2,40]
["2022-09-30","I",3,134]
["2022-09-30","I",4,185]
["2022-09-30","I",5,232]
["2022-09-30","I",6,281]
["2022-09-30","I",7,329]
["2022-09-30","I",8,376]
["2022-09-30","I",9,420]
["2022-09-30","I",10,464]
["2022-09-30","I",11,509]
["2022-09-30","I",12,554]
["2022-09-30","I",13,598]
["2022-09-30","I",14,642]
["2022-09-30","I",15,686]
["2022-09-30","I",16,730]
["2022-09-30","I",17,774]
["2022-09-30","I",18,818]
["2022-09-30","I",19,862]
["2022-09-30","I",20,907]
["2022-09-30","I",21,943]
["2022-09-30","I",22,980]
["2022-09-30","I",23,1017]
["2022-09-30","I",24,1053]
["2022-09-30","I",25,1088]
["2022-09-30","I",26,1124]
["2022-09-30","I",27,1160]
["2022-09-30","I",28,1196]
["2022-09-30","I",29,1231]
["2022-09-30","I",30,1267]
["2022-09-30","I",31,1303]
["2022-09-30","I",32,1349]
["2022-09-30","I",33,1394]
["2022-09-30","I",34,1439]
["2022-09-30","I",35,1485]
["2022-09-30","I",36,1530]
["2022-09-30","I",37,1575]
["2022-09-30","I",38,1621]
["2022-09-30","I",39,1666]
["2022-09-30","I",40,1704]
["2022-09-30","I",41,1742]
["2022-09-30","I",42,1780]
["2022-09-30","I",43,1818]
["2022-09-30","I",44,1856]
["2022-09-30","I",45,1894]
["2022-09-30","I",46,1932]
["2022-09-30","I",47,1970]
["2022-09-30","I",48,2008]
["2022-09-30","I",49,2046]
["2022-09-30","I",50,2084]
["2022-09-30","I",51,2122]
["2022-09-30","I",52,2160]
["2022-09-30","I",53,2198]
["2022-09-30","I",54,2236]
["2022-09-30","I",55,2275]
["2022-09-30","I",56,2313]
["2022-09-30","I",57,2351]
["2022-09-30","I",58,2389]
["2022-09-30","I",59,2427]
["2022-09-30","I",60,2465]
["2022-09-30","I",61,2503]
["2022-09-30","I",62,2542]
["2022-09-30","I",63,2580]
["2022-09-30","I",64,2618]
["2022-09-30","I",65,2656]
["2022-09-30","I",66,2694]
["2022-09-30","I",67,2776]
["2022-09-30","I",68,2865]
["2022-09-30","I",69,2954]
["2022-09-30","I",70,3043]
["2022-09-30","I",71,3132]
["2022-09-30","I",72,3221]
["2022-09-30","I",73,3310]
["2022-09-30","I",74,3399]
["2022-09-30","I",75,3488]
["2022-09-30","I",76,3577]
["2022-09-30","I",77,3666]
["2022-09-30","I",78,3755]
["2022-09-30","I",79,3844]
["2022-09-30","I",80,3933]
["2022-09-30","I",81,4023]
["2022-09-30","I",82,4112]
["2022-09-30","I",83,4201]
["2022-09-30","I",84,4290]
["2022-09-30","I",85,4379]
["2022-09-30","I",86,4469]
["2022-09-30","I",87,4558]
["2022-09-30","I",88,4647]
["2022-09-30","I",89,4737]
["2022-09-30","I",90,4826]
["2022-09-30","I",91,4915]
["2022-09-30","I",92,5005]
["2022-09-30","I",93,5094]
["2022-09-30","I",94,5183]
["2022-09-30","I",95,5273]
["2022-09-30","I",96,5362]
["2022-09-30","I",97,5452]
["2022-09-30","I",98,5541]
["2022-09-30","I",99,5631]
["2022-09-30","I",100,5720]
["2022-09-30","I",101,5810]
["2022-09-30","I",102,5899]
["2022-09-30","I",103,5989]
["2022-09-30","I",104,6079]
["2022-09-30","I",105,6168]
["2022-09-30","I",106,6258]
["2022-09-30","I",107,6348]
["2022-09-30","I",108,6437]
["2022-09-30","I",109,6527]
["2022-09-30","I",110,6617]
["2022-09-30","I",111,6706]
["2022-09-30","I",112,6796]
["2022-09-30","I",113,6886]
["2022-09-30","I",114,6976]
["2022-09-30","I",115,7066]
["2022-09-30","I",116,7155]
["2022-09-30","I",117,7245]
["2022-09-30","I",118,7335]
["2022-09-30","I",119,7425]
["2022-09-30","I",120,7515]
["2022-09-30","I",121,7605]
["2022-09-30","I",122,7693]
["2022-09-30","I",123,7782]
["2022-09-30","I",124,7871]
["2022-09-30","I",125,7959]
["2022-09-30","I",126,8048]
["2022-09-30","I",127,8137]
["2022-09-30","I",128,8225]
["2022-09-30","I",129,8314]
["2022-09-30","I",130,8403]
["2022-09-30","I",131,8491]
["2022-09-30","I",132,8580]
["2022-09-30","I",133,8669]
["2022-09-30","I",134,8757]
["2022-09-30","I",135,8846]
["2022-09-30","I",136,8935]
["2022-09-30","I",137,9023]
["2022-09-30","I",138,9112]
["2022-09-30","I",139,9201]
["2022-09-30","I",140,9289]
["2022-09-30","I",141,9378]
["2022-09-30","I",142,9467]
["2022-09-30","I",143,9555]
["2022-09-30","I",144,9644]
["2022-09-30","I",145,9733]
["2022-09-30","I",146,9821]
["2022-09-30","I",147,9910]
["2022-09-30","I",148,9999]
["2022-09-30","I",149,10087]
["2022-09-30","I",150,10176]
["2022-09-30","I",151,10265]
["2022-09-30","I",152,10353]
["2022-09-30","I",153,10442]
["2022-09-30","I",154,10531]
["2022-09-30","I",155,10619]
["2022-09-30","I",156,10708]
["2022-09-30","I",157,10797]
["2022-09-30","I",158,10885]
["2022-09-30","I",159,10974]
["2022-09-30","I",160,11063]
["2022-09-30","I",161,11151]
["2022-09-30","I",162,11240]
["2022-09-30","I",163,11329]
["2022-09-30","I",164,11417]
["2022-09-30","I",165,11506]
["2022-09-30","I",166,11595]
["2022-09-30","I",167,11683]
["2022-09-30","I",168,11772]
["2022-09-30","I",169,11861]
["2022-09-30","I",170,11949]
["2022-09-30","I",171,12038]
["2022-09-30","I",172,12127]
["2022-09-30","I",173,12215]
["2022-09-30","I",174,12304]
["2022-09-30","I",175,12393]
["2022-09-30","I",176,12481]
["2022-09-30","I",177,12570]
["2022-09-30","I",178,12659]
["2022-09-30","I",179,12747]
["2022-09-30","I",180,12836]
["2022-09-30","I",181,12925]
["2022-09-30","I",182,13013]
["2022-09-30","I",183,13102]
["2022-09-30","I",184,13191]
["2022-09-30","I",185,13279]
["2022-09-30","I",186,13368]
["2022-09-30","I",187,13457]
["2022-09-30","I",188,13545]
["2022-09-30","I",189,13634]
["2022-09-30","I",190,13723]
["2022-09-30","I",191,13811]
["2022-09-30","I",192,13900]
["2022-09-30","I",193,13988]
["2022-09-30","I",194,14077]
["2022-09-30","I",195,14166]
["2022-09-30","I",196,14254]
["2022-09-30","I",197,14343]
["2022-09-30","I",198,14432]
["2022-09-30","I",199,14520]
["2022-09-30","I",200,14609]
["2022-09-30","J",1,80]
["2022-09-30","J",2,80]
["2022-09-30","J",3,95]
["2022-09-30","J",4,126]
["2022-09-30","J",5,156]
["2022-09-30","J",6,186]
["2022-09-30","J",7,218]
["2022-09-30","J",8,257]
["2022-09-30","J",9,293]
["2022-09-30","J",10,330]
["2022-09-30","J",11,367]
["2022-09-30","J",12,404]
["2022-09-30","J",13,440]
["2022-09-30","J",14,477]
["2022-09-30","J",15,514]
["2022-09-30","J",16,551]
["2022-09-30","J",17,587]
["2022-09-30","J",18,624]
["2022-09-30","J",19,661]
["2022-09-30","J",20,697]
["2022-09-30","J",21,742]
["2022-09-30","J",22,786]
["2022-09-30","J",23,830]
["2022-09-30","J",24,874]
["2022-09-30","J",25,917]
["2022-09-30","J",26,961]
["2022-09-30","J",27,1005]
["2022-09-30","J",28,1049]
["2022-09-30","J",29,1099]
["2022-09-30","J",30,1150]
["2022-09-30","J",31,1200]
["2022-09-30","J",32,1251]
["2022-09-30","J",33,1301]
["2022-09-30","J",34,1352]
["2022-09-30","J",35,1402]
["2022-09-30","J",36,1453]
["2022-09-30","J",37,1503]
["2022-09-30","J",38,1554]
["2022-09-30","J",39,1604]
["2022-09-30","J",40,1652]
["2022-09-30","J",41,1700]
["2022-09-30","J",42,1748]
["2022-09-30","J",43,1796]
["2022-09-30","J",44,1844]
["2022-09-30","J",45,1892]
["2022-09-30","J",46,1939]
["2022-09-30","J",47,1987]
["2022-09-30","J",48,2039]
["2022-09-30","J",49,2091]
["2022-09-30","J",50,2144]
["2022-09-30","J",51,2196]
["2022-09-30","J",52,2249]
["2022-09-30","J",53,2301]
["2022-09-30","J",54,2354]
["2022-09-30","J",55,2406]
["2022-09-30","J",56,2459]
["2022-09-30","J",57,2512]
["2022-09-30","J",58,2564]
["2022-09-30","J",59,2617]
["2022-09-30","J",60,2669]
["2022-09-30","J",61,2722]
["2022-09-30","J",62,2775]
["2022-09-30","J",63,2827]
["2022-09-30","J",64,2880]
["2022-09-30","J",65,2933]
["2022-09-30","J",66,2985]
["2022-09-30","J",67,3038]
["2022-09-30","J",68,3091]
["2022-09-30","J",69,3144]
["2022-09-30","J",70,3196]
["2022-09-30","J",71,3249]
["2022-09-30","J",72,3302]
["2022-09-30","J",73,3355]
["2022-09-30","J",74,3407]
["2022-09-30","J",75,3460]
["2022-09-30","J",76,3513]
["2022-09-30","J",77,3566]
["2022-09-30","J",78,3619]
["2022-09-30","J",79,3672]
["2022-09-30","J",80,3724]
["2022-09-30","J",81,3777]
["2022-09-30","J",82,3830]
["2022-09-30","J",83,3883]
["2022-09-30","J",84,3936]
["2022-09-30","J",85,3989]
["2022-09-30","J",86,4042]
["2022-09-30","J",87,4095]
["2022-09-30","J",88,4148]
["2022-09-30","J",89,4201]
["2022-09-30","J",90,4254]
["2022-09-30","J",91,4307]
["2022-09-30","J",92,4360]
["2022-09-30","J",93,4413]
["2022-09-30","J",94,4466]
["2022-09-30","J",95,4519]
["2022-09-30","J",96,4572]
["2022-09-30","J",97,4625]
["2022-09-30","J",98,4679]
["2022-09-30","J",99,4732]
["2022-09-30","J",100,4785]
["2022-09-30","J",101,4838]
["2022-09-30","J",102,4891]
["2022-09-30","J",103,4944]
["2022-09-30","J",104,4997]
["2022-09-30","J",105,5051]
["2022-09-30","J",106,5104]
["2022-09-30","J",107,5157]
["2022-09-30","J",108,5210]
["2022-09-30","J",109,5264]
["2022-09-30","J",110,5317]
["2022-09-30","J",111,5370]
["2022-09-30","J",112,5423]
["2022-09-30","J",113,5477]
["2022-09-30","J",114,5530]
["2022-09-30","J",115,5583]
["2022-09-30","J",116,5637]
["2022-09-30","J",117,5690]
["2022-09-30","J",118,5743]
["2022-09-30","J",119,5797]
["2022-09-30","J",120,5850]
["2022-09-30","J",121,5904]
["2022-09-30","J",122,5956]
["2022-09-30","J",123,6009]
["2022-09-30","J",124,6061]
["2022-09-30","J",125,6114]
["2022-09-30","J",126,6167]
["2022-09-30","J",127,6219]
["2022-09-30","J",128,6272]
["2022-09-30","J",129,6324]
["2022-09-30","J",130,6377]
["2022-09-30","J",131,6430]
["2022-09-30","J",132,6482]
["2022-09-30","J",133,6535]
["2022-09-30","J",134,6588]
["2022-09-30","J",135,6640]
["2022-09-30","J",136,6693]
["2022-09-30","J",137,6745]
["2022-09-30","J",138,6798]
["2022-09-30","J",139,6851]
["2022-09-30","J",140,6903]
["2022-09-30","J",141,6956]
["2022-09-30","J",142,7008]
["2022-09-30","J",143,7061]
["2022-09-30","J",144,7114]
["2022-09-30","J",145,7166]
["2022-09-30","J",146,7219]
["2022-09-30","J",147,7272]
["2022-09-30","J",148,7324]
["2022-09-30","J",149,7377]
["2022-09-30","J",150,7429]
["2022-09-30","J",151,7482]
["2022-09-30","J",152,7535]
["2022-09-30","J",153,7587]
["2022-09-30","J",154,7640]
["2022-09-30","J",155,7692]
["2022-09-30","J",156,7745]
["2022-09-30","J",157,7798]
["2022-09-30","J",158,7850]
["2022-09-30","J",159,7903]
["2022-09-30","J",160,7956]
["2022-09-30","J",161,8008]
["2022-09-30","J",162,8061]
["2022-09-30","J",163,8113]
["2022-09-30","J",164,8166]
["2022-09-30","J",165,8219]
["2022-09-30","J",166,8271]
["2022-09-30","J",167,8324]
["2022-09-30","J",168,8376]
["2022-09-30","J",169,8429]
["2022-09-30","J",170,8482]
["2022-09-30","J",171,8534]
["2022-09-30","J",172,8587]
["2022-09-30","J",173,8639]
["2022-09-30","J",174,8692]
["2022-09-30","J",175,8745]
["2022-09-30","J",176,8797]
["2022-09-30","J",177,8850]
["2022-09-30","J",178,8903]
["2022-09-30","J",179,8955]
["2022-09-30","J",180,9008]
["2022-09-30","J",181,9060]
["2022-09-30","J",182,9113]
["2022-09-30","J",183,9166]
["2022-09-30","J",184,9218]
["2022-09-30","J",185,9271]
["2022-09-30","J",186,9323]
["2022-09-30","J",187,9376]
["2022-09-30","J",188,9429]
["2022-09-30","J",189,9481]
["2022-09-30","J",190,9534]
["2022-09-30","J",191,9587]
["2022-09-30","J",192,9639]
["2022-09-30","J",193,9692]
["2022-09-30","J",194,9744]
["2022-09-30","J",195,9797]
["2022-09-30","J",196,9850]
["2022-09-30","J",197,9902]
["2022-09-30","J",198,9955]
["2022-09-30","J",199,10007]
["2022-09-30","J",200,10060]
["2022-09-30","K",1,120]
["2022-09-30","K",2,120]
["2022-09-30","K",3,186]
["2022-09-30","K",4,252]
["2022-09-30","K",5,314]
["2022-09-30","K",6,372]
["2022-09-30","K",7,433]
["2022-09-30","K",8,495]
["2022-09-30","K",9,550]
["2022-09-30","K",10,606]
["2022-09-30","K",11,663]
["2022-09-30","K",12,721]
["2022-09-30","K",13,779]
["2022-09-30","K",14,836]
["2022-09-30","K",15,894]
["2022-09-30","K",16,951]
["2022-09-30","K",17,1007]
["2022-09-30","K",18,1063]
["2022-09-30","K",19,1119]
["2022-09-30","K",20,1174]
["2022-09-30","K",21,1230]
["2022-09-30","K",22,1286]
["2022-09-30","K",23,1341]
["2022-09-30","K",24,1396]
["2022-09-30","K",25,1451]
["2022-09-30","K",26,1505]
["2022-09-30","K",27,1560]
["2022-09-30","K",28,1615]
["2022-09-30","K",29,1670]
["2022-09-30","K",30,1725]
["2022-09-30","K",31,1780]
["2022-09-30","K",32,1835]
["2022-09-30","K",33,1889]
["2022-09-30","K",34,1944]
["2022-09-30","K",35,1999]
["2022-09-30","K",36,2054]
["2022-09-30","K",37,2109]
["2022-09-30","K",38,2164]
["2022-09-30","K",39,2219]
["2022-09-30","K",40,2271]
["2022-09-30","K",41,2324]
["2022-09-30","K",42,2377]
["2022-09-30","K",43,2430]
["2022-09-30","K",44,2483]
["2022-09-30","K",45,2536]
["2022-09-30","K",46,2589]
["2022-09-30","K",47,2642]
["2022-09-30","K",48,2695]
["2022-09-30","K",49,2749]
["2022-09-30","K",50,2802]
["2022-09-30","K",51,2855]
["2022-09-30","K",52,2908]
["2022-09-30","K",53,2962]
["2022-09-30","K",54,3015]
["2022-09-30","K",55,3068]
["2022-09-30","K",56,3121]
["2022-09-30","K",57,3175]
["2022-09-30","K",58,3228]
["2022-09-30","K",59,3281]
["2022-09-30","K",60,3335]
["2022-09-30","K",61,3388]
["2022-09-30","K",62,3442]
["2022-09-30","K",63,3495]
["2022-09-30","K",64,3549]
["2022-09-30","K",65,3602]
["2022-09-30","K",66,3656]
["2022-09-30","K",67,3709]
["2022-09-30","K",68,3763]
["2022-09-30","K",69,3816]
["2022-09-30","K",70,3870]
["2022-09-30","K",71,3923]
["2022-09-30","K",72,3977]
["2022-09-30","K",73,4031]
["2022-09-30","K",74,4084]
["2022-09-30","K",75,4138]
["2022-09-30","K",76,4192]
["2022-09-30","K",77,4245]
["2022-09-30","K",78,4299]
["2022-09-30","K",79,4353]
["2022-09-30","K",80,4406]
["2022-09-30","K",81,4460]
["2022-09-30","K",82,4514]
["2022-09-30","K",83,4568]
["2022-09-30","K",84,4622]
["2022-09-30","K",85,4675]
["2022-09-30","K",86,4729]
["2022-09-30","K",87,4783]
["2022-09-30","K",88,4837]
["2022-09-30","K",89,4891]
["2022-09-30","K",90,4945]
["2022-09-30","K",91,4999]
["2022-09-30","K",92,5053]
["2022-09-30","K",93,5107]
["2022-09-30","K",94,5161]
["2022-09-30","K",95,5215]
["2022-09-30","K",96,5269]
["2022-09-30","K",97,5323]
["2022-09-30","K",98,5377]
["2022-09-30","K",99,5431]
["2022-09-30","K",100,5485]
["2022-09-30","K",101,5539]
["2022-09-30","K",102,5593]
["2022-09-30","K",103,5647]
["2022-09-30","K",104,5702]
["2022-09-30","K",105,5756]
["2022-09-30","K",106,5810]
["2022-09-30","K",107,5864]
["2022-09-30","K",108,5918]
["2022-09-30","K",109,5973]
["2022-09-30","K",110,6027]
["2022-09-30","K",111,6081]
["2022-09-30","K",112,6135]
["2022-09-30","K",113,6189]
["2022-09-30","K",114,6244]
["2022-09-30","K",115,6298]
["2022-09-30","K",116,6352]
["2022-09-30","K",117,6406]
["2022-09-30","K",118,6460]
["2022-09-30","K",119,6514]
["2022-09-30","K",120,6569]
["2022-09-30","K",121,6623]
["2022-09-30","K",122,6677]
["2022-09-30","K",123,6731]
["2022-09-30","K",124,6785]
["2022-09-30","K",125,6839]
["2022-09-30","K",126,6892]
["2022-09-30","K",127,6945]
["2022-09-30","K",128,6999]
["2022-09-30","K",129,7052]
["2022-09-30","K",130,7106]
["2022-09-30","K",131,7159]
["2022-09-30","K",132,7212]
["2022-09-30","K",133,7266]
["2022-09-30","K",134,7319]
["2022-09-30","K",135,7373]
["2022-09-30","K",136,7426]
["2022-09-30","K",137,7479]
["2022-09-30","K",138,7533]
["2022-09-30","K",139,7586]
["2022-09-30","K",140,7639]
["2022-09-30","K",141,7693]
["2022-09-30","K",142,7746]
["2022-09-30","K",143,7800]
["2022-09-30","K",144,7853]
["2022-09-30","K",145,7906]
["2022-09-30","K",146,7960]
["2022-09-30","K",147,8013]
["2022-09-30","K",148,8067]
["2022-09-30","K",149,8120]
["2022-09-30","K",150,8173]
["2022-09-30","K",151,8227]
["2022-09-30","K",152,8280]
["2022-09-30","K",153,8333]
["2022-09-30","K",154,8387]
["2022-09-30","K",155,8440]
["2022-09-30","K",156,8494]
["2022-09-30","K",157,8547]
["2022-09-30","K",158,8600]
["2022-09-30","K",159,8654]
["2022-09-30","K",160,8707]
["2022-09-30","K",161,8760]
["2022-09-30","K",162,8814]
["2022-09-30","K",163,8867]
["2022-09-30","K",164,8921]
["2022-09-30","K",165,8974]
["2022-09-30","K",166,9027]
["2022-09-30","K",167,9081]
["2022-09-30","K",168,9134]
["2022-09-30","K",169,9188]
["2022-09-30","K",170,9241]
["2022-09-30","K",171,9294]
["2022-09-30","K",172,9348]
["2022-09-30","K",173,9401]
["2022-09-30","K",174,9454]
["2022-09-30","K",175,9508]
["2022-09-30","K",176,9561]
["2022-09-30","K",177,9615]
["2022-09-30","K",178,9668]
["2022-09-30","K",179,9721]
["2022-09-30","K",180,9775]
["2022-09-30","K",181,9828]
["2022-09-30","K",182,9881]
["2022-09-30","K",183,9935]
["2022-09-30","K",184,9988]
["2022-09-30","K",185,10042]
["2022-09-30","K",186,10095]
["2022-09-30","K",187,10148]
["2022-09-30","K",188,10202]
["2022-09-30","K",189,10255]
["2022-09-30","K",190,10309]
["2022-09-30","K",191,10362]
["2022-09-30","K",192,10415]
["2022-09-30","K",193,10469]
["2022-09-30","K",194,10522]
["2022-09-30","K",195,10575]
["2022-09-30","K",196,10629]
["2022-09-30","K",197,10682]
["2022-09-30","K",198,10736]
["2022-09-30","K",199,10789]
["2022-09-30","K",200,10842]

{"sheet":"PPE Fees","index":3,"n_rows":651,"n_cols":7,"rows_kept":651,"cut":false,"hidden":true,"merged":[]}
["Regs Date","Case Type ID","Class Code","PPE Lower Limit","PPE Upper Limit","Initial Fee","Plus Increment For Each Page above Lower Limit"]
["2020-09-17",1,"A",0,79,1467.58,0]
["2020-09-17",1,"A",80,209,1467.58,16.579999999999998]
["2020-09-17",1,"A",210,699,3622.54,12.66]
["2020-09-17",1,"A",700,1049,9824.91,10.62]
["2020-09-17",1,"A",1050,1999,13543.42,9.2100000000000009]
["2020-09-17",1,"A",2000,3599,22295.42,8.42]
["2020-09-17",1,"A",3600,5199,35767.03,8.42]
["2020-09-17",1,"A",5200,6799,49238.64,8.42]
["2020-09-17",1,"A",6800,8399,62710.26,8.42]
["2020-09-17",1,"A",8400,9999,76181.87,8.42]
["2020-09-17",1,"A",10000,1000000,89645.06,0]
["2020-09-17",1,"B",0,69,1097.6600000000001,0]
["2020-09-17",1,"B",70,199,1097.6600000000001,12.81]
["2020-09-17",1,"B",200,499,2762.6,11.44]
["2020-09-17",1,"B",500,899,6195.38,9.6300000000000008]
["2020-09-17",1,"B",900,1299,10048.209999999999,8.09]
["2020-09-17",1,"B",1300,1999,13285.03,7.09]
["2020-09-17",1,"B",2000,3299,18249.509999999998,7.09]
["2020-09-17",1,"B",3300,4999,27469.24,7.09]
["2020-09-17",1,"B",5000,5999,39525.82,7.09]
["2020-09-17",1,"B",6000,7999,46617.93,7.09]
["2020-09-17",1,"B",8000,8999,60802.14,7.09]
["2020-09-17",1,"B",9000,9999,67894.240000000005,7.09]
["2020-09-17",1,"B",10000,1000000,74979.259999999995,0]
["2020-09-17",1,"C",0,39,739.59,0]
["2020-09-17",1,"C",40,299,739.59,10.57]
["2020-09-17",1,"C",300,799,3486.54,9.23]
["2020-09-17",1,"C",800,1249,8101.74,7.73]
["2020-09-17",1,"C",1250,1999,11578.09,6.83]
["2020-09-17",1,"C",2000,3199,16700.93,4.72]
["2020-09-17",1,"C",3200,4559,22368.79,4.72]
["2020-09-17",1,"C",4560,5919,28792.38,4.72]
["2020-09-17",1,"C",5920,7279,35215.96,4.72]
["2020-09-17",1,"C",7280,8639,41639.54,4.72]
["2020-09-17",1,"C",8640,9999,48063.12,4.72]
["2020-09-17",1,"C",10000,1000000,54482,0]
["2020-09-17",1,"D",0,79,1394.2,0]
["2020-09-17",1,"D",80,209,1394.2,15.75]
["2020-09-17",1,"D",210,699,3441.41,12.03]
["2020-09-17",1,"D",700,1049,9333.67,10.09]
["2020-09-17",1,"D",1050,1999,12866.25,8.75]
["2020-09-17",1,"D",2000,3599,21180.65,8]
["2020-09-17",1,"D",3600,5199,33978.67,8]
["2020-09-17",1,"D",5200,6799,46776.7,8]
["2020-09-17",1,"D",6800,8399,59574.74,8]
["2020-09-17",1,"D",8400,9999,72372.77,8]
["2020-09-17",1,"D",10000,1000000,85162.8,0]
["2020-09-17",1,"E",0,39,352.72,0]
["2020-09-17",1,"E",40,69,352.72,9.52]
["2020-09-17",1,"E",70,129,638.20000000000005,8.57]
["2020-09-17",1,"E",130,599,1152.58,8.2899999999999991]
["2020-09-17",1,"E",600,1349,5049.74,5.44]
["2020-09-17",1,"E",1350,2999,9131.9599999999991,2.39]
["2020-09-17",1,"E",3000,4749,13072.77,2.39]
["2020-09-17",1,"E",4750,6499,17252.41,2.39]
["2020-09-17",1,"E",6500,8249,21432.04,2.39]
["2020-09-17",1,"E",8250,9999,25611.69,2.39]
["2020-09-17",1,"E",10000,1000000,29788.93,0]
["2020-09-17",1,"F",0,49,357.6,0]
["2020-09-17",1,"F",50,229,357.6,7.31]
["2020-09-17",1,"F",230,699,1673.21,6.96]
["2020-09-17",1,"F",700,1399,4946.6400000000003,5.6]
["2020-09-17",1,"F",1400,1949,8865.7999999999993,4.32]
["2020-09-17",1,"F",1950,3549,11242.37,2.16]
["2020-09-17",1,"F",3550,5149,14691.41,2.16]
["2020-09-17",1,"F",5150,6749,18140.45,2.16]
["2020-09-17",1,"F",6750,8349,21589.49,2.16]
["2020-09-17",1,"F",8350,9999,25038.53,2.16]
["2020-09-17",1,"F",10000,1000000,28593.21,0]
["2020-09-17",1,"G",0,49,357.6,0]
["2020-09-17",1,"G",50,229,357.6,7.31]
["2020-09-17",1,"G",230,699,1673.21,6.96]
["2020-09-17",1,"G",700,1399,4946.6400000000003,5.6]
["2020-09-17",1,"G",1400,1949,8865.7999999999993,4.32]
["2020-09-17",1,"G",1950,3549,11242.37,2.16]
["2020-09-17",1,"G",3550,5149,14691.41,2.16]
["2020-09-17",1,"G",5150,6749,18140.45,2.16]
["2020-09-17",1,"G",6750,8349,21589.49,2.16]
["2020-09-17",1,"G",8350,9999,25038.53,2.16]
["2020-09-17",1,"G",10000,1000000,28593.21,0]
["2020-09-17",1,"H",0,39,357.75,0]
["2020-09-17",1,"H",40,249,357.75,8.6]
["2020-09-17",1,"H",250,619,2162.92,7.15]
["2020-09-17",1,"H",620,1299,4807.79,5.31]
["2020-09-17",1,"H",1300,2999,8418.74,4.21]
["2020-09-17",1,"H",3000,4999,15583.59,2.27]
["2020-09-17",1,"H",5000,5999,20129.84,2.27]
["2020-09-17",1,"H",6000,6999,22402.9,2.27]
["2020-09-17",1,"H",7000,7999,24676.03,2.27]
["2020-09-17",1,"H",8000,8999,26949.15,2.27]
["2020-09-17",1,"H",9000,9999,29222.28,2.27]
["2020-09-17",1,"H",10000,1000000,31493.13,0]
["2020-09-17",1,"I",0,39,357.44,0]
["2020-09-17",1,"I",40,369,357.44,9.14]
["2020-09-17",1,"I",370,799,3373.66,9.09]
["2020-09-17",1,"I",800,1299,7282.43,8.99]
["2020-09-17",1,"I",1300,2699,11779.02,7.08]
["2020-09-17",1,"I",2700,4199,21697.63,3.04]
["2020-09-17",1,"I",4200,5359,26264.52,3.04]
["2020-09-17",1,"I",5360,6519,29796.25,3.04]
["2020-09-17",1,"I",6520,7679,33327.97,3.04]
["2020-09-17",1,"I",7680,8839,36859.71,3.04]
["2020-09-17",1,"I",8840,9999,40391.43,3.04]
["2020-09-17",1,"I",10000,1000000,43920.11,0]
["2020-09-17",1,"J",0,79,1467.58,0]
["2020-09-17",1,"J",80,209,1467.58,16.579999999999998]
["2020-09-17",1,"J",210,699,3622.54,12.66]
["2020-09-17",1,"J",700,1049,9824.91,10.62]
["2020-09-17",1,"J",1050,1999,13543.42,9.2100000000000009]
["2020-09-17",1,"J",2000,3599,22295.42,8.42]
["2020-09-17",1,"J",3600,5199,35767.03,8.42]
["2020-09-17",1,"J",5200,6799,49238.64,8.42]
["2020-09-17",1,"J",6800,8399,62710.26,8.42]
["2020-09-17",1,"J",8400,9999,76181.87,8.42]
["2020-09-17",1,"J",10000,1000000,89645.06,0]
["2020-09-17",1,"K",0,119,1031.82,0]
["2020-09-17",1,"K",120,734,1031.82,8.66]
["2020-09-17",1,"K",735,1289,6356.06,8.7200000000000006]
["2020-09-17",1,"K",1290,2399,11193.67,8.8699999999999992]
["2020-09-17",1,"K",2400,4499,21042.53,8.84]
["2020-09-17",1,"K",4500,7999,39605.74,8.84]
["2020-09-17",1,"K",8000,8399,70544.399999999994,8.84]
["2020-09-17",1,"K",8400,8799,74080.240000000005,8.84]
["2020-09-17",1,"K",8800,9199,77616.08,8.84]
["2020-09-17",1,"K",9200,9599,81151.94,8.84]
["2020-09-17",1,"K",9600,9999,84687.78,8.84]
["2020-09-17",1,"K",10000,1000000,88214.79,0]
["2020-09-17",2,"A",0,79,904.58,0]
["2020-09-17",2,"A",80,249,904.58,10.7]
["2020-09-17",2,"A",250,999,2722.89,6.71]
["2020-09-17",2,"A",1000,2799,7757.9,3.92]
["2020-09-17",2,"A",2800,4599,14820.75,3.92]
["2020-09-17",2,"A",4600,6399,21883.61,3.11]
["2020-09-17",2,"A",6400,8199,27490.35,3.11]
["2020-09-17",2,"A",8200,9999,33097.089999999997,3.11]
["2020-09-17",2,"A",10000,1000000,38700.71,0]
["2020-09-17",2,"B",0,69,709.15,0]
["2020-09-17",2,"B",70,249,709.15,7.83]
["2020-09-17",2,"B",250,999,2117.67,3.66]
["2020-09-17",2,"B",1000,2799,4864.5600000000004,2.44]
["2020-09-17",2,"B",2800,4599,9255.51,2.44]
["2020-09-17",2,"B",4600,6399,13646.46,2.0499999999999998]
["2020-09-17",2,"B",6400,8199,17338.490000000002,2.0499999999999998]
["2020-09-17",2,"B",8200,9999,21030.5,2.0499999999999998]
["2020-09-17",2,"B",10000,1000000,24720.46,0]
["2020-09-17",2,"C",0,39,524.84,0]
["2020-09-17",2,"C",40,249,524.84,3.92]
["2020-09-17",2,"C",250,999,1348.77,2.25]
["2020-09-17",2,"C",1000,2799,3033.06,1.43]
["2020-09-17",2,"C",2800,4599,5607.48,1.43]
["2020-09-17",2,"C",4600,6399,8181.89,1.43]
["2020-09-17",2,"C",6400,8199,10756.31,1.43]
["2020-09-17",2,"C",8200,9999,13330.74,1.43]
["2020-09-17",2,"C",10000,1000000,15903.73,0]
["2020-09-17",2,"D",0,79,859.35,0]
["2020-09-17",2,"D",80,249,859.35,10.14]
["2020-09-17",2,"D",250,999,2582.5,6.11]
["2020-09-17",2,"D",1000,2799,7163.76,3.61]
["2020-09-17",2,"D",2800,4599,13655.74,3.61]
["2020-09-17",2,"D",4600,6399,20147.71,2.96]
["2020-09-17",2,"D",6400,8199,25474.79,2.96]
["2020-09-17",2,"D",8200,9999,30801.87,2.96]
["2020-09-17",2,"D",10000,1000000,36125.980000000003,0]
["2020-09-17",2,"E",0,39,233.03,0]
["2020-09-17",2,"E",40,249,233.03,4.5999999999999996]
["2020-09-17",2,"E",250,999,1199.43,1.46]
["2020-09-17",2,"E",1000,2799,2291.54,0.61]
["2020-09-17",2,"E",2800,4599,3390.26,0.61]
["2020-09-17",2,"E",4600,6399,4488.97,0.61]
["2020-09-17",2,"E",6400,8199,5587.69,0.61]
["2020-09-17",2,"E",8200,9999,6686.41,0.61]
["2020-09-17",2,"E",10000,1000000,7784.51,0]
["2020-09-17",2,"F",0,49,224.22,0]
["2020-09-17",2,"F",50,249,224.22,4.42]
["2020-09-17",2,"F",250,999,1107.53,1.79]
["2020-09-17",2,"F",1000,2799,2450.39,0.7]
["2020-09-17",2,"F",2800,4599,3704.67,0.7]
["2020-09-17",2,"F",4600,6399,4958.9399999999996,0.7]
["2020-09-17",2,"F",6400,8199,6213.21,0.7]
["2020-09-17",2,"F",8200,9999,7467.49,0.7]
["2020-09-17",2,"F",10000,1000000,8721.06,0]
["2020-09-17",2,"G",0,49,224.22,0]
["2020-09-17",2,"G",50,249,224.22,4.42]
["2020-09-17",2,"G",250,999,1107.53,1.79]
["2020-09-17",2,"G",1000,2799,2450.39,0.7]
["2020-09-17",2,"G",2800,4599,3704.67,0.7]
["2020-09-17",2,"G",4600,6399,4958.9399999999996,0.7]
["2020-09-17",2,"G",6400,8199,6213.21,0.7]
["2020-09-17",2,"G",8200,9999,7467.49,0.7]
["2020-09-17",2,"G",10000,1000000,8721.06,0]
["2020-09-17",2,"H",0,39,237,0]
["2020-09-17",2,"H",40,249,237,4.26]
["2020-09-17",2,"H",250,999,1131.6099999999999,1.56]
["2020-09-17",2,"H",1000,2799,2298.1999999999998,0.7]
["2020-09-17",2,"H",2800,4599,3550.79,0.7]
["2020-09-17",2,"H",4600,6399,4803.37,0.7]
["2020-09-17",2,"H",6400,8199,6055.96,0.7]
["2020-09-17",2,"H",8200,9999,7308.55,0.7]
["2020-09-17",2,"H",10000,1000000,8560.44,0]
["2020-09-17",2,"I",0,39,253.68,0]
["2020-09-17",2,"I",40,249,253.68,5.92]
["2020-09-17",2,"I",250,999,1496.8,2.31]
["2020-09-17",2,"I",1000,2799,3231.91,0.9]
["2020-09-17",2,"I",2800,4599,4847.3599999999997,0.9]
["2020-09-17",2,"I",4600,6399,6462.79,0.9]
["2020-09-17",2,"I",6400,8199,8078.23,0.9]
["2020-09-17",2,"I",8200,9999,9693.67,0.9]
["2020-09-17",2,"I",10000,1000000,11308.2,0]
["2020-09-17",2,"J",0,79,904.58,0]
["2020-09-17",2,"J",80,249,904.58,10.7]
["2020-09-17",2,"J",250,999,2722.89,6.71]
["2020-09-17",2,"J",1000,2799,7757.9,3.92]
["2020-09-17",2,"J",2800,4599,14820.75,3.92]
["2020-09-17",2,"J",4600,6399,21883.61,3.11]
["2020-09-17",2,"J",6400,8199,27490.35,3.11]
["2020-09-17",2,"J",8200,9999,33097.089999999997,3.11]
["2020-09-17",2,"J",10000,1000000,38700.71,0]
["2020-09-17",2,"K",0,119,773.86,0]
["2020-09-17",2,"K",120,249,773.86,6.55]
["2020-09-17",2,"K",250,999,1624.85,5.0199999999999996]
["2020-09-17",2,"K",1000,2799,5388.98,4.3899999999999997]
["2020-09-17",2,"K",2800,4599,13299.04,4.3899999999999997]
["2020-09-17",2,"K",4600,6399,21209.119999999999,3.75]
["2020-09-17",2,"K",6400,8199,27954.29,3.75]
["2020-09-17",2,"K",8200,9999,34699.46,3.75]
["2020-09-17",2,"K",10000,1000000,41440.89,0]
["2020-09-17",3,"A",0,79,680.39,0]
["2020-09-17",3,"A",80,399,680.39,5.62]
["2020-09-17",3,"A",400,999,2478.29,2.96]
["2020-09-17",3,"A",1000,2799,4256.09,1.89]
["2020-09-17",3,"A",2800,4599,7666.89,1.89]
["2020-09-17",3,"A",4600,6399,11077.68,1.1200000000000001]
["2020-09-17",3,"A",6400,8199,13090.6,1.1200000000000001]
["2020-09-17",3,"A",8200,9999,15103.53,1.1200000000000001]
["2020-09-17",3,"A",10000,1000000,17115.330000000002,0]
["2020-09-17",3,"B",0,69,556.11,0]
["2020-09-17",3,"B",70,399,556.11,4.5199999999999996]
["2020-09-17",3,"B",400,999,2046.59,2.2799999999999998]
["2020-09-17",3,"B",1000,2799,3411.75,1.45]
["2020-09-17",3,"B",2800,4599,6025.92,1.45]
["2020-09-17",3,"B",4600,6399,8640.11,1.06]
["2020-09-17",3,"B",6400,8199,10555.35,1.06]
["2020-09-17",3,"B",8200,9999,12470.6,1.06]
["2020-09-17",3,"B",10000,1000000,14384.78,0]
["2020-09-17",3,"C",0,39,442.91,0]
["2020-09-17",3,"C",40,399,442.91,2.66]
["2020-09-17",3,"C",400,999,1401.88,1.46]
["2020-09-17",3,"C",1000,2799,2276.27,0.79]
["2020-09-17",3,"C",2800,4599,3699.93,0.79]
["2020-09-17",3,"C",4600,6399,5123.6099999999997,0.79]
["2020-09-17",3,"C",6400,8199,6547.28,0.79]
["2020-09-17",3,"C",8200,9999,7970.95,0.79]
["2020-09-17",3,"C",10000,1000000,9393.82,0]
["2020-09-17",3,"D",0,79,646.36,0]
["2020-09-17",3,"D",80,399,646.36,5.23]
["2020-09-17",3,"D",400,999,2320.66,2.75]
["2020-09-17",3,"D",1000,2799,3968.37,1.71]
["2020-09-17",3,"D",2800,4599,7046.2,1.71]
["2020-09-17",3,"D",4600,6399,10124.030000000001,1.06]
["2020-09-17",3,"D",6400,8199,12036.98,1.06]
["2020-09-17",3,"D",8200,9999,13949.91,1.06]
["2020-09-17",3,"D",10000,1000000,15861.79,0]
["2020-09-17",3,"E",0,39,184.7,0]
["2020-09-17",3,"E",40,399,184.7,2.92]
["2020-09-17",3,"E",400,999,1237.24,1.25]
["2020-09-17",3,"E",1000,2799,1989.07,0.46]
["2020-09-17",3,"E",2800,4599,2819.7,0.46]
["2020-09-17",3,"E",4600,6399,3650.33,0.46]
["2020-09-17",3,"E",6400,8199,4480.96,0.46]
["2020-09-17",3,"E",8200,9999,5311.59,0.46]
["2020-09-17",3,"E",10000,1000000,6141.75,0]
["2020-09-17",3,"F",0,49,195.81,0]
["2020-09-17",3,"F",50,399,195.81,2.83]
["2020-09-17",3,"F",400,999,1187.73,0.99]
["2020-09-17",3,"F",1000,2799,1781.21,0.32]
["2020-09-17",3,"F",2800,4599,2354.0700000000002,0.32]
["2020-09-17",3,"F",4600,6399,2926.93,0.32]
["2020-09-17",3,"F",6400,8199,3499.78,0.32]
["2020-09-17",3,"F",8200,9999,4072.64,0.32]
["2020-09-17",3,"F",10000,1000000,4645.18,0]
["2020-09-17",3,"G",0,49,195.81,0]
["2020-09-17",3,"G",50,399,195.81,2.83]
["2020-09-17",3,"G",400,999,1187.73,0.99]
["2020-09-17",3,"G",1000,2799,1781.21,0.32]
["2020-09-17",3,"G",2800,4599,2354.0700000000002,0.32]
["2020-09-17",3,"G",4600,6399,2926.93,0.32]
["2020-09-17",3,"G",6400,8199,3499.78,0.32]
["2020-09-17",3,"G",8200,9999,4072.64,0.32]
["2020-09-17",3,"G",10000,1000000,4645.18,0]
["2020-09-17",3,"H",0,39,190.97,0]
["2020-09-17",3,"H",40,399,190.97,2.79]
["2020-09-17",3,"H",400,999,1196.5899999999999,0.99]
["2020-09-17",3,"H",1000,2799,1790.74,0.32]
["2020-09-17",3,"H",2800,4599,2359.85,0.32]
["2020-09-17",3,"H",4600,6399,2928.98,0.32]
["2020-09-17",3,"H",6400,8199,3498.1,0.32]
["2020-09-17",3,"H",8200,9999,4067.22,0.32]
["2020-09-17",3,"H",10000,1000000,4636,0]
["2020-09-17",3,"I",0,39,174.6,0]
["2020-09-17",3,"I",40,399,174.6,3.12]
["2020-09-17",3,"I",400,999,1298.52,1.36]
["2020-09-17",3,"I",1000,2799,2116.29,0.51]
["2020-09-17",3,"I",2800,4599,3033.02,0.51]
["2020-09-17",3,"I",4600,6399,3949.75,0.51]
["2020-09-17",3,"I",6400,8199,4866.4799999999996,0.51]
["2020-09-17",3,"I",8200,9999,5783.22,0.51]
["2020-09-17",3,"I",10000,1000000,6699.45,0]
["2020-09-17",3,"J",0,79,680.39,0]
["2020-09-17",3,"J",80,399,680.39,5.62]
["2020-09-17",3,"J",400,999,2478.29,2.96]
["2020-09-17",3,"J",1000,2799,4256.09,1.89]
["2020-09-17",3,"J",2800,4599,7666.89,1.89]
["2020-09-17",3,"J",4600,6399,11077.68,1.1200000000000001]
["2020-09-17",3,"J",6400,8199,13090.6,1.1200000000000001]
["2020-09-17",3,"J",8200,9999,15103.53,1.1200000000000001]
["2020-09-17",3,"J",10000,1000000,17115.330000000002,0]
["2020-09-17",3,"K",0,119,640.84,0]
["2020-09-17",3,"K",120,399,640.84,5.26]
["2020-09-17",3,"K",400,999,2113.13,2.93]
["2020-09-17",3,"K",1000,2799,3869.24,2.73]
["2020-09-17",3,"K",2800,4599,8775.5499999999993,2.73]
["2020-09-17",3,"K",4600,6399,13681.86,2.08]
["2020-09-17",3,"K",6400,8199,17423.28,2.08]
["2020-09-17",3,"K",8200,9999,21164.71,2.08]
["2020-09-17",3,"K",10000,1000000,24904.04,0]
["2022-09-30",1,"A",0,79,1687.72,0]
["2022-09-30",1,"A",80,209,1687.72,16.579999999999998]
["2022-09-30",1,"A",210,699,3842.68,12.66]
["2022-09-30",1,"A",700,1049,10045.049999999999,10.62]
["2022-09-30",1,"A",1050,1999,13763.56,9.2100000000000009]
["2022-09-30",1,"A",2000,3599,22515.56,8.42]
["2022-09-30",1,"A",3600,5199,35987.17,8.42]
["2022-09-30",1,"A",5200,6799,49458.78,8.42]
["2022-09-30",1,"A",6800,8399,62930.400000000001,8.42]
["2022-09-30",1,"A",8400,9999,76402.009999999995,8.42]
["2022-09-30",1,"A",10000,1000000,89865.2,0]
["2022-09-30",1,"B",0,69,1262.31,0]
["2022-09-30",1,"B",70,199,1262.31,12.81]
["2022-09-30",1,"B",200,499,2927.25,11.44]
["2022-09-30",1,"B",500,899,6360.03,9.6300000000000008]
["2022-09-30",1,"B",900,1299,10212.86,8.09]
["2022-09-30",1,"B",1300,1999,13449.68,7.09]
["2022-09-30",1,"B",2000,3299,18414.16,7.09]
["2022-09-30",1,"B",3300,4999,27633.89,7.09]
["2022-09-30",1,"B",5000,5999,39690.47,7.09]
["2022-09-30",1,"B",6000,7999,46782.58,7.09]
["2022-09-30",1,"B",8000,8999,60966.79,7.09]
["2022-09-30",1,"B",9000,9999,68058.89,7.09]
["2022-09-30",1,"B",10000,1000000,75143.91,0]
["2022-09-30",1,"C",0,39,850.53,0]
["2022-09-30",1,"C",40,299,850.53,10.57]
["2022-09-30",1,"C",300,799,3597.48,9.23]
["2022-09-30",1,"C",800,1249,8212.68,7.73]
["2022-09-30",1,"C",1250,1999,11689.03,6.83]
["2022-09-30",1,"C",2000,3199,16811.87,4.72]
["2022-09-30",1,"C",3200,4559,22479.73,4.72]
["2022-09-30",1,"C",4560,5919,28903.32,4.72]
["2022-09-30",1,"C",5920,7279,35326.9,4.72]
["2022-09-30",1,"C",7280,8639,41750.480000000003,4.72]
["2022-09-30",1,"C",8640,9999,48174.06,4.72]
["2022-09-30",1,"C",10000,1000000,54592.94,0]
["2022-09-30",1,"D",0,79,1603.33,0]
["2022-09-30",1,"D",80,209,1603.33,15.75]
["2022-09-30",1,"D",210,699,3650.54,12.03]
["2022-09-30",1,"D",700,1049,9542.7999999999993,10.09]
["2022-09-30",1,"D",1050,1999,13075.38,8.75]
["2022-09-30",1,"D",2000,3599,21389.78,8]
["2022-09-30",1,"D",3600,5199,34187.800000000003,8]
["2022-09-30",1,"D",5200,6799,46985.83,8]
["2022-09-30",1,"D",6800,8399,59783.87,8]
["2022-09-30",1,"D",8400,9999,72581.899999999994,8]
["2022-09-30",1,"D",10000,1000000,85371.93,0]
["2022-09-30",1,"E",0,39,405.63,0]
["2022-09-30",1,"E",40,69,405.63,9.52]
["2022-09-30",1,"E",70,129,691.11,8.57]
["2022-09-30",1,"E",130,599,1205.49,8.2899999999999991]
["2022-09-30",1,"E",600,1349,5102.6499999999996,5.44]
["2022-09-30",1,"E",1350,2999,9184.8700000000008,2.39]
["2022-09-30",1,"E",3000,4749,13125.68,2.39]
["2022-09-30",1,"E",4750,6499,17305.32,2.39]
["2022-09-30",1,"E",6500,8249,21484.95,2.39]
["2022-09-30",1,"E",8250,9999,25664.6,2.39]
["2022-09-30",1,"E",10000,1000000,29841.84,0]
["2022-09-30",1,"F",0,49,411.24,0]
["2022-09-30",1,"F",50,229,411.24,7.31]
["2022-09-30",1,"F",230,699,1726.85,6.96]
["2022-09-30",1,"F",700,1399,5000.28,5.6]
["2022-09-30",1,"F",1400,1949,8919.44,4.32]
["2022-09-30",1,"F",1950,3549,11296.01,2.16]
["2022-09-30",1,"F",3550,5149,14744.05,2.16]
["2022-09-30",1,"F",5150,6749,18194.09,2.16]
["2022-09-30",1,"F",6750,8349,21643.13,2.16]
["2022-09-30",1,"F",8350,9999,25092.17,2.16]
["2022-09-30",1,"F",10000,1000000,28646.85,0]
["2022-09-30",1,"G",0,49,411.24,0]
["2022-09-30",1,"G",50,229,411.24,7.31]
["2022-09-30",1,"G",230,699,1726.85,6.96]
["2022-09-30",1,"G",700,1399,5000.28,5.6]
["2022-09-30",1,"G",1400,1949,8919.44,4.32]
["2022-09-30",1,"G",1950,3549,11296.01,2.16]
["2022-09-30",1,"G",3550,5149,14744.05,2.16]
["2022-09-30",1,"G",5150,6749,18194.09,2.16]
["2022-09-30",1,"G",6750,8349,21643.13,2.16]
["2022-09-30",1,"G",8350,9999,25092.17,2.16]
["2022-09-30",1,"G",10000,1000000,28646.85,0]
["2022-09-30",1,"H",0,39,411.41,0]
["2022-09-30",1,"H",40,249,411.41,8.6]
["2022-09-30",1,"H",250,619,2216.58,7.15]
["2022-09-30",1,"H",620,1299,4861.45,5.31]
["2022-09-30",1,"H",1300,2999,8472.4,4.21]
["2022-09-30",1,"H",3000,4999,15637.25,2.27]
["2022-09-30",1,"H",5000,5999,20183.5,2.27]
["2022-09-30",1,"H",6000,6999,22456.560000000001,2.27]
["2022-09-30",1,"H",7000,7999,24729.69,2.27]
["2022-09-30",1,"H",8000,8999,27002.81,2.27]
["2022-09-30",1,"H",9000,9999,29275.94,2.27]
["2022-09-30",1,"H",10000,1000000,31546.79,0]
["2022-09-30",1,"I",0,39,411.06,0]
["2022-09-30",1,"I",40,369,411.06,9.14]
["2022-09-30",1,"I",370,799,3427.28,9.09]
["2022-09-30",1,"I",800,1299,7336.05,8.99]
["2022-09-30",1,"I",1300,2699,11832.64,7.08]
["2022-09-30",1,"I",2700,4199,21751.25,3.04]
["2022-09-30",1,"I",4200,5359,26318.14,3.04]
["2022-09-30",1,"I",5360,6519,29849.87,3.04]
["2022-09-30",1,"I",6520,7679,33381.589999999997,3.04]
["2022-09-30",1,"I",7680,8839,36913.33,3.04]
["2022-09-30",1,"I",8840,9999,40445.050000000003,3.04]
["2022-09-30",1,"I",10000,1000000,43973.73,0]
["2022-09-30",1,"J",0,79,1687.72,0]
["2022-09-30",1,"J",80,209,1687.72,16.579999999999998]
["2022-09-30",1,"J",210,699,3842.68,12.66]
["2022-09-30",1,"J",700,1049,10045.049999999999,10.62]
["2022-09-30",1,"J",1050,1999,13763.56,9.2100000000000009]
["2022-09-30",1,"J",2000,3599,22515.56,8.42]
["2022-09-30",1,"J",3600,5199,35987.17,8.42]
["2022-09-30",1,"J",5200,6799,49458.78,8.42]
["2022-09-30",1,"J",6800,8399,62930.400000000001,8.42]
["2022-09-30",1,"J",8400,9999,76402.009999999995,8.42]
["2022-09-30",1,"J",10000,1000000,89865.2,0]
["2022-09-30",1,"K",0,119,1186.5899999999999,0]
["2022-09-30",1,"K",120,734,1186.5899999999999,8.66]
["2022-09-30",1,"K",735,1289,6510.83,8.7200000000000006]
["2022-09-30",1,"K",1290,2399,11348.44,8.8699999999999992]
["2022-09-30",1,"K",2400,4499,21197.3,8.84]
["2022-09-30",1,"K",4500,7999,39760.51,8.84]
["2022-09-30",1,"K",8000,8399,70699.17,8.84]
["2022-09-30",1,"K",8400,8799,74235.009999999995,8.84]
["2022-09-30",1,"K",8800,9199,77770.850000000006,8.84]
["2022-09-30",1,"K",9200,9599,81306.710000000006,8.84]
["2022-09-30",1,"K",9600,9999,84842.55,8.84]
["2022-09-30",1,"K",10000,1000000,88369.56,0]
["2022-09-30",2,"A",0,79,1040.27,0]
["2022-09-30",2,"A",80,249,1040.27,10.7]
["2022-09-30",2,"A",250,999,2858.58,6.71]
["2022-09-30",2,"A",1000,2799,7893.59,3.92]
["2022-09-30",2,"A",2800,4599,14956.44,3.92]
["2022-09-30",2,"A",4600,6399,22019.3,3.11]
["2022-09-30",2,"A",6400,8199,27626.04,3.11]
["2022-09-30",2,"A",8200,9999,33232.78,3.11]
["2022-09-30",2,"A",10000,1000000,38836.400000000001,0]
["2022-09-30",2,"B",0,69,815.52,0]
["2022-09-30",2,"B",70,249,815.52,7.83]
["2022-09-30",2,"B",250,999,2224.04,3.66]
["2022-09-30",2,"B",1000,2799,4970.93,2.44]
["2022-09-30",2,"B",2800,4599,9361.8799999999992,2.44]
["2022-09-30",2,"B",4600,6399,13752.83,2.0499999999999998]
["2022-09-30",2,"B",6400,8199,17444.86,2.0499999999999998]
["2022-09-30",2,"B",8200,9999,21136.87,2.0499999999999998]
["2022-09-30",2,"B",10000,1000000,24826.83,0]
["2022-09-30",2,"C",0,39,603.54999999999995,0]
["2022-09-30",2,"C",40,249,603.54999999999995,3.92]
["2022-09-30",2,"C",250,999,1427.49,2.25]
["2022-09-30",2,"C",1000,2799,3111.78,1.43]
["2022-09-30",2,"C",2800,4599,5686.2,1.43]
["2022-09-30",2,"C",4600,6399,8260.61,1.43]
["2022-09-30",2,"C",6400,8199,10835.03,1.43]
["2022-09-30",2,"C",8200,9999,13409.46,1.43]
["2022-09-30",2,"C",10000,1000000,15982.45,0]
["2022-09-30",2,"D",0,79,988.25,0]
["2022-09-30",2,"D",80,249,988.25,10.14]
["2022-09-30",2,"D",250,999,2711.4,6.11]
["2022-09-30",2,"D",1000,2799,7292.66,3.61]
["2022-09-30",2,"D",2800,4599,13784.64,3.61]
["2022-09-30",2,"D",4600,6399,20276.61,2.96]
["2022-09-30",2,"D",6400,8199,25605.69,2.96]
["2022-09-30",2,"D",8200,9999,30930.77,2.96]
["2022-09-30",2,"D",10000,1000000,36254.879999999997,0]
["2022-09-30",2,"E",0,39,267.98,0]
["2022-09-30",2,"E",40,249,267.98,4.5999999999999996]
["2022-09-30",2,"E",250,999,1234.3800000000001,1.46]
["2022-09-30",2,"E",1000,2799,2326.4899999999998,0.61]
["2022-09-30",2,"E",2800,4599,3425.21,0.61]
["2022-09-30",2,"E",4600,6399,4523.92,0.61]
["2022-09-30",2,"E",6400,8199,5622.64,0.61]
["2022-09-30",2,"E",8200,9999,6721.36,0.61]
["2022-09-30",2,"E",10000,1000000,7819.46,0]
["2022-09-30",2,"F",0,49,257.85000000000002,0]
["2022-09-30",2,"F",50,249,257.85000000000002,4.42]
["2022-09-30",2,"F",250,999,1141.1600000000001,1.79]
["2022-09-30",2,"F",1000,2799,2484.02,0.7]
["2022-09-30",2,"F",2800,4599,3738.3,0.7]
["2022-09-30",2,"F",4600,6399,4992.57,0.7]
["2022-09-30",2,"F",6400,8199,6246.84,0.7]
["2022-09-30",2,"F",8200,9999,7501.12,0.7]
["2022-09-30",2,"F",10000,1000000,8754.69,0]
["2022-09-30",2,"G",0,49,257.85000000000002,0]
["2022-09-30",2,"G",50,249,257.85000000000002,4.42]
["2022-09-30",2,"G",250,999,1141.1600000000001,1.79]
["2022-09-30",2,"G",1000,2799,2484.02,0.7]
["2022-09-30",2,"G",2800,4599,3738.3,0.7]
["2022-09-30",2,"G",4600,6399,4992.57,0.7]
["2022-09-30",2,"G",6400,8199,6246.84,0.7]
["2022-09-30",2,"G",8200,9999,7501.12,0.7]
["2022-09-30",2,"G",10000,1000000,8754.69,0]
["2022-09-30",2,"H",0,39,272.55,0]
["2022-09-30",2,"H",40,249,272.55,4.26]
["2022-09-30",2,"H",250,999,1167.1600000000001,1.56]
["2022-09-30",2,"H",1000,2799,2333.75,0.7]
["2022-09-30",2,"H",2800,4599,3586.34,0.7]
["2022-09-30",2,"H",4600,6399,4838.92,0.7]
["2022-09-30",2,"H",6400,8199,6091.51,0.7]
["2022-09-30",2,"H",8200,9999,7344.1,0.7]
["2022-09-30",2,"H",10000,1000000,8595.99,0]
["2022-09-30",2,"I",0,39,291.73,0]
["2022-09-30",2,"I",40,249,291.73,5.92]
["2022-09-30",2,"I",250,999,1534.85,2.31]
["2022-09-30",2,"I",1000,2799,3269.96,0.9]
["2022-09-30",2,"I",2800,4599,4885.41,0.9]
["2022-09-30",2,"I",4600,6399,6500.84,0.9]
["2022-09-30",2,"I",6400,8199,8116.28,0.9]
["2022-09-30",2,"I",8200,9999,9731.7199999999993,0.9]
["2022-09-30",2,"I",10000,1000000,11346.25,0]
["2022-09-30",2,"J",0,79,1040.27,0]
["2022-09-30",2,"J",80,249,1040.27,10.7]
["2022-09-30",2,"J",250,999,2858.58,6.71]
["2022-09-30",2,"J",1000,2799,7893.59,3.92]
["2022-09-30",2,"J",2800,4599,14956.44,3.92]
["2022-09-30",2,"J",4600,6399,22019.3,3.11]
["2022-09-30",2,"J",6400,8199,27626.04,3.11]
["2022-09-30",2,"J",8200,9999,33232.78,3.11]
["2022-09-30",2,"J",10000,1000000,38836.400000000001,0]
["2022-09-30",2,"K",0,119,889.94,0]
["2022-09-30",2,"K",120,249,889.94,6.55]
["2022-09-30",2,"K",250,999,1740.93,5.0199999999999996]
["2022-09-30",2,"K",1000,2799,5505.06,4.3899999999999997]
["2022-09-30",2,"K",2800,4599,13415.12,4.3899999999999997]
["2022-09-30",2,"K",4600,6399,21325.200000000001,3.75]
["2022-09-30",2,"K",6400,8199,28070.37,3.75]
["2022-09-30",2,"K",8200,9999,34815.54,3.75]
["2022-09-30",2,"K",10000,1000000,41556.97,0]
["2022-09-30",3,"A",0,79,782.45,0]
["2022-09-30",3,"A",80,399,782.45,5.62]
["2022-09-30",3,"A",400,999,2580.35,2.96]
["2022-09-30",3,"A",1000,2799,4358.1499999999996,1.89]
["2022-09-30",3,"A",2800,4599,7768.95,1.89]
["2022-09-30",3,"A",4600,6399,11179.74,1.1200000000000001]
["2022-09-30",3,"A",6400,8199,13192.66,1.1200000000000001]
["2022-09-30",3,"A",8200,9999,15205.59,1.1200000000000001]
["2022-09-30",3,"A",10000,1000000,17217.39,0]
["2022-09-30",3,"B",0,69,639.53,0]
["2022-09-30",3,"B",70,399,639.53,4.5199999999999996]
["2022-09-30",3,"B",400,999,2130.0100000000002,2.2799999999999998]
["2022-09-30",3,"B",1000,2799,3495.17,1.45]
["2022-09-30",3,"B",2800,4599,6109.34,1.45]
["2022-09-30",3,"B",4600,6399,8723.5300000000007,1.06]
["2022-09-30",3,"B",6400,8199,10638.77,1.06]
["2022-09-30",3,"B",8200,9999,12554.02,1.06]
["2022-09-30",3,"B",10000,1000000,14468.2,0]
["2022-09-30",3,"C",0,39,509.35,0]
["2022-09-30",3,"C",40,399,509.35,2.66]
["2022-09-30",3,"C",400,999,1468.32,1.46]
["2022-09-30",3,"C",1000,2799,2342.71,0.79]
["2022-09-30",3,"C",2800,4599,3766.37,0.79]
["2022-09-30",3,"C",4600,6399,5190.05,0.79]
["2022-09-30",3,"C",6400,8199,6613.72,0.79]
["2022-09-30",3,"C",8200,9999,8037.39,0.79]
["2022-09-30",3,"C",10000,1000000,9460.26,0]
["2022-09-30",3,"D",0,79,743.31,0]
["2022-09-30",3,"D",80,399,743.31,5.23]
["2022-09-30",3,"D",400,999,2417.61,2.75]
["2022-09-30",3,"D",1000,2799,4065.32,1.71]
["2022-09-30",3,"D",2800,4599,7143.15,1.71]
["2022-09-30",3,"D",4600,6399,10220.98,1.06]
["2022-09-30",3,"D",6400,8199,12133.93,1.06]
["2022-09-30",3,"D",8200,9999,14046.86,1.06]
["2022-09-30",3,"D",10000,1000000,15958.74,0]
["2022-09-30",3,"E",0,39,212.4,0]
["2022-09-30",3,"E",40,399,212.4,2.92]
["2022-09-30",3,"E",400,999,1264.94,1.25]
["2022-09-30",3,"E",1000,2799,2016.77,0.46]
["2022-09-30",3,"E",2800,4599,2847.4,0.46]
["2022-09-30",3,"E",4600,6399,3678.03,0.46]
["2022-09-30",3,"E",6400,8199,4508.66,0.46]
["2022-09-30",3,"E",8200,9999,5339.29,0.46]
["2022-09-30",3,"E",10000,1000000,6169.45,0]
["2022-09-30",3,"F",0,49,225.18,0]
["2022-09-30",3,"F",50,399,225.18,2.83]
["2022-09-30",3,"F",400,999,1217.0999999999999,0.99]
["2022-09-30",3,"F",1000,2799,1810.58,0.32]
["2022-09-30",3,"F",2800,4599,2383.44,0.32]
["2022-09-30",3,"F",4600,6399,2956.3,0.32]
["2022-09-30",3,"F",6400,8199,3529.15,0.32]
["2022-09-30",3,"F",8200,9999,4102.01,0.32]
["2022-09-30",3,"F",10000,1000000,4674.55,0]
["2022-09-30",3,"G",0,49,225.18,0]
["2022-09-30",3,"G",50,399,225.18,2.83]
["2022-09-30",3,"G",400,999,1217.0999999999999,0.99]
["2022-09-30",3,"G",1000,2799,1810.58,0.32]
["2022-09-30",3,"G",2800,4599,2383.44,0.32]
["2022-09-30",3,"G",4600,6399,2956.3,0.32]
["2022-09-30",3,"G",6400,8199,3529.15,0.32]
["2022-09-30",3,"G",8200,9999,4102.01,0.32]
["2022-09-30",3,"G",10000,1000000,4674.55,0]
["2022-09-30",3,"H",0,39,219.62,0]
["2022-09-30",3,"H",40,399,219.62,2.79]
["2022-09-30",3,"H",400,999,1225.24,0.99]
["2022-09-30",3,"H",1000,2799,1819.39,0.32]
["2022-09-30",3,"H",2800,4599,2388.5,0.32]
["2022-09-30",3,"H",4600,6399,2957.63,0.32]
["2022-09-30",3,"H",6400,8199,3526.75,0.32]
["2022-09-30",3,"H",8200,9999,4095.87,0.32]
["2022-09-30",3,"H",10000,1000000,4664.6499999999996,0]
["2022-09-30",3,"I",0,39,200.79,0]
["2022-09-30",3,"I",40,399,200.79,3.12]
["2022-09-30",3,"I",400,999,1324.71,1.36]
["2022-09-30",3,"I",1000,2799,2142.48,0.51]
["2022-09-30",3,"I",2800,4599,3059.21,0.51]
["2022-09-30",3,"I",4600,6399,3975.94,0.51]
["2022-09-30",3,"I",6400,8199,4892.67,0.51]
["2022-09-30",3,"I",8200,9999,5809.41,0.51]
["2022-09-30",3,"I",10000,1000000,6725.64,0]
["2022-09-30",3,"J",0,79,782.45,0]
["2022-09-30",3,"J",80,399,782.45,5.62]
["2022-09-30",3,"J",400,999,2580.35,2.96]
["2022-09-30",3,"J",1000,2799,4358.1499999999996,1.89]
["2022-09-30",3,"J",2800,4599,7768.95,1.89]
["2022-09-30",3,"J",4600,6399,11179.74,1.1200000000000001]
["2022-09-30",3,"J",6400,8199,13192.66,1.1200000000000001]
["2022-09-30",3,"J",8200,9999,15205.59,1.1200000000000001]
["2022-09-30",3,"J",10000,1000000,17217.39,0]
["2022-09-30",3,"K",0,119,736.97,0]
["2022-09-30",3,"K",120,399,736.97,5.26]
["2022-09-30",3,"K",400,999,2209.2600000000002,2.93]
["2022-09-30",3,"K",1000,2799,3965.37,2.73]
["2022-09-30",3,"K",2800,4599,8871.68,2.73]
["2022-09-30",3,"K",4600,6399,13777.99,2.08]
["2022-09-30",3,"K",6400,8199,17519.41,2.08]
["2022-09-30",3,"K",8200,9999,21260.84,2.08]
["2022-09-30",3,"K",10000,1000000,25000.17,0]

{"sheet":"Trial Length Proxys","index":4,"n_rows":2201,"n_cols":3,"rows_kept":2201,"cut":false,"hidden":true,"merged":[]}
["Class Code","Length of Trial in Days","Trial Length Proxy"]
["A",1,0]
["A",2,0]
["A",3,252.54]
["A",4,769.79]
["A",5,1261.1600000000001]
["A",6,1761.17]
["A",7,2253.87]
["A",8,2746.56]
["A",9,3210.92]
["A",10,3675.29]
["A",11,4143.1000000000004]
["A",12,4607.74]
["A",13,5072.3900000000003]
["A",14,5537.03]
["A",15,6001.68]
["A",16,6466.32]
["A",17,6930.96]
["A",18,7395.6]
["A",19,7860.25]
["A",20,8324.89]
["A",21,8798.4]
["A",22,9271.81]
["A",23,9737.2099999999991]
["A",24,10202.620000000001]
["A",25,10668.04]
["A",26,11133.44]
["A",27,11598.84]
["A",28,12064.25]
["A",29,12529.67]
["A",30,12995.07]
["A",31,13460.48]
["A",32,13925.88]
["A",33,14391.3]
["A",34,14856.7]
["A",35,15322.11]
["A",36,15787.52]
["A",37,16252.93]
["A",38,16718.330000000002]
["A",39,17183.740000000002]
["A",40,17622.38]
["A",41,18063.400000000001]
["A",42,18504.54]
["A",43,18945.79]
["A",44,19387.150000000001]
["A",45,19828.61]
["A",46,20270.18]
["A",47,20711.849999999999]
["A",48,21153.65]
["A",49,21595.54]
["A",50,22037.53]
["A",51,22479.65]
["A",52,22921.86]
["A",53,23364.19]
["A",54,23806.62]
["A",55,24249.16]
["A",56,24691.8]
["A",57,25134.560000000001]
["A",58,25577.42]
["A",59,26020.39]
["A",60,26463.47]
["A",61,26906.66]
["A",62,27349.94]
["A",63,27793.35]
["A",64,28236.86]
["A",65,28680.48]
["A",66,29124.2]
["A",67,29568.03]
["A",68,30011.97]
["A",69,30456.02]
["A",70,30900.17]
["A",71,31344.44]
["A",72,31788.81]
["A",73,32233.279999999999]
["A",74,32677.87]
["A",75,33122.559999999998]
["A",76,33567.360000000001]
["A",77,34012.28]
["A",78,34457.29]
["A",79,34902.42]
["A",80,35347.65]
["A",81,35792.99]
["A",82,36238.43]
["A",83,36683.99]
["A",84,37129.65]
["A",85,37575.42]
["A",86,38021.300000000003]
["A",87,38467.29]
["A",88,38913.39]
["A",89,39359.589999999997]
["A",90,39805.9]
["A",91,40252.32]
["A",92,40698.83]
["A",93,41145.47]
["A",94,41592.21]
["A",95,42039.06]
["A",96,42486.02]
["A",97,42933.08]
["A",98,43380.25]
["A",99,43827.53]
["A",100,44274.91]
["A",101,44722.41]
["A",102,45170.01]
["A",103,45617.73]
["A",104,46065.54]
["A",105,46513.46]
["A",106,46961.5]
["A",107,47409.64]
["A",108,47857.89]
["A",109,48306.239999999998]
["A",110,48754.7]
["A",111,49203.28]
["A",112,49651.95]
["A",113,50100.74]
["A",114,50549.63]
["A",115,50998.64]
["A",116,51447.75]
["A",117,51896.97]
["A",118,52346.29]
["A",119,52795.73]
["A",120,53245.27]
["A",121,53694.91]
["A",122,54137.91]
["A",123,54580.9]
["A",124,55023.91]
["A",125,55466.9]
["A",126,55909.89]
["A",127,56352.9]
["A",128,56795.89]
["A",129,57238.879999999997]
["A",130,57681.88]
["A",131,58124.87]
["A",132,58567.87]
["A",133,59010.87]
["A",134,59453.86]
["A",135,59896.86]
["A",136,60339.86]
["A",137,60782.85]
["A",138,61225.85]
["A",139,61668.84]
["A",140,62111.839999999997]
["A",141,62554.83]
["A",142,62997.82]
["A",143,63440.83]
["A",144,63883.82]
["A",145,64326.82]
["A",146,64769.82]
["A",147,65212.81]
["A",148,65655.81]
["A",149,66098.81]
["A",150,66541.8]
["A",151,66984.789999999994]
["A",152,67427.789999999994]
["A",153,67870.78]
["A",154,68313.78]
["A",155,68756.78]
["A",156,69199.78]
["A",157,69642.77]
["A",158,70085.77]
["A",159,70528.77]
["A",160,70971.759999999995]
["A",161,71414.759999999995]
["A",162,71857.75]
["A",163,72300.740000000005]
["A",164,72743.740000000005]
["A",165,73186.740000000005]
["A",166,73629.73]
["A",167,74072.73]
["A",168,74515.73]
["A",169,74958.720000000001]
["A",170,75401.72]
["A",171,75844.72]
["A",172,76287.710000000006]
["A",173,76730.7]
["A",174,77173.7]
["A",175,77616.7]
["A",176,78059.69]
["A",177,78502.69]
["A",178,78945.69]
["A",179,79388.679999999993]
["A",180,79831.679999999993]
["A",181,80274.679999999993]
["A",182,80717.67]
["A",183,81160.67]
["A",184,81603.66]
["A",185,82046.649999999994]
["A",186,82489.66]
["A",187,82932.649999999994]
["A",188,83375.649999999994]
["A",189,83818.64]
["A",190,84261.64]
["A",191,84704.639999999999]
["A",192,85147.63]
["A",193,85590.63]
["A",194,86033.62]
["A",195,86476.61]
["A",196,86919.61]
["A",197,87362.61]
["A",198,87805.6]
["A",199,88248.61]
["A",200,88691.6]
["B",1,0]
["B",2,0]
["B",3,452.88]
["B",4,879.65]
["B",5,1285.08]
["B",6,1695.98]
["B",7,2102.2199999999998]
["B",8,2508.44]
["B",9,2874.04]
["B",10,3239.65]
["B",11,3605.74]
["B",12,3971.38]
["B",13,4337.0200000000004]
["B",14,4702.67]
["B",15,5068.3100000000004]
["B",16,5433.96]
["B",17,5799.6]
["B",18,6165.24]
["B",19,6530.88]
["B",20,6896.53]
["B",21,7234.27]
["B",22,7571.99]
["B",23,7909.69]
["B",24,8239.7199999999993]
["B",25,8569.74]
["B",26,8899.77]
["B",27,9229.7999999999993]
["B",28,9559.83]
["B",29,9889.86]
["B",30,10219.879999999999]
["B",31,10549.91]
["B",32,10879.95]
["B",33,11209.97]
["B",34,11540]
["B",35,11870.03]
["B",36,12200.05]
["B",37,12530.09]
["B",38,12860.11]
["B",39,13190.13]
["B",40,13492.13]
["B",41,13796.43]
["B",42,14100.82]
["B",43,14405.31]
["B",44,14709.89]
["B",45,15014.56]
["B",46,15319.32]
["B",47,15624.18]
["B",48,15929.14]
["B",49,16234.19]
["B",50,16539.330000000002]
["B",51,16844.560000000001]
["B",52,17149.88]
["B",53,17455.3]
["B",54,17760.82]
["B",55,18066.419999999998]
["B",56,18372.13]
["B",57,18677.919999999998]
["B",58,18983.810000000001]
["B",59,19289.79]
["B",60,19595.86]
["B",61,19902.03]
["B",62,20208.3]
["B",63,20514.64]
["B",64,20821.099999999999]
["B",65,21127.63]
["B",66,21434.28]
["B",67,21741.01]
["B",68,22047.83]
["B",69,22354.74]
["B",70,22661.759999999998]
["B",71,22968.86]
["B",72,23276.06]
["B",73,23583.35]
["B",74,23890.74]
["B",75,24198.21]
["B",76,24505.78]
["B",77,24813.45]
["B",78,25121.21]
["B",79,25429.06]
["B",80,25737]
["B",81,26045.040000000001]
["B",82,26353.17]
["B",83,26661.4]
["B",84,26969.72]
["B",85,27278.13]
["B",86,27586.639999999999]
["B",87,27895.23]
["B",88,28203.93]
["B",89,28512.71]
["B",90,28821.599999999999]
["B",91,29130.57]
["B",92,29439.63]
["B",93,29748.799999999999]
["B",94,30058.05]
["B",95,30367.4]
["B",96,30676.84]
["B",97,30986.38]
["B",98,31296.01]
["B",99,31605.73]
["B",100,31915.55]
["B",101,32225.46]
["B",102,32535.45]
["B",103,32845.550000000003]
["B",104,33155.74]
["B",105,33466.03]
["B",106,33776.400000000001]
["B",107,34086.839999999997]
["B",108,34397.269999999997]
["B",109,34707.71]
["B",110,35018.15]
["B",111,35328.589999999997]
["B",112,35639.019999999997]
["B",113,35949.449999999997]
["B",114,36259.89]
["B",115,36570.33]
["B",116,36880.769999999997]
["B",117,37191.199999999997]
["B",118,37501.64]
["B",119,37812.07]
["B",120,38122.51]
["B",121,38432.949999999997]
["B",122,38743.379999999997]
["B",123,39053.82]
["B",124,39360.61]
["B",125,39666.39]
["B",126,39972.160000000003]
["B",127,40277.949999999997]
["B",128,40583.730000000003]
["B",129,40889.51]
["B",130,41195.29]
["B",131,41501.07]
["B",132,41806.85]
["B",133,42112.63]
["B",134,42418.400000000001]
["B",135,42724.19]
["B",136,43029.97]
["B",137,43335.75]
["B",138,43641.53]
["B",139,43947.3]
["B",140,44253.09]
["B",141,44558.86]
["B",142,44864.65]
["B",143,45170.43]
["B",144,45476.21]
["B",145,45781.99]
["B",146,46087.77]
["B",147,46393.55]
["B",148,46699.32]
["B",149,47005.1]
["B",150,47310.89]
["B",151,47616.67]
["B",152,47922.44]
["B",153,48228.23]
["B",154,48534]
["B",155,48839.79]
["B",156,49145.56]
["B",157,49451.34]
["B",158,49757.13]
["B",159,50062.91]
["B",160,50368.69]
["B",161,50674.46]
["B",162,50980.24]
["B",163,51286.02]
["B",164,51591.8]
["B",165,51897.59]
["B",166,52203.37]
["B",167,52509.14]
["B",168,52814.93]
["B",169,53120.7]
["B",170,53426.48]
["B",171,53732.26]
["B",172,54038.04]
["B",173,54343.83]
["B",174,54649.599999999999]
["B",175,54955.38]
["B",176,55261.16]
["B",177,55566.94]
["B",178,55872.72]
["B",179,56178.5]
["B",180,56484.28]
["B",181,56790.07]
["B",182,57095.839999999997]
["B",183,57401.62]
["B",184,57707.4]
["B",185,58013.18]
["B",186,58318.96]
["B",187,58624.74]
["B",188,58930.52]
["B",189,59236.3]
["B",190,59542.080000000002]
["B",191,59847.86]
["B",192,60153.64]
["B",193,60459.41]
["B",194,60765.2]
["B",195,61070.98]
["B",196,61376.76]
["B",197,61682.54]
["B",198,61988.32]
["B",199,62294.1]
["B",200,62599.87]
["C",1,0]
["C",2,0]
["C",3,432.51]
["C",4,843.33]
["C",5,1233.6099999999999]
["C",6,1621.2]
["C",7,2011.03]
["C",8,2400.87]
["C",9,2751.71]
["C",10,3102.56]
["C",11,3462.93]
["C",12,3823.47]
["C",13,4175.8]
["C",14,4528.13]
["C",15,4880.46]
["C",16,5232.79]
["C",17,5585.12]
["C",18,5937.45]
["C",19,6289.77]
["C",20,6642.11]
["C",21,6931.61]
["C",22,7221.19]
["C",23,7510.79]
["C",24,7800.39]
["C",25,8088.48]
["C",26,8371.5300000000007]
["C",27,8654.6]
["C",28,8937.65]
["C",29,9220.7000000000007]
["C",30,9503.75]
["C",31,9786.81]
["C",32,10069.870000000001]
["C",33,10352.92]
["C",34,10635.97]
["C",35,10919.03]
["C",36,11202.09]
["C",37,11485.14]
["C",38,11768.2]
["C",39,12051.25]
["C",40,12163.57]
["C",41,12277.13]
["C",42,12390.73]
["C",43,12504.33]
["C",44,12617.96]
["C",45,12731.61]
["C",46,12845.28]
["C",47,12958.98]
["C",48,13072.69]
["C",49,13186.44]
["C",50,13300.19]
["C",51,13413.98]
["C",52,13527.78]
["C",53,13641.6]
["C",54,13755.44]
["C",55,13869.31]
["C",56,13983.2]
["C",57,14097.11]
["C",58,14211.04]
["C",59,14325]
["C",60,14438.97]
["C",61,14552.97]
["C",62,14666.99]
["C",63,14781.02]
["C",64,14895.09]
["C",65,15009.17]
["C",66,15123.28]
["C",67,15237.4]
["C",68,15351.55]
["C",69,15465.72]
["C",70,15579.91]
["C",71,15694.12]
["C",72,15808.35]
["C",73,15922.61]
["C",74,16036.89]
["C",75,16151.19]
["C",76,16265.5]
["C",77,16379.85]
["C",78,16494.21]
["C",79,16608.599999999999]
["C",80,16723]
["C",81,16837.419999999998]
["C",82,16951.88]
["C",83,17066.349999999999]
["C",84,17180.830000000002]
["C",85,17295.349999999999]
["C",86,17409.900000000001]
["C",87,17524.45]
["C",88,17639.03]
["C",89,17753.63]
["C",90,17868.25]
["C",91,17982.89]
["C",92,18097.560000000001]
["C",93,18212.240000000002]
["C",94,18326.95]
["C",95,18441.68]
["C",96,18556.439999999999]
["C",97,18671.21]
["C",98,18786]
["C",99,18900.82]
["C",100,19015.650000000001]
["C",101,19130.509999999998]
["C",102,19245.39]
["C",103,19360.3]
["C",104,19475.21]
["C",105,19590.12]
["C",106,19705.04]
["C",107,19819.95]
["C",108,19934.87]
["C",109,20049.78]
["C",110,20164.689999999999]
["C",111,20279.599999999999]
["C",112,20394.509999999998]
["C",113,20509.43]
["C",114,20624.34]
["C",115,20739.25]
["C",116,20854.169999999998]
["C",117,20969.080000000002]
["C",118,21083.99]
["C",119,21198.91]
["C",120,21313.82]
["C",121,21428.73]
["C",122,21543.64]
["C",123,21658.55]
["C",124,21771.79]
["C",125,21884.98]
["C",126,21998.17]
["C",127,22111.360000000001]
["C",128,22224.55]
["C",129,22337.74]
["C",130,22450.92]
["C",131,22564.12]
["C",132,22677.3]
["C",133,22790.49]
["C",134,22903.68]
["C",135,23016.87]
["C",136,23130.07]
["C",137,23243.25]
["C",138,23356.44]
["C",139,23469.63]
["C",140,23582.82]
["C",141,23696.01]
["C",142,23809.200000000001]
["C",143,23922.38]
["C",144,24035.58]
["C",145,24148.77]
["C",146,24261.95]
["C",147,24375.15]
["C",148,24488.33]
["C",149,24601.52]
["C",150,24714.71]
["C",151,24827.9]
["C",152,24941.09]
["C",153,25054.28]
["C",154,25167.46]
["C",155,25280.66]
["C",156,25393.84]
["C",157,25507.03]
["C",158,25620.22]
["C",159,25733.41]
["C",160,25846.61]
["C",161,25959.79]
["C",162,26072.98]
["C",163,26186.17]
["C",164,26299.360000000001]
["C",165,26412.55]
["C",166,26525.74]
["C",167,26638.92]
["C",168,26752.12]
["C",169,26865.3]
["C",170,26978.49]
["C",171,27091.68]
["C",172,27204.87]
["C",173,27318.06]
["C",174,27431.25]
["C",175,27544.44]
["C",176,27657.63]
["C",177,27770.82]
["C",178,27884]
["C",179,27997.200000000001]
["C",180,28110.38]
["C",181,28223.58]
["C",182,28336.77]
["C",183,28449.95]
["C",184,28563.15]
["C",185,28676.33]
["C",186,28789.52]
["C",187,28902.71]
["C",188,29015.9]
["C",189,29129.09]
["C",190,29242.28]
["C",191,29355.46]
["C",192,29468.66]
["C",193,29581.84]
["C",194,29695.03]
["C",195,29808.22]
["C",196,29921.41]
["C",197,30034.6]
["C",198,30147.79]
["C",199,30260.97]
["C",200,30374.17]
["D",1,0]
["D",2,0]
["D",3,239.92]
["D",4,731.3]
["D",5,1198.0999999999999]
["D",6,1673.12]
["D",7,2141.1799999999998]
["D",8,2609.2399999999998]
["D",9,3050.38]
["D",10,3491.52]
["D",11,3935.94]
["D",12,4377.3500000000004]
["D",13,4818.7700000000004]
["D",14,5260.19]
["D",15,5701.59]
["D",16,6143]
["D",17,6584.42]
["D",18,7025.83]
["D",19,7467.24]
["D",20,7908.66]
["D",21,8358.4699999999993]
["D",22,8808.2199999999993]
["D",23,9250.36]
["D",24,9692.49]
["D",25,10134.629999999999]
["D",26,10576.78]
["D",27,11018.9]
["D",28,11461.05]
["D",29,11903.18]
["D",30,12345.31]
["D",31,12787.46]
["D",32,13229.59]
["D",33,13671.73]
["D",34,14113.87]
["D",35,14556.01]
["D",36,14998.14]
["D",37,15440.28]
["D",38,15882.42]
["D",39,16324.55]
["D",40,16741.259999999998]
["D",41,17160.240000000002]
["D",42,17579.32]
["D",43,17998.509999999998]
["D",44,18417.79]
["D",45,18837.18]
["D",46,19256.68]
["D",47,19676.259999999998]
["D",48,20095.97]
["D",49,20515.759999999998]
["D",50,20935.66]
["D",51,21355.67]
["D",52,21775.77]
["D",53,22195.99]
["D",54,22616.29]
["D",55,23036.69]
["D",56,23457.22]
["D",57,23877.83]
["D",58,24298.55]
["D",59,24719.38]
["D",60,25140.29]
["D",61,25561.32]
["D",62,25982.45]
["D",63,26403.69]
["D",64,26825.02]
["D",65,27246.45]
["D",66,27667.99]
["D",67,28089.63]
["D",68,28511.37]
["D",69,28933.21]
["D",70,29355.16]
["D",71,29777.22]
["D",72,30199.37]
["D",73,30621.63]
["D",74,31043.98]
["D",75,31466.43]
["D",76,31889]
["D",77,32311.66]
["D",78,32734.43]
["D",79,33157.300000000003]
["D",80,33580.26]
["D",81,34003.35]
["D",82,34426.519999999997]
["D",83,34849.800000000003]
["D",84,35273.17]
["D",85,35696.65]
["D",86,36120.239999999998]
["D",87,36543.93]
["D",88,36967.72]
["D",89,37391.61]
["D",90,37815.599999999999]
["D",91,38239.699999999997]
["D",92,38663.9]
["D",93,39088.199999999997]
["D",94,39512.6]
["D",95,39937.1]
["D",96,40361.72]
["D",97,40786.43]
["D",98,41211.24]
["D",99,41636.15]
["D",100,42061.17]
["D",101,42486.29]
["D",102,42911.51]
["D",103,43336.84]
["D",104,43762.27]
["D",105,44187.79]
["D",106,44613.42]
["D",107,45039.15]
["D",108,45465]
["D",109,45890.93]
["D",110,46316.97]
["D",111,46743.12]
["D",112,47169.36]
["D",113,47595.72]
["D",114,48022.16]
["D",115,48448.7]
["D",116,48875.360000000001]
["D",117,49302.12]
["D",118,49728.98]
["D",119,50155.94]
["D",120,50583]
["D",121,51010.17]
["D",122,51431.02]
["D",123,51851.87]
["D",124,52272.71]
["D",125,52693.55]
["D",126,53114.41]
["D",127,53535.25]
["D",128,53956.1]
["D",129,54376.94]
["D",130,54797.79]
["D",131,55218.63]
["D",132,55639.48]
["D",133,56060.32]
["D",134,56481.17]
["D",135,56902.01]
["D",136,57322.86]
["D",137,57743.7]
["D",138,58164.56]
["D",139,58585.4]
["D",140,59006.25]
["D",141,59427.09]
["D",142,59847.94]
["D",143,60268.79]
["D",144,60689.64]
["D",145,61110.47]
["D",146,61531.33]
["D",147,61952.17]
["D",148,62373.03]
["D",149,62793.86]
["D",150,63214.71]
["D",151,63635.56]
["D",152,64056.41]
["D",153,64477.25]
["D",154,64898.1]
["D",155,65318.94]
["D",156,65739.789999999994]
["D",157,66160.63]
["D",158,66581.48]
["D",159,67002.33]
["D",160,67423.17]
["D",161,67844.02]
["D",162,68264.86]
["D",163,68685.72]
["D",164,69106.559999999998]
["D",165,69527.399999999994]
["D",166,69948.25]
["D",167,70369.100000000006]
["D",168,70789.95]
["D",169,71210.789999999994]
["D",170,71631.63]
["D",171,72052.490000000005]
["D",172,72473.33]
["D",173,72894.179999999993]
["D",174,73315.02]
["D",175,73735.87]
["D",176,74156.710000000006]
["D",177,74577.56]
["D",178,74998.399999999994]
["D",179,75419.25]
["D",180,75840.09]
["D",181,76260.94]
["D",182,76681.78]
["D",183,77102.64]
["D",184,77523.48]
["D",185,77944.320000000007]
["D",186,78365.17]
["D",187,78786.02]
["D",188,79206.87]
["D",189,79627.710000000006]
["D",190,80048.55]
["D",191,80469.41]
["D",192,80890.25]
["D",193,81311.100000000006]
["D",194,81731.94]
["D",195,82152.789999999994]
["D",196,82573.64]
["D",197,82994.48]
["D",198,83415.33]
["D",199,83836.17]
["D",200,84257.02]
["E",1,0]
["E",2,0]
["E",3,716.58]
["E",4,1033.6500000000001]
["E",5,1334.86]
["E",6,1617.11]
["E",7,1915.45]
["E",8,2213.79]
["E",9,2482.29]
["E",10,2750.81]
["E",11,3031.66]
["E",12,3312.59]
["E",13,3593.15]
["E",14,3865.07]
["E",15,4136.1499999999996]
["E",16,4407.26]
["E",17,4678.3500000000004]
["E",18,4949.45]
["E",19,5220.54]
["E",20,5491.63]
["E",21,5715.66]
["E",22,5939.7]
["E",23,6157.06]
["E",24,6374.43]
["E",25,6591.8]
["E",26,6809.17]
["E",27,7026.53]
["E",28,7243.91]
["E",29,7461.27]
["E",30,7678.63]
["E",31,7896.01]
["E",32,8113.38]
["E",33,8330.74]
["E",34,8548.11]
["E",35,8765.48]
["E",36,8982.84]
["E",37,9200.2199999999993]
["E",38,9417.58]
["E",39,9634.94]
["E",40,9722.09]
["E",41,9811.5400000000009]
["E",42,9901.0400000000009]
["E",43,9990.58]
["E",44,10080.16]
["E",45,10169.77]
["E",46,10259.43]
["E",47,10349.129999999999]
["E",48,10438.870000000001]
["E",49,10528.64]
["E",50,10618.45]
["E",51,10708.32]
["E",52,10798.21]
["E",53,10888.15]
["E",54,10978.13]
["E",55,11068.14]
["E",56,11158.2]
["E",57,11248.29]
["E",58,11338.39]
["E",59,11428.49]
["E",60,11518.59]
["E",61,11608.7]
["E",62,11698.8]
["E",63,11788.9]
["E",64,11879]
["E",65,11969.1]
["E",66,12059.2]
["E",67,12149.3]
["E",68,12239.4]
["E",69,12329.5]
["E",70,12419.6]
["E",71,12509.7]
["E",72,12599.8]
["E",73,12689.9]
["E",74,12780]
["E",75,12870.1]
["E",76,12960.2]
["E",77,13050.3]
["E",78,13140.4]
["E",79,13230.5]
["E",80,13320.6]
["E",81,13410.7]
["E",82,13500.8]
["E",83,13590.9]
["E",84,13681.01]
["E",85,13771.11]
["E",86,13861.21]
["E",87,13951.31]
["E",88,14041.41]
["E",89,14131.51]
["E",90,14221.61]
["E",91,14311.71]
["E",92,14401.81]
["E",93,14491.91]
["E",94,14582.01]
["E",95,14672.11]
["E",96,14762.22]
["E",97,14852.32]
["E",98,14942.42]
["E",99,15032.52]
["E",100,15122.62]
["E",101,15212.72]
["E",102,15302.82]
["E",103,15392.92]
["E",104,15483.02]
["E",105,15573.12]
["E",106,15663.22]
["E",107,15753.32]
["E",108,15843.43]
["E",109,15933.53]
["E",110,16023.63]
["E",111,16113.73]
["E",112,16203.83]
["E",113,16293.93]
["E",114,16384.03]
["E",115,16474.13]
["E",116,16564.23]
["E",117,16654.330000000002]
["E",118,16744.43]
["E",119,16834.53]
["E",120,16924.63]
["E",121,17014.73]
["E",122,17104.830000000002]
["E",123,17194.93]
["E",124,17285.03]
["E",125,17375.13]
["E",126,17465.23]
["E",127,17555.330000000002]
["E",128,17645.43]
["E",129,17735.53]
["E",130,17825.63]
["E",131,17915.740000000002]
["E",132,18005.84]
["E",133,18095.939999999999]
["E",134,18186.04]
["E",135,18276.14]
["E",136,18366.240000000002]
["E",137,18456.34]
["E",138,18546.439999999999]
["E",139,18636.54]
["E",140,18726.64]
["E",141,18816.740000000002]
["E",142,18906.84]
["E",143,18996.95]
["E",144,19087.05]
["E",145,19177.150000000001]
["E",146,19267.25]
["E",147,19357.349999999999]
["E",148,19447.45]
["E",149,19537.55]
["E",150,19627.650000000001]
["E",151,19717.75]
["E",152,19807.849999999999]
["E",153,19897.95]
["E",154,19988.05]
["E",155,20078.16]
["E",156,20168.259999999998]
["E",157,20258.36]
["E",158,20348.46]
["E",159,20438.560000000001]
["E",160,20528.66]
["E",161,20618.759999999998]
["E",162,20708.86]
["E",163,20798.96]
["E",164,20889.060000000001]
["E",165,20979.16]
["E",166,21069.26]
["E",167,21159.360000000001]
["E",168,21249.46]
["E",169,21339.56]
["E",170,21429.66]
["E",171,21519.759999999998]
["E",172,21609.86]
["E",173,21699.96]
["E",174,21790.06]
["E",175,21880.16]
["E",176,21970.26]
["E",177,22060.36]
["E",178,22150.47]
["E",179,22240.57]
["E",180,22330.67]
["E",181,22420.77]
["E",182,22510.87]
["E",183,22599.68]
["E",184,22688.43]
["E",185,22777.18]
["E",186,22865.93]
["E",187,22954.68]
["E",188,23043.43]
["E",189,23132.18]
["E",190,23220.93]
["E",191,23309.68]
["E",192,23398.43]
["E",193,23487.18]
["E",194,23575.919999999998]
["E",195,23664.67]
["E",196,23753.42]
["E",197,23842.17]
["E",198,23930.92]
["E",199,24019.67]
["E",200,24108.42]
["F",1,0]
["F",2,0]
["F",3,644.94000000000005]
["F",4,898.77]
["F",5,1139.9000000000001]
["F",6,1386.43]
["F",7,1632.83]
["F",8,1875.25]
["F",9,2093.4499999999998]
["F",10,2311.64]
["F",11,2536.06]
["F",12,2760.47]
["F",13,2983.98]
["F",14,3203.34]
["F",15,3422.69]
["F",16,3642.05]
["F",17,3861.41]
["F",18,4080.76]
["F",19,4300.12]
["F",20,4519.4799999999996]
["F",21,4698.9399999999996]
["F",22,4878.4799999999996]
["F",23,5058.0200000000004]
["F",24,5237.57]
["F",25,5417.1]
["F",26,5596.65]
["F",27,5776.19]
["F",28,5955.73]
["F",29,6133.18]
["F",30,6309.59]
["F",31,6486.01]
["F",32,6662.43]
["F",33,6838.84]
["F",34,7015.26]
["F",35,7191.68]
["F",36,7368.1]
["F",37,7544.51]
["F",38,7720.93]
["F",39,7897.35]
["F",40,8027.76]
["F",41,8158.44]
["F",42,8289.1200000000008]
["F",43,8419.82]
["F",44,8550.52]
["F",45,8681.2199999999993]
["F",46,8811.94]
["F",47,8942.66]
["F",48,9073.39]
["F",49,9204.1200000000008]
["F",50,9334.8799999999992]
["F",51,9465.6299999999992]
["F",52,9596.4]
["F",53,9727.16]
["F",54,9857.94]
["F",55,9988.7199999999993]
["F",56,10119.52]
["F",57,10250.32]
["F",58,10381.129999999999]
["F",59,10511.95]
["F",60,10642.77]
["F",61,10773.6]
["F",62,10904.44]
["F",63,11035.28]
["F",64,11166.14]
["F",65,11297.01]
["F",66,11427.88]
["F",67,11558.76]
["F",68,11689.65]
["F",69,11820.54]
["F",70,11951.45]
["F",71,12082.36]
["F",72,12213.28]
["F",73,12344.21]
["F",74,12475.14]
["F",75,12606.09]
["F",76,12737.03]
["F",77,12867.99]
["F",78,12998.95]
["F",79,13129.94]
["F",80,13260.92]
["F",81,13391.9]
["F",82,13522.9]
["F",83,13653.9]
["F",84,13784.93]
["F",85,13915.94]
["F",86,14046.97]
["F",87,14178.01]
["F",88,14309.06]
["F",89,14440.1]
["F",90,14571.17]
["F",91,14702.24]
["F",92,14833.32]
["F",93,14964.4]
["F",94,15095.49]
["F",95,15226.59]
["F",96,15357.69]
["F",97,15488.81]
["F",98,15619.94]
["F",99,15751.07]
["F",100,15882.21]
["F",101,16013.36]
["F",102,16144.51]
["F",103,16275.67]
["F",104,16406.84]
["F",105,16538.02]
["F",106,16669.21]
["F",107,16800.400000000001]
["F",108,16931.599999999999]
["F",109,17062.82]
["F",110,17194.03]
["F",111,17325.259999999998]
["F",112,17456.490000000002]
["F",113,17587.73]
["F",114,17718.990000000002]
["F",115,17850.240000000002]
["F",116,17981.509999999998]
["F",117,18112.78]
["F",118,18244.060000000001]
["F",119,18375.349999999999]
["F",120,18506.650000000001]
["F",121,18637.95]
["F",122,18768.689999999999]
["F",123,18899.43]
["F",124,19030.16]
["F",125,19160.900000000001]
["F",126,19291.63]
["F",127,19422.37]
["F",128,19553.11]
["F",129,19683.849999999999]
["F",130,19814.580000000002]
["F",131,19945.32]
["F",132,20076.060000000001]
["F",133,20206.79]
["F",134,20337.53]
["F",135,20468.27]
["F",136,20599.009999999998]
["F",137,20729.740000000002]
["F",138,20860.48]
["F",139,20991.22]
["F",140,21121.95]
["F",141,21252.69]
["F",142,21383.43]
["F",143,21514.17]
["F",144,21644.9]
["F",145,21775.64]
["F",146,21906.38]
["F",147,22037.11]
["F",148,22167.85]
["F",149,22298.59]
["F",150,22429.33]
["F",151,22560.06]
["F",152,22690.799999999999]
["F",153,22821.54]
["F",154,22952.27]
["F",155,23083.01]
["F",156,23213.74]
["F",157,23344.49]
["F",158,23475.22]
["F",159,23605.96]
["F",160,23736.7]
["F",161,23867.43]
["F",162,23998.17]
["F",163,24128.91]
["F",164,24259.64]
["F",165,24390.38]
["F",166,24521.119999999999]
["F",167,24651.85]
["F",168,24782.59]
["F",169,24913.33]
["F",170,25044.06]
["F",171,25174.81]
["F",172,25305.54]
["F",173,25436.28]
["F",174,25567.02]
["F",175,25697.75]
["F",176,25828.49]
["F",177,25959.23]
["F",178,26089.96]
["F",179,26220.7]
["F",180,26351.439999999999]
["F",181,26482.17]
["F",182,26612.91]
["F",183,26743.65]
["F",184,26874.38]
["F",185,27005.13]
["F",186,27135.86]
["F",187,27266.6]
["F",188,27397.34]
["F",189,27528.06]
["F",190,27658.81]
["F",191,27789.55]
["F",192,27920.28]
["F",193,28051.02]
["F",194,28181.759999999998]
["F",195,28312.49]
["F",196,28443.23]
["F",197,28573.96]
["F",198,28704.7]
["F",199,28835.45]
["F",200,28966.17]
["G",1,0]
["G",2,0]
["G",3,644.94000000000005]
["G",4,898.77]
["G",5,1139.9000000000001]
["G",6,1386.43]
["G",7,1632.83]
["G",8,1875.25]
["G",9,2093.4499999999998]
["G",10,2311.64]
["G",11,2536.06]
["G",12,2760.47]
["G",13,2983.98]
["G",14,3203.34]
["G",15,3422.69]
["G",16,3642.05]
["G",17,3861.41]
["G",18,4080.76]
["G",19,4300.12]
["G",20,4519.4799999999996]
["G",21,4698.9399999999996]
["G",22,4878.4799999999996]
["G",23,5058.0200000000004]
["G",24,5237.57]
["G",25,5417.1]
["G",26,5596.65]
["G",27,5776.19]
["G",28,5955.73]
["G",29,6133.18]
["G",30,6309.59]
["G",31,6486.01]
["G",32,6662.43]
["G",33,6838.84]
["G",34,7015.26]
["G",35,7191.68]
["G",36,7368.1]
["G",37,7544.51]
["G",38,7720.93]
["G",39,7897.35]
["G",40,8027.76]
["G",41,8158.44]
["G",42,8289.1200000000008]
["G",43,8419.82]
["G",44,8550.52]
["G",45,8681.2199999999993]
["G",46,8811.94]
["G",47,8942.66]
["G",48,9073.39]
["G",49,9204.1200000000008]
["G",50,9334.8799999999992]
["G",51,9465.6299999999992]
["G",52,9596.4]
["G",53,9727.16]
["G",54,9857.94]
["G",55,9988.7199999999993]
["G",56,10119.52]
["G",57,10250.32]
["G",58,10381.129999999999]
["G",59,10511.95]
["G",60,10642.77]
["G",61,10773.6]
["G",62,10904.44]
["G",63,11035.28]
["G",64,11166.14]
["G",65,11297.01]
["G",66,11427.88]
["G",67,11558.76]
["G",68,11689.65]
["G",69,11820.54]
["G",70,11951.45]
["G",71,12082.36]
["G",72,12213.28]
["G",73,12344.21]
["G",74,12475.14]
["G",75,12606.09]
["G",76,12737.03]
["G",77,12867.99]
["G",78,12998.95]
["G",79,13129.94]
["G",80,13260.92]
["G",81,13391.9]
["G",82,13522.9]
["G",83,13653.9]
["G",84,13784.93]
["G",85,13915.94]
["G",86,14046.97]
["G",87,14178.01]
["G",88,14309.06]
["G",89,14440.1]
["G",90,14571.17]
["G",91,14702.24]
["G",92,14833.32]
["G",93,14964.4]
["G",94,15095.49]
["G",95,15226.59]
["G",96,15357.69]
["G",97,15488.81]
["G",98,15619.94]
["G",99,15751.07]
["G",100,15882.21]
["G",101,16013.36]
["G",102,16144.51]
["G",103,16275.67]
["G",104,16406.84]
["G",105,16538.02]
["G",106,16669.21]
["G",107,16800.400000000001]
["G",108,16931.599999999999]
["G",109,17062.82]
["G",110,17194.03]
["G",111,17325.259999999998]
["G",112,17456.490000000002]
["G",113,17587.73]
["G",114,17718.990000000002]
["G",115,17850.240000000002]
["G",116,17981.509999999998]
["G",117,18112.78]
["G",118,18244.060000000001]
["G",119,18375.349999999999]
["G",120,18506.650000000001]
["G",121,18637.95]
["G",122,18768.689999999999]
["G",123,18899.43]
["G",124,19030.16]
["G",125,19160.900000000001]
["G",126,19291.63]
["G",127,19422.37]
["G",128,19553.11]
["G",129,19683.849999999999]
["G",130,19814.580000000002]
["G",131,19945.32]
["G",132,20076.060000000001]
["G",133,20206.79]
["G",134,20337.53]
["G",135,20468.27]
["G",136,20599.009999999998]
["G",137,20729.740000000002]
["G",138,20860.48]
["G",139,20991.22]
["G",140,21121.95]
["G",141,21252.69]
["G",142,21383.43]
["G",143,21514.17]
["G",144,21644.9]
["G",145,21775.64]
["G",146,21906.38]
["G",147,22037.11]
["G",148,22167.85]
["G",149,22298.59]
["G",150,22429.33]
["G",151,22560.06]
["G",152,22690.799999999999]
["G",153,22821.54]
["G",154,22952.27]
["G",155,23083.01]
["G",156,23213.74]
["G",157,23344.49]
["G",158,23475.22]
["G",159,23605.96]
["G",160,23736.7]
["G",161,23867.43]
["G",162,23998.17]
["G",163,24128.91]
["G",164,24259.64]
["G",165,24390.38]
["G",166,24521.119999999999]
["G",167,24651.85]
["G",168,24782.59]
["G",169,24913.33]
["G",170,25044.06]
["G",171,25174.81]
["G",172,25305.54]
["G",173,25436.28]
["G",174,25567.02]
["G",175,25697.75]
["G",176,25828.49]
["G",177,25959.23]
["G",178,26089.96]
["G",179,26220.7]
["G",180,26351.439999999999]
["G",181,26482.17]
["G",182,26612.91]
["G",183,26743.65]
["G",184,26874.38]
["G",185,27005.13]
["G",186,27135.86]
["G",187,27266.6]
["G",188,27397.34]
["G",189,27528.06]
["G",190,27658.81]
["G",191,27789.55]
["G",192,27920.28]
["G",193,28051.02]
["G",194,28181.759999999998]
["G",195,28312.49]
["G",196,28443.23]
["G",197,28573.96]
["G",198,28704.7]
["G",199,28835.45]
["G",200,28966.17]
["H",1,0]
["H",2,0]
["H",3,703.69]
["H",4,1009.83]
["H",5,1300.6400000000001]
["H",6,1589.05]
["H",7,1879.51]
["H",8,2169.9699999999998]
["H",9,2431.38]
["H",10,2692.79]
["H",11,2961.38]
["H",12,3229.64]
["H",13,3492.07]
["H",14,3754.51]
["H",15,4016.95]
["H",16,4279.3900000000003]
["H",17,4541.82]
["H",18,4804.26]
["H",19,5066.6899999999996]
["H",20,5329.13]
["H",21,5544.96]
["H",22,5760.9]
["H",23,5976.83]
["H",24,6192.76]
["H",25,6405.21]
["H",26,6615.99]
["H",27,6826.76]
["H",28,7037.54]
["H",29,7248.3]
["H",30,7459.07]
["H",31,7669.85]
["H",32,7880.61]
["H",33,8091.39]
["H",34,8302.16]
["H",35,8512.93]
["H",36,8723.7000000000007]
["H",37,8934.48]
["H",38,9145.25]
["H",39,9356.02]
["H",40,9447.16]
["H",41,9539.4]
["H",42,9631.68]
["H",43,9723.9699999999993]
["H",44,9816.2800000000007]
["H",45,9908.6299999999992]
["H",46,10000.969999999999]
["H",47,10093.35]
["H",48,10185.75]
["H",49,10278.16]
["H",50,10370.61]
["H",51,10463.06]
["H",52,10555.54]
["H",53,10648.04]
["H",54,10740.56]
["H",55,10833.1]
["H",56,10925.66]
["H",57,11018.24]
["H",58,11110.84]
["H",59,11203.47]
["H",60,11296.1]
["H",61,11388.77]
["H",62,11481.46]
["H",63,11574.16]
["H",64,11666.89]
["H",65,11759.62]
["H",66,11852.39]
["H",67,11945.17]
["H",68,12037.98]
["H",69,12130.81]
["H",70,12223.66]
["H",71,12316.53]
["H",72,12409.42]
["H",73,12502.32]
["H",74,12595.26]
["H",75,12688.21]
["H",76,12781.18]
["H",77,12874.16]
["H",78,12967.17]
["H",79,13060.21]
["H",80,13153.27]
["H",81,13246.34]
["H",82,13339.43]
["H",83,13432.55]
["H",84,13525.68]
["H",85,13618.83]
["H",86,13712.01]
["H",87,13805.21]
["H",88,13898.42]
["H",89,13991.66]
["H",90,14084.91]
["H",91,14178.2]
["H",92,14271.49]
["H",93,14364.81]
["H",94,14458.15]
["H",95,14551.52]
["H",96,14644.89]
["H",97,14738.25]
["H",98,14831.63]
["H",99,14925]
["H",100,15018.37]
["H",101,15111.74]
["H",102,15205.11]
["H",103,15298.48]
["H",104,15391.85]
["H",105,15485.22]
["H",106,15578.59]
["H",107,15671.96]
["H",108,15765.33]
["H",109,15858.7]
["H",110,15952.07]
["H",111,16045.44]
["H",112,16138.81]
["H",113,16232.18]
["H",114,16325.55]
["H",115,16418.919999999998]
["H",116,16512.29]
["H",117,16605.66]
["H",118,16699.03]
["H",119,16792.400000000001]
["H",120,16885.77]
["H",121,16979.14]
["H",122,17072.509999999998]
["H",123,17165.88]
["H",124,17259.25]
["H",125,17352.62]
["H",126,17445.93]
["H",127,17537.91]
["H",128,17629.88]
["H",129,17721.849999999999]
["H",130,17813.82]
["H",131,17905.79]
["H",132,17997.759999999998]
["H",133,18089.73]
["H",134,18181.7]
["H",135,18273.66]
["H",136,18365.63]
["H",137,18457.599999999999]
["H",138,18549.57]
["H",139,18641.54]
["H",140,18733.52]
["H",141,18825.48]
["H",142,18917.46]
["H",143,19009.43]
["H",144,19101.39]
["H",145,19193.36]
["H",146,19285.32]
["H",147,19377.3]
["H",148,19469.27]
["H",149,19561.240000000002]
["H",150,19653.21]
["H",151,19745.18]
["H",152,19837.150000000001]
["H",153,19929.12]
["H",154,20021.09]
["H",155,20113.05]
["H",156,20205.02]
["H",157,20297]
["H",158,20388.96]
["H",159,20480.93]
["H",160,20572.91]
["H",161,20664.87]
["H",162,20756.849999999999]
["H",163,20848.82]
["H",164,20940.78]
["H",165,21032.75]
["H",166,21124.720000000001]
["H",167,21216.69]
["H",168,21308.66]
["H",169,21400.63]
["H",170,21492.6]
["H",171,21584.57]
["H",172,21676.54]
["H",173,21768.51]
["H",174,21860.48]
["H",175,21952.44]
["H",176,22044.41]
["H",177,22136.39]
["H",178,22228.35]
["H",179,22320.32]
["H",180,22412.3]
["H",181,22504.26]
["H",182,22596.240000000002]
["H",183,22688.21]
["H",184,22780.17]
["H",185,22872.14]
["H",186,22964.11]
["H",187,23056.080000000002]
["H",188,23148.05]
["H",189,23240.02]
["H",190,23331.99]
["H",191,23423.96]
["H",192,23515.94]
["H",193,23607.9]
["H",194,23699.87]
["H",195,23791.84]
["H",196,23883.8]
["H",197,23975.78]
["H",198,24067.75]
["H",199,24159.72]
["H",200,24251.69]
["I",1,0]
["I",2,0]
["I",3,862.39]
["I",4,1320.93]
["I",5,1756.54]
["I",6,2200.59]
["I",7,2637.65]
["I",8,3074.7]
["I",9,3473.43]
["I",10,3872.17]
["I",11,4279.0200000000004]
["I",12,4686.22]
["I",13,5086.28]
["I",14,5486.32]
["I",15,5886.37]
["I",16,6286.42]
["I",17,6686.47]
["I",18,7086.52]
["I",19,7486.57]
["I",20,7886.63]
["I",21,8215.3700000000008]
["I",22,8544.1200000000008]
["I",23,8872.9]
["I",24,9198.07]
["I",25,9519.15]
["I",26,9840.24]
["I",27,10161.33]
["I",28,10482.41]
["I",29,10803.51]
["I",30,11124.59]
["I",31,11445.67]
["I",32,11766.76]
["I",33,12087.84]
["I",34,12408.93]
["I",35,12730.02]
["I",36,13051.1]
["I",37,13372.19]
["I",38,13693.28]
["I",39,14014.36]
["I",40,14282]
["I",41,14551.22]
["I",42,14820.51]
["I",43,15089.84]
["I",44,15359.23]
["I",45,15628.69]
["I",46,15898.19]
["I",47,16167.76]
["I",48,16437.38]
["I",49,16707.05]
["I",50,16976.79]
["I",51,17246.59]
["I",52,17516.43]
["I",53,17786.330000000002]
["I",54,18056.29]
["I",55,18326.310000000001]
["I",56,18596.39]
["I",57,18866.52]
["I",58,19136.71]
["I",59,19406.96]
["I",60,19677.259999999998]
["I",61,19947.62]
["I",62,20218.04]
["I",63,20488.52]
["I",64,20759.04]
["I",65,21029.63]
["I",66,21300.28]
["I",67,21570.97]
["I",68,21841.73]
["I",69,22112.55]
["I",70,22383.42]
["I",71,22654.35]
["I",72,22925.33]
["I",73,23196.37]
["I",74,23467.47]
["I",75,23738.63]
["I",76,24009.84]
["I",77,24281.1]
["I",78,24552.43]
["I",79,24823.82]
["I",80,25095.26]
["I",81,25366.75]
["I",82,25638.3]
["I",83,25909.919999999998]
["I",84,26181.58]
["I",85,26453.3]
["I",86,26725.09]
["I",87,26996.93]
["I",88,27268.82]
["I",89,27540.77]
["I",90,27812.78]
["I",91,28084.84]
["I",92,28356.97]
["I",93,28629.15]
["I",94,28901.38]
["I",95,29173.67]
["I",96,29446.03]
["I",97,29718.43]
["I",98,29990.89]
["I",99,30263.42]
["I",100,30535.98]
["I",101,30808.63]
["I",102,31081.31]
["I",103,31354.06]
["I",104,31626.86]
["I",105,31899.72]
["I",106,32172.639999999999]
["I",107,32445.62]
["I",108,32718.65]
["I",109,32991.74]
["I",110,33264.879999999997]
["I",111,33538.080000000002]
["I",112,33811.339999999997]
["I",113,34084.660000000003]
["I",114,34358.03]
["I",115,34631.46]
["I",116,34904.94]
["I",117,35178.49]
["I",118,35452.089999999997]
["I",119,35725.74]
["I",120,35999.46]
["I",121,36273.230000000003]
["I",122,36543.17]
["I",123,36813.11]
["I",124,37083.050000000003]
["I",125,37353]
["I",126,37622.93]
["I",127,37892.879999999997]
["I",128,38162.82]
["I",129,38432.76]
["I",130,38702.699999999997]
["I",131,38972.65]
["I",132,39242.58]
["I",133,39512.53]
["I",134,39782.47]
["I",135,40052.42]
["I",136,40322.36]
["I",137,40592.300000000003]
["I",138,40862.239999999998]
["I",139,41132.19]
["I",140,41402.129999999997]
["I",141,41672.07]
["I",142,41942.01]
["I",143,42211.96]
["I",144,42481.89]
["I",145,42751.839999999997]
["I",146,43021.78]
["I",147,43291.72]
["I",148,43561.66]
["I",149,43831.61]
["I",150,44101.54]
["I",151,44371.49]
["I",152,44641.43]
["I",153,44911.37]
["I",154,45181.32]
["I",155,45451.26]
["I",156,45721.2]
["I",157,45991.14]
["I",158,46261.09]
["I",159,46531.02]
["I",160,46800.97]
["I",161,47070.91]
["I",162,47340.85]
["I",163,47610.79]
["I",164,47880.74]
["I",165,48150.67]
["I",166,48420.62]
["I",167,48690.559999999998]
["I",168,48960.5]
["I",169,49230.44]
["I",170,49500.39]
["I",171,49770.33]
["I",172,50040.28]
["I",173,50310.22]
["I",174,50580.160000000003]
["I",175,50850.1]
["I",176,51120.05]
["I",177,51389.98]
["I",178,51659.93]
["I",179,51929.87]
["I",180,52199.81]
["I",181,52469.75]
["I",182,52739.7]
["I",183,53009.63]
["I",184,53279.58]
["I",185,53549.52]
["I",186,53819.46]
["I",187,54089.4]
["I",188,54359.35]
["I",189,54629.29]
["I",190,54899.23]
["I",191,55169.18]
["I",192,55439.11]
["I",193,55709.06]
["I",194,55979]
["I",195,56248.94]
["I",196,56518.879999999997]
["I",197,56788.83]
["I",198,57058.76]
["I",199,57328.71]
["I",200,57598.65]
["J",1,0]
["J",2,0]
["J",3,252.54]
["J",4,769.79]
["J",5,1261.1600000000001]
["J",6,1761.17]
["J",7,2253.87]
["J",8,2746.56]
["J",9,3210.92]
["J",10,3675.29]
["J",11,4143.1000000000004]
["J",12,4607.74]
["J",13,5072.3900000000003]
["J",14,5537.03]
["J",15,6001.68]
["J",16,6466.32]
["J",17,6930.96]
["J",18,7395.6]
["J",19,7860.25]
["J",20,8324.89]
["J",21,8798.4]
["J",22,9271.81]
["J",23,9737.2099999999991]
["J",24,10202.620000000001]
["J",25,10668.04]
["J",26,11133.44]
["J",27,11598.84]
["J",28,12064.25]
["J",29,12529.67]
["J",30,12995.07]
["J",31,13460.48]
["J",32,13925.88]
["J",33,14391.3]
["J",34,14856.7]
["J",35,15322.11]
["J",36,15787.52]
["J",37,16252.93]
["J",38,16718.330000000002]
["J",39,17183.740000000002]
["J",40,17622.38]
["J",41,18063.400000000001]
["J",42,18504.54]
["J",43,18945.79]
["J",44,19387.150000000001]
["J",45,19828.61]
["J",46,20270.18]
["J",47,20711.849999999999]
["J",48,21153.65]
["J",49,21595.54]
["J",50,22037.53]
["J",51,22479.65]
["J",52,22921.86]
["J",53,23364.19]
["J",54,23806.62]
["J",55,24249.16]
["J",56,24691.8]
["J",57,25134.560000000001]
["J",58,25577.42]
["J",59,26020.39]
["J",60,26463.47]
["J",61,26906.66]
["J",62,27349.94]
["J",63,27793.35]
["J",64,28236.86]
["J",65,28680.48]
["J",66,29124.2]
["J",67,29568.03]
["J",68,30011.97]
["J",69,30456.02]
["J",70,30900.17]
["J",71,31344.44]
["J",72,31788.81]
["J",73,32233.279999999999]
["J",74,32677.87]
["J",75,33122.559999999998]
["J",76,33567.360000000001]
["J",77,34012.28]
["J",78,34457.29]
["J",79,34902.42]
["J",80,35347.65]
["J",81,35792.99]
["J",82,36238.43]
["J",83,36683.99]
["J",84,37129.65]
["J",85,37575.42]
["J",86,38021.300000000003]
["J",87,38467.29]
["J",88,38913.39]
["J",89,39359.589999999997]
["J",90,39805.9]
["J",91,40252.32]
["J",92,40698.83]
["J",93,41145.47]
["J",94,41592.21]
["J",95,42039.06]
["J",96,42486.02]
["J",97,42933.08]
["J",98,43380.25]
["J",99,43827.53]
["J",100,44274.91]
["J",101,44722.41]
["J",102,45170.01]
["J",103,45617.73]
["J",104,46065.54]
["J",105,46513.46]
["J",106,46961.5]
["J",107,47409.64]
["J",108,47857.89]
["J",109,48306.239999999998]
["J",110,48754.7]
["J",111,49203.28]
["J",112,49651.95]
["J",113,50100.74]
["J",114,50549.63]
["J",115,50998.64]
["J",116,51447.75]
["J",117,51896.97]
["J",118,52346.29]
["J",119,52795.73]
["J",120,53245.27]
["J",121,53694.91]
["J",122,54137.91]
["J",123,54580.9]
["J",124,55023.91]
["J",125,55466.9]
["J",126,55909.89]
["J",127,56352.9]
["J",128,56795.89]
["J",129,57238.879999999997]
["J",130,57681.88]
["J",131,58124.87]
["J",132,58567.87]
["J",133,59010.87]
["J",134,59453.86]
["J",135,59896.86]
["J",136,60339.86]
["J",137,60782.85]
["J",138,61225.85]
["J",139,61668.84]
["J",140,62111.839999999997]
["J",141,62554.83]
["J",142,62997.82]
["J",143,63440.83]
["J",144,63883.82]
["J",145,64326.82]
["J",146,64769.82]
["J",147,65212.81]
["J",148,65655.81]
["J",149,66098.81]
["J",150,66541.8]
["J",151,66984.789999999994]
["J",152,67427.789999999994]
["J",153,67870.78]
["J",154,68313.78]
["J",155,68756.78]
["J",156,69199.78]
["J",157,69642.77]
["J",158,70085.77]
["J",159,70528.77]
["J",160,70971.759999999995]
["J",161,71414.759999999995]
["J",162,71857.75]
["J",163,72300.740000000005]
["J",164,72743.740000000005]
["J",165,73186.740000000005]
["J",166,73629.73]
["J",167,74072.73]
["J",168,74515.73]
["J",169,74958.720000000001]
["J",170,75401.72]
["J",171,75844.72]
["J",172,76287.710000000006]
["J",173,76730.7]
["J",174,77173.7]
["J",175,77616.7]
["J",176,78059.69]
["J",177,78502.69]
["J",178,78945.69]
["J",179,79388.679999999993]
["J",180,79831.679999999993]
["J",181,80274.679999999993]
["J",182,80717.67]
["J",183,81160.67]
["J",184,81603.66]
["J",185,82046.649999999994]
["J",186,82489.66]
["J",187,82932.649999999994]
["J",188,83375.649999999994]
["J",189,83818.64]
["J",190,84261.64]
["J",191,84704.639999999999]
["J",192,85147.63]
["J",193,85590.63]
["J",194,86033.62]
["J",195,86476.61]
["J",196,86919.61]
["J",197,87362.61]
["J",198,87805.6]
["J",199,88248.61]
["J",200,88691.6]
["K",1,0]
["K",2,0]
["K",3,574.13]
["K",4,1140.6300000000001]
["K",5,1678.81]
["K",6,2181.04]
["K",7,2713.26]
["K",8,3245.48]
["K",9,3724.49]
["K",10,4203.4799999999996]
["K",11,4703.99]
["K",12,5204.8]
["K",13,5705.63]
["K",14,6206.43]
["K",15,6707.21]
["K",16,7207.2]
["K",17,7693.86]
["K",18,8180.52]
["K",19,8667.17]
["K",20,9153.84]
["K",21,9640.5]
["K",22,10127.16]
["K",23,10613.82]
["K",24,11100.48]
["K",25,11587.14]
["K",26,12073.81]
["K",27,12560.46]
["K",28,13047.13]
["K",29,13533.78]
["K",30,14020.44]
["K",31,14507.11]
["K",32,14993.76]
["K",33,15480.43]
["K",34,15967.09]
["K",35,16453.75]
["K",36,16940.41]
["K",37,17427.07]
["K",38,17913.73]
["K",39,18400.400000000001]
["K",40,18865.89]
["K",41,19334.830000000002]
["K",42,19803.93]
["K",43,20273.2]
["K",44,20742.61]
["K",45,21212.18]
["K",46,21681.91]
["K",47,22151.8]
["K",48,22621.84]
["K",49,23092.04]
["K",50,23562.39]
["K",51,24032.91]
["K",52,24503.58]
["K",53,24974.41]
["K",54,25445.4]
["K",55,25916.54]
["K",56,26387.85]
["K",57,26859.31]
["K",58,27330.92]
["K",59,27802.7]
["K",60,28274.63]
["K",61,28746.720000000001]
["K",62,29218.959999999999]
["K",63,29691.37]
["K",64,30163.93]
["K",65,30636.65]
["K",66,31109.52]
["K",67,31582.55]
["K",68,32055.74]
["K",69,32529.08]
["K",70,33002.6]
["K",71,33476.26]
["K",72,33950.080000000002]
["K",73,34424.050000000003]
["K",74,34898.19]
["K",75,35372.480000000003]
["K",76,35846.92]
["K",77,36321.53]
["K",78,36796.300000000003]
["K",79,37271.22]
["K",80,37746.29]
["K",81,38221.519999999997]
["K",82,38696.92]
["K",83,39172.47]
["K",84,39648.18]
["K",85,40124.04]
["K",86,40600.06]
["K",87,41076.239999999998]
["K",88,41552.58]
["K",89,42029.07]
["K",90,42505.73]
["K",91,42982.53]
["K",92,43459.49]
["K",93,43936.62]
["K",94,44413.9]
["K",95,44891.33]
["K",96,45368.93]
["K",97,45846.68]
["K",98,46324.6]
["K",99,46802.66]
["K",100,47280.88]
["K",101,47759.26]
["K",102,48237.8]
["K",103,48716.5]
["K",104,49195.35]
["K",105,49674.36]
["K",106,50153.43]
["K",107,50632.480000000003]
["K",108,51111.54]
["K",109,51590.6]
["K",110,52069.66]
["K",111,52548.71]
["K",112,53027.77]
["K",113,53506.84]
["K",114,53985.89]
["K",115,54464.95]
["K",116,54944.01]
["K",117,55423.07]
["K",118,55902.12]
["K",119,56381.19]
["K",120,56860.25]
["K",121,57339.3]
["K",122,57818.36]
["K",123,58297.42]
["K",124,58775.55]
["K",125,59247.42]
["K",126,59719.29]
["K",127,60191.17]
["K",128,60663.040000000001]
["K",129,61134.92]
["K",130,61606.79]
["K",131,62078.65]
["K",132,62550.53]
["K",133,63022.41]
["K",134,63494.28]
["K",135,63966.15]
["K",136,64438.02]
["K",137,64909.9]
["K",138,65381.77]
["K",139,65853.64]
["K",140,66325.52]
["K",141,66797.38]
["K",142,67269.259999999995]
["K",143,67741.13]
["K",144,68213]
["K",145,68684.88]
["K",146,69156.75]
["K",147,69628.62]
["K",148,70100.490000000005]
["K",149,70572.37]
["K",150,71044.25]
["K",151,71516.11]
["K",152,71987.98]
["K",153,72459.86]
["K",154,72931.73]
["K",155,73403.61]
["K",156,73875.48]
["K",157,74347.34]
["K",158,74819.22]
["K",159,75291.100000000006]
["K",160,75762.97]
["K",161,76234.84]
["K",162,76706.710000000006]
["K",163,77178.59]
["K",164,77650.460000000006]
["K",165,78122.33]
["K",166,78594.210000000006]
["K",167,79066.070000000007]
["K",168,79537.95]
["K",169,80009.83]
["K",170,80481.69]
["K",171,80953.570000000007]
["K",172,81425.440000000002]
["K",173,81897.320000000007]
["K",174,82369.19]
["K",175,82841.06]
["K",176,83312.94]
["K",177,83784.800000000003]
["K",178,84256.68]
["K",179,84728.55]
["K",180,85200.42]
["K",181,85672.3]
["K",182,86144.17]
["K",183,86616.04]
["K",184,87087.91]
["K",185,87559.79]
["K",186,88031.67]
["K",187,88503.53]
["K",188,88975.4]
["K",189,89447.28]
["K",190,89919.15]
["K",191,90391.03]
["K",192,90862.9]
["K",193,91334.76]
["K",194,91806.64]
["K",195,92278.52]
["K",196,92750.39]
["K",197,93222.26]
["K",198,93694.13]
["K",199,94166.01]
["K",200,94637.88]

{"sheet":"Special Prep","index":5,"n_rows":13,"n_cols":4,"rows_kept":13,"cut":false,"hidden":true,"merged":[]}
["Regs Date","Solicitor Type ID","Inside or Outside London","Rate"]
["2020-09-17",1,"Outside",48.36]
["2020-09-17",2,"Outside",41.06]
["2020-09-17",3,"Outside",27.15]
["2020-09-17",1,"Inside",50.87]
["2020-09-17",2,"Inside",43.12]
["2020-09-17",3,"Inside",31.03]
["2022-09-30",1,"Outside",55.61]
["2022-09-30",2,"Outside",47.22]
["2022-09-30",3,"Outside",31.22]
["2022-09-30",1,"Inside",58.5]
["2022-09-30",2,"Inside",49.59]
["2022-09-30",3,"Inside",35.68]

{"sheet":"Unused Material","index":6,"n_rows":25,"n_cols":7,"rows_kept":25,"cut":false,"hidden":true,"merged":[]}
["Regs Date","Solicitor Type ID","Hours Greater Than","Hours Less Than or Equal to","Inside or Outside London","Fixed Fee or Rate","Fixed or Hourly"]
["2020-09-17",1,0,3,"Outside",64.680000000000007,"Fixed"]
["2020-09-17",2,0,3,"Outside",64.680000000000007,"Fixed"]
["2020-09-17",3,0,3,"Outside",64.680000000000007,"Fixed"]
["2020-09-17",1,3,1000000,"Outside",48.36,"Hourly"]
["2020-09-17",2,3,1000000,"Outside",41.06,"Hourly"]
["2020-09-17",3,3,1000000,"Outside",27.15,"Hourly"]
["2020-09-17",1,0,3,"Inside",64.680000000000007,"Fixed"]
["2020-09-17",2,0,3,"Inside",64.680000000000007,"Fixed"]
["2020-09-17",3,0,3,"Inside",64.680000000000007,"Fixed"]
["2020-09-17",1,3,1000000,"Inside",50.87,"Hourly"]
["2020-09-17",2,3,1000000,"Inside",43.12,"Hourly"]
["2020-09-17",3,3,1000000,"Inside",31.03,"Hourly"]
["2022-09-30",1,0,3,"Outside",74.38,"Fixed"]
["2022-09-30",2,0,3,"Outside",74.38,"Fixed"]
["2022-09-30",3,0,3,"Outside",74.38,"Fixed"]
["2022-09-30",1,3,1000000,"Outside",55.61,"Hourly"]
["2022-09-30",2,3,1000000,"Outside",47.22,"Hourly"]
["2022-09-30",3,3,1000000,"Outside",31.22,"Hourly"]
["2022-09-30",1,0,3,"Inside",74.38,"Fixed"]
["2022-09-30",2,0,3,"Inside",74.38,"Fixed"]
["2022-09-30",3,0,3,"Inside",74.38,"Fixed"]
["2022-09-30",1,3,1000000,"Inside",58.5,"Hourly"]
["2022-09-30",2,3,1000000,"Inside",49.59,"Hourly"]
["2022-09-30",3,3,1000000,"Inside",35.68,"Hourly"]

{"sheet":"Defendant Uplifts","index":7,"n_rows":4,"n_cols":3,"rows_kept":4,"cut":false,"hidden":true,"merged":[]}
["No of Defendants Lower Limit","No of Defendants Upper Limit","Uplift"]
[0,1,0]
[2,4,0.2]
[5,1000000,0.3]

{"sheet":"Bill Types","index":8,"n_rows":38,"n_cols":7,"rows_kept":38,"cut":false,"hidden":true,"merged":[]}
["Bill Type ID","Bill Type","Case Type ID","Percentage","A, S or T","Unused material applies ","Remarks"]
[1,"Discontinuances",3,0.5,"T","N","No change of solicitor"]
[2,"Guilty Plea",3,1,"T","N","No change of solicitor"]
[3,"Cracked Trial",2,1,"T","Y","No change of solicitor"]
[4,"Trial",1,1,"T","Y","No change of solicitor"]
[5,"Appeal against Conviction",4,1,"A",null,"No change of solicitor"]
[6,"Appeal against Sentence",5,1,"A",null,"No change of solicitor"]
[7,"Committal for Sentence",6,1,"S",null,"No change of solicitor"]
[8,"Contempt",7,1,"T","N","No change of solicitor"]
[9,"Breach of Crown Court Order (new)",8,1,"S"]
[10,"Cracked before retrial",2,0.25,"T","Y","No change of solicitor"]
[11,"Retrial",1,0.25,"T","Y","No change of solicitor"]
[12,"Up to and including PCMH transfer (org)",2,0.25,"T","N"]
[13,"Up to and including PCMH transfer (new) - Guilty Plea",3,1,"T","N"]
[14,"Up to and including PCMH transfer (new) - Cracked",2,1,"T","Y"]
[15,"Up to and including PCMH transfer (new) - Trial",1,1,"T","Y"]
[16,"Before trial transfer (org)",2,0.75,"T","Y"]
[17,"Before trial transfer (new) - Cracked",2,1,"T","Y"]
[18,"Before trial transfer (new) - Trial",1,1,"T","Y"]
[19,"During trial transfer (org) - Trial",1,1,"T","Y","Claim up to the day before the transfer"]
[20,"During trial transfer (new) - Trial",1,0.5,"T","Y","Claim for the full trial length"]
[21,"Transfer before retrial (org) - Retrial",2,0.25,"T","Y"]
[22,"Transfer before retrial (new) - Cracked Retrial",2,0.5,"T","Y"]
[23,"Transfer before retrial (new) - Retrial",1,0.5,"T","Y","Claim for the full retrial length"]
[24,"Transfer during retrial (org) - Retrial",1,0.25,"T","Y","Claim up to retrial day before the transfer"]
[25,"Transfer during retrial (new) - Retrial",1,0.5,"T","Y","Claim for the full retrial length"]
[26,"Hearing Subsequent to Sentence",9,1,"T","N"]
[27,"Transfer after retrial and before sentence hearing (org) - Retrial",1,0.25,"T","Y"]
[28,"Transfer after retrial and before sentence hearing (new) - Retrial",1,0.1,"T","Y"]
[29,"Transfer after trial and before sentence hearing (org) - Trial",1,1,"T","Y"]
[30,"Transfer after trial and before sentence hearing (new) - Trial",1,0.1,"T","Y"]
[31,"Either Way Guilty plea/Cracked trial (fixed fee)",10,1,"T","N"]
[32,"Either Way GP/CT Up to and including PCMH transfer (org)",10,0.25,"T","N"]
[33,"Either Way GP/CT Up to and including PCMH transfer (new) ",10,1,"T","N"]
[34,"Either Way GP/CT Before trial transfer (org)",10,0.75,"T","N"]
[35,"Either Way GP/CT Before trial transfer (new)",10,1,"T","N"]
[36,"Either Way GP/CT Transfer before retrial (org)",10,0.25,"T","N"]
[37,"Either Way GP/CT Transfer during retrial (new)",10,0.5,"T","N"]

{"sheet":"Case Types","index":9,"n_rows":11,"n_cols":2,"rows_kept":11,"cut":false,"hidden":true,"merged":[]}
["Case Type ID","Case Type"]
[1,"Trial"]
[2,"Cracked trial"]
[3,"Guilty plea"]
[4,"Appeal against conviction"]
[5,"Appeal against sentence"]
[6,"Committal for sentence"]
[7,"Contempt"]
[8,"Breach of Crown Court order"]
[9,"Hearing subsequent to Sentence"]
[10,"Either Way Guilty plea/Cracked trial (fixed fee)"]

{"sheet":"Classes","index":10,"n_rows":12,"n_cols":2,"rows_kept":12,"cut":false,"hidden":true,"merged":[]}
["Class Code","Class"]
["A","Homicide and related grave offences"]
["B","Offences involving serious violence or damage, and serious drug offences"]
["C","Lesser ofences involving violence or damage, and less serious drug offences"]
["D","Sexual offences and offences against children"]
["E","Burglary, etc"]
["F","Other offences of dishonesty"]
["G","Other offences of dishonesty (>£30,000)"]
["H","Miscellaneous other offences"]
["I","Offences aginst public justice"]
["J","Serious sexual offences"]
["K","Other offences of dishonesty (>£100,000)"]

{"sheet":"Solicitor Types","index":11,"n_rows":4,"n_cols":2,"rows_kept":4,"cut":false,"hidden":true,"merged":[]}
["Solicitor Type ID","Solicitor Type"]
[1,"Senior Solicitor"]
[2,"Solicitor"]
[3,"Trainee"]

{"sheet":"Inside or Outside","index":12,"n_rows":3,"n_cols":1,"rows_kept":3,"cut":false,"hidden":true,"merged":[]}
["Inside or Outside London"]
["Inside"]
["Outside"]

{"sheet":"Yes or No","index":13,"n_rows":3,"n_cols":1,"rows_kept":3,"cut":false,"hidden":true,"merged":[]}
["Yes or No"]
["Yes"]
["No"]

{"sheet":"VAT","index":14,"n_rows":2,"n_cols":1,"rows_kept":2,"cut":false,"hidden":true,"merged":[]}
["VAT"]
[0.2]