{"text_format":"1","workbook":"xlsx","n_sheets":13,"sheets":["Instructions","Start Page","AF model","RF model","AC model","MCC Model ","Result Page","Update Inflation","AF Workings","RF Workings","MCC Example","PTE","Non-PTE"],"not_rendered":{"charts":2,"images":5,"macros":1,"external_links":0,"defined_names":72,"comments":0,"pivot_tables":0},"unopened":[],"bounds":{"document_bytes":16777216,"sheet_cells":100000,"rows_first":2000,"rows_last":500,"rows_between":2000,"halvings":0,"cell_chars":16384,"cell_head_chars":4096},"cells_cut":0,"cells_raw":0,"read":"whole","date_system":"1900"}

{"sheet":"Instructions","index":0,"n_rows":117,"n_cols":3,"rows_kept":117,"cut":false,"hidden":false,"merged":[[138,2,138,11],[135,2,135,11],[136,2,136,11],[137,2,137,11]]}
[]
[]
[]
[]
[]
[null,"Concessionary Travel for Older and Disabled People: Guidance on Reimbursing Bus Operators (England)"]
[null,"Reimbursement Calculator"]
[]
[null,"Version 4.0  - November 2022"]
[null,"Introduction"]
{"$rows_left_out":108}
{"sheet":"Start Page","index":1,"n_rows":6,"n_cols":7,"rows_kept":6,"cut":false,"hidden":false,"merged":[[2,1,2,5],[3,1,3,5],[5,1,5,5],[4,1,4,5]]}
[null,"Start Page"]
[]
[1,"Area Type",null,null,null,null,"Non-PTE"]
[2,"Year",null,null,null,null,"2023/24"]
[]
[3,"Observed Concessionary Journeys"]

{"sheet":"AF model","index":2,"n_rows":94,"n_cols":8,"rows_kept":94,"cut":false,"hidden":false,"merged":[[20,6,20,7],[65,1,65,4],[79,1,79,2],[93,1,93,2],[46,1,46,4],[47,1,47,5],[64,1,64,3],[48,1,48,5]]}
[null,"Average Fare Calculator"]
[]
[4]
[]
[]
[]
[]
[]
[]
[21,"Average Fare Foregone"]
{"$rows_left_out":85}
{"sheet":"RF model","index":3,"n_rows":48,"n_cols":4,"rows_kept":48,"cut":false,"hidden":false,"merged":[]}
["22a","Reimbursement Factor Calculator"]
[]
["22b","Choose option for change in fares"]
[23,"Area Type",{"$f":"'Start Page'!$G$3","v":"Non-PTE"}]
[24,"Year",{"$f":"'Start Page'!$G$4","v":"2023/24"}]
[25,"Current Average Fare Forgone",null,"Fare from Average Fare Model"]
[]
[]
[]
[]
{"$rows_left_out":39}
{"sheet":"AC model","index":4,"n_rows":29,"n_cols":4,"rows_kept":29,"cut":false,"hidden":false,"merged":[]}
[35,"Additional Costs Calculator"]
[]
[36,"Reimbursement Period",null,{"$f":"'Start Page'!$G$4","v":"2023/24"}]
[null,"Area type",null,{"$f":"'Start Page'!$G$3","v":"Non-PTE"}]
[]
[]
[37,"Administration Costs"]
[]
[38,"Enter Local Administration Cost of Scheme (£)",null,0]
[]
{"$rows_left_out":20}
{"sheet":"MCC Model ","index":5,"n_rows":159,"n_cols":53,"rows_kept":159,"cut":false,"hidden":false,"merged":[[0,0,0,1]]}
["Marginal Capacity Cost Calculator",null,null,null,"Area Type",{"$f":"'Start Page'!$G$3","v":"Non-PTE"},null,null,null,null,null,null,null,null,null,null,null,null,null,null,null,null,null,null,null,"MODEL INPUTS"]
[null,null,null,null,"Year",{"$f":"'Start Page'!$G$4","v":"2023/24"},null,null,null,null,null,null,null,null,null,null,null,null,null,null,null,null,null,null,null,null,"PTE","Non-PTE"]
[null,null,null,null,null,null,null,null,null,null,null,null,null,null,null,null,null,null,null,null,null,null,null,"Detailed workings are on the right     ®",null,"Overall speed incl turns",8.7857142857142865,10.027714285714286,"   miles per hour"]
[null,null,null,null,null,null,null,null,null,null,null,null,null,null,null,null,null,null,null,null,null,"[Select Cols X and BB and",null,null,null,"Default Mean Vehicle Occupancy",10,10,"   passengers per bus miles"]
[null,null,null,null,null,null,null,null,null,"Use Default",null,null,null,null,null,null,null,null,null,null,null,"go to Format\\Column\\Unhide",null,null,null,"Mean Journey Length",3.1068559609999999,3.5728843349999999,"   miles"]
[null,null,null,null,null,null,null,null,null,"Use Local Value",null,null,null,null,null,null,null,null,null,null,null,"to unhide columns]",null,null,null,"Mean Route Length",6.2137119219999999,7.1457686799999998,"   miles"]
[null,null,null,null,null,null,null,null,null,null,null,null,null,null,null,null,null,null,null,null,null,null,null,null,null,"Default Percentage of Commercial Journeys",0.6,0.6]
[null,null,"Total Concessionary Journeys",null,63,{"$f":"IF(D8='Start Page'!G6,\"\",\"NOTE - number of concessionary journeys does not equal the number entered on the start page\")","v":""},null,null,null,null,null,null,null,null,null,null,null,null,null,null,null,"Total net marginal capacity costs",{"$f":"SUM(W11:W160)","v":0},64,null,"Base frequency",6,6,"   buses/hr"]
[47,48,49,50,51,52,null,53,null,54,null,55,null,56,null,57,null,58,59,null,60,61,62]
["Activate calculation","Network/Subset of networks","Generation Factor","Total Concessionary Journeys on Network/Subset of networks","Mohring Power","Cost/Vehicle Hour (£)",null,"Cost/Vehicle Mile (£)",null,"Speed (mph)",null,"Mean vehicle occupancy (passengers per bus mile)",null,"Mean Journey Length (miles)",null,"Mean route length (miles)",null,"Average commercial fare (£)","Commercial Journeys as a % of Total",null,"Service elasticity","Net additional capacity cost per generated passenger journey (£)","Total net costs for the network/subset of networks (£)",null,null,"WORKINGS","Base frequency (buses/hr)","Pax boardings/m of route/bus","Pax boardings/m of route/hr","Additional pax per m of route/hr","χ1 (Buses/hr)","Veh hrs/hr to operate BOTH sides of the route - Without marginal pax","Veh hrs/hr to operate on ONE side of the route - Without marginal pax","Veh hrs/hr to operate BOTH sides of the route - With marginal pax","Veh hrs/hr to operate on ONE side of the route - With marginal pax","Δveh hrs","£ per additional passenger journey","Veh miles/hr to operate BOTH sides of the route - Without marginal pax","Veh miles/hr to operate on ONE side of the route - Without marginal pax","Veh miles/hr to operate BOTH sides of the route - With marginal pax","Veh ,iles/hr to operate on ONE side of the route - With marginal pax","Δveh miles","£ per additional passenger journey","Total additional capacity cost per generated passenger journey excluding any effect on the PVR","Percentage change in frequency","Percentage change in demand","Total boardings/hr BOTH WAYS","Total boardings/hr ONE WAY","Of which commercial journeys","Change in commercial journeys","Revenue Gain","Net of marginal costs of commercial journeys generated by the service elasticity","Net additional capacity cost per generated passenger journey"]
{"$rows_left_out":150}
{"sheet":"Result Page","index":6,"n_rows":26,"n_cols":8,"rows_kept":26,"cut":false,"hidden":false,"merged":[]}
[65,"Result page"]
[]
[null,"Area Type",{"$f":"'Start Page'!$G$3","v":"Non-PTE"}]
[null,"Year of Calculation",{"$f":"'Start Page'!$G$4","v":"2023/24"}]
[]
[]
[]
[null,"Revenue Forgone"]
[]
[66,null,"Observed Concessionary Journeys",null,null,null,null,{"$f":"'Start Page'!$G$6","v":0}]
{"$rows_left_out":17}
{"sheet":"Update Inflation","index":7,"n_rows":40,"n_cols":15,"rows_kept":40,"cut":false,"hidden":false,"merged":[[22,1,22,8],[23,1,23,8]]}
[null,"Master Index",null,null,null,"Updated index",null,null,null,null,"Workings","Change in CPI index"]
[null,"Year","CPI /GDP Deflator",null,null,"Year","CPI Index","GDP deflator","Updated Index",null,"Year","CPI/GDP Deflator","GDP Deflator"]
[null,"2005/6","78.9",null,null,"2005/6",78.900000000000006,2.7575570899932934E-2,"78.9",null,"2005/6",{"$f":"C3","v":"78.9"}]
[null,"2006/7","81.4",null,null,"2006/7",81.400000000000006,2.9935988560841377E-2,"81.4",null,"2006/7",{"$f":"C4","v":"81.4"}]
[null,"2007/8","83.4",null,null,"2007/8",83.4,2.3628682865693588E-2,"83.4",null,"2007/8","83.4"]
[null,"2008/9","85.8",null,null,"2008/9",85.8,3.6126298235244533E-2,"85.8",null,"2008/9","85.8"]
[null,"2009/10","88.7",null,null,"2009/10",88.7,1.3379020900661454E-2,"88.7",null,"2009/10","88.7"]
[null,"2010/11","92.2",null,null,"2010/11",92.2,1.6680467580835877E-2,"92.2",null,"2010/11","92.2",null,100]
[null,"2011/12","95.4",null,null,"2011/12",95.4,1.7724281808788683E-2,{"$f":"'Update Inflation'!C9","v":"95.4"},null,"2011/12","95.4",1.7724281808788683E-2,{"$f":"N8*(1+M9)","v":101.77242818087886},92.2]
[null,"2012/13","98.1",null,null,"2012/13",98.1,1.7326952105574427E-2,{"$f":"'Update Inflation'!C10","v":"98.1"},null,"2012/13",{"$f":"C10","v":"98.1"},1.7326952105574427E-2,{"$f":"N9*(1+M10)","v":103.53583416963696},95.4]
{"$rows_left_out":31}
{"sheet":"AF Workings","index":8,"n_rows":76,"n_cols":36,"rows_kept":76,"cut":false,"hidden":false,"merged":[[2,3,3,3],[3,7,5,7],[2,4,2,7],[4,1,4,2],[5,1,5,2],[2,23,2,26],[3,26,5,26],[4,20,4,21],[5,20,5,21],[31,6,31,35],[2,22,3,22],[32,33,32,35],[32,9,32,11],[32,12,32,14],[8,20,8,21],[6,20,6,21],[7,20,7,21],[12,23,12,24],[9,20,9,21],[32,18,32,20],[32,21,32,23],[32,24,32,26],[32,27,32,29],[32,30,32,32],[6,1,6,2],[7,1,7,2],[8,1,8,2],[9,1,9,2],[10,1,10,2],[31,0,33,0],[31,1,32,2],[32,6,32,8],[32,15,32,17],[10,20,10,21],[11,20,11,21],[13,4,13,5],[11,1,11,2],[31,3,32,5]]}
["(2) Interpolation",null,null,null,null,null,null,null,null,null,"(3) Average fare",null,null,null,null,"(4) Degenerate price ratio",null,null,null,"(5) Interpolation",null,null,null,null,null,null,null,null,null,"(6) Degenerate Cash Fare journeys"]
[]
[null,null,null,"Input values","Interpolation ",null,null,null,null,null,null,null,null,null,null,null,null,null,null,null,null,null,"Input values","Interpolation "]
[null,null,null,null,"Lower band","Upper band","Factor","Int'lated value",null,null,null,null,null,null,null,"Area",{"$f":"'Start Page'!$G$3","v":"Non-PTE"},null,null,null,null,null,null,"Lower band","Upper band","Factor","Int'lated value"]
[null,"Weekly ticket price",null,{"$f":"'AF model'!C23/'AF model'!C21","v":{"$error":"#DIV/0!"}},{"$f":"ROUNDDOWN(D5,0)","v":{"$error":"#DIV/0!"}},{"$f":"ROUNDUP(D5,0)","v":{"$error":"#DIV/0!"}},{"$f":"D5-E5","v":{"$error":"#DIV/0!"}},null,null,null,null,null,null,null,null,null,null,null,null,null,"Weekly ticket price",null,{"$f":"$R$9","v":{"$error":"#DIV/0!"}},{"$f":"ROUNDDOWN(W5,0)","v":{"$error":"#DIV/0!"}},{"$f":"ROUNDUP(W5,0)","v":{"$error":"#DIV/0!"}},{"$f":"W5-X5","v":{"$error":"#DIV/0!"}},null,null,null,null,"Cash Fare","Daily","Weekly"]
[null,"Daily Ticket Price ",null,{"$f":"'AF model'!C22/'AF model'!C21","v":{"$error":"#DIV/0!"}},{"$f":"ROUNDDOWN(D6,0)","v":{"$error":"#DIV/0!"}},{"$f":"ROUNDUP(D6,0)","v":{"$error":"#DIV/0!"}},{"$f":"D6-E6","v":{"$error":"#DIV/0!"}},null,null,null,null,"Cash Fare","Daily","Weekly",null,null,"RF","Price ratio",null,null,"Daily Ticket Price ",null,{"$f":"$R$8","v":{"$error":"#DIV/0!"}},{"$f":"ROUNDDOWN(W6,0)","v":{"$error":"#DIV/0!"}},{"$f":"ROUNDUP(W6,0)","v":{"$error":"#DIV/0!"}},{"$f":"W6-X6","v":{"$error":"#DIV/0!"}},null,null,null,"Price ratio",{"$f":"1","v":1},{"$f":"W6","v":{"$error":"#DIV/0!"}},{"$f":"W5","v":{"$error":"#DIV/0!"}}]
[null,"Weekly Tickets",null,null,{"$f":"VLOOKUP(E$5,$A$35:$AJ$76,2)","v":{"$error":"#DIV/0!"}},{"$f":"VLOOKUP(F$5,$A$35:$AJ$76,2)","v":{"$error":"#DIV/0!"}},{"$f":"G5","v":{"$error":"#DIV/0!"}},{"$f":"E7+G7*(F7-E7)","v":{"$error":"#DIV/0!"}},null,null,"Price ratio",1,{"$f":"D6","v":{"$error":"#DIV/0!"}},{"$f":"D5","v":{"$error":"#DIV/0!"}},null,"Cash Fare",{"$f":"IF($Q$4=\"Non-PTE\", EXP('RF Workings'!$G$40*((L12*VLOOKUP('Start Page'!$G$4, 'RF Workings'!$E$3:$G$21, 3)/1.2)^'RF Workings'!$G$39)), EXP('RF Workings'!$F$40*((L12*VLOOKUP('Start Page'!$G$4, 'RF Workings'!$E$3:$G$21, 3)/1.12)^'RF Workings'!$F$39)))","v":{"$error":"#DIV/0!"}},1,null,null,"Weekly Tickets",null,null,{"$f":"VLOOKUP(X$5,$A$35:$AJ$76,2)","v":{"$error":"#DIV/0!"}},{"$f":"VLOOKUP(Y$5,$A$35:$AJ$76,2)","v":{"$error":"#DIV/0!"}},{"$f":"Z5","v":{"$error":"#DIV/0!"}},{"$f":"X7+Z7*(Y7-X7)","v":{"$error":"#DIV/0!"}},null,null,"Tickets sold (from Look Up Table)",{"$f":"AA11-H11*Q7","v":{"$error":"#DIV/0!"}},{"$f":"AA9","v":{"$error":"#DIV/0!"}},{"$f":"AA7","v":{"$error":"#DIV/0!"}}]
[null,"Weekly journeys",null,null,{"$f":"VLOOKUP(E$5,$A$35:$AJ$76,3)","v":{"$error":"#DIV/0!"}},{"$f":"VLOOKUP(F$5,$A$35:$AJ$76,3)","v":{"$error":"#DIV/0!"}},{"$f":"G5","v":{"$error":"#DIV/0!"}},{"$f":"E8+G8*(F8-E8)","v":{"$error":"#DIV/0!"}},null,null,"Price per ticket",{"$f":"'AF model'!C21","v":{"$error":"#DIV/0!"}},{"$f":"'AF model'!C22","v":{"$error":"#DIV/0!"}},{"$f":"'AF model'!C23","v":{"$error":"#DIV/0!"}},null,"Daily",{"$f":"IF($Q$4=\"Non-PTE\", EXP('RF Workings'!$G$40*((M12*VLOOKUP('Start Page'!$G$4, 'RF Workings'!$E$3:$G$21, 3)/1.2)^'RF Workings'!$G$39)), EXP('RF Workings'!$F$40*((M12*VLOOKUP('Start Page'!$G$4, 'RF Workings'!$E$3:$G$21, 3)/1.12)^'RF Workings'!$F$39)))","v":{"$error":"#DIV/0!"}},{"$f":"(1+Q8)*D6","v":{"$error":"#DIV/0!"}},null,null,"Weekly journeys",null,null,{"$f":"VLOOKUP(X$5,$A$35:$AJ$76,3)","v":{"$error":"#DIV/0!"}},{"$f":"VLOOKUP(Y$5,$A$35:$AJ$76,3)","v":{"$error":"#DIV/0!"}},{"$f":"Z5","v":{"$error":"#DIV/0!"}},{"$f":"X8+Z8*(Y8-X8)","v":{"$error":"#DIV/0!"}},null,null,"Journeys made (from Look Up Table)",{"$f":"AA11-H11*Q7","v":{"$error":"#DIV/0!"}},{"$f":"AA10","v":{"$error":"#DIV/0!"}},{"$f":"AA8","v":{"$error":"#DIV/0!"}}]
[null,"Daily Tickets",null,null,{"$f":"VLOOKUP($E$5,$A$35:$AJ$76,$E15)+$G$5*(VLOOKUP($F$5,$A$35:$AJ$76,E$15)-VLOOKUP($E$5,$A$35:$AJ$76,E$15))","v":{"$error":"#DIV/0!"}},{"$f":"VLOOKUP($E$5,$A$35:$AJ$76,$F15)+$G$5*(VLOOKUP($F$5,$A$35:$AJ$76,F$15)-VLOOKUP($E$5,$A$35:$AJ$76,F$15))","v":{"$error":"#DIV/0!"}},{"$f":"IF(G6=0,G5,G6)","v":{"$error":"#DIV/0!"}},{"$f":"E9+G9*(F9-E9)","v":{"$error":"#DIV/0!"}},null,null,"Tickets sold (from Look Up Table)",{"$f":"H11","v":{"$error":"#DIV/0!"}},{"$f":"H9","v":{"$error":"#DIV/0!"}},{"$f":"H7","v":{"$error":"#DIV/0!"}},null,"Weekly",{"$f":"IF($Q$4=\"Non-PTE\", EXP('RF Workings'!$G$40*((N12*VLOOKUP('Start Page'!$G$4, 'RF Workings'!$E$3:$G$21, 3)/1.2)^'RF Workings'!$G$39)), EXP('RF Workings'!$F$40*((N12*VLOOKUP('Start Page'!$G$4, 'RF Workings'!$E$3:$G$21, 3)/1.12)^'RF Workings'!$F$39)))","v":{"$error":"#DIV/0!"}},{"$f":"(1+Q9)*D5","v":{"$error":"#DIV/0!"}},null,null,"Daily Tickets",null,null,{"$f":"VLOOKUP($X$5,$A$35:$AJ$76,$X14)+Z5*(VLOOKUP($Y$5,$A$35:$AJ$76,$X14)-VLOOKUP($X$5,$A$35:$AJ$76,$X14))","v":{"$error":"#DIV/0!"}},{"$f":"VLOOKUP($X$5,$A$35:$AJ$76,$Y14)+Z5*(VLOOKUP($Y$5,$A$35:$AJ$76,$Y14)-VLOOKUP($X$5,$A$35:$AJ$76,$Y14))","v":{"$error":"#DIV/0!"}},{"$f":"IF(Z6=0,Z5,Z6)","v":{"$error":"#DIV/0!"}},{"$f":"X9+Z9*(Y9-X9)","v":{"$error":"#DIV/0!"}}]
[null,"Daily journeys",null,null,{"$f":"VLOOKUP($E$5,$A$35:$AJ$76,$E16)+$G$5*(VLOOKUP($F$5,$A$35:$AJ$76,E$16)-VLOOKUP($E$5,$A$35:$AJ$76,E$16))","v":{"$error":"#DIV/0!"}},{"$f":"VLOOKUP($E$5,$A$35:$AJ$76,$F16)+$G$5*(VLOOKUP($F$5,$A$35:$AJ$76,F$16)-VLOOKUP($E$5,$A$35:$AJ$76,F$16))","v":{"$error":"#DIV/0!"}},{"$f":"IF(G6=0,G5,G6)","v":{"$error":"#DIV/0!"}},{"$f":"E10+G10*(F10-E10)","v":{"$error":"#DIV/0!"}},null,null,"journeys made (from Look Up Table)",{"$f":"H11","v":{"$error":"#DIV/0!"}},{"$f":"H10","v":{"$error":"#DIV/0!"}},{"$f":"H8","v":{"$error":"#DIV/0!"}},null,null,null,null,null,null,"Daily journeys",null,null,{"$f":"VLOOKUP($X$5,$A$35:$AJ$76,$X15)+Z5*(VLOOKUP($Y$5,$A$35:$AJ$76,$X15)-VLOOKUP($X$5,$A$35:$AJ$76,$X15))","v":{"$error":"#DIV/0!"}},{"$f":"VLOOKUP($X$5,$A$35:$AJ$76,$Y15)+Z5*(VLOOKUP($Y$5,$A$35:$AJ$76,$Y15)-VLOOKUP($X$5,$A$35:$AJ$76,$Y15))","v":{"$error":"#DIV/0!"}},{"$f":"IF(Z6=0,Z5,Z6)","v":{"$error":"#DIV/0!"}},{"$f":"X10+Z10*(Y10-X10)","v":{"$error":"#DIV/0!"}}]
{"$rows_left_out":67}
{"sheet":"RF Workings","index":9,"n_rows":789,"n_cols":12,"rows_kept":789,"cut":false,"hidden":false,"merged":[[47,4,47,6],[71,4,71,6]]}
[]
[null,null,null,null,"CPI Index","CPI /GDP Deflator","Deflation Factor"]
[null,null,null,null,"2005/6",{"$f":"'Update Inflation'!I3","v":"78.9"},{"$f":"$F$3/F3","v":1}]
[null,null,null,null,"2006/7",{"$f":"'Update Inflation'!I4","v":"81.4"},{"$f":"$F$3/F4","v":0.96928746928746934}]
[null,null,null,null,"2007/8",{"$f":"'Update Inflation'!I5","v":"83.4"},{"$f":"$F$3/F5","v":0.9460431654676259}]
[null,null,null,null,"2008/9",{"$f":"'Update Inflation'!I6","v":"85.8"},0.91958041958041969]
[null,null,null,null,"2009/10",{"$f":"'Update Inflation'!I7","v":"88.7"},0.88951521984216464]
[null,null,null,null,"2010/11",{"$f":"'Update Inflation'!I8","v":"92.2"},0.85574837310195229]
[null,null,null,null,"2011/12",{"$f":"'Update Inflation'!I9","v":"95.4"},0.82704402515723274]
[null,null,null,null,"2012/13",{"$f":"'Update Inflation'!I10","v":"98.1"},0.80428134556574937]
{"$rows_left_out":780}
{"sheet":"MCC Example","index":10,"n_rows":172,"n_cols":5,"rows_kept":172,"cut":false,"hidden":false,"merged":[]}
[null,"MARGINAL CAPACITY COSTS MODEL - WORKED EXAMPLE",null,null,"NPTE, 2009/10"]
[]
[null,"ASSUMPTIONS"]
[null,"Mohring power",null,0.6,"Default value"]
[null,"Vehicle/mile cost",null,0.7,"Default value"]
[null,"Vehicle/hr cost",null,13.3,"Default value"]
[null,"Speed (mph)",null,10.9,"Local"]
[null,"Mean vehicle occupancy",null,17.8,"Local"]
[null,"Mean route length",null,10,"Local"]
[null,"Mean journey length",null,4.9000000000000004,"Local"]
{"$rows_left_out":163}
{"sheet":"PTE","index":11,"n_rows":43,"n_cols":15,"rows_kept":43,"cut":false,"hidden":false,"merged":[]}
["ENTER OLD PAX RATIO CONCFARE/FREE",null,0.75295850538825659,null,null,null,null,null,"Shifted demand functions"]
["IMPLIED ELAST AT FARE=1 (2005/6)",null,{"$f":"C40","v":-0.5140157734077605},null,null,null,null,null,"Parameters ","Parameters "]
["Demand",null,null,"Demand",null,null,"Demand","Shifted","for lower","for"]
["function","OLD PASSHOLDER DEMAND",null,"function",null,null,"function","demand","piecewise","single"]
["parameters",null,null,"parameters for lower piecewise section",null,null,"parameters approx single curve","functions","section","curve"]
["k = ",100,null,"k = ",{"$f":"B6","v":100},null,{"$f":"B6","v":100},"Full fare",{"$f":"B6","v":100},{"$f":"B6","v":100}]
["b = ",{"$f":"LN(C1)/A26^B8","v":-0.64251971675970065},null,"b = ",{"$f":"+B7-((LN(B6/(B6*B9)))/(A26^B8))","v":-0.77838529778233945},null,{"$f":"(LN(B9)+B7*(A26^B8))/(A26^G8)","v":-0.70383855891433567},"abstraction",{"$f":"LN((B26+H9*(B6-(B6*B9)))/B6)/(A26^B8)","v":-0.72327182038473303},{"$f":"LN(H26/B6)/(A26^J8)","v":-0.66869077279260036}]
["λ = ",0.8,null,"λ = ",{"$f":"B8","v":0.8},null,{"$f":"(LN((LN(B9)+B7*(A18^B8))/(LN(B9)+B7*(A26^B8))))/LN(A18/A26)","v":0.70146086244280337},"rate",{"$f":"B8","v":0.8},{"$f":"(LN(LN(H18/B6)/LN(H26/B6)))/(LN(A18/A26))","v":0.72319944476429909}]
["Factor* = ",0.94176450748472662,"*=Old Passholder trips/Total Trips (2008/9)(from Last 2010 Draft Report MCL/PTE, Table 5)",null,null,null,null,0.3,null,null," "]
[null,null,null,null,"Revised demand curve",null,null,null,"Piecewise"]
{"$rows_left_out":34}
{"sheet":"Non-PTE","index":12,"n_rows":43,"n_cols":15,"rows_kept":43,"cut":false,"hidden":false,"merged":[]}
["ENTER OLD PAX RATIO CONCFARE/FREE",null,0.67092949778834299,null,null,null,null,null,"Shifted demand functions"]
["IMPLIED ELAST AT FARE=1 (2005/6)",null,{"$f":"C40","v":-0.67025749126462675},null,null,null,null,null,"Parameters ","Parameters "]
["Demand",null,null,"Demand",null,null,"Demand","Shifted","Parameters ","for"]
["function","OLD PASSHOLDER DEMAND",null,"function",null,null,"function","demand","piecewise","single"]
["parameters",null,null,"parameters for lower piecewise section",null,null,"parameters approx single curve","functions","section","curve"]
["k = ",100,null,"k = ",{"$f":"B6","v":100},null,{"$f":"B6","v":100},"Full fare",{"$f":"B6","v":100},{"$f":"B6","v":100}]
["b = ",{"$f":"LN(C1)/A26^B8","v":-0.74473054584958531},null,"b = ",{"$f":"+B7-((LN(B6/(B6*B9)))/(A26^B8))","v":-1.2361294901633597},null,{"$f":"(LN(B9)+B7*(A26^B8))/(A26^G8)","v":-1.0115751932567498},"abstraction",{"$f":"LN((B26+H9*(B6-(B6*B9)))/B6)/(A26^B8)","v":-1.000307501635205},{"$f":"LN(H26/B6)/(A26^J8)","v":-0.8356666825757737}]
["λ = ",0.9,null,"λ = ",{"$f":"B8","v":0.9},null,{"$f":"(LN((LN(B9)+B7*(A18^B8))/(LN(B9)+B7*(A26^B8))))/LN(A18/A26)","v":0.61077368350238048},"rate",{"$f":"B8","v":0.9},{"$f":"(LN(LN(H18/B6)/LN(H26/B6)))/(LN(A18/A26))","v":0.64055596002666726}]
["Factor* = ",0.76848504666215289,"*=Old Passholder trips/Total Trips (2008/9)(from Last 2010 Draft Report MCL/PTE, Table 5)",null,null,null,null,0.3]
[null,null,null,null,"Revised demand curve",null,null,null,"Piecewise"]
{"$rows_left_out":33}