{"text_format":"1","workbook":"xlsx","n_sheets":13,"sheets":["How to complete","IDPS Data return","FASP Data Return","SCT Data return","Overview of data","IDPS Guidance","FASP Guidance","SCT Guidance","Lists","IDPS Output","SCT Output","FASP Output","Contact details"],"not_rendered":{"charts":0,"images":7,"macros":0,"external_links":0,"defined_names":4,"comments":3,"pivot_tables":0},"unopened":[],"bounds":{"document_bytes":16777216,"sheet_cells":100000,"rows_first":2000,"rows_last":500,"rows_between":2000,"halvings":0,"cell_chars":16384,"cell_head_chars":4096},"cells_cut":0,"cells_raw":0,"read":"whole","date_system":"1900"}

{"sheet":"How to complete","index":0,"n_rows":81,"n_cols":7,"rows_kept":81,"cut":false,"hidden":false,"merged":[[9,2,9,11],[19,2,19,10],[70,2,70,10],[20,2,20,10],[15,2,15,11],[17,2,17,10],[31,2,31,11],[38,2,38,10],[77,2,77,10],[68,2,68,10],[80,2,80,10],[23,2,23,11],[27,2,27,10],[46,2,46,10],[57,2,57,10],[58,2,58,10],[35,2,36,10]]}
[]
[]
[]
[]
[]
[]
[]
[]
[]
[null,null,"Contents"]
{"$rows_left_out":72}
{"sheet":"IDPS Data return","index":1,"n_rows":113,"n_cols":18,"rows_kept":113,"cut":false,"hidden":false,"merged":[[50,2,50,6],[50,7,50,8],[50,9,50,10],[50,11,50,12],[51,7,51,8],[51,9,51,10],[51,11,51,12],[59,2,59,7],[60,8,60,9],[64,10,64,11],[64,12,64,13],[77,12,77,13],[77,2,77,11],[74,10,74,11],[70,3,70,9],[62,6,62,7],[62,12,62,13],[74,2,75,9],[47,9,47,10],[47,11,47,12],[44,7,44,12],[45,7,45,12],[48,2,48,6],[44,2,44,6],[45,2,45,6],[46,7,46,8],[46,9,46,10],[46,11,46,12],[47,2,47,6],[48,7,48,8],[48,9,48,10],[48,11,48,12],[112,10,112,11],[112,12,112,13],[112,7,112,9],[106,12,106,13],[80,8,80,9],[95,2,95,14],[110,12,110,13],[85,2,85,17],[82,6,82,7],[93,12,93,13],[110,14,110,17],[109,12,109,13],[109,14,109,17],[108,14,108,17],[82,12,82,13],[82,8,82,9],[92,3,92,11],[92,12,92,13],[92,14,92,17],[105,2,105,11],[106,2,106,11],[88,12,88,13],[105,12,105,13],[104,14,104,17],[105,14,105,17],[106,14,106,17],[100,14,103,17],[69,10,69,11],[68,12,68,13],[68,10,68,11],[69,12,69,13],[73,3,73,9],[73,10,73,11],[73,12,73,13],[73,14,73,17],[79,12,79,13],[32,8,32,11],[31,8,31,11],[59,12,59,13],[56,12,56,13],[58,2,58,7],[58,12,58,13],[57,12,57,13],[59,10,59,11],[57,2,57,7],[58,8,58,9],[54,8,54,9],[47,7,47,8],[30,2,32,6],[37,2,37,17],[54,14,54,17],[56,14,56,17],[55,14,55,17],[58,14,58,17],[59,14,59,17],[58,10,58,11],[57,14,57,17],[39,2,39,14],[54,12,54,13],[54,10,54,11],[111,12,111,13],[111,10,111,11],[55,10,55,11],[55,8,55,9],[55,2,55,7],[55,12,55,13],[109,2,109,11],[60,2,60,7],[110,2,110,11],[71,12,71,13],[97,2,97,17],[79,14,79,17],[80,10,80,11],[79,10,79,11],[91,3,91,11],[86,2,87,11],[90,3,90,11],[90,14,90,17],[88,14,88,17],[70,12,70,13],[80,2,80,7],[72,10,72,11],[68,14,68,17],[62,14,62,17],[17,2,17,14],[27,2,29,6],[27,8,27,11],[28,8,28,11],[29,8,29,11],[21,7,21,11],[20,2,20,6],[21,2,21,6],[26,8,26,11],[24,2,26,6],[24,8,24,11],[25,8,25,11],[20,7,20,11],[35,2,35,14],[30,8,30,11],[71,14,71,17],[60,14,60,17],[91,12,91,13],[80,12,80,13],[89,3,89,11],[69,2,69,9],[79,8,79,9],[82,10,82,11],[88,3,88,11],[71,3,71,9],[70,10,70,11],[76,14,76,17],[89,14,89,17],[89,12,89,13],[72,14,72,17],[81,14,82,17],[74,12,74,13],[91,14,91,17],[72,12,72,13],[87,14,87,17],[80,14,80,17],[90,12,90,13],[49,2,49,6],[49,7,49,8],[49,9,49,10],[49,11,49,12],[77,14,77,17],[69,14,69,17],[62,8,62,9],[72,3,72,9],[76,12,76,13],[64,2,64,7],[70,14,70,17],[62,10,62,11],[71,10,71,11],[66,2,66,14],[60,10,60,11],[56,2,56,7],[57,8,57,9],[56,10,56,11],[56,8,56,9],[60,12,60,13],[51,2,51,6],[59,8,59,9],[57,10,57,11],[64,8,64,9]]}
[]
[]
[]
[]
[]
[]
[]
[]
[]
[null,null,"NHS Infectious Diseases in Screening Programme"]
{"$rows_left_out":104}
{"sheet":"FASP Data Return","index":2,"n_rows":85,"n_cols":18,"rows_kept":85,"cut":false,"hidden":false,"merged":[[84,8,84,10],[84,11,84,12],[84,13,84,14],[80,14,80,17],[81,2,81,11],[81,12,81,13],[81,14,81,17],[83,11,83,12],[83,13,83,14],[77,14,77,17],[78,2,78,11],[78,12,78,13],[78,14,78,17],[79,2,79,11],[79,12,79,13],[79,14,79,17],[74,2,74,11],[74,12,74,13],[74,14,74,17],[75,2,75,11],[75,12,75,13],[75,14,75,17],[73,14,73,17],[61,2,61,11],[61,12,61,13],[61,14,61,17],[63,9,63,11],[63,12,63,13],[65,2,65,14],[68,14,68,17],[69,2,69,11],[69,12,69,13],[69,14,69,17],[71,2,71,17],[58,14,58,17],[59,2,59,11],[59,12,59,13],[59,14,59,17],[60,2,60,11],[60,12,60,13],[60,14,60,17],[56,2,56,14],[35,14,35,17],[36,2,36,14],[38,2,38,17],[40,2,40,14],[42,2,42,17],[44,2,44,14],[46,2,46,17],[48,2,48,14],[50,2,50,17],[52,2,52,14],[54,2,54,17],[34,2,34,17],[22,2,22,6],[22,7,22,11],[25,2,27,6],[25,8,25,11],[26,8,26,11],[27,8,27,11],[28,2,30,6],[28,8,28,11],[29,8,29,11],[30,8,30,11],[32,2,32,14],[17,2,17,14],[20,2,20,6],[20,7,20,11],[20,12,21,17],[21,2,21,6],[21,7,21,11]]}
[]
[]
[]
[]
[]
[]
[]
[]
[]
[null,null,"NHS Fetal Anomaly Screening Programme"]
{"$rows_left_out":76}
{"sheet":"SCT Data return","index":3,"n_rows":70,"n_cols":18,"rows_kept":70,"cut":false,"hidden":false,"merged":[[16,2,16,14],[19,2,19,6],[19,7,19,11],[20,2,20,6],[20,7,20,11],[19,12,20,17],[34,2,34,14],[30,2,30,14],[32,2,32,17],[23,2,25,6],[23,8,23,11],[24,8,24,11],[25,8,25,11],[26,2,28,6],[26,8,26,11],[27,8,27,11],[28,8,28,11],[46,2,46,14],[48,2,48,17],[50,2,50,14],[61,10,61,11],[61,12,61,13],[57,12,57,13],[59,12,59,13],[52,2,52,17],[58,12,58,13],[58,14,58,17],[57,14,57,17],[59,2,59,11],[69,2,69,17],[65,2,65,17],[67,2,67,14],[54,2,54,14],[57,2,57,11],[56,14,56,17],[59,14,59,17],[58,2,58,11],[63,2,63,14],[36,2,36,17],[38,2,38,14],[40,2,40,17],[42,2,42,14],[44,2,44,17]]}
[]
[]
[]
[]
[]
[]
[]
[]
[null,null,"NHS Sickle Cell and Thalassaemia Screening Programme"]
[null,null,"Annual data collection template"]
{"$rows_left_out":61}
{"sheet":"Overview of data","index":4,"n_rows":56,"n_cols":8,"rows_kept":56,"cut":false,"hidden":false,"merged":[[55,3,55,7],[46,3,46,7],[54,3,54,7],[47,3,47,7],[48,3,48,7],[49,3,49,7],[52,3,52,7],[50,3,50,7],[51,3,51,7],[43,2,43,7],[44,2,45,2],[44,3,45,3],[44,4,45,4],[44,5,45,5],[44,6,44,7],[8,2,8,8],[13,6,13,7],[15,3,15,7],[13,5,14,5],[13,4,14,4],[13,3,14,3],[13,2,14,2],[24,3,24,7],[12,2,12,7],[29,2,29,7],[30,2,31,2],[30,3,31,3],[30,4,31,4],[30,5,31,5],[30,6,30,7],[16,3,16,7],[17,3,17,7],[32,3,32,7],[36,3,36,7],[37,3,37,7],[35,3,35,7],[33,3,33,7],[34,3,34,7]]}
[]
[]
[]
[]
[]
[]
[]
[]
[null,null,"Data to be reported by the NHS Screening Programmes"]
[]
{"$rows_left_out":47}
{"sheet":"IDPS Guidance","index":5,"n_rows":36,"n_cols":7,"rows_kept":36,"cut":false,"hidden":false,"merged":[[30,1,30,6]]}
[]
[null,"Standard 4: Test turnaround time (HIV, hepatitis B, and syphilis)"]
[null,"Data item","Data source","Links to standard","Description","Guidance","Definitions"]
[null,"Screening laboratory name","Laboratory",null,"Name of the screening laboratory receiving samples"]
[null,"UKAS customer reference number","Laboratory",null,"UKAS customer reference number for accreditation of screening laboratory to ISO 15189"]
[null,"Assay used\n","Laboratory",null,"Assay used by screening laboratory to test for each infection"]
[null,"Analysers used","Laboratory",null,"Analyser used by screening laboratory to test for each infection","Please provide the name for the analyser used for each infection. If there has been a change in analyser during the reporting period, please provide dates when the analyser was changed."]
[null,"Assay used for confirmation\n","Laboratory",null,"Assay used for confirmatory testing of each infection"]
[null,"Analyser used for confirmation\n","Laboratory",null,"Analyser used for confirmatory testing of each infection"]
[null,"Confirmatory laboratory","Laboratory",null,"Name of laboratory where samples are sent for confirmatory testing","If samples are sent to different laboratories for different infections, please specify this."]
{"$rows_left_out":27}
{"sheet":"FASP Guidance","index":6,"n_rows":12,"n_cols":8,"rows_kept":12,"cut":false,"hidden":false,"merged":[[3,5,4,5]]}
[]
[null,"FASP-S07: referral: timeliness to information and support (T21/T18/T13)"]
[null,"Data item","Data source","Links to standard","Description","Guidance","Exclusions","Definitions"]
[null,"Denominator: number of women for whom a higher chance result (from the combined or quadruple test) is received by the maternity service in the reporting period.","Maternity","FASP-S07: referral: timeliness to information and support (T21/T18/T13)","Number of women for whom a higher chance result (from the combined or quadruple test) is received by the maternity service in the reporting period.","The date the maternity service receives the result is counted as day 1.\n\nThe chance cut-off is set at 1 in 150 at term for the combined and quadruple tests. This means women with a result of ≥ 1 in 150 (between 1 in 2 and 1 in 150) are in the higher chance group. These women must be offered an appointment to discuss their results and the option of prenatal diagnosis. The appointment can be face to face or virtual depending on the woman’s choice.\n\nWe calculate performance by dividing numerator by denominator and multiplying by 100 to give a percentage.",null,"\nOffer is defined as direct contact with the woman – providers should be able to demonstrate that reasonable efforts were made to contact the woman. Where contact was not possible, this should be explained in the mitigations.\n\n\n"]
[null,"Numerator: number of women with higher chance results attending an appointment in ≤ 3 working days to discuss their results.","Maternity","FASP-S07: referral: timeliness to information and support (T21/T18/T13)","The proportion of women with higher chance T21/T18/T13 screening results attending an appointment in ≤ 3 working days to discuss their results."]
[null,"FASP-S08: referral: timeliness to intervention (20-week screening scan)"]
[null,"Data item","Data source","Links to standard","Description","Guidance","Exclusions","Definitions"]
[null,"The total number of women who had a screening scan within the reporting period, where an unexpected finding is suspected or confirmed in the baby at the 20-week screening scan.","Maternity","FASP-S08: referral: timeliness to intervention (20-week screening scan)","The proportion of women where an unexpected finding is suspected or confirmed in the baby at the 20-week screening scan.","This standard is reported in 2 parts: S08a (local referrals) and S08b (tertiary referrals).\nThe denominators for standards 8a (local referral) and 8b (tertiary referral) should equal this number. These women should be included in either 8a or 8b, and not double counted."]
[null,"S08a - local referrals\nDenominator: number of women who had a screening scan within the reporting period with an unexpected finding and were referred locally.","Maternity","FASP- S08a: Local referral","Number of women who had a screening scan within the reporting period with an unexpected finding and were referred locally.\n\nLocal referral is defined as a referral within the same provider organisation (this includes a local fetal medicine service).","The denominator for 8a plus the denominator for 8b should add up to the total number of women in the reporting period who had a suspected/identified anomaly at the screening scan. Women should be included in either 8a or 8b, and not double counted.","Excludes women with a suspected or confirmed fetal anomaly where a referral is required to a tertiary fetal medicine centre for further investigation and care (as clinically appropriate as per local pathway)"]
[null,"S08a - local referrals\nNumerator: number of women referred locally and seen in ≤ 3 working days of the screening scan.","Maternity","FASP- S08a: Local referral","number of women referred locally and seen in ≤ 3 working days of the screening scan.\n","This is a sub-set of the denominator for 8a.\n\nDate of the completed screening scan is counted as day 1.","Excludes women with a suspected or confirmed fetal anomaly where a referral is required to a tertiary fetal medicine centre for further investigation and care (as clinically appropriate as per local pathway)"]
{"$rows_left_out":3}
{"sheet":"SCT Guidance","index":7,"n_rows":5,"n_cols":8,"rows_kept":5,"cut":false,"hidden":false,"merged":[]}
[]
[null,"Standard 7: Timely reporting of prenatal diagnosis (PND) results to parents"]
[null,"Data item","Data source","Links to standard","Description","Guidance","Exclusions","Definitions"]
[null,"Number of women who have PND (denominator)","Maternity","Standard 7 (Timely reporting of PND results)","This is the number of women who have prenatal diagnostic (PND) testing in the reporting period."]
[null,"Number of women who receive their PND result ≤5 working days of test (numerator)","Maternity","Standard 7 (Timely reporting of PND results)","This is the number of women who have PND testing in the reporting period, who then receive their result in less than or equal to 5 working days of the PND test."]

{"sheet":"Lists","index":8,"n_rows":140,"n_cols":3,"rows_kept":140,"cut":false,"hidden":true,"merged":[]}
["Maternity service","Service code"]
["Bedfordshire Hospitals NHS Foundation Trust (Bedford)","RC9","East of England"]
["Bedfordshire Hospitals NHS Foundation Trust (Luton and Dunstable)","RC9","East of England"]
["Cambridge University Hospitals NHS Foundation Trust","RGT","East of England"]
["East and North Hertfordshire NHS Trust","RWH","East of England"]
["East Suffolk and North Essex NHS Foundation Trust (Colchester)","RDE","East of England"]
["East Suffolk and North Essex NHS Foundation Trust (Ipswich)","RDE","East of England"]
["James Paget University Hospitals NHS Foundation Trust","RGP","East of England"]
["Mid and South Essex NHS Foundation Trust (Basildon)","RAJ","East of England"]
["Mid and South Essex NHS Foundation Trust (Broomfield)","RAJ","East of England"]
{"$rows_left_out":131}
{"sheet":"IDPS Output","index":9,"n_rows":18,"n_cols":46,"rows_kept":18,"cut":false,"hidden":true,"merged":[[9,0,9,30],[15,0,15,11],[4,0,4,27]]}
[]
["IDPS"]
[]
[]
["Standard 4"]
["Trust","Lab Name","UKAS No.","HIV assay","Hep B assay","Syphilis assay","HIV analyser","Hep B analyser","Syphilis analyser","HIV confirmation assay","Hep B confirmation assay","Syphilis confirmation assay","HIV confirmation analyser","Hep B confirmation analyser","Syphilis confirmation analyser","HIV confirmatory lab","Hep B confirmatory lab","Syphilis confirmatory lab","Collection Year","Exclude HIV?","Exclude Hep B?","Exclude syphilis?","Samples rec. (HIV)","Lab excl. HIV","HIV Denominator","Reported HIV (numerator)","HIV mitigations","HIV late","Samples rec. Hep B","Lab excl. Hep B","Hep B denominator","Reported Hep B (numerator)","Hep B mitigations","Hep B late","Samples rec. Syphilis","Lab excl. syphilis","Syphilis denominator","Reported Syphilis (numerator)","Syphilis mitigations","Syphilis late","Samples received comments","Exclusions comments","Denominator comments","Numerator comments","Mitigations comments","Late comments"]
[{"$f":"IF('IDPS Data return'!$H$21=\"\", \"\", 'IDPS Data return'!$H$21)","v":""},{"$f":"IF('IDPS Data return'!$H$45=\"\", \"\", 'IDPS Data return'!$H$45)","v":""},{"$f":"IF('IDPS Data return'!$H$46=\"\", \"\", 'IDPS Data return'!$H$46)","v":""},{"$f":"IF('IDPS Data return'!$H$48=\"\", \"\", 'IDPS Data return'!$H$48)","v":""},{"$f":"IF('IDPS Data return'!$J$48=\"\", \"\", 'IDPS Data return'!$J$48)","v":""},{"$f":"IF('IDPS Data return'!$L$48=\"\", \"\", 'IDPS Data return'!$L$48)","v":""},{"$f":"IF('IDPS Data return'!$H$49=\"\", \"\", 'IDPS Data return'!$H$49)","v":""},{"$f":"IF('IDPS Data return'!$J$49=\"\", \"\", 'IDPS Data return'!$J$49)","v":""},{"$f":"IF('IDPS Data return'!$L$49=\"\", \"\", 'IDPS Data return'!$L$49)","v":""},{"$f":"IF('IDPS Data return'!$H$50=\"\", \"\", 'IDPS Data return'!$H$50)","v":""},{"$f":"IF('IDPS Data return'!$J$50=\"\", \"\", 'IDPS Data return'!$J$50)","v":""},{"$f":"IF('IDPS Data return'!$L$50=\"\", \"\", 'IDPS Data return'!$L$50)","v":""},{"$f":"IF('IDPS Data return'!$H$51=\"\", \"\", 'IDPS Data return'!$H$51)","v":""},{"$f":"IF('IDPS Data return'!$J$51=\"\", \"\", 'IDPS Data return'!$J$51)","v":""},{"$f":"IF('IDPS Data return'!$L$51=\"\", \"\", 'IDPS Data return'!$L$51)","v":""},{"$f":"IF('IDPS Data return'!$H$52=\"\", \"\", 'IDPS Data return'!$H$52)","v":""},{"$f":"IF('IDPS Data return'!$J$52=\"\", \"\", 'IDPS Data return'!$J$52)","v":""},{"$f":"IF('IDPS Data return'!$L$52=\"\", \"\", 'IDPS Data return'!$L$52)","v":""},"2021/22",null,null,null,{"$f":"IF('IDPS Data return'!$I$56=\"\", \"\", 'IDPS Data return'!$I$56)","v":""},{"$f":"IF('IDPS Data return'!$I$57=\"\", \"\", 'IDPS Data return'!$I$57)","v":""},{"$f":"IF('IDPS Data return'!$I$58=\"\", \"\", 'IDPS Data return'!$I$58)","v":""},{"$f":"IF('IDPS Data return'!$I$59=\"\", \"\", 'IDPS Data return'!$I$59)","v":""},{"$f":"IF('IDPS Data return'!$I$60=\"\", \"\", 'IDPS Data return'!$I$60)","v":""},{"$f":"IF('IDPS Data return'!$I$61=\"\", \"\", 'IDPS Data return'!$I$61)","v":""},{"$f":"IF('IDPS Data return'!$K$56=\"\", \"\", 'IDPS Data return'!$K$56)","v":""},{"$f":"IF('IDPS Data return'!$K$57=\"\", \"\", 'IDPS Data return'!$K$57)","v":""},{"$f":"IF('IDPS Data return'!$K$58=\"\", \"\", 'IDPS Data return'!$K$58)","v":""},{"$f":"IF('IDPS Data return'!$K$59=\"\", \"\", 'IDPS Data return'!$K$59)","v":""},{"$f":"IF('IDPS Data return'!$K$60=\"\", \"\", 'IDPS Data return'!$K$60)","v":""},{"$f":"IF('IDPS Data return'!$K$61=\"\", \"\", 'IDPS Data return'!$K$61)","v":""},{"$f":"IF('IDPS Data return'!$M$56=\"\", \"\", 'IDPS Data return'!$M$56)","v":""},{"$f":"IF('IDPS Data return'!$M$57=\"\", \"\", 'IDPS Data return'!$M$57)","v":""},{"$f":"IF('IDPS Data return'!$M$58=\"\", \"\", 'IDPS Data return'!$M$58)","v":""},{"$f":"IF('IDPS Data return'!$M$59=\"\", \"\", 'IDPS Data return'!$M$59)","v":""},{"$f":"IF('IDPS Data return'!$M$60=\"\", \"\", 'IDPS Data return'!$M$60)","v":""},{"$f":"IF('IDPS Data return'!$M$61=\"\", \"\", 'IDPS Data return'!$M$61)","v":""},{"$f":"IF('IDPS Data return'!$O$56=\"\", \"\", 'IDPS Data return'!$O$56)","v":""},{"$f":"IF('IDPS Data return'!$O$57=\"\", \"\", 'IDPS Data return'!$O$57)","v":""},{"$f":"IF('IDPS Data return'!$O$58=\"\", \"\", 'IDPS Data return'!$O$58)","v":""},{"$f":"IF('IDPS Data return'!$O$59=\"\", \"\", 'IDPS Data return'!$O$59)","v":""},{"$f":"IF('IDPS Data return'!$O$60=\"\", \"\", 'IDPS Data return'!$O$60)","v":""},{"$f":"IF('IDPS Data return'!$O$61=\"\", \"\", 'IDPS Data return'!$O$61)","v":"Please indicate here why results were reported greater than 8 working days"}]
[]
[]
["Standard 5"]
{"$rows_left_out":9}
{"sheet":"SCT Output","index":10,"n_rows":6,"n_cols":7,"rows_kept":6,"cut":false,"hidden":true,"merged":[[3,0,3,6]]}
[]
["SCT"]
[]
["Standard 7:"]
["TrustName","Collection Year","Exclude Data","Women had PND (denom)","Denom Comments","Results within 5 days (num)","Numerator Comments"]
[{"$f":"IF('SCT Data return'!H20=\"\", \"\", 'SCT Data return'!H20)","v":""},"2021/22",null,{"$f":"IF('SCT Data return'!M58=\"\", \"\", 'SCT Data return'!M58)","v":""},{"$f":"IF('SCT Data return'!O58=\"\",\"\", 'SCT Data return'!O58)","v":""},{"$f":"IF('SCT Data return'!M59=\"\", \"\", 'SCT Data return'!M59)","v":""},{"$f":"IF('SCT Data return'!O59=\"\", \"\", 'SCT Data return'!O59)","v":""}]

{"sheet":"FASP Output","index":11,"n_rows":8,"n_cols":12,"rows_kept":8,"cut":false,"hidden":true,"merged":[[1,0,1,4],[5,2,5,5],[5,6,5,9]]}
[]
["Standard 7"]
["Trust","Collection Year","Name of software","Comments","Number of higher risk results (denominator)","Comments","Number of women offered appt within 3 working days (numerator)","Comments"]
[{"$f":"'IDPS Data return'!H21:H21","v":0},"2022-23",{"$f":"'FASP Data Return'!M60:M60","v":0},{"$f":"'FASP Data Return'!O60","v":0},{"$f":"'FASP Data Return'!M61","v":0},{"$f":"'FASP Data Return'!O61","v":0},{"$f":"'FASP Data Return'!M62","v":0},{"$f":"'FASP Data Return'!O62","v":0}]
[]
[null,null,"Standard 8a",null,null,null,"Standard 8b"]
["Trust","Collection Year","Total number of women in the reporting period who had a suspected/identified anomaly at the screening scan","Comments","Women with a suspected/confirmed abnormality referred locally (denominator)","Comments","Women with a suspected/confirmed abnormality referred locally, seen within 3 working days (numerator)","Comments","Women with a suspected/confirmed abnormality referred to a tertiary fetal medicine centre (denominator)","Comments","Women with a suspected/confirmed abnormality referred to a tertiary fetal medicine centre, seen within 5 working days (numerator)","Comments"]
[{"$f":"'IDPS Data return'!H21","v":0},"2022-23",{"$f":"'FASP Data Return'!M70","v":0},{"$f":"'FASP Data Return'!O70","v":0},{"$f":"'FASP Data Return'!M75","v":0},{"$f":"'FASP Data Return'!O75","v":0},{"$f":"'FASP Data Return'!M76","v":0},{"$f":"'FASP Data Return'!O76","v":0},{"$f":"'FASP Data Return'!M79","v":0},{"$f":"'FASP Data Return'!O79","v":0},{"$f":"'FASP Data Return'!M80","v":0},{"$f":"'FASP Data Return'!O80","v":0}]

{"sheet":"Contact details","index":12,"n_rows":5,"n_cols":24,"rows_kept":5,"cut":false,"hidden":true,"merged":[[2,2,2,4],[2,5,2,7],[2,8,2,10],[1,2,1,10],[2,21,2,23],[2,18,2,20],[1,18,1,23],[2,12,2,14],[2,15,2,17],[1,11,1,17],[2,11,3,11]]}
["Contact details - IDPS lab details within standard 4 collection"]
[null,null,null,null,null,null,null,null,null,null,null,"FASP",null,null,null,null,null,null,"SCT"]
["Trust info",null,"Data return completed by:",null,null,"Sign-off for standards 2, 3, 5, and 6:\n(Head of Midwifery)",null,null,"Sign-off for standard 4:\n(Laboratory Lead)",null,null,"Name of laboratory to which samples are sent. If more than one laboratory (e.g for first and second trimester screening) please state.","Data return completed by:",null,null,"Sign-off for standards 1, 7, and 8:\n(Head of Midwifery)",null,null,"Data return completed by:",null,null,"Sign-off for standards 2, 3, 5, and 6:\n(Head of Midwifery)"]
["Name of trust (select from drop-down)","Other","Name","Job title","Email","Name","Job title","Email","Name","Job title","Email",null,"Name","Job title","Email","Name","Job title","Email","Name","Job title","Email","Name","Job title","Email"]
[{"$f":"IF('IDPS Data return'!H21=\"\", \"\", 'IDPS Data return'!H21)","v":""},{"$f":"IF('IDPS Data return'!H22=\"\", \"\", 'IDPS Data return'!H22)","v":""},{"$f":"IF('IDPS Data return'!I25=\"\", \"\", 'IDPS Data return'!I25)","v":""},{"$f":"IF('IDPS Data return'!I26=\"\", \"\", 'IDPS Data return'!I26)","v":""},{"$f":"IF('IDPS Data return'!I27=\"\", \"\", 'IDPS Data return'!I27)","v":""},{"$f":"IF('IDPS Data return'!I28=\"\", \"\", 'IDPS Data return'!I28)","v":""},{"$f":"IF('IDPS Data return'!I29=\"\", \"\", 'IDPS Data return'!I29)","v":""},{"$f":"IF('IDPS Data return'!I30=\"\", \"\", 'IDPS Data return'!I30)","v":""},{"$f":"IF('IDPS Data return'!I31=\"\", \"\", 'IDPS Data return'!I31)","v":""},{"$f":"IF('IDPS Data return'!I32=\"\", \"\", 'IDPS Data return'!I32)","v":""},{"$f":"IF('IDPS Data return'!I33=\"\", \"\", 'IDPS Data return'!I33)","v":""},{"$f":"IF(#REF!=\"\", \"\",#REF!)","v":{"$error":"#REF!"}},{"$f":" IF(#REF!=\"\", \"\",#REF!)","v":{"$error":"#REF!"}},{"$f":" IF(#REF!=\"\", \"\",#REF!)","v":{"$error":"#REF!"}},{"$f":" IF(#REF!=\"\", \"\",#REF!)","v":{"$error":"#REF!"}},{"$f":" IF(#REF!=\"\", \"\",#REF!)","v":{"$error":"#REF!"}},{"$f":" IF(#REF!=\"\", \"\",#REF!)","v":{"$error":"#REF!"}},{"$f":" IF(#REF!=\"\", \"\",#REF!)","v":{"$error":"#REF!"}},{"$f":"IF('SCT Data return'!I24=\"\", \"\", 'SCT Data return'!I24)","v":""},{"$f":"IF('SCT Data return'!I25=\"\", \"\", 'SCT Data return'!I25)","v":""},{"$f":"IF('SCT Data return'!I26=\"\", \"\", 'SCT Data return'!I26)","v":""},{"$f":"IF('SCT Data return'!I27=\"\", \"\", 'SCT Data return'!I27)","v":""},{"$f":"IF('SCT Data return'!I28=\"\", \"\", 'SCT Data return'!I28)","v":""},{"$f":"IF('SCT Data return'!I29=\"\", \"\", 'SCT Data return'!I29)","v":""}]