HouseholdIncome,BedroomEntitlement,WishToLive,ApplicationSubmitDate,App1_Age,App1_Town,App1_HousingStatus,App1_IsDisabled,App2_Age,App2_Town,App2_HousingStatus,App2_IsDisabled,Total_Savings
46500,4 / 5 Bedrooms,,05/12/2018,41,Rochester,Private Tenant,No,42,ROCHESTER,Private Tenant,No,0
47000,1 / 2 Bedrooms,,25/02/2017,40,BRIGHTON,Private Tenant,No,41,BRIGHTON,Private Tenant,No,17000
26822,2 / 3 Bedrooms,,08/01/2008,57,ST ALBANS,Private Tenant,No,,,,No,500
23023,1 / 2 Bedrooms,,27/02/2019,29,Cambridge,With family or friends,No,,,,No,20000
24593,1 / 2 Bedrooms,,20/01/2019,32,Horsham,With family or friends,No,,,,No,0
53000,1 / 2 Bedrooms,,09/12/2019,71,Wickham Market,Housing Association Tenant,Yes,,,,No,16000
38000,1 / 2 Bedrooms,,20/04/2016,42,Gravesend,Private Tenant,No,38,Gravesend,Private Tenant,No,0
40638,3 / 4 Bedrooms,,14/08/2019,35,St. Albans,Private Tenant,No,35,St. Albans,Private Tenant,No,24000
8122,2 / 3 Bedrooms,North Kesteven | North Kesteven | North Kesteven,19/06/2020,52,Sleaford,Owner Occupier,No,,,,No,84000
20000,2 / 3 Bedrooms,,11/09/2019,44,Dunmow,Private Tenant,No,,,,No,20000
39205,1 / 2 Bedrooms,Northampton,05/08/2020,22,Northampton,With family or friends,Yes,23,Northampton,With family or friends,No,5000
29081,2 / 3 Bedrooms,,24/04/2014,50,"Langton Green, Tunbridge Wells",Private Tenant,No,,,,No,15000
20500,1 / 2 Bedrooms,,23/03/2019,48,Luton,Private Tenant,No,,,,No,500
50090,2 / 3 Bedrooms,,07/02/2019,43,Shoreham-by-Sea,With family or friends,No,,,,No,35000
69630,4 / 5 Bedrooms,Boston,30/08/2020,38,Boston,Shared Owners,No,39,Boston,With family or friends,No,50000
56637.6,3 / 4 Bedrooms,,18/04/2019,36,Brighton,Owner Occupier,No,37,Brighton,Owner Occupier,No,50000
76000,2 / 3 Bedrooms,,03/10/2019,52,Tunbridge Wells,Private Tenant,No,60,Tunbridge Wells,Private Tenant,No,55000
28955,1 / 2 Bedrooms,,15/10/2018,74,ASHFORD,Shared Owners,Yes,76,Ashford,Shared Owners,Yes,0
17600,1 / 2 Bedrooms,,21/12/2016,48,Tonbridge,With family or friends,No,,,,No,50000
23000,2 / 3 Bedrooms,Derby,02/07/2020,58,Derby,With family or friends,Yes,,,,No,0
13635,3 / 4 Bedrooms,,22/11/2017,44,Buntingford,Owner Occupier,No,,,,No,125000
25684,1 / 2 Bedrooms,,25/08/2015,50,Banstead,With family or friends,No,,,,No,16000
56000,3 / 4 Bedrooms,,20/04/2017,36,,Private Tenant,No,24,,Private Tenant,No,0
9097.6,3 / 4 Bedrooms,Worcester,30/01/2020,43,Worcester,Owner Occupier,No,,,,No,80000
49900,1 / 2 Bedrooms,,08/01/2019,60,Chatham,Private Tenant,No,58,Chatham,Private Tenant,No,0
20751,1 / 2 Bedrooms,Blaby,04/02/2020,50,Leicester,With family or friends,No,,,,No,55000
35547,3 / 4 Bedrooms,,28/01/2018,49,,Housing Association Tenant,No,52,,Housing Association Tenant,No,3500
21000,1 / 2 Bedrooms,,28/05/2019,29,King's Lynn,With family or friends,No,,,,No,0
13381,2 / 3 Bedrooms,South Derbyshire,04/08/2020,36,Burton-on-Trent,Owner Occupier,No,,,,No,25000
45137,3 / 4 Bedrooms,,03/12/2019,35,Sandhurst,With family or friends,No,,,,No,0
24267,2 / 3 Bedrooms,Corby,23/03/2020,37,Rushden,With family or friends,No,,,,No,5400
60000,2 / 3 Bedrooms,,19/10/2019,45,Harlow,With family or friends,No,,,,No,0
35000,1 / 2 Bedrooms,,20/03/2015,41,Hatfield,With family or friends,No,,,,No,3500
19365,1 / 2 Bedrooms,Redditch | Birmingham | Dudley,18/03/2020,24,Birmingham,With family or friends,No,,,,No,8000
50000,2 / 3 Bedrooms,,12/10/2019,33,March,With family or friends,No,,,,No,0
43484,3 / 4 Bedrooms,South Northamptonshire,28/05/2020,37,Towcester,Private Tenant,No,114,Towcester,Private Tenant,No,10000
57500,1 / 2 Bedrooms,,04/02/2019,30,Milton Keynes,Private Tenant,No,34,Milton Keynes,Private Tenant,No,6000
20800,1 / 2 Bedrooms,Warwick,07/07/2020,33,Leamington Spa,With family or friends,No,,,,No,40000
20500,1 / 2 Bedrooms,Shropshire,05/05/2020,30,Telford,With family or friends,No,,,,No,11000
64264,3 / 4 Bedrooms,,15/01/2019,22,Aldershot,Private Tenant,No,46,Aldershot,Private Tenant,No,30000
50000,1 / 2 Bedrooms,Dudley | South Staffordshire | Birmingham,09/03/2020,42,Birmingham,With family or friends,No,,,,No,5000
19000,1 / 2 Bedrooms,,07/04/2019,24,Dunstable,With family or friends,No,22,Dunstable,With family or friends,No,0
26743.8,2 / 3 Bedrooms,Redditch | Bromsgrove,23/02/2020,38,Redditch,Owner Occupier,No,,,,No,35000
21661.2,5 / 6 Bedrooms,Amber Valley,17/01/2020,46,Ripley,Private Tenant,No,43,Ripley,Private Tenant,No,5000
23661,3 / 4 Bedrooms,,15/06/2018,45,Eastbourne,Private Tenant,No,,,,No,0
17400,3 / 4 Bedrooms,,16/01/2015,65,Chelmsford,Owner Occupier,No,,,,No,100000
39500,1 / 2 Bedrooms,,16/06/2014,39,Epsom,With family or friends,No,,,,No,15000
72000,3 / 4 Bedrooms,,19/11/2019,38,Thetford,Council Tenant,No,25,Thetford,Council Tenant,No,5000
11903,3 / 4 Bedrooms,Ashfield | Nottingham,05/05/2020,29,Nottingham,Housing Association Tenant,No,,,,No,0
41500,1 / 2 Bedrooms,,31/01/2019,25,Bishop's Stortford,With family or friends,No,27,Stansted,With family or friends,No,41500
30002.96,4 / 5 Bedrooms,,17/11/2016,47,Herne Bay,Private Tenant,Yes,,,,No,2000
30000,1 / 2 Bedrooms,,09/05/2019,53,Aylesbury,With family or friends,No,,,,No,15000
14000,1 / 2 Bedrooms,,13/09/2016,68,Margate,With family or friends,No,,,,No,50000
18720,1 / 2 Bedrooms,Northampton,04/08/2020,26,Northampton,With family or friends,No,35,Northampton,With family or friends,No,63000
38000,3 / 4 Bedrooms,,24/01/2019,32,Dartford,Council Tenant,No,37,Dartford,Council Tenant,No,0
30000,1 / 2 Bedrooms,Northampton,13/01/2020,34,Northampton,Owner Occupier,No,,,,No,10000
16000,1 / 2 Bedrooms,,09/06/2014,33,Littleport,With family or friends,No,,,,No,5500
20488,3 / 4 Bedrooms,Bromsgrove,16/05/2020,53,Birmingham,Owner Occupier,No,,,,No,135000
19215,1 / 2 Bedrooms,Bromsgrove | Redditch | Herefordshire | Stratford-on-Avon,17/07/2020,23,Hemel Hempstead,With family or friends,No,,,,No,5000
32084.83,2 / 3 Bedrooms,,13/01/2018,38,,Rent to Buy,No,27,,Rent to Buy,No,6000
35670.5,4 / 5 Bedrooms,,12/08/2014,45,Greenhithe,Private Tenant,No,,,,No,0
22555.8,2 / 3 Bedrooms,,01/02/2019,50,Norwich,Private Tenant,No,,,,No,3400
20950,1 / 2 Bedrooms,Newark and Sherwood,10/06/2020,20,Newark,Private Tenant,No,64,Newark,Private Tenant,No,5000
923.57,1 / 2 Bedrooms,Rutland | Oadby and Wigston,12/08/2020,79,Wigston,With family or friends,No,75,Wigston,With family or friends,No,124000
49000,1 / 2 Bedrooms,,17/01/2019,38,Brighton,Private Tenant,No,,,,No,7600
30000,2 / 3 Bedrooms,Lichfield,03/06/2020,50,Lichfield,With family or friends,No,,,,No,130000
37582,2 / 3 Bedrooms,Hinckley and Bosworth | Blaby | Harborough,05/02/2020,32,Leicester,Private Tenant,No,35,Leicester,Private Tenant,No,6000
32.81,1 / 2 Bedrooms,,09/09/2019,21,Bedford,With family or friends,No,27,Bedford,With family or friends,No,0
37000,1 / 2 Bedrooms,,07/01/2019,45,Bury St. Edmunds,With family or friends,No,,,,No,15000
33189,2 / 3 Bedrooms,,10/10/2019,44,Canterbury,Private Tenant,No,44,Canterbury,Private Tenant,No,18000
46000,3 / 4 Bedrooms,,01/02/2019,36,East Grinstead,With family or friends,No,,,,No,25000
39386.8,2 / 3 Bedrooms,,01/01/2019,31,Marlow,Private Tenant,No,29,Marlow,Private Tenant,No,6000
43000,1 / 2 Bedrooms,,20/09/2019,39,Stansted,Private Tenant,No,29,Stansted,Private Tenant,No,20000
837.42,1 / 2 Bedrooms,,10/01/2019,69,Northampton,Owner Occupier,No,,,,No,117000
50000,1 / 2 Bedrooms,,19/03/2017,31,,With family or friends,No,30,,With family or friends,No,15000
79082,2 / 3 Bedrooms,,08/01/2019,35,Cambridge,Private Tenant,No,36,Cambridge,Private Tenant,No,2000
62150,5 / 6 Bedrooms,,07/11/2019,53,Erith,Private Tenant,No,43,Erith,Private Tenant,No,0
17968,1 / 2 Bedrooms,,13/05/2019,26,Milton Keynes,With family or friends,No,,,,No,70000
30800,1 / 2 Bedrooms,Lincoln,08/01/2020,32,Lincoln,Private Tenant,No,33,Lincoln,Private Tenant,No,120000
46692,3 / 4 Bedrooms,,29/11/2017,33,Luton,With family or friends,No,34,Luton,With family or friends,No,25000
16000,2 / 3 Bedrooms,,16/05/2013,50,Worthing,Private Tenant,No,,,,No,20000
39000,2 / 3 Bedrooms,,31/05/2019,39,Aylesbury,Private Tenant,No,30,Aylesbury,Private Tenant,No,0
53153,1 / 2 Bedrooms,,04/01/2019,27,Peterborough,With family or friends,No,29,Peterborough,With family or friends,No,11000
35500,1 / 2 Bedrooms,,19/09/2019,30,Waltham Cross,With family or friends,No,,,,No,0
58330,5 / 6 Bedrooms,Kettering,26/05/2020,48,Kettering,Private Tenant,Yes,46,Kettering,Private Tenant,Yes,0
58000,2 / 3 Bedrooms,,07/01/2019,46,Milton Keynes,With family or friends,No,,,,No,8000
54240,1 / 2 Bedrooms,,14/05/2019,21,Epping,Private Tenant,No,21,Epping,Private Tenant,No,0
26720,2 / 3 Bedrooms,,09/09/2019,31,Eastbourne,Private Tenant,No,29,Eastbourne,Private Tenant,No,20000
40840,2 / 3 Bedrooms,,06/12/2019,37,Horsham,Private Tenant,No,35,Crawley,Private Tenant,No,70000
23023,1 / 2 Bedrooms,,12/03/2019,31,Upminster,With family or friends,No,,,,No,0
8000,1 / 2 Bedrooms,,12/07/2019,59,Tenterden,Owner Occupier,No,,,,No,200000
10051.08,2 / 3 Bedrooms,Nuneaton and Bedworth,24/05/2020,25,Nuneaton,Housing Association Tenant,No,,,,No,0
49485,2 / 3 Bedrooms,,08/08/2018,46,King's Lynn,Private Tenant,No,52,King's Lynn,Private Tenant,No,10000
58500,1 / 2 Bedrooms,,12/08/2019,28,Chertsey,With family or friends,No,32,Weybridge,With family or friends,No,10000
24177,1 / 2 Bedrooms,,26/11/2019,30,Dover,Owner Occupier,No,,,,No,10000
12764.77,2 / 3 Bedrooms,,15/10/2019,25,Peterborough,Private Tenant,No,24,March,With family or friends,No,0
70116,3 / 4 Bedrooms,,25/10/2019,44,Watford,Private Tenant,No,38,Watford,Private Tenant,No,0
20216.27,2 / 3 Bedrooms,,05/06/2019,57,Ware,Private Tenant,No,34,Hoddesdon,Housing Association Tenant,No,110000
18000,2 / 3 Bedrooms,Northampton,10/06/2020,47,Northampton,Private Tenant,No,,,,No,13000
55993.32,1 / 2 Bedrooms,,11/11/2019,40,Milton Keynes,Private Tenant,No,37,Milton Keynes,Private Tenant,No,16371
31500,1 / 2 Bedrooms,,16/01/2019,37,Bedford,Private Tenant,No,,,,No,20000
23800,1 / 2 Bedrooms,,28/03/2019,32,Borehamwood,With family or friends,No,,,,No,0
3133,3 / 4 Bedrooms,,05/08/2019,33,Woodford Green,With family or friends,No,,,,No,3000
23050,2 / 3 Bedrooms,East Lindsey,23/08/2020,24,Louth,Private Tenant,No,26,Louth,Private Tenant,No,3000
58500,2 / 3 Bedrooms,,06/04/2018,52,Bexhill-on-Sea,Private Tenant,No,39,Bexhill-on-Sea,Private Tenant,No,1000
33724.6,3 / 4 Bedrooms,,22/11/2019,38,Colchester,Owner Occupier,No,,,,No,45000
40821.6,3 / 4 Bedrooms,,02/07/2019,56,Epsom,Private Tenant,No,,,,No,45000
30000,1 / 2 Bedrooms,Worcester,17/07/2020,63,Tenbury Wells,Private Tenant,No,,,,No,7500
52212.96,1 / 2 Bedrooms,,13/01/2019,36,Milton Keynes,With family or friends,No,39,Milton Keynes,With family or friends,No,6000
27582,1 / 2 Bedrooms,,02/09/2019,37,Dorking,With family or friends,No,,,,No,15000
68175,2 / 3 Bedrooms,,11/02/2019,56,Luton,Private Tenant,Yes,52,Luton,Private Tenant,Yes,15000
31000,2 / 3 Bedrooms,,14/08/2019,33,Peterborough,Tied Accommodation (Job),No,,,,No,4000
14320.86,3 / 4 Bedrooms,,30/10/2017,45,Great Yarmouth,Owner Occupier,Yes,,,,No,43000
28098,1 / 2 Bedrooms,,20/11/2019,68,Brentwood,Shared Owners,No,73,Brentwood,Shared Owners,Yes,150000
36000,1 / 2 Bedrooms,,03/10/2019,24,Chatham,With family or friends,No,23,Chatham,With family or friends,No,0
38286.78,2 / 3 Bedrooms,,19/08/2019,52,Norwich,Private Tenant,No,51,Norwich,Private Tenant,No,0
42545.39,2 / 3 Bedrooms,Nottingham | Nottingham,12/05/2020,41,Newark,Private Tenant,No,44,Newark,Private Tenant,No,3000
51600,2 / 3 Bedrooms,,03/09/2019,53,Epsom,Private Tenant,No,34,Epsom,Private Tenant,No,10000
37500,1 / 2 Bedrooms,,06/11/2019,25,Welling,With family or friends,No,24,Maidstone,With family or friends,No,0
37140,3 / 4 Bedrooms,Tamworth,06/08/2020,37,Tamworth,Private Tenant,No,32,Tamworth,Private Tenant,No,15000
24000,1 / 2 Bedrooms,,26/02/2019,30,Peterborough,With family or friends,No,,,,No,10000
17518.75,1 / 2 Bedrooms,,30/06/2019,36,Chelmsford,Housing Association Tenant,No,54,Chelmsford,Housing Association Tenant,No,1500
41682,2 / 3 Bedrooms,,07/09/2017,34,Westcliff-on-Sea,With family or friends,No,32,Westcliff-on-Sea,With family or friends,No,1000
65044,1 / 2 Bedrooms,,03/01/2019,32,Ashford,Private Tenant,No,32,Ashford,Private Tenant,No,0
40000,1 / 2 Bedrooms,,02/06/2014,40,London,With family or friends,No,,,,No,5000
6423.25,2 / 3 Bedrooms,,03/07/2014,93,Sevenoaks,Owner Occupier,Yes,59,Sevenoaks,Owner Occupier,Yes,50000
30100,1 / 2 Bedrooms,,17/01/2019,36,Harrow,With family or friends,No,,,,No,100000
29890,1 / 2 Bedrooms,Cherwell District Council | Reading Unitary Council,01/11/2013,70,Isleworth,With family or friends,No,,,,No,50000
11200,1 / 2 Bedrooms,,19/08/2019,57,Baldock,Private Tenant,No,,,,No,55000
23067,1 / 2 Bedrooms,Leicester,07/02/2020,30,Leicester,Private Tenant,No,,,,No,17000
27717,1 / 2 Bedrooms,Basingstoke &amp; Deane District Council | Bromley Borough Council,11/07/2013,46,London,Council Tenant,No,,,,No,7000
60067.63,3 / 4 Bedrooms,,18/04/2018,22,Bishop's Stortford,Private Tenant,No,,,,No,0
40416,1 / 2 Bedrooms,,13/08/2019,30,Northampton,Private Tenant,No,,,,No,6000
30000,1 / 2 Bedrooms,,31/05/2019,23,Chichester,With family or friends,No,23,Petworth,With family or friends,No,4000
29468,2 / 3 Bedrooms,,04/02/2019,64,Braintree,Private Tenant,No,52,Braintree,Private Tenant,No,18000
28947,1 / 2 Bedrooms,,12/09/2019,33,London,With family or friends,No,,,,No,0
28000,1 / 2 Bedrooms,,24/01/2019,28,Buntingford,With family or friends,No,,,,No,25000
33000,3 / 4 Bedrooms,Northampton | Leicester,20/04/2020,42,Harrow,Council Tenant,No,48,Harrow,Council Tenant,No,4500
68650,1 / 2 Bedrooms,,06/05/2019,28,Loughton,With family or friends,No,37,London,With family or friends,No,0
54080.2,2 / 3 Bedrooms,,08/01/2019,44,Milton Keynes,Private Tenant,No,50,Milton Keynes,Private Tenant,No,15000
78000,1 / 2 Bedrooms,,10/05/2019,41,Slough,Private Tenant,No,41,LANGLEY,Private Tenant,No,10000
60241.04,3 / 4 Bedrooms,,17/04/2019,45,Eastbourne,Private Tenant,No,31,Eastbourne,Private Tenant,No,5000
42582,2 / 3 Bedrooms,,15/06/2014,44,Guildford,Private Tenant,No,43,Guildford,Private Tenant,No,10000
19330,2 / 3 Bedrooms,Leicester,03/06/2020,40,Leicester,Private Tenant,No,37,Leicester,Private Tenant,No,7000
36100,4 / 5 Bedrooms,,05/05/2019,34,Harleston,Private Tenant,No,32,Harleston,Private Tenant,No,0
29512,2 / 3 Bedrooms,,01/11/2019,42,London,Private Tenant,No,39,London,Private Tenant,No,6500
21500,1 / 2 Bedrooms,,20/03/2019,50,Brighton,Private Tenant,No,,,,No,0
235.75,1 / 2 Bedrooms,Newark and Sherwood,02/04/2020,50,Mansfield,With family or friends,Yes,,,,No,800
43737,3 / 4 Bedrooms,,16/07/2019,44,Buckingham,Private Tenant,No,47,Buckingham,Private Tenant,No,38000
48196,2 / 3 Bedrooms,,19/05/2014,39,Bedford,Shared Owners,No,35,Bedford,Shared Owners,No,0
50200,2 / 3 Bedrooms,,13/05/2017,45,Sidcup,With family or friends,No,,,,No,4000
20800,5 / 6 Bedrooms,,30/07/2019,53,Margate,Private Tenant,No,39,Margate,Private Tenant,No,0
62000,2 / 3 Bedrooms,,06/11/2019,37,London,Private Tenant,No,37,London,Private Tenant,No,0
49151,2 / 3 Bedrooms,Lichfield,23/06/2020,36,Rugeley,Private Tenant,No,38,Rugeley,Private Tenant,No,17000
29000,1 / 2 Bedrooms,,24/02/2019,40,Saffron Walden,With family or friends,No,,,,No,10.1
56347.2,5 / 6 Bedrooms,,11/09/2019,38,Royston,Private Tenant,No,39,Royston,Private Tenant,No,0
48220.4,4 / 5 Bedrooms,,25/02/2019,43,milton keynes,Private Tenant,No,43,milton keynes,Private Tenant,No,16000
49999,2 / 3 Bedrooms,,19/02/2019,62,Haywards Heath,Housing Association Tenant,No,27,Haywards Heath,Housing Association Tenant,No,0
34400,1 / 2 Bedrooms,Wychavon | Worcester,27/04/2020,27,Worcester,With family or friends,No,27,Worcester,With family or friends,No,10000
20000,2 / 3 Bedrooms,South Kesteven,02/02/2020,25,Grantham,With family or friends,No,,,,No,8000
23500,2 / 3 Bedrooms,Herefordshire,27/04/2020,46,Hereford,Private Tenant,No,,,,No,0
18333,1 / 2 Bedrooms,,18/07/2019,35,peterborough,With family or friends,No,,,,No,0
49300,1 / 2 Bedrooms,Kettering | Wellingborough,20/01/2020,26,Wellingborough,With family or friends,No,25,Corby,With family or friends,No,7000
31153,1 / 2 Bedrooms,,20/01/2019,40,Billericay,Private Tenant,No,,,,No,0
49645,4 / 5 Bedrooms,,27/12/2018,39,Rochester,Private Tenant,No,36,Rochester,Private Tenant,No,7000
25183,1 / 2 Bedrooms,Nottingham,05/06/2020,36,Nottingham,With family or friends,No,,,,No,0
30200,1 / 2 Bedrooms,,17/04/2019,35,Aylesbury,With family or friends,No,,,,No,9000
33800,1 / 2 Bedrooms,,29/08/2019,36,Wellingborough,Private Tenant,No,,,,No,7000
8034.84,1 / 2 Bedrooms,,14/04/2015,63,London,Private Tenant,Yes,,,,No,50000
33628.04,3 / 4 Bedrooms,,26/03/2019,38,Bury St. Edmunds,Private Tenant,No,34,Bury St. Edmunds,Private Tenant,No,0
50787,3 / 4 Bedrooms,,11/06/2019,57,Braintree,Discounted Rent,Yes,49,Braintree,Discounted Rent,No,0
49206,1 / 2 Bedrooms,,16/09/2019,33,London,With family or friends,No,,,,No,25000
9380.19,1 / 2 Bedrooms,,05/04/2016,59,Saxmundham,Private Tenant,No,,,,No,50000
41200,1 / 2 Bedrooms,North Kesteven,01/05/2020,27,Lincoln,Private Tenant,No,27,Lincoln,Private Tenant,No,5000
31120,1 / 2 Bedrooms,,05/06/2019,27,Bexleyheath,With family or friends,No,,,,No,0
62953,3 / 4 Bedrooms,,09/07/2018,46,Tunbridge Wells,Private Tenant,No,46,Tunbridge Wells,Private Tenant,No,32000
28337,1 / 2 Bedrooms,,23/06/2013,67,Crawley,Private Tenant,No,77,Crawley,Private Tenant,No,30000
68000,1 / 2 Bedrooms,,02/04/2019,44,Greenford,Private Tenant,No,,,,No,7000
18054.63,2 / 3 Bedrooms,Nuneaton and Bedworth,19/02/2020,53,Nuneaton,Shared Owners,No,,,,No,0
381.57,1 / 2 Bedrooms,Kettering,07/08/2020,70,Kettering,Shared Owners,Yes,69,Kettering,Shared Owners,Yes,79000
36400,1 / 2 Bedrooms,,22/03/2018,30,,With family or friends,No,,,,No,0
42000,2 / 3 Bedrooms,,09/03/2019,33,Wickford,With family or friends,No,34,Wickford,Temporary Accommodation,No,8000
14500,1 / 2 Bedrooms,,15/05/2014,31,Hamstreet,With family or friends,No,,,,No,6000
37638.2,3 / 4 Bedrooms,,10/12/2018,38,Bedford,Shared Owners,No,,,,No,15000
27000,1 / 2 Bedrooms,,13/12/2018,30,Sandy,With family or friends,No,,,,No,10000
39838,1 / 2 Bedrooms,Worcester,12/08/2020,30,Worcester,Private Tenant,No,32,Worcester,Private Tenant,No,16000
30850,1 / 2 Bedrooms,,29/04/2019,36,Bedford,Private Tenant,No,,,,No,0
49782,1 / 2 Bedrooms,Warwick,04/05/2020,31,Leamington Spa,With family or friends,No,30,Leamington Spa,With family or friends,No,6850
40000,1 / 2 Bedrooms,,14/03/2019,36,Huntingdon,Private Tenant,No,34,Huntingdon,Private Tenant,No,1500
64000,3 / 4 Bedrooms,Coventry,18/01/2020,32,Coventry,With family or friends,No,30,Coventry,With family or friends,Yes,2000
1200,1 / 2 Bedrooms,Birmingham,15/04/2020,44,Ferryhill,With family or friends,No,,,,No,0
28843,4 / 5 Bedrooms,,21/10/2019,43,Luton,With family or friends,No,,,,No,60000
30150,2 / 3 Bedrooms,Birmingham,25/05/2020,46,Birmingham,With family or friends,No,,,,No,5000
168.24,1 / 2 Bedrooms,Wolverhampton | Wolverhampton,10/02/2020,69,Sidcup,With family or friends,No,,,,No,57000
58530,1 / 2 Bedrooms,,31/05/2019,59,Midhurst,Housing Association Tenant,No,57,Midhurst,Housing Association Tenant,Yes,8000
20921,2 / 3 Bedrooms,,20/09/2019,32,Sittingbourne,Private Tenant,No,33,Sittingbourne,Private Tenant,No,0
53832,3 / 4 Bedrooms,,19/06/2014,51,Tonbridge,Private Tenant,No,45,Tonbridge,Private Tenant,No,15000
54334.2,2 / 3 Bedrooms,Walsall | Shropshire | Telford and Wrekin,18/05/2020,27,Telford,Private Tenant,No,26,Telford,Private Tenant,No,7200
18836.2,3 / 4 Bedrooms,,03/03/2019,46,Aylesbury,Owner Occupier,No,,,,No,0
33448,2 / 3 Bedrooms,,22/07/2019,32,Cambridge,Housing Association Tenant,No,,,,No,0
36082.8,3 / 4 Bedrooms,,19/07/2019,51,St. Neots,Private Tenant,Yes,49,St. Neots,Private Tenant,Yes,15000
36443.6,3 / 4 Bedrooms,,05/05/2019,35,Baldock,Owner Occupier,No,,,,No,50000
27140,1 / 2 Bedrooms,,22/05/2015,54,Milton Keynes,Owner Occupier,Yes,76,Milton Keynes,Private Tenant,Yes,0
42591.54,2 / 3 Bedrooms,,29/01/2019,52,Sheerness,With family or friends,No,24,Sheerness,Tied Accommodation (Job),No,0
27054.77,1 / 2 Bedrooms,,14/10/2019,33,Bognor Regis,With family or friends,No,,,,No,11000
36411.6,2 / 3 Bedrooms,,05/11/2019,31,Peterborough,Housing Association Tenant,Yes,31,Peterborough,Housing Association Tenant,Yes,5200
19855.12,3 / 4 Bedrooms,,30/04/2019,55,Epsom,Owner Occupier,Yes,,,,No,180000
22800,1 / 2 Bedrooms,Blaby | Oadby and Wigston | Harborough,28/01/2020,36,Wigston,With family or friends,Yes,,,,No,11000
26500,1 / 2 Bedrooms,,27/05/2019,30,Bedford,With family or friends,No,,,,No,6000
14730.27,2 / 3 Bedrooms,Mansfield,27/05/2020,28,Newark,Council Tenant,No,,,,No,0
17000,1 / 2 Bedrooms,Nottingham,09/07/2020,33,Nottingham,With family or friends,No,,,,No,0
62000,1 / 2 Bedrooms,,04/05/2019,32,Cambridge,Private Tenant,No,28,Cambridge,Private Tenant,No,20000
63500,1 / 2 Bedrooms,Chesterfield,07/05/2020,65,Chesterfield,Private Tenant,No,68,Chesterfield,Private Tenant,No,45000
28000,2 / 3 Bedrooms,Coventry,21/04/2020,51,Coventry,Housing Association Tenant,No,,,,No,0
35275.6,3 / 4 Bedrooms,,23/09/2019,34,Colchester,Private Tenant,No,39,Colchester,Private Tenant,No,0
10314.4,3 / 4 Bedrooms,,12/01/2019,38,Brighton,Owner Occupier,No,,,,No,40000
25000,1 / 2 Bedrooms,,17/04/2019,27,Maidstone,With family or friends,No,,,,No,12500
24551,1 / 2 Bedrooms,Stratford-on-Avon | Coventry | Warwick,20/01/2020,32,Coventry,Private Tenant,No,,,,No,20000
45200,1 / 2 Bedrooms,,20/10/2019,40,Uxbridge,With family or friends,No,44,Godalming,Shared Owners,No,22000
39055,1 / 2 Bedrooms,,31/10/2019,32,Haywards Heath,Private Tenant,No,,,,No,25000
30000,1 / 2 Bedrooms,,04/01/2019,57,Rye,Private Tenant,No,,,,No,10000
44000,1 / 2 Bedrooms,,11/01/2019,58,Canterbury,Private Tenant,No,,,,No,0
36081,1 / 2 Bedrooms,,27/01/2019,31,Chelmsford,With family or friends,No,32,Chelmsford,With family or friends,No,17000
45500,1 / 2 Bedrooms,,25/04/2019,41,Milton Keynes,Shared Owners,No,39,Milton Keynes,With family or friends,No,30000
28580,3 / 4 Bedrooms,,13/09/2019,36,St. Neots,Private Tenant,No,,,,No,40000
20000,1 / 2 Bedrooms,,07/01/2015,45,Norwich,With family or friends,No,,,,No,30000
19000,1 / 2 Bedrooms,Derbyshire Dales | Derbyshire Dales,26/08/2020,46,Matlock,Private Tenant,No,,,,No,0
54000,1 / 2 Bedrooms,,03/09/2019,39,London,With family or friends,No,,,,No,0
30590,1 / 2 Bedrooms,,18/10/2019,24,Cambridge,With family or friends,No,,,,No,30000
30000,1 / 2 Bedrooms,,24/11/2019,28,Harlow,With family or friends,No,,,,No,3000
30000,2 / 3 Bedrooms,,22/11/2019,21,London,With family or friends,No,,,,No,0
25977,3 / 4 Bedrooms,,13/09/2019,29,Gillingham,Private Tenant,No,30,Gillingham,Private Tenant,No,0
19100,1 / 2 Bedrooms,Leicester,06/02/2020,28,Loughborough,With family or friends,No,,,,No,0
22.83,1 / 2 Bedrooms,,13/01/2019,64,Brandon,Private Tenant,No,64,Brandon,Private Tenant,No,3
25312,2 / 3 Bedrooms,Coventry,04/06/2020,30,Coventry,Private Tenant,No,,,,No,1300
32000,1 / 2 Bedrooms,,25/06/2019,32,Billericay,With family or friends,No,,,,No,10000
25385,2 / 3 Bedrooms,Birmingham,17/03/2020,54,Sutton Coldfield,Private Tenant,No,50,BIRMINGHAM,Private Tenant,No,0
17540,2 / 3 Bedrooms,,09/08/2019,32,Dover,Owner Occupier,No,,,,No,20000
30000,1 / 2 Bedrooms,,12/07/2019,25,Waltham Cross,With family or friends,No,,,,No,27000
34514.1,4 / 5 Bedrooms,,07/02/2019,43,Broxbourne,Private Tenant,No,47,Broxbourne,Private Tenant,No,0
25000,1 / 2 Bedrooms,Coventry | Warwick,01/04/2020,30,Leamington Spa,Housing Association Tenant,No,,,,No,2000
25549.1,4 / 5 Bedrooms,,21/06/2018,50,Ipswich,Private Tenant,Yes,42,Ipswich,Private Tenant,Yes,20000
38800,3 / 4 Bedrooms,,12/02/2019,51,Overton,Private Tenant,No,40,Overton,Private Tenant,No,5000
30000,1 / 2 Bedrooms,,13/05/2019,37,Luton,Owner Occupier,No,,,,No,130800
28200,1 / 2 Bedrooms,,10/07/2018,54,Gravesend,Private Tenant,Yes,,,,No,0