{"text_format":"1","workbook":"xlsx","n_sheets":11,"sheets":["SurveyLog","Instr1","Instr2","Instr3","Breach","Info","Headers","All_Stats","Checks","CTDAQC_","METADATA_"],"not_rendered":{"charts":0,"images":1,"macros":1,"external_links":1,"defined_names":105,"comments":4,"pivot_tables":0},"unopened":[],"bounds":{"document_bytes":16777216,"sheet_cells":100000,"rows_first":2000,"rows_last":500,"rows_between":2000,"halvings":0,"cell_chars":16384,"cell_head_chars":4096},"cells_cut":0,"cells_raw":0,"read":"whole","date_system":"1900"}

{"sheet":"SurveyLog","index":0,"n_rows":41,"n_cols":34,"rows_kept":41,"cut":false,"hidden":false,"merged":[[3,12,3,13],[5,1,5,2],[5,17,5,18],[3,17,3,18],[3,1,3,2],[3,6,3,8],[3,9,3,11],[8,6,8,7],[4,1,4,2],[4,9,4,11],[5,9,5,11],[4,6,4,7],[5,6,5,7],[6,9,6,11],[7,9,7,11],[8,9,8,11],[6,6,6,7],[7,6,7,7],[8,12,8,13],[4,12,4,13],[5,12,5,13],[4,17,4,18],[6,12,6,13],[7,12,7,13],[6,17,6,18],[7,23,7,24],[8,23,8,24],[4,33,4,34],[4,26,4,32],[4,23,4,24],[5,23,5,24],[6,23,6,24]]}
[null,"Survey Log version 21.10.1"]
[null,null,null,null,null,null,null,null,null,null,null,null,null,null,null,null,null,null,null,null,null,null,null,null,null,null,null,null,null,null,null,"Columns to add ",5]
[]
[null,"Date (d/m/y)",null,null,"Vessel name",null,"Completed by",null,null,"Survey title(s)",null,null,"Survey activity",null,null,"Instr. ID(s)","Config.","AQC batch number",null,null,"Tide","Time UTC","Date (if diff.)","Port name",null,null,"Path to master survey data folder",null,null,null,null,null,null,"Log filename"]
[null,"2022-01-19",null,null,"Humber Guardian",{"$f":"IF(ISBLANK(E5),0,IF(ISNA(VLOOKUP(E5,vessel_table,2,FALSE)),\"ZX\",VLOOKUP(E5,vessel_table,2,FALSE)))","v":"HG"},"Nick Meaton",null,{"$f":"IF(ISBLANK(G5),\"\",IF(ISNA(VLOOKUP(G5,sampler_table,2,FALSE)),\"ZX\",VLOOKUP(G5,sampler_table,2,FALSE)))","v":"NM_"},"Teeside Crustcacean Death Investigation",null,null,"Fish trawling",null,1,null,null,{"$f":"IF(ISBLANK($P5),\"\",Instr1!$T$2)","v":""},null,{"$f":"IF(AND($U5=\"High water\",ISNUMBER($V5)),IF(ISBLANK($W5),$B$5+$V5,$W5+$V5))","v":"2022-01-19T04:34:00"},"High water","04:34:00",null,"Tees Entrance",null,{"$f":"IF(AND(BST_start<T5,BST_end>T5),T5+0.041667,T5)","v":"2022-01-19T04:34:00"},"C:\\Users\\nmeaton\\OneDrive - Defra\\Survey Data",null,null,null,null,null,null,{"$f":"VLOOKUP($E$7,region_table,2,FALSE)&\" \"&YEAR($B$5)&\"-\"&TEXT(MONTH($B$5),\"00\")&TEXT(DAY($B$5),\"00\")&\" \"&VLOOKUP($E$5,vessel_table,2,FALSE)","v":"EA 2022-0119 HG"}]
[null,{"$f":"IF(ISBLANK(B5),\"\",B5)","v":"2022-01-19"},null,null,"Area of operation",null,"Other survey personnel",null,null,null,null,null,null,null,2,null,null,{"$f":"IF(ISBLANK($P6),\"\",Instr2!$T$2)","v":""},null,{"$f":"IF(AND($U6=\"High water\",ISNUMBER($V6)),IF(ISBLANK($W6),$B$5+$V6,$W6+$V6))","v":"2022-01-19T16:46:00"},"High water","16:46:00",null,null,null,{"$f":"IF(AND(BST_start<T6,BST_end>T6),T6+0.041667,T6)","v":"2022-01-19T16:46:00"}]
{"$rows_left_out":36}
{"sheet":"Instr1","index":1,"n_rows":26,"n_cols":21,"rows_kept":26,"cut":false,"hidden":false,"merged":[[16,11,17,11],[12,9,13,9],[16,12,17,12],[13,5,13,6],[16,8,17,8],[16,9,17,9],[16,10,17,10],[12,7,13,7],[12,8,13,8],[16,7,17,7],[12,10,13,10],[18,19,19,19],[18,16,19,16],[4,18,5,18],[4,15,5,15],[4,16,5,16],[18,15,19,15],[12,15,13,15],[16,15,17,15],[14,18,15,18],[14,15,15,15],[16,18,17,18],[6,19,11,19],[9,15,11,15],[9,16,11,16],[12,16,13,16],[6,18,11,18],[4,19,5,19],[16,14,17,14],[4,13,5,13],[12,13,13,13],[1,1,1,2],[1,4,1,6],[4,6,5,6],[4,8,5,8],[4,7,5,7],[4,1,5,1],[4,2,5,2],[4,3,5,3],[4,4,5,4],[4,5,5,5],[16,13,17,13],[12,14,13,14],[4,9,5,9],[4,10,5,10],[4,11,5,11],[4,12,5,12],[12,12,13,12],[12,11,13,11],[22,18,25,18],[22,19,25,19],[12,17,13,17],[20,15,21,15],[14,16,15,16],[12,19,13,19],[18,18,19,18],[16,19,17,19],[16,16,17,16],[12,18,13,18],[20,19,21,19],[20,18,21,18],[20,17,21,17],[20,16,21,16],[16,17,17,17],[14,19,15,19]]}
[null,"Instrument 1 ID",null,null,"Completed by",null,null,null,null,null,null,null,null,null,null,null,null,null,null,"Batch number"]
[null,{"$f":"IF(ISBLANK(SurveyLog!P5),\"\",SurveyLog!P5)","v":""},null,{"$f":"HLOOKUP($B$2,turg_range1,25,FALSE)","v":{"$error":"#NAME?"}},null,null,null,{"$f":"IF(ISBLANK(E2),0,IF(ISNA(VLOOKUP(E2,Info!$F$2:$G$53,2,FALSE)),\"ZXY\",VLOOKUP(E2,Info!$F$2:$G$53,2,FALSE)))","v":0},null,null,null,null,null,null,null,null,null,null,null,{"$f":"IF($U$2=0,\"NOT AVAILABLE\",BATCH($U$2,$U$2))","v":"NOT AVAILABLE"},{"$f":"DMIN(U6:U22,1,U$4:U$5)","v":"00:00:00"}]
[null,{"$f":"IF(ISBLANK(SurveyLog!P5),\"Please enter instrument ID on 'SurveyLog' sheet.\",VLOOKUP($B$2,instr_table,2,FALSE)&\" (\"&VLOOKUP($B$2,instr_table,4,FALSE)&\") manufacturer's serial number: \"&VLOOKUP($B$2,instr_table,3,FALSE))","v":"Please enter instrument ID on 'SurveyLog' sheet."}]
[null,"Pre-survey checks / calibration",null,null,null,null,null,null,"During / post-survey checks",null,null,null,null,null,null,"Alerts",null,null,null,null,"DateTime"]
[null,"Date","Time UTC","Temp (°C)","Instr reading","Value","Error",null,"Date","Time UTC","Temp (°C)","Instr reading","Value","Error",null,"Range\n(drift)","Message",null,"Include in AQC file?","Remarks\n(reason for breach or to exclude results)",">0"]
[null,null,null,null,null,null,null,null,null,null,null,null,null,null,null,null,null,null,null,null,"DateTime"]
{"$rows_left_out":21}
{"sheet":"Instr2","index":2,"n_rows":26,"n_cols":21,"rows_kept":26,"cut":false,"hidden":false,"merged":[[13,5,13,6],[16,19,17,19],[16,7,17,7],[16,10,17,10],[16,8,17,8],[16,9,17,9],[16,15,17,15],[16,17,17,17],[16,18,17,18],[16,16,17,16],[16,11,17,11],[16,12,17,12],[1,1,1,2],[1,4,1,6],[4,6,5,6],[4,8,5,8],[4,7,5,7],[4,1,5,1],[4,2,5,2],[4,5,5,5],[4,3,5,3],[4,4,5,4],[6,19,11,19],[4,19,5,19],[4,15,5,15],[4,16,5,16],[9,15,11,15],[6,18,11,18],[9,16,11,16],[4,18,5,18],[4,9,5,9],[12,7,13,7],[12,12,13,12],[12,11,13,11],[4,10,5,10],[4,11,5,11],[4,12,5,12],[12,8,13,8],[12,9,13,9],[12,10,13,10],[4,13,5,13],[20,15,21,15],[20,16,21,16],[12,16,13,16],[12,14,13,14],[12,15,13,15],[18,16,19,16],[18,15,19,15],[14,15,15,15],[12,13,13,13],[14,16,15,16],[16,13,17,13],[16,14,17,14],[22,18,25,18],[12,17,13,17],[12,19,13,19],[12,18,13,18],[14,18,15,18],[14,19,15,19],[22,19,25,19],[20,17,21,17],[20,18,21,18],[20,19,21,19],[18,18,19,18],[18,19,19,19]]}
[null,"Instrument 2 ID",null,null,"Completed by",null,null,null,null,null,null,null,null,null,null,null,null,null,null,"Batch number"]
[null,{"$f":"IF(ISBLANK(SurveyLog!P6),\"\",SurveyLog!P6)","v":""},null,null,null,null,null,{"$f":"IF(ISBLANK(E2),0,IF(ISNA(VLOOKUP(E2,Info!$F$2:$G$53,2,FALSE)),\"ZXY\",VLOOKUP(E2,Info!$F$2:$G$53,2,FALSE)))","v":0},null,null,null,null,null,null,null,null,null,null,null,{"$f":"IF($U$2=0,\"NOT AVAILABLE\",BATCH($U$2,$U$2))","v":"NOT AVAILABLE"},{"$f":"DMIN(U6:U22,1,U$4:U$5)","v":"00:00:00"}]
[null,{"$f":"IF(ISBLANK(SurveyLog!P6),\"Please enter instrument ID on 'SurveyLog' sheet.\",VLOOKUP($B$2,instr_table,2,FALSE)&\" (\"&VLOOKUP($B$2,instr_table,4,FALSE)&\") manufacturer's serial number: \"&VLOOKUP($B$2,instr_table,3,FALSE))","v":"Please enter instrument ID on 'SurveyLog' sheet."}]
[null,"Pre-survey checks / calibration",null,null,null,null,null,null,"During / post-survey checks",null,null,null,null,null,null,"Alerts",null,null,null,null,"DateTime"]
[null,"Date","Time UTC","Temp (°C)","Instr reading","Value","Error",null,"Date","Time UTC","Temp (°C)","Instr reading","Value","Error",null,"Range\n(drift)","Message",null,"Include in AQC file?","Remarks\n(reason for breach or to exclude results)",">0"]
[null,null,null,null,null,null,null,null,null,null,null,null,null,null,null,null,null,null,null,null,"DateTime"]
{"$rows_left_out":21}
{"sheet":"Instr3","index":3,"n_rows":20,"n_cols":21,"rows_kept":20,"cut":false,"hidden":false,"merged":[[4,19,5,19],[6,18,11,18],[4,18,5,18],[16,13,17,13],[16,14,17,14],[6,19,11,19],[9,16,11,16],[14,19,15,19],[12,16,13,16],[14,18,15,18],[16,8,17,8],[16,9,17,9],[16,10,17,10],[16,11,17,11],[16,12,17,12],[18,15,19,15],[9,15,11,15],[4,10,5,10],[4,16,5,16],[4,9,5,9],[4,11,5,11],[4,12,5,12],[4,15,5,15],[4,13,5,13],[12,12,13,12],[12,10,13,10],[13,5,13,6],[12,8,13,8],[12,9,13,9],[12,11,13,11],[12,7,13,7],[18,19,19,19],[12,17,13,17],[12,13,13,13],[12,14,13,14],[18,18,19,18],[18,16,19,16],[14,16,15,16],[12,15,13,15],[16,18,17,18],[16,17,17,17],[12,19,13,19],[12,18,13,18],[16,19,17,19],[14,15,15,15],[16,15,17,15],[16,16,17,16],[1,1,1,2],[1,4,1,6],[4,6,5,6],[4,8,5,8],[4,7,5,7],[4,1,5,1],[4,2,5,2],[4,3,5,3],[4,4,5,4],[4,5,5,5]]}
[null,"Instrument 3 ID",null,null,"Completed by",null,null,null,null,null,null,null,null,null,null,null,null,null,null,"Batch number"]
[null,{"$f":"IF(ISBLANK(SurveyLog!P7),\"\",SurveyLog!P7)","v":""},null,null,null,null,null,{"$f":"IF(ISBLANK(E2),0,IF(ISNA(VLOOKUP(E2,Info!$F$2:$G$53,2,FALSE)),\"ZXY\",VLOOKUP(E2,Info!$F$2:$G$53,2,FALSE)))","v":0},null,null,null,null,null,null,null,null,null,null,null,{"$f":"IF($U$2=0,\"NOT AVAILABLE\",BATCH($U$2,$U$2))","v":"NOT AVAILABLE"},{"$f":"DMIN(U6:U20,1,U$4:U$5)","v":"00:00:00"}]
[null,{"$f":"IF(ISBLANK(SurveyLog!P7),\"Please enter instrument ID on 'SurveyLog' sheet.\",VLOOKUP($B$2,instr_table,2,FALSE)&\" (\"&VLOOKUP($B$2,instr_table,4,FALSE)&\") manufacturer's serial number: \"&VLOOKUP($B$2,instr_table,3,FALSE))","v":"Please enter instrument ID on 'SurveyLog' sheet."}]
[null,"Pre-survey checks / calibration",null,null,null,null,null,null,"During / post-survey checks",null,null,null,null,null,null,"Alerts",null,null,null,null,"DateTime"]
[null,"Date","Time UTC","Temp (°C)","Instr reading","Value","Error",null,"Date","Time UTC","Temp (°C)","Instr reading","Value","Error",null,"Range\n(drift)","Message",null,"Include in AQC file?","Remarks\n(reason for breach or to exclude results)",">0"]
[null,null,null,null,null,null,null,null,null,null,null,null,null,null,null,null,null,null,null,null,"DateTime"]
{"$rows_left_out":15}
{"sheet":"Breach","index":4,"n_rows":51,"n_cols":20,"rows_kept":51,"cut":false,"hidden":true,"merged":[[23,1,23,3],[49,7,49,10],[20,1,20,13],[26,1,26,13],[32,1,32,13],[41,1,41,13],[44,7,44,9],[1,1,1,13],[4,3,4,4],[17,1,17,13],[18,1,18,4],[18,6,18,10],[18,12,18,13]]}
[null,"CTD AQC Breach Form",null,null,null,null,null,null,null,null,null,null,null,null,null,null,null,{"$f":"(B5)&\",\"&D5&\",\"&B7&\",\"&B24&\",\"&B36&\",\"&B39&\",\"&R3","v":",,,*,,*,U"}]
[]
[1,"Event Data",null,null,null,null,null,null,null,null,null,null,null,null,null,null,null,{"$f":"IF(OR(LEN(H50)=0,LEN(H51)=0)=TRUE,\"U\",\"A\")","v":"U"}]
[null,"Batch ID",null,"Probe ID & sensor",null,null,"Lab","Analyst"]
[]
[null,"AQC type",null,"Result 1","Outcome",null,"Result 2","Outcome",null,"Result 3","Outcome",null,"Result 4","Outcome"]
{"$rows_left_out":46}
{"sheet":"Info","index":5,"n_rows":62,"n_cols":37,"rows_kept":62,"cut":false,"hidden":false,"merged":[[45,8,45,9],[60,8,60,9],[61,8,61,9],[35,8,35,9],[36,8,36,9],[37,8,37,9],[39,8,39,9],[44,8,44,9],[42,8,42,9],[43,8,43,9],[38,8,38,9],[40,8,40,9],[41,8,41,9],[56,8,56,9],[57,8,57,9],[58,8,58,9],[59,8,59,9],[46,8,46,9],[55,8,55,9],[47,8,47,9],[48,8,48,9],[49,8,49,9],[50,8,50,9],[51,8,51,9],[52,8,52,9],[53,8,53,9],[54,8,54,9]]}
[null,"Vessel","Code","Callsign",null,"Surveyor","Code",null,"Sal std batch ID","Certified value",null,"Survey title",null,null,null,null,null,null,"Instr. AQC ID","Instrument Name","Serial No.","Description","Turgetto","Membr. cap #",null,"Ordnance Survey NRGs ",null,null,null,null,null,null,null,"pH buffer","Polynomial constants"]
[null,"Humber Guardian","HG","2ENC3",null,"Charly Alexander","CA_",null,"CH2021-0810",34.793100000000003,null,"NW","EA","TH","CH","SO","SW",null,"IDR02232","Idronaut Ocean Seven 316","0202232","CG Minibat White Acetal","TG50","#N/A",null,"SV","SW","SX","SY","SZ","TV",null,null,"pH 4 ",2.4000000000000001E-5,1.1900000000000001E-4,3.9971429999999999]
[null,"Mersey Guardian","MG","2FGL4",null,"Ed Stevens","ES_",null,"CH2021-0811",33.757899999999999,null,"Caernarfon Bay North","N Northd Coast","Blackwater & Colne","Bridgwater Bay","Chichester Harbour","Camel",null,"IDR03298","Idronaut Ocean Seven 316","0203298","Standard White Acetal + Tb","TG37","#N/A",null,"SQ","SR","SS","ST","SU","TQ","TR",null,"pH 7 ",5.7000000000000003E-5,5.8570000000000002E-3,7.0935709999999998]
[null,"Severn Guardian","SG","2FGL5",null,"Gabrielle Garland","GG_",null,"CH2021-1009A",30.241700000000002,null,"Cefni","Tweed","Lower Medway","Caernarfon Bay North","Cornwall Coast","Dart",null,"IDR04345","Idronaut Ocean Seven 316","0204345","SPARE Minibat + Tb","TG45","#N/A",null,null,"SM","SN","SO","SP","TL","TM",null,"pH 8 ",3.8000000000000002E-5,6.1900000000000002E-3,8.1071430000000007]
[null,"Solent Guardian","SL","2GDK7",null,"Gareth King","GK_",null,"CH2021-1011",33.3005,null,"Conwy Bay & Est","Holy Island","North Kent","Caernarfon Bay South","Eurohabs Devon - Dorset","Exe",null,"IDR05373","Idronaut Ocean Seven 316","0205373","Standard White Acetal + Tb","TG41","#N/A",null,null,"SG","SH","SJ","SK","TF","TG",null,"pH 10 ",1.1900000000000001E-4,1.8166999999999999E-2,10.317857]
[null,"Thames Guardian","TG","2EYX7",null,"Graham Sloane","GCS",null,"CH2021-1018",31.052299999999999,null,"Cumbria Coast","Farne Islands","Outer Thames","Cardiff East","Eurohabs Needles - Poole","Fal",null,"IDR05376","Idronaut Ocean Seven 316","0205376","Minibat White Acetal + Tb","TG38","#N/A",null,null,"SB","SC","SD","SE","TA","TB",null,"Membrane",null,"I"]
{"$rows_left_out":57}
{"sheet":"Headers","index":6,"n_rows":49,"n_cols":34,"rows_kept":49,"cut":false,"hidden":true,"merged":[[2,1,2,4],[3,1,3,4],[9,1,9,4],[11,1,11,4],[0,1,0,4],[1,1,1,4],[4,1,4,4],[5,1,5,4],[8,1,8,4],[6,1,6,4],[10,1,10,4]]}
[null,"[ Clear all column headers ]"]
[null,"Water sampling",null,null,null,null,1]
[null,"Fish trawling survey",null,null,null,null,2]
[null,"Grab survey",null,null,null,null,3]
[null,"Grab survey with biota",null,null,null,null,4]
[null,"EA WFD benthic (grab) survey",null,null,null,null,5]
{"$rows_left_out":44}
{"sheet":"All_Stats","index":7,"n_rows":398,"n_cols":10,"rows_kept":398,"cut":false,"hidden":true,"merged":[]}
["AQC_ID","Value","CalcErr","Mean","STDev","d.f","AbsErr","Review Date","Turbidity","Turgetto Stats Updated"]
["IDR02232DOXAQC-Blan",0,null,null,null,null,2]
["IDR02232DOXAQC-DIFF",2.0756428571428568E-2,null,2.0756428571428568E-2,3.1823710020683006E-3,57,2E-3,"2019-12-10"]
["IDR02232DOXAQC-High",100,null,99.575400000000002,1.5062,546,5]
["IDR02232SALAQC-High",8.1765999999999991E-3,"Y",8.1765999999999991E-3,1.5528999999999999E-2,544,0.1,"2020-12-30"]
["IDR02232SALAQC-Low",0,"Y",null,null,null,0.1]
{"$rows_left_out":393}
{"sheet":"Checks","index":8,"n_rows":25,"n_cols":19,"rows_kept":25,"cut":false,"hidden":true,"merged":[]}
["AQC_ID","Value","Calc Error","Mean","STDev","d.f.","Abs Error","[USL]","[+3S]","[+2S]","[-2S]","[-3S]","[LSL]","Message1","Message2","Message3","Message4","2x 2S","DP"]
[{"$f":"IF(CTDAQC_!E2=\"*\",\"\",CTDAQC_!B2)","v":""},{"$f":"VLOOKUP($A2,CTD_stats,2,FALSE)","v":{"$error":"#N/A"}},{"$f":"VLOOKUP($A2,CTD_stats,3,FALSE)","v":{"$error":"#N/A"}},{"$f":"VLOOKUP($A2,CTD_stats,4,FALSE)","v":{"$error":"#N/A"}},{"$f":"VLOOKUP($A2,CTD_stats,5,FALSE)","v":{"$error":"#N/A"}},{"$f":"VLOOKUP($A2,CTD_stats,6,FALSE)","v":{"$error":"#N/A"}},{"$f":"VLOOKUP($A2,CTD_stats,7,FALSE)","v":{"$error":"#N/A"}},{"$f":"$B2+$G2","v":{"$error":"#N/A"}},{"$f":"$D2+(3*$E2)","v":{"$error":"#N/A"}},{"$f":"$D2+(2*$E2)","v":{"$error":"#N/A"}},{"$f":"$D2-(2*$E2)","v":{"$error":"#N/A"}},{"$f":"$D2-(3*$E2)","v":{"$error":"#N/A"}},{"$f":"$B2-$G2","v":{"$error":"#N/A"}},{"$f":"CHKRES(CTDAQC_!J2,$F2,$C2,CTDAQC_!$I2,$B2,$D2,$G2,$E2)","v":""},{"$f":"CHKRES(CTDAQC_!K2,$F2,$C2,CTDAQC_!$I2,$B2,$D2,$G2,$E2)","v":""},{"$f":"CHKRES(CTDAQC_!L2,$F2,$C2,CTDAQC_!$I2,$B2,$D2,$G2,$E2)","v":""},{"$f":"CHKRES(CTDAQC_!M2,$F2,$C2,CTDAQC_!$I2,$B2,$D2,$G2,$E2)","v":""},{"$f":"IF(ISNUMBER(FIND(22,MID(N2,4,1)&MID(O2,4,1)&MID(P2,4,1)&MID(Q2,4,1))),\"2 x 2S\",\"\")","v":""},{"$f":"IF(Instr1!$E$9=\"Optical DO\",2,1)","v":1}]
[{"$f":"IF(CTDAQC_!E3=\"*\",\"\",CTDAQC_!B3)","v":""},{"$error":"#N/A"},{"$error":"#N/A"},{"$error":"#N/A"},{"$error":"#N/A"},{"$error":"#N/A"},{"$error":"#N/A"},{"$error":"#N/A"},{"$error":"#N/A"},{"$error":"#N/A"},{"$error":"#N/A"},{"$error":"#N/A"},{"$error":"#N/A"},{"$f":"CHKRES(CTDAQC_!J3,$F3,$C3,CTDAQC_!$I3,$B3,$D3,$G3,$E3)","v":""},{"$f":"CHKRES(CTDAQC_!K3,$F3,$C3,CTDAQC_!$I3,$B3,$D3,$G3,$E3)","v":""},{"$f":"CHKRES(CTDAQC_!L3,$F3,$C3,CTDAQC_!$I3,$B3,$D3,$G3,$E3)","v":""},{"$f":"CHKRES(CTDAQC_!M3,$F3,$C3,CTDAQC_!$I3,$B3,$D3,$G3,$E3)","v":""},"",{"$f":"IF(Instr1!$E$9=\"Optical DO\",2,1)","v":1}]
[{"$f":"IF(CTDAQC_!E4=\"*\",\"\",CTDAQC_!B4)","v":""},{"$error":"#N/A"},{"$error":"#N/A"},{"$error":"#N/A"},{"$error":"#N/A"},{"$error":"#N/A"},{"$error":"#N/A"},{"$error":"#N/A"},{"$error":"#N/A"},{"$error":"#N/A"},{"$error":"#N/A"},{"$error":"#N/A"},{"$error":"#N/A"},{"$f":"CHKRES(CTDAQC_!J4,$F4,$C4,CTDAQC_!$I4,$B4,$D4,$G4,$E4)","v":""},{"$f":"CHKRES(CTDAQC_!K4,$F4,$C4,CTDAQC_!$I4,$B4,$D4,$G4,$E4)","v":""},{"$f":"CHKRES(CTDAQC_!L4,$F4,$C4,CTDAQC_!$I4,$B4,$D4,$G4,$E4)","v":""},{"$f":"CHKRES(CTDAQC_!M4,$F4,$C4,CTDAQC_!$I4,$B4,$D4,$G4,$E4)","v":""},"",{"$f":"IF(Instr1!$E$9=\"Optical DO\",2,4)","v":4}]
[{"$f":"IF(CTDAQC_!E5=\"*\",\"\",CTDAQC_!B5)","v":""},{"$error":"#N/A"},{"$error":"#N/A"},{"$error":"#N/A"},{"$error":"#N/A"},{"$error":"#N/A"},{"$error":"#N/A"},{"$error":"#N/A"},{"$error":"#N/A"},{"$error":"#N/A"},{"$error":"#N/A"},{"$error":"#N/A"},{"$error":"#N/A"},{"$f":"CHKRES(CTDAQC_!J5,$F5,$C5,CTDAQC_!$I5,$B5,$D5,$G5,$E5)","v":""},{"$f":"CHKRES(CTDAQC_!K5,$F5,$C5,CTDAQC_!$I5,$B5,$D5,$G5,$E5)","v":""},{"$f":"CHKRES(CTDAQC_!L5,$F5,$C5,CTDAQC_!$I5,$B5,$D5,$G5,$E5)","v":""},{"$f":"CHKRES(CTDAQC_!M5,$F5,$C5,CTDAQC_!$I5,$B5,$D5,$G5,$E5)","v":""},{"$f":"IF(ISNUMBER(FIND(22,MID(N5,4,1)&MID(O5,4,1)&MID(P5,4,1)&MID(Q5,4,1))),\"2 x 2S\",\"\")","v":""},2]
[{"$f":"IF(CTDAQC_!E6=\"*\",\"\",CTDAQC_!B6)","v":""},{"$error":"#N/A"},{"$error":"#N/A"},{"$error":"#N/A"},{"$error":"#N/A"},{"$error":"#N/A"},{"$error":"#N/A"},{"$error":"#N/A"},{"$error":"#N/A"},{"$error":"#N/A"},{"$error":"#N/A"},{"$error":"#N/A"},{"$error":"#N/A"},{"$f":"CHKRES(CTDAQC_!J6,$F6,$C6,CTDAQC_!$I6,$B6,$D6,$G6,$E6)","v":""},{"$f":"CHKRES(CTDAQC_!K6,$F6,$C6,CTDAQC_!$I6,$B6,$D6,$G6,$E6)","v":""},{"$f":"CHKRES(CTDAQC_!L6,$F6,$C6,CTDAQC_!$I6,$B6,$D6,$G6,$E6)","v":""},{"$f":"CHKRES(CTDAQC_!M6,$F6,$C6,CTDAQC_!$I6,$B6,$D6,$G6,$E6)","v":""},"",3]
{"$rows_left_out":20}
{"sheet":"CTDAQC_","index":9,"n_rows":25,"n_cols":17,"rows_kept":25,"cut":false,"hidden":true,"merged":[]}
["Batch","AQC_ID","Date","UTC","Probe","Add_Sensor","Det","AQC_Type","Nom_Value","Result 1","Result 2","Result 3","Result 4","Lab","Analyst","Include","Excuse"]
[{"$f":"Instr1!T$2","v":"NOT AVAILABLE"},{"$f":"E2&G2&H2","v":"*DOXAQC-Blan"},{"$f":"IF(ISBLANK(Instr1!B$7),\"*\",Instr1!B$7)","v":"*"},{"$f":"IF(ISBLANK(Instr1!C$7),\"*\",Instr1!C$7)","v":"*"},{"$f":"IF(Instr1!B$2=\"\",\"*\",IF(H2=\"\",\"*\",Instr1!B$2))","v":"*"},{"$f":"IF(ISTEXT(Instr1!$E$9),IF(Instr1!$E$9=\"Optical DO\",IF(Instr1!$F$9=\"Enter cap # on 'Info'\",\"*\",Instr1!$F$9),Instr1!$E$9),\"*\")","v":"*"},"DOX","AQC-Blan",0,{"$f":"IF(ISNUMBER(Instr1!E$7),Instr1!E$7,\"*\")","v":"*"},{"$f":"IF(ISNUMBER(Instr1!L$7),Instr1!L$7,\"*\")","v":"*"},"*","*",{"$f":"IF(ISTEXT(SurveyLog!$F$5),SurveyLog!$F$5,\"*\")","v":"HG"},{"$f":"IF(ISTEXT(Instr1!$H$2),Instr1!$H$2,\"*\")","v":"*"},{"$f":"IF(COUNT(J2:M2)=0,\"*\",IF(Instr1!$S$7=\"Y\",\"!\",IF(Instr1!$S$7=\"N\",\"Z\",0)))","v":"*"},{"$f":"IF(ISTEXT(Instr1!T$7),Instr1!T$7,\"*\")","v":"*"}]
[{"$f":"Instr1!T$2","v":"NOT AVAILABLE"},"*DOXAQC-High",{"$f":"IF($J4=\"*\",IF(ISBLANK(Instr1!B$10),\"*\",Instr1!B$10),IF(ISBLANK(Instr1!I$10),\"*\",Instr1!I$10))","v":"*"},{"$f":"IF($J4=\"*\",IF(ISBLANK(Instr1!C$10),\"*\",Instr1!C$10),IF(ISBLANK(Instr1!J$10),\"*\",Instr1!J$10))","v":"*"},{"$f":"IF(Instr1!B$2=\"\",\"*\",IF(H3=\"\",\"*\",Instr1!B$2))","v":"*"},{"$f":"IF(ISTEXT(Instr1!$E$9),IF(Instr1!$E$9=\"Optical DO\",IF(Instr1!$F$9=\"Enter cap # on 'Info'\",\"*\",Instr1!$F$9),Instr1!$E$9),\"*\")","v":"*"},"DOX","AQC-High",100,{"$f":"IF($J4=\"*\",IF(ISNUMBER(Instr1!E$10),Instr1!E$10,\"*\"),IF(ISNUMBER(Instr1!$L$10),Instr1!$L$10,\"*\"))","v":"*"},{"$f":"IF($J4=\"*\",IF(ISNUMBER(Instr1!$L$10),Instr1!$L$10,\"*\"),IF(ISNUMBER(Instr1!$L$11),Instr1!$L$11,\"*\"))","v":"*"},{"$f":"IF($J4=\"*\",IF(ISNUMBER(Instr1!$L$11),Instr1!$L$11,\"*\"),IF(ISNUMBER(Instr1!$L$12),Instr1!$L$12,\"*\"))","v":"*"},{"$f":"IF($J4=\"*\",IF(ISNUMBER(Instr1!$L$12),Instr1!$L$12,\"*\"),\"*\")","v":"*"},{"$f":"IF(ISTEXT(SurveyLog!$F$5),SurveyLog!$F$5,\"*\")","v":"HG"},{"$f":"IF(ISTEXT(Instr1!$H$2),Instr1!$H$2,\"*\")","v":"*"},{"$f":"IF(COUNT(J3:M3)=0,\"*\",IF(Instr1!$S$7=\"Y\",\"!\",IF(Instr1!$S$7=\"N\",\"Z\",0)))","v":"*"},{"$f":"IF(ISTEXT(Instr1!T$7),Instr1!T$7,\"*\")","v":"*"}]
[{"$f":"Instr1!T$2","v":"NOT AVAILABLE"},"*DOXAQC-Diff",{"$f":"IF(ISBLANK(Instr1!B$10),\"*\",Instr1!B$10)","v":"*"},{"$f":"IF(ISBLANK(Instr1!C$10),\"*\",Instr1!C$10)","v":"*"},{"$f":"IF(Instr1!B$2=\"\",\"*\",IF(H4=\"\",\"*\",Instr1!B$2))","v":"*"},{"$f":"IF(ISTEXT(Instr1!$E$9),IF(Instr1!$E$9=\"Optical DO\",IF(Instr1!$F$9=\"Enter cap # on 'Info'\",\"*\",Instr1!$F$9),Instr1!$E$9),\"*\")","v":"*"},"DOX",{"$f":"IF(Instr1!$E$9=\"Optical DO\",\"AQC-OOSi\",\"AQC-Diff\")","v":"AQC-Diff"},{"$f":"IF(Instr1!$E$9=\"Optical DO\",450,\"*\")","v":"*"},{"$f":"IF(ISNUMBER(Instr1!E$11),Instr1!E$11,\"*\")","v":"*"},"*","*","*",{"$f":"IF(ISTEXT(SurveyLog!$F$5),SurveyLog!$F$5,\"*\")","v":"HG"},{"$f":"IF(ISTEXT(Instr1!$H$2),Instr1!$H$2,\"*\")","v":"*"},{"$f":"IF(COUNT(J4:M4)=0,\"*\",IF(Instr1!$S$7=\"Y\",\"!\",IF(Instr1!$S$7=\"N\",\"Z\",0)))","v":"*"},{"$f":"IF(ISTEXT(Instr1!T$7),Instr1!T$7,\"*\")","v":"*"}]
[{"$f":"Instr1!T$2","v":"NOT AVAILABLE"},{"$f":"E5&G5&H5","v":"*DOXAQC-OOAm"},{"$f":"IF(ISBLANK(Instr1!B$10),\"*\",Instr1!B$10)","v":"*"},{"$f":"IF(ISBLANK(Instr1!C$10),\"*\",Instr1!C$10)","v":"*"},{"$f":"IF(Instr1!B$2=\"\",\"*\",IF(H5=\"\",\"*\",Instr1!B$2))","v":"*"},{"$f":"IF(ISTEXT(Instr1!$E$9),IF(Instr1!$E$9=\"Optical DO\",IF(Instr1!$F$9=\"Enter cap # on 'Info'\",\"*\",Instr1!$F$9),Instr1!$E$9),\"*\")","v":"*"},"DOX","AQC-OOAm",0,{"$f":"IF(Instr1!$E$9=\"Optical DO\",IF(ISNUMBER(Instr1!E$12),Instr1!E$12,\"*\"),\"*\")","v":"*"},"*","*","*",{"$f":"IF(ISTEXT(SurveyLog!$F$5),SurveyLog!$F$5,\"*\")","v":"HG"},{"$f":"IF(ISTEXT(Instr1!$H$2),Instr1!$H$2,\"*\")","v":"*"},{"$f":"IF(COUNT(J5:M5)=0,\"*\",IF(Instr1!$S$7=\"Y\",\"!\",IF(Instr1!$S$7=\"N\",\"Z\",0)))","v":"*"},{"$f":"IF(ISTEXT(Instr1!T$7),Instr1!T$7,\"*\")","v":"*"}]
[{"$f":"Instr1!T$2","v":"NOT AVAILABLE"},"*SALAQC-High",{"$f":"IF(ISBLANK(Instr1!B$15),\"*\",Instr1!B$15)","v":"*"},{"$f":"IF(ISBLANK(Instr1!C$15),\"*\",Instr1!C$15)","v":"*"},{"$f":"IF(Instr1!B$2=\"\",\"*\",IF(H6=\"\",\"*\",Instr1!B$2))","v":"*"},"*","SAL","AQC-High",{"$f":"IF(ISNUMBER(Instr1!F$15),Instr1!F$15,\"*\")","v":"*"},{"$f":"IF(ISNUMBER(Instr1!E$15),Instr1!E$15,\"*\")","v":"*"},{"$f":"IF(ISNUMBER(Instr1!L$15),Instr1!L$15,\"*\")","v":"*"},{"$f":"IF(ISNUMBER(Instr1!L$16),Instr1!L$16,\"*\")","v":"*"},"*",{"$f":"IF(ISTEXT(SurveyLog!$F$5),SurveyLog!$F$5,\"*\")","v":"HG"},{"$f":"IF(ISTEXT(Instr1!$H$2),Instr1!$H$2,\"*\")","v":"*"},{"$f":"IF(COUNT(J6:M6)=0,\"*\",IF(Instr1!$S$15=\"Y\",\"!\",IF(Instr1!$S$15=\"N\",\"Z\",0)))","v":"*"},{"$f":"IF(ISTEXT(Instr1!T$15),Instr1!T$15,\"*\")","v":"*"}]
{"$rows_left_out":20}
{"sheet":"METADATA_","index":10,"n_rows":2,"n_cols":34,"rows_kept":2,"cut":false,"hidden":true,"merged":[]}
["Date","Region","Vessel name","Sampler name","Sampler ID","SurveyLog ID","Survey Log received","Survey log posit data check","Survey log in-situ data check","Comments / action","Hpro posit files logged","Raw posit files received","H/held gps posits logged","HW dets selected","Tidal data recorded","Survey title(s)","Survey activity","Instrument data required","Instr1 ID","Instr1 config","Instr1 batch","Instr2 ID","Instr2 config","Instr2 batch","Raw CTD cast count","Raw casts received","CTDAQC data received","Breach ID","Breach ID","Breach ID","Breach ID","Breach form(s) signed off","Benthic/trawl supporting data received","Notes"]
[{"$f":"IF(ISNUMBER(SurveyLog!B5),SurveyLog!B5,FALSE)","v":"2022-01-19"},{"$f":"IF(ISTEXT(SurveyLog!E7),SurveyLog!E7,FALSE)","v":"East Coast"},{"$f":"IF(ISTEXT(SurveyLog!E5),SurveyLog!E5,FALSE)","v":"Humber Guardian"},{"$f":"IF(ISTEXT(SurveyLog!G5),SurveyLog!G5,FALSE)","v":"Nick Meaton"},{"$f":"IF(ISTEXT(SurveyLog!G5),SurveyLog!I5,FALSE)","v":"NM_"},{"$f":"IF(ISTEXT(SurveyLog!AH5),SurveyLog!AH5&\"_log\",FALSE)","v":"EA 2022-0119 HG_log"},"EVALUATE","EVALUATE","EVALUATE","NULL",true,{"$f":"IF(Hpro_used=FALSE,\"N/A\",\"EVALUATE\")","v":"EVALUATE"},false,true,{"$f":"IF(HW_dets_selected=FALSE,\"N/A\",\"EVALUATE\")","v":"EVALUATE"},{"$f":"CONCATENATE(IF(ISTEXT(SurveyLog!J5),SurveyLog!J5,FALSE),IF(ISTEXT(SurveyLog!J6),\"; \"&SurveyLog!J6,\"\"),IF(ISTEXT(SurveyLog!J7),\"; \"&SurveyLog!J7,\"\"),IF(ISTEXT(SurveyLog!J8),\"; \"&SurveyLog!J8,\"\"),IF(ISTEXT(SurveyLog!J9),\"; \"&SurveyLog!J9,\"\"))","v":"Teeside Crustcacean Death Investigation"},{"$f":"CONCATENATE(IF(ISTEXT(SurveyLog!M5),SurveyLog!M5,FALSE),IF(ISTEXT(SurveyLog!M6),\"; \"&SurveyLog!M6,\"\"),IF(ISTEXT(SurveyLog!M7),\"; \"&SurveyLog!M7,\"\"),IF(ISTEXT(SurveyLog!M8),\"; \"&SurveyLog!M8,\"\"),IF(ISTEXT(SurveyLog!M9),\"; \"&SurveyLog!M9,\"\"))","v":"Fish trawling"},false,{"$f":"IF(ISTEXT(SurveyLog!P5),SurveyLog!P5,FALSE)","v":false},{"$f":"IF(ISTEXT(SurveyLog!Q5),SurveyLog!Q5,FALSE)","v":false},{"$f":"IF(ISTEXT(SurveyLog!P5),SurveyLog!R5,FALSE)","v":false},{"$f":"IF(ISTEXT(SurveyLog!P6),SurveyLog!P6,FALSE)","v":false},{"$f":"IF(ISTEXT(SurveyLog!Q6),SurveyLog!Q6,FALSE)","v":false},{"$f":"IF(ISTEXT(SurveyLog!P6),SurveyLog!R6,FALSE)","v":false},{"$f":"COUNT(IF(FREQUENCY(INDEX(SurveyLog!J12:AI4962,,MATCH(\"*cast*\",SurveyLog!J11:AI11,0)),INDEX(SurveyLog!J12:AI4962,,MATCH(\"*cast*\",SurveyLog!J11:AI11,0))),1))","v":0},{"$f":"IF(Raw_cast_count<1,\"N/A\",\"EVALUATE\")","v":"N/A"},{"$f":"IF(instr_data_reqd=TRUE,\"EVALUATE\",\"N/A\")","v":"N/A"},null,null,null,null,{"$f":"IF(COUNTA(breach_list)=0,\"N/A\",\"EVALUATE\")","v":"N/A"},"EVALUATE","NULL"]