{"text_format":"1","workbook":"xlsx","n_sheets":6,"sheets":["Instructions","Cover Sheet","Table A","Table A1","Admin-MissingRowCheck","Admin"],"not_rendered":{"charts":0,"images":17,"macros":1,"external_links":4,"defined_names":44,"comments":0,"pivot_tables":0},"unopened":[],"bounds":{"document_bytes":16777216,"sheet_cells":100000,"rows_first":2000,"rows_last":500,"rows_between":2000,"halvings":0,"cell_chars":16384,"cell_head_chars":4096},"cells_cut":0,"cells_raw":0,"read":"whole","date_system":"1900"}

{"sheet":"Instructions","index":0,"n_rows":257,"n_cols":2,"rows_kept":257,"cut":false,"hidden":false,"merged":[]}
[]
[null,"Completing the Return"]
[]
[null,"Important: You must enable macros before completing your return or the built-in validation checks will not work."]
[]
[null,"Detailed guidance on how to complete the return is available at: https://www.gov.uk/government/publications/section-251-2021-to-2022."]
[]
[null,"Table A"]
[]
[null,"This is information at local authority level that provides an overall picture of the expenditure on schools and the amount being spent on education centrally."]
[]
[null,"Table A1"]
[]
[null,"This relates to the expenditure on children’s and young people’s services including: sure start children's centres and early years, children looked after, other children and family services, safeguarding children and young people’s services, family support services, services for young people and youth justice."]
[]
[null,"Values should be entered in all red cells. If the value entered does not match the data validation restrictions for the cell, an error message will be displayed. You will still be able to submit your return, but you will be prompted to enter an explanation within COLLECT."]
[]
[]
[null,"Uploading the return to COLLECT"]
[]
[null,"When you have finished entering your data, click the ‘Convert to XML’ button on the Cover Sheet. This will create an XML file for uploading to COLLECT."]
[]
[null,"Log into COLLECT."]
[]
[null,"On the Source page click on 'Upload Return from file…'"]
[]
[]
[]
[]
[]
[]
[]
[]
[]
[]
[]
[]
[]
[]
[]
{"$rows_left_out":218}
{"sheet":"Cover Sheet","index":1,"n_rows":21,"n_cols":4,"rows_kept":21,"cut":false,"hidden":false,"merged":[]}
[]
[]
[]
[]
[]
[null,null,null,"Section 251 Outturn 2021-22"]
[null,null,null,"XML Generator"]
[null,null,null,"Version 1.1"]
[]
[]
[]
[]
[null,"Local Authority Number:",940]
[]
[null,"Local Authority Name:",{"$f":"IF(ISNA(VLOOKUP(C13,LA, 2, FALSE)),\"\",VLOOKUP(C13, LA, 2, FALSE))","v":"North Northamptonshire"}]
[]
[null,"Contact Name:",null,"C17: 1.1: Value is missing. Do not leave any cell blank.\r\n"]
[]
[null,"Contact Email:",null,"C19: 1.1: Value is missing. Do not leave any cell blank.\r\n"]
[]
[null,"Contact Telephone:",null,"C21: 1.1: Value is missing. Do not leave any cell blank.\r\n"]

{"sheet":"Table A","index":2,"n_rows":124,"n_cols":26,"rows_kept":124,"cut":false,"hidden":false,"merged":[[2,16,2,24],[74,4,74,6],[77,4,77,6]]}
[null,"S251 Outturn 2021-22"]
[null,"TABLE A:  LA LEVEL INFORMATION"]
[null,null,null,null,null,null,null,null,null,null,null,null,null,null,null,null,"Rule Application (offset by 12 columns to data)"]
[null,null,"Description",null,"Early Years","Primary","Secondary","SEN/Special Schools ","AP/PRUs","Post school ","Gross","Income","Net",null,"Error Cell Reference and Description",null,"Early Years","Primary","Secondary","SEN/Special Schools ","AP/PRUs","Post school ","Gross","Income","Net","Notes"]
[null,null,null,null,null,null,null,null,null,null,null,null,null,null,null,null,"(only 1.1, 1.3, 1.4, 1.6, 1021 & Decimal check will be implemented)"]
[null,null,null,null,{"$f":"IF(COUNTA(E9:M124)<447,\"PLEASE ENTER VALUES IN ALL CELLS\",\"\")","v":"PLEASE ENTER VALUES IN ALL CELLS"},null,null,null,null,null,null,null,"LA Table Errors:",null,null,null,"E","F","G","H","I","J","K","L","M"]
[null,1,"SCHOOLS EXPENDITURE"]
[]
[null,"1.0.1","Individual Schools Budget (after academies recoupment), including grant for maintained school sixth forms but excluding all high needs place funding",null,null,null,null,null,null,null,{"$f":"SUM(E9:J9)","v":0},null,{"$f":"K9-L9","v":0},null,null,null,"1.1,1.3","1.1,1.3","1.1,1.3",1.6,1.6,1.6," \n3.1.1, 1007",1.6," "]
[null,"1.0.2","High needs place funding within Individual Schools Budget (after academies recoupment), including all pre- and post-16 place funding for maintained schools",null,null,null,null,null,null,null,{"$f":"SUM(E10:J10)","v":0},null,{"$f":"K10-L10","v":0},null,null,null,"1.1,1.3","1.1,1.3","1.1,1.3","1.1,1.3","1.1,1.3",1.6," \n3.1.1, 1007, 1022",1.6," "]
[]
[null,null,"DE-DELEGATED ITEMS      "]
[null,"1.1.1","Contingencies      ",null,null,null,null,null,null,null,{"$f":"SUM(E13:J13)","v":0},null,{"$f":"K13-L13","v":0},null,null,null,1.6,"1.1,1.3","1.1,1.3",1.6,1.6,1.6," \n3.1.1, 1010, 1007, 1008","1.1,1.3"," "]
[null,"1.1.2","Behaviour support services",null,null,null,null,null,null,null,0,null,0,null,null,null,1.6,"1.1,1.3","1.1,1.3",1.6,1.6,1.6," \n3.1.1, 1010, 1007, 1008","1.1,1.3"," "]
[null,"1.1.3","Support to UPEG and bilingual learners  ",null,null,null,null,null,null,null,0,null,0,null,null,null,1.6,"1.1,1.3","1.1,1.3",1.6,1.6,1.6," \n3.1.1, 1010, 1007, 1008","1.1,1.3"," "]
[null,"1.1.4","Free school meals eligibility",null,null,null,null,null,null,null,0,null,0,null,null,null,1.6,"1.1,1.3","1.1,1.3",1.6,1.6,1.6," \n3.1.1, 1010, 1007, 1008","1.1,1.3"," "]
[null,"1.1.5","Insurance",null,null,null,null,null,null,null,0,null,0,null,null,null,1.6,"1.1,1.3","1.1,1.3",1.6,1.6,1.6," \n3.1.1, 1010, 1007, 1008","1.1,1.3"," "]
[null,"1.1.6","Museum and Library services",null,null,null,null,null,null,null,0,null,0,null,null,null,1.6,"1.1,1.3","1.1,1.3",1.6,1.6,1.6," \n3.1.1, 1010, 1007, 1008","1.1,1.3"," "]
[null,"1.1.7","Licences/subscriptions ",null,null,null,null,null,null,null,0,null,0,null,null,null,1.6,"1.1,1.3","1.1,1.3",1.6,1.6,1.6," \n3.1.1, 1010, 1007, 1008","1.1,1.3"," "]
[null,"1.1.8","Staff costs - supply cover excluding cover for facility time",null,null,null,null,null,null,null,0,null,0,null,null,null,1.6,"1.1,1.3","1.1,1.3",1.6,1.6,1.6," \n3.1.1, 1010, 1007, 1008","1.1,1.3"," "]
[null,"1.1.9","Staff costs - supply cover for facility time",null,null,null,null,null,null,null,0,null,0,null,null,null,1.6,"1.1,1.3","1.1,1.3",1.6,1.6,1.6," \n3.1.1, 1010, 1007, 1008","1.1,1.3"," "]
[null,"1.1.10","School improvement",null,null,null,null,null,null,null,0,null,0,null,null,null,1.6,"1.1,1.3","1.1,1.3",1.6,1.6,1.6," \n3.1.1, 1007, 1010, 1008","1.1,1.3"," "]
[]
[null,null,"HIGH NEEDS EXPENDITURE"]
[null,"1.2.1","Top up funding - maintained schools",null,null,null,null,null,null,null,{"$f":"SUM(E25:J25)","v":0},null,{"$f":"K25-L25","v":0},null,null,null,"1.1,1.3","1.1,1.3","1.1,1.3","1.1,1.3","1.1,1.3",1.6," \n3.1.1, 1010, 1007, 1008","1.1,1.3"," "]
[null,"1.2.2","Top-up funding – academies, free schools and colleges",null,null,null,null,null,null,null,0,null,0,null,null,null,"1.1,1.3","1.1,1.3","1.1,1.3","1.1,1.3","1.1,1.3","1.1,1.3"," \n3.1.1, 1010, 1007, 1008","1.1,1.3"," "]
[null,"1.2.3","Top-up and other funding – non-maintained and independent providers",null,null,null,null,null,null,null,0,null,0,null,null,null,"1.1,1.3","1.1,1.3","1.1,1.3","1.1,1.3","1.1,1.3","1.1,1.3"," \n3.1.1, 1010, 1007, 1008","1.1,1.3"," "]
[null,"1.2.4","Additional high needs targeted funding for mainstream schools and academies",null,null,null,null,null,null,null,0,null,0,null,null,null,"1.1,1.3","1.1,1.3","1.1,1.3",1.6,1.6,1.6," \n3.1.1, 1010, 1007, 1008","1.1,1.3"," "]
[null,"1.2.5","SEN support services  ",null,null,null,null,null,null,null,0,null,0,null,null,null,"1.1,1.3","1.1,1.3","1.1,1.3","1.1,1.3","1.1,1.3","1.1,1.3"," \n3.1.1, 1010, 1007, 1008","1.1,1.3"," "]
[null,"1.2.6","Hospital education services  ",null,null,null,null,null,null,null,0,null,0,null,null,null,1.6,1.6,1.6,"1.1,1.3","1.1,1.3",1.6," \n3.1.1, 1010, 1007, 1008","1.1,1.3"," "]
[null,"1.2.7","Other alternative provision services",null,null,null,null,null,null,null,0,null,0,null,null,null,"1.1,1.3","1.1,1.3","1.1,1.3","1.1,1.3","1.1,1.3","1.1,1.3"," \n3.1.1, 1010, 1007, 1008","1.1,1.3"," "]
[null,"1.2.8","Support for inclusion ",null,null,null,null,null,null,null,0,null,0,null,null,null,"1.1,1.3","1.1,1.3","1.1,1.3","1.1,1.3","1.1,1.3","1.1,1.3"," \n3.1.1, 1010, 1007, 1008","1.1,1.3"," "]
[null,"1.2.9","Special schools and PRUs in financial difficulty",null,null,null,null,null,null,null,0,null,0,null,null,null,1.6,1.6,1.6,"1.1,1.3","1.1,1.3",1.6," \n3.1.1, 1010, 1007, 1008","1.1,1.3"," "]
[null,"1.2.10","PFI and BSF costs at special schools, AP/ PRUs and Post 16 institutions only",null,null,null,null,null,null,null,0,null,0,null,null,null,1.6,1.6,1.6,"1.1,1.3","1.1,1.3","1.1,1.3"," \n3.1.1, 1010, 1007, 1008","1.1,1.3"," "]
[null,"1.2.11","Direct payments (SEN and disability) ",null,null,null,null,null,null,null,0,null,0,null,null,null,"1.1,1.3","1.1,1.3","1.1,1.3","1.1,1.3","1.1,1.3","1.1,1.3"," \n3.1.1, 1010, 1007, 1008","1.1,1.3"," "]
[null,"1.2.12","Carbon reduction commitment allowances (PRUs)",null,null,null,null,null,null,null,0,null,0,null,null,null,1.6,1.6,1.6,1.6,"1.1,1.3",1.6," \n3.1.1, 1010, 1007, 1008","1.1,1.3"," "]
[null,"1.2.13","Therapies and other health related services",null,null,null,null,null,null,null,0,null,0,null,null,null,"1.1,1.3","1.1,1.3","1.1,1.3","1.1,1.3","1.1,1.3","1.1,1.3"," \n3.1.1, 1010, 1007, 1008","1.1,1.3"," "]
[]
[null,null,"EARLY YEARS EXPENDITURE"]
[null,"1.3.1","Central expenditure on early years entitlement ",null,null,null,null,null,null,null,{"$f":"SUM(E40:J40)","v":0},null,{"$f":"K40-L40","v":0},null,null,null,"1.1,1.3",1.6,1.6,1.6,1.6,1.6," \n3.1.1, 1010, 1007, 1008","1.1,1.3"," "]
{"$rows_left_out":85}
{"sheet":"Table A1","index":3,"n_rows":70,"n_cols":29,"rows_kept":70,"cut":false,"hidden":false,"merged":[[4,5,4,7],[4,18,4,28]]}
[null,"S251 Outturn 2021-22"]
[null,"TABLE A1: CHILDREN'S AND YOUNG PEOPLE'S SERVICES"]
[]
[null,null,null,null,null,null,null,null,null,null,null,null,null,null," Table A1 Errors:"]
[null,null,null,null,null,"PROVISIONS BY OTHERS",null,null,null,null,null,null,null,null,null,null,null,null,"Rule Application (only 1.1, 1.3, 1.4, 1.6, 1021 & Decimal check will be implemented)"]
[null,null,"Description",null,"OWN PROVISION","PRIVATE","OTHER PUBLIC","VOLUNTARY","TOTAL EXPENDITURE","INCOME","NET Current Expenditure",null,"Govt. Grants Inside AEF ","Govt. Grants Outside AEF ","LEA NET Revenue Expenditure",null,"Error Cell Reference and Description",null,"OWN PROVISION","PRIVATE","OTHER PUBLIC","VOLUNTARY","TOTAL EXPENDITURE","INCOME","NET Current Expenditure",null,"Govt. Grants Inside AEF ","Govt. Grants Outside AEF ","LEA NET Revenue Expenditure"]
[null,null,null,null,"(a)","(b)","(c)","(d)","(k)","(l)","(m)",null,"(n)","(o)","(q)"]
[null,null,null,null,{"$f":"IF(COUNTA(E9:N70)<289,\"PLEASE ENTER VALUES IN ALL CELLS\",\"\")","v":"PLEASE ENTER VALUES IN ALL CELLS"}]
[null,null,"CHILDREN'S AND YOUNG PEOPLE'S SERVICES           "]
[]
[null,null,"SURE START CHILDREN'S CENTRES AND OTHER SPEND ON CHILDREN UNDER 5"]
[null,"3.0.1","Spend on individual Sure Start Children's Centres",null,null,null,null,null,{"$f":"SUM(E12:H12)","v":0},null,{"$f":"I12-J12","v":0},null,null,null,{"$f":"K12-(M12+N12)","v":0},null,null,null,"1.1,1.3","1.1,1.3","1.1,1.3","1.1,1.3","3.1.1,1010,1007,1008","1.1,1.3",null,null,"1.1,1.3","1.1,1.3"]
[null,"3.0.2","Spend for local authority provided or commissioned area wide services delivered through Sure Start Children's Centres",null,null,null,null,null,{"$f":"SUM(E13:H13)","v":0},null,{"$f":"I13-J13","v":0},null,null,null,{"$f":"K13-(M13+N13)","v":0},null,null,null,"1.1,1.3","1.1,1.3","1.1,1.3","1.1,1.3","3.1.1,1010,1007,1008","1.1,1.3",null,null,"1.1,1.3","1.1,1.3"]
[null,"3.0.3","Spend on local authority management costs relating to Sure Start Children's Centres",null,null,null,null,null,{"$f":"SUM(E14:H14)","v":0},null,{"$f":"I14-J14","v":0},null,null,null,0,null,null,null,"1.1,1.3","1.1,1.3","1.1,1.3","1.1,1.3","3.1.1,1010,1007,1008","1.1,1.3",null,null,"1.1,1.3","1.1,1.3"]
[null,"3.0.4","Other spend on children under 5",null,null,null,null,null,{"$f":"SUM(E15:H15)","v":0},null,{"$f":"I15-J15","v":0},null,null,null,0,null,null,null,"1.1,1.3","1.1,1.3","1.1,1.3","1.1,1.3","3.1.1,1010,1007,1008","1.1,1.3",null,null,"1.1,1.3","1.1,1.3"]
[null,"3.0.5","Total Sure Start children's centres and other spend on children under 5",null,{"$f":"SUM(E12:E15)","v":0},0,0,0,{"$f":"SUM(E16:H16)","v":0},0,0,null,{"$f":"SUM(M12:M15)","v":0},{"$f":"SUM(N12:N15)","v":0},{"$f":"SUM(O12:O15)","v":0}]
[]
[null,null,"CHILDREN LOOKED AFTER"]
[null,"3.1.1","Residential care",null,null,null,null,null,{"$f":"SUM(E19:H19)","v":0},null,{"$f":"I19-J19","v":0},null,null,null,{"$f":"K19-(M19+N19)","v":0},null,null,null,"1.1,1.3","1.1,1.3","1.1,1.3","1.1,1.3","3.1.1,1010,1007,1008","1.1,1.3",null,null,"1.1,1.3","1.1,1.3"]
[null,"3.1.2a","Fostering services (excluding fees and allowances for LA foster carers)",null,null,null,null,null,0,null,0,null,null,null,0,null,null,null,"1.1,1.3","1.1,1.3","1.1,1.3","1.1,1.3","3.1.1,1010,1007,1008","1.1,1.3",null,null,"1.1,1.3","1.1,1.3"]
[null,"3.1.2b","Fostering services (fees and allowances for LA foster carers)",null,null,null,null,null,0,null,0,null,null,null,0,null,null,null,"1.1,1.3","1.1,1.3","1.1,1.3","1.1,1.3","3.1.1,1010,1007,1008","1.1,1.3",null,null,"1.1,1.3","1.1,1.3"]
[null,"3.1.3","Adoption services",null,null,null,null,null,0,null,0,null,null,null,0,null,null,null,"1.1,1.3","1.1,1.3","1.1,1.3","1.1,1.3","3.1.1,1010,1007,1008","1.1,1.3",null,null,"1.1,1.3","1.1,1.3"]
[null,"3.1.4","Special guardianship support ",null,null,null,null,null,0,null,0,null,null,null,0,null,null,null,"1.1,1.3","1.1,1.3","1.1,1.3","1.1,1.3","3.1.1,1010,1007,1008","1.1,1.3",null,null,"1.1,1.3","1.1,1.3"]
[null,"3.1.5","Other children looked after services",null,null,null,null,null,0,null,0,null,null,null,0,null,null,null,"1.1,1.3","1.1,1.3","1.1,1.3","1.1,1.3","3.1.1,1010,1007,1008","1.1,1.3",null,null,"1.1,1.3","1.1,1.3"]
[null,"3.1.6","Short breaks (respite) for looked after disabled children",null,null,null,null,null,0,null,0,null,null,null,0,null,null,null,"1.1,1.3","1.1,1.3","1.1,1.3","1.1,1.3","3.1.1,1010,1007,1008","1.1,1.3",null,null,"1.1,1.3","1.1,1.3"]
[null,"3.1.7","Children placed with family and friends",null,null,null,null,null,0,null,0,null,null,null,0,null,null,null,"1.1,1.3","1.1,1.3","1.1,1.3","1.1,1.3","3.1.1,1010,1007,1008","1.1,1.3",null,null,"1.1,1.3","1.1,1.3"]
[null,"3.1.8","Education of looked after children ",null,null,null,null,null,0,null,0,null,null,null,0,null,null,null,"1.1,1.3","1.1,1.3","1.1,1.3","1.1,1.3","3.1.1,1010,1007,1008","1.1,1.3",null,null,"1.1,1.3","1.1,1.3"]
[null,"3.1.9","Leaving care support services",null,null,null,null,null,0,null,0,null,null,null,0,null,null,null,"1.1,1.3","1.1,1.3","1.1,1.3","1.1,1.3","3.1.1,1010,1007,1008","1.1,1.3",null,null,"1.1,1.3","1.1,1.3"]
[null,"3.1.10","Asylum seeker services - children",null,null,null,null,null,0,null,0,null,null,null,0,null,null,null,"1.1,1.3","1.1,1.3","1.1,1.3","1.1,1.3","3.1.1,1010,1007,1008","1.1,1.3",null,null,"1.1,1.3","1.1,1.3"]
[null,"3.1.11","Total Children Looked After",null,{"$f":"SUM(E19:E29)","v":0},{"$f":"SUM(F19:F29)","v":0},0,0,0,0,0,null,{"$f":"SUM(M19:M29)","v":0},{"$f":"SUM(N19:N29)","v":0},{"$f":"SUM(O19:O29)","v":0}]
[]
[null,null,"OTHER CHILDREN AND FAMILY SERVICES"]
[null,"3.2.1","Other children and families services",null,null,null,null,null,{"$f":"SUM(E33:H33)","v":0},null,{"$f":"I33-J33","v":0},null,null,null,{"$f":"K33-(M33+N33)","v":0},null,null,null,"1.1,1.3","1.1,1.3","1.1,1.3","1.1,1.3","3.1.1,1010,1007,1008","1.1,1.3",null,null,"1.1,1.3","1.1,1.3"]
[]
[null,null,"SAFEGUARDING CHILDREN AND YOUNG PEOPLE'S SERVICES"]
[null,"3.3.1","Social work (including LA functions in relation to child protection)",null,null,null,null,null,{"$f":"SUM(E36:H36)","v":0},null,{"$f":"I36-J36","v":0},null,null,null,{"$f":"K36-(M36+N36)","v":0},null,null,null,"1.1,1.3","1.1,1.3","1.1,1.3","1.1,1.3","3.1.1,1010,1007,1008","1.1,1.3",null,null,"1.1,1.3","1.1,1.3"]
[null,"3.3.2","Commissioning and Children's Services Strategy",null,null,null,null,null,{"$f":"SUM(E37:H37)","v":0},null,{"$f":"I37-J37","v":0},null,null,null,0,null,null,null,"1.1,1.3","1.1,1.3","1.1,1.3","1.1,1.3","3.1.1,1010,1007,1008","1.1,1.3",null,null,"1.1,1.3","1.1,1.3"]
[null,"3.3.3","Local Safeguarding Children Board",null,null,null,null,null,{"$f":"SUM(E38:H38)","v":0},null,{"$f":"I38-J38","v":0},null,null,null,0,null,null,null,"1.1,1.3","1.1,1.3","1.1,1.3","1.1,1.3","3.1.1,1010,1007,1008","1.1,1.3",null,null,"1.1,1.3","1.1,1.3"]
[null,"3.3.4","Total Safeguarding Children and Young People's Services",null,{"$f":"SUM(E36:E38)","v":0},{"$f":"SUM(F36:F38)","v":0},0,0,0,0,0,null,{"$f":"SUM(M36:M38)","v":0},{"$f":"SUM(N36:N38)","v":0},{"$f":"SUM(O36:O38)","v":0}]
[]
{"$rows_left_out":31}
{"sheet":"Admin-MissingRowCheck","index":4,"n_rows":93,"n_cols":11,"rows_kept":93,"cut":false,"hidden":true,"merged":[]}
["Table A - Error 1033 information for error message",null,null,"Missing rows",null,null,null,"Table A1",null,null,"Missing rows"]
["Required Row Numbers","Are they present? If not output the number in column C to add to end of 1033 error message","Check for isna",{"$f":"_xlfn.CONCAT(C3:C150)","v":""},null,null,null,"Required Rows","Are they present? If not output the number in column C to add to end of 1033 error message","Check for isna",{"$f":"_xlfn.CONCAT(J3:J150)","v":""}]
[1,{"$f":"VLOOKUP(A3,LARowCount,1,FALSE)","v":1},{"$f":"IF(ISNA(B3),\", \"&A3,\"\")","v":""},null,null,null,null,"3.0.1",{"$f":"VLOOKUP(H3,'Table A1'!B:B,1,FALSE)","v":"3.0.1"},{"$f":"IF(ISNA(I3),\", \"&H3,\"\")","v":""}]
["1.0.1",{"$f":"VLOOKUP(A4,LARowCount,1,FALSE)","v":"1.0.1"},{"$f":"IF(ISNA(B4),\", \"&A4,\"\")","v":""},null,null,null,null,"3.0.2",{"$f":"VLOOKUP(H4,'Table A1'!B:B,1,FALSE)","v":"3.0.2"},{"$f":"IF(ISNA(I4),\", \"&H4,\"\")","v":""}]
["1.0.2","1.0.2","",null,null,null,null,"3.0.3",{"$f":"VLOOKUP(H5,'Table A1'!B:B,1,FALSE)","v":"3.0.3"},""]
["1.1.1","1.1.1","",null,null,null,null,"3.0.4",{"$f":"VLOOKUP(H6,'Table A1'!B:B,1,FALSE)","v":"3.0.4"},""]
["1.1.2","1.1.2","",null,null,null,null,"3.0.5",{"$f":"VLOOKUP(H7,'Table A1'!B:B,1,FALSE)","v":"3.0.5"},""]
["1.1.3","1.1.3","",null,null,null,null,"3.1.1",{"$f":"VLOOKUP(H8,'Table A1'!B:B,1,FALSE)","v":"3.1.1"},""]
["1.1.4","1.1.4","",null,null,null,null,"3.1.2a",{"$f":"VLOOKUP(H9,'Table A1'!B:B,1,FALSE)","v":"3.1.2a"},""]
["1.1.5","1.1.5","",null,null,null,null,"3.1.2b",{"$f":"VLOOKUP(H10,'Table A1'!B:B,1,FALSE)","v":"3.1.2b"},""]
["1.1.6","1.1.6","",null,null,null,null,"3.1.3",{"$f":"VLOOKUP(H11,'Table A1'!B:B,1,FALSE)","v":"3.1.3"},""]
["1.1.7","1.1.7","",null,null,null,null,"3.1.4",{"$f":"VLOOKUP(H12,'Table A1'!B:B,1,FALSE)","v":"3.1.4"},""]
["1.1.8","1.1.8","",null,null,null,null,"3.1.5",{"$f":"VLOOKUP(H13,'Table A1'!B:B,1,FALSE)","v":"3.1.5"},""]
["1.1.9","1.1.9","",null,null,null,null,"3.1.6",{"$f":"VLOOKUP(H14,'Table A1'!B:B,1,FALSE)","v":"3.1.6"},""]
["1.1.10","1.1.10","",null,null,null,null,"3.1.7",{"$f":"VLOOKUP(H15,'Table A1'!B:B,1,FALSE)","v":"3.1.7"},""]
["1.2.1","1.2.1","",null,null,null,null,"3.1.8",{"$f":"VLOOKUP(H16,'Table A1'!B:B,1,FALSE)","v":"3.1.8"},""]
["1.2.2","1.2.2","",null,null,null,null,"3.1.9",{"$f":"VLOOKUP(H17,'Table A1'!B:B,1,FALSE)","v":"3.1.9"},""]
["1.2.3","1.2.3","",null,null,null,null,"3.1.10",{"$f":"VLOOKUP(H18,'Table A1'!B:B,1,FALSE)","v":"3.1.10"},""]
["1.2.4","1.2.4","",null,null,null,null,"3.1.11",{"$f":"VLOOKUP(H19,'Table A1'!B:B,1,FALSE)","v":"3.1.11"},""]
["1.2.5","1.2.5","",null,null,null,null,"3.2.1",{"$f":"VLOOKUP(H20,'Table A1'!B:B,1,FALSE)","v":"3.2.1"},""]
["1.2.6","1.2.6","",null,null,null,null,"3.3.1",{"$f":"VLOOKUP(H21,'Table A1'!B:B,1,FALSE)","v":"3.3.1"},""]
["1.2.7","1.2.7","",null,null,null,null,"3.3.2",{"$f":"VLOOKUP(H22,'Table A1'!B:B,1,FALSE)","v":"3.3.2"},""]
["1.2.8","1.2.8","",null,null,null,null,"3.3.3",{"$f":"VLOOKUP(H23,'Table A1'!B:B,1,FALSE)","v":"3.3.3"},""]
["1.2.9","1.2.9","",null,null,null,null,"3.3.4",{"$f":"VLOOKUP(H24,'Table A1'!B:B,1,FALSE)","v":"3.3.4"},""]
["1.2.10","1.2.10","",null,null,null,null,"3.4.1",{"$f":"VLOOKUP(H25,'Table A1'!B:B,1,FALSE)","v":"3.4.1"},""]
["1.2.11","1.2.11","",null,null,null,null,"3.4.2",{"$f":"VLOOKUP(H26,'Table A1'!B:B,1,FALSE)","v":"3.4.2"},""]
["1.2.12","1.2.12","",null,null,null,null,"3.4.3",{"$f":"VLOOKUP(H27,'Table A1'!B:B,1,FALSE)","v":"3.4.3"},""]
["1.2.13","1.2.13","",null,null,null,null,"3.4.4",{"$f":"VLOOKUP(H28,'Table A1'!B:B,1,FALSE)","v":"3.4.4"},""]
["1.3.1","1.3.1","",null,null,null,null,"3.4.5",{"$f":"VLOOKUP(H29,'Table A1'!B:B,1,FALSE)","v":"3.4.5"},""]
["1.4.1","1.4.1","",null,null,null,null,"3.4.6",{"$f":"VLOOKUP(H30,'Table A1'!B:B,1,FALSE)","v":"3.4.6"},""]
["1.4.2","1.4.2","",null,null,null,null,"3.5.1",{"$f":"VLOOKUP(H31,'Table A1'!B:B,1,FALSE)","v":"3.5.1"},""]
["1.4.3","1.4.3","",null,null,null,null,"3.5.2",{"$f":"VLOOKUP(H32,'Table A1'!B:B,1,FALSE)","v":"3.5.2"},""]
["1.4.4","1.4.4","",null,null,null,null,"3.5.3",{"$f":"VLOOKUP(H33,'Table A1'!B:B,1,FALSE)","v":"3.5.3"},""]
["1.4.5","1.4.5","",null,null,null,null,"3.6.1",{"$f":"VLOOKUP(H34,'Table A1'!B:B,1,FALSE)","v":"3.6.1"},""]
["1.4.6",{"$f":"VLOOKUP(A35,LARowCount,1,FALSE)","v":"1.4.6"},"",null,null,null,null,"4.0.1",{"$f":"VLOOKUP(H35,'Table A1'!B:B,1,FALSE)","v":"4.0.1"},""]
["1.4.7","1.4.7","",null,null,null,null,"5.0.1",{"$f":"VLOOKUP(H36,'Table A1'!B:B,1,FALSE)","v":"5.0.1"},""]
["1.4.8","1.4.8","",null,null,null,null,"5.0.2",{"$f":"VLOOKUP(H37,'Table A1'!B:B,1,FALSE)","v":"5.0.2"},""]
["1.4.9","1.4.9","",null,null,null,null,"5.0.3",{"$f":"VLOOKUP(H38,'Table A1'!B:B,1,FALSE)","v":"5.0.3"},""]
["1.4.10","1.4.10","",null,null,null,null,8,{"$f":"VLOOKUP(H39,'Table A1'!B:B,1,FALSE)","v":8},""]
["1.4.11","1.4.11","",null,null,null,null,"8a.1",{"$f":"VLOOKUP(H40,'Table A1'!B:B,1,FALSE)","v":"8a.1"},""]
{"$rows_left_out":54}
{"sheet":"Admin","index":5,"n_rows":154,"n_cols":2,"rows_kept":154,"cut":false,"hidden":true,"merged":[]}
["Local Authority List"]
[201,"City of London"]
[202,"Camden"]
[203,"Greenwich"]
[204,"Hackney"]
[205,"Hammersmith & Fulham"]
[206,"Islington"]
[207,"Kensington & Chelsea"]
[208,"Lambeth"]
[209,"Lewisham"]
[210,"Southwark"]
[211,"Tower Hamlets"]
[212,"Wandsworth"]
[213,"Westminster"]
[301,"Barking & Dagenham"]
[302,"Barnet"]
[303,"Bexley"]
[304,"Brent"]
[305,"Bromley"]
[306,"Croydon"]
[307,"Ealing"]
[308,"Enfield"]
[309,"Haringey"]
[310,"Harrow"]
[311,"Havering"]
[312,"Hillingdon"]
[313,"Hounslow"]
[314,"Kingston Upon Thames"]
[315,"Merton"]
[316,"Newham"]
[317,"Redbridge"]
[318,"Richmond Upon Thames"]
[319,"Sutton"]
[320,"Waltham Forest"]
[330,"Birmingham"]
[331,"Coventry"]
[332,"Dudley"]
[333,"Sandwell"]
[334,"Solihull"]
[335,"Walsall"]
{"$rows_left_out":114}