{"text_format":"1","workbook":"xlsx","n_sheets":7,"sheets":["Cover Sheet","Instructions","LA Table","High Needs Places Table","Early Years Proforma","Admin-Lists","Admin-MissingRowCheck"],"not_rendered":{"charts":0,"images":19,"macros":1,"external_links":3,"defined_names":97,"comments":1,"pivot_tables":0},"unopened":[],"bounds":{"document_bytes":16777216,"sheet_cells":100000,"rows_first":2000,"rows_last":500,"rows_between":2000,"halvings":0,"cell_chars":16384,"cell_head_chars":4096},"cells_cut":0,"cells_raw":0,"read":"whole","date_system":"1900"}

{"sheet":"Cover Sheet","index":0,"n_rows":24,"n_cols":5,"rows_kept":24,"cut":false,"hidden":false,"merged":[]}
[]
[]
[]
[]
[null,null,null,"Section 251 Budget 2022-23"]
[null,null,null,"XML Generator"]
[null,null,null,"Version 1.0"]
[]
[]
[]
[]
[null,"Local Authority Number:"]
[]
[null,"Local Authority Name:",{"$f":"IF(ISNA(VLOOKUP(C12,LA, 2, FALSE)),\"\",VLOOKUP(C12, LA, 2, FALSE))","v":""}]
[]
{"$rows_left_out":10}
{"sheet":"Instructions","index":1,"n_rows":314,"n_cols":2,"rows_kept":314,"cut":false,"hidden":false,"merged":[]}
[]
[null,"Completing the return"]
[]
[null,"Before you complete the return you are advised to read the guidance at https://gov.uk/government/publications/section-251-2022-to-2023."]
[]
[null,"LA Table"]
[]
[null,"This table is for local authorities to provide an overall picture of the funding being allocated direct to schools, the amount being spent on education centrally and the amount being spent on children’s and young people’s services."]
[]
[null,"Values should be entered in all red cells. If the value entered does not match the data validation restrictions for the cell, an error message will be displayed. You will still be able to submit your return, but you will be prompted to enter an explanation within COLLECT."]
[]
[null,"Error messages will be displayed in column O if the data entered does not match the validation restrictions applied to the table."]
[]
[null,"High Needs Places Table"]
[]
{"$rows_left_out":300}
{"sheet":"LA Table","index":2,"n_rows":189,"n_cols":26,"rows_kept":189,"cut":false,"hidden":false,"merged":[[2,16,2,24],[74,4,74,5],[188,4,188,12]]}
[null,"S251 Budget 2022-23",null,null,null,null,null,null,null,null,null,null,null,null,null,null,"Count of headings:",{"$f":"COUNTIF(O:O,\"Error Cell Reference and Description\")","v":1}]
[null,"LA Table:  Local Authority Information",null,null,null,null,null,null,null,null,null,null,null,null,null,null,"Count of cells with errors:",{"$f":"COUNTIF(O:O,\"<>\")-R1-COUNTIF(LAErrorCell,\"<>\")","v":0}]
[null,null,null,null,null,null,null,null,null,null,null,null,null,null,null,null,"Rule Application (offset by 12 columns to data)"]
[null,null,"Description",null,"Early Years","Primary","Secondary","SEN/Special schools","AP/PRUs","\nPost school (e.g. Sixth Form & FE Colleges)\n\n","Gross","Income","Net",null,"Error Cell Reference and Description",null,"Early Years","Primary","Secondary","SEN/    Special schools","AP/    PRUs","Post school (e.g. Sixth Form & FE Colleges)\n","Gross","Income","Net","Notes"]
[null,null,null,null,{"$f":"IF(COUNTA(E9:L187)<456,\"PLEASE ENTER VALUES IN ALL CELLS\",\"\")","v":"PLEASE ENTER VALUES IN ALL CELLS"},null,null,null,null,null,null,null,null,null,null,null,"E","F","G","H","I","J","K","L","M"]
[null,null,null,null,null,null,null,null,null,null,null,null,"LA Table Errors:"]
[null,1,"SCHOOLS BUDGET"]
[]
[null,"1.0.1","Individual Schools Budget (i.e. school budget shares, before Academy recoupment), including 6th form grant for maintained schools, but excluding all high needs place funding ",null,null,null,null,null,null,null,{"$f":"SUM(E9,F9,G9)","v":0},null,{"$f":"K9-L9","v":0},null,null,null,"1.1,1.3,1.7","1.1,1.3,1.7","1.1,1.3,1.7",1.6,1.6,1.6,1001,1.6," "]
[null,"1.0.2","High needs place funding within Individual Schools Budget (i.e. within school budget shares, before Academy recoupment), including all pre- and post-16 place funding for maintained schools and academies",null,null,null,null,null,null,null,{"$f":"SUM(E10,F10,G10,H10,I10)","v":0},null,{"$f":"K10-L10","v":0},null,null,null,"1.1,1.3,1.7","1.1,1.3,1.7","1.1,1.3,1.7","1.1,1.3,1.7","1.1,1.3,1.7",1.6,"1001, 1022",1.6," "]
[]
[null,null,"DEDELEGATED ITEMS      "]
[null,"1.1.1","Contingencies      ",null,null,null,null," ",null,null,{"$f":"SUM(F13,G13)","v":0},null,{"$f":"K13-L13","v":0},null,null,null,1.6,"1.1,1.3,1.7","1.1,1.3,1.7",1.6,1.6,1.6,"3.1.1,1007","1.1,1.3,1.7"," "]
[null,"1.1.2","Behaviour support services",null,null,null,null,null,null,null,0,null,0,null,null,null,1.6,"1.1,1.3,1.7","1.1,1.3,1.7",1.6,1.6,1.6,"3.1.1,1007","1.1,1.3,1.7"," "]
[null,"1.1.3","Support to UPEG and bilingual learners  ",null,null,null,null,null,null,null,0,null,0,null,null,null,1.6,"1.1,1.3,1.7","1.1,1.3,1.7",1.6,1.6,1.6,"3.1.1,1007","1.1,1.3,1.7"," "]
{"$rows_left_out":175}
{"sheet":"High Needs Places Table","index":3,"n_rows":209,"n_cols":40,"rows_kept":209,"cut":false,"hidden":false,"merged":[[3,5,3,16],[5,33,5,34],[5,37,6,37],[5,22,6,24],[5,25,6,25],[5,26,6,26],[5,27,5,28],[5,30,5,31],[5,19,6,19],[5,13,5,14],[5,17,6,17],[5,2,6,4],[5,5,6,5],[5,6,6,6],[5,7,5,8],[5,10,5,11]]}
[null,"S251 Budget 2022-23"]
[null,"Nursery, Pre-16 and Post-16 high needs places in maintained schools. Full-year data should be entered for schools becoming academies on or after 1 April 2022."]
[]
[null,null,null,null,"Schools Table Notes:",null,null,null,null,null,null,null,null,null,null,null,null,"HNP Table Errors:",null,null,null,null,"Count of headings:",{"$f":"COUNTIF(T:T,\"Error Cell Reference and Description\")","v":1}]
[null,null,null,null,null,null,null,null,null,null,null,null,null,null,null,null,null,null,null,null,null,null,"Count of cells with errors:",{"$f":"COUNTIF(T:T,\"<>\")-X4","v":0}]
[null,null,"Special Schools / Pupil Referral Units / Hospital Schools / Special units and resourced provision in mainstream schools",null,null,"Is School/Unit Opening/Closing In-Year?","Date Opening / Closing","Special Educational Needs (SEN) Places",null,"SEN place funding","Alternative provision (AP) places",null,"AP place funding","Hospital education places  ",null,"Hospital education place funding","Total place funding","Comments",null,"Error Cell Reference and Description",null,"Last Row with data entered:","Special Schools / Pupil Referral Units / Hospital Schools / Special units and resourced provision in mainstream schools",null,null,"Is School/Unit Opening/Closing In-Year?","Date Opening / Closing","Special Educational Needs (SEN) Places",null,"SEN place funding","Alternative provision (AP) places",null,"AP place funding","Hospital education places  ",null,"Hospital education place funding","Total Place funding         net ","Comments"]
[null,null,null,null,null,null,null,"April 2022 to August 2022       ","September 2022 to March 2023","April 2022 to March 2023","April 2022 to August 2022","September 2022 to March 2023","April 2022 to March 2023","April 2022 to August 2022","September 2022 to March 2023","April 2022 to March 2023","April 2022 to March 2023",null,null,null,null,{"$f":"IF(MAX(IF(V9:V1002=1, ROW(V9:V1002)-ROW(INDEX(V9:V1002,1,1))+1))+6>6,MAX(IF(V9:V1002=1, ROW(V9:V1002)-ROW(INDEX(V9:V1002,1,1))+1))+8,0)","v":0},null,null,null,null,null,"April 2022 to August 2022       ","September 2022 to March 2023","April 2022 to March 2023","April 2022 to August 2022","September 2022 to March 2023","April 2022 to March 2023","April 2022 to August 2022","September 2022 to March 2023","April 2022 to March 2023","April 2022 to March 2023"]
[null,"School number - for authorities own use","School Name","DfE Number","School Type","O or C","yyyy-mm-dd",null,null,"£",null,null,"£",null,null,"£","£",null,null,null,null,"Count if values are present","School Name","DfE Number","School Type","O or C",null,null,null,"£",null,null,"£",null,null,"£","£",null,"Error1002\nCalc","Error1003\nCalc"]
[null,null,null,null,null,null,null,null,null,null,null,null,null,null,null,null,{"$f":"SUM(J9,M9,P9)","v":0},null,null,null,null,{"$f":"IF(COUNTIF(B9:R9,\"<>\")-1>0,1,0)","v":0},2.12,"2.11, 2.5, 1.2,1.7",1025,"2.9.1","2.9.1,2.10.1","1002, 1012, 1.3,1.7","1002, 1012, 1.3,1.7","1003, 1024, 1034, 1035,1.7","1002, 1012, 1.3,1.7","1002, 1012, 1.3,1.7","1004, 1036,1.7","1002, 1012, 1.3,1.7","1002, 1012, 1.3,1.7","1005, 1012, 1013, 1037,1.7","1011, 1022,1.7",null,{"$f":"SUM(H9:I9,K9:L9,N9:O9)","v":0},{"$f":"ROUND(H9*5/12+I9*7/12*10000,2)","v":0}]
[null,null,null,null,null,null,null,null,null,null,null,null,null,null,null,null,{"$f":"SUM(J10,M10,P10)","v":0},null,null,null,null,{"$f":"IF(COUNTIF(B10:R10,\"<>\")-1>0,1,0)","v":0},2.12,"2.11, 2.5, 1.2,1.7",1025,"2.9.1","2.9.1,2.10.1","1002, 1012, 1.3,1.7","1002, 1012, 1.3,1.7","1003, 1024, 1034, 1035,1.7","1002, 1012, 1.3,1.7","1002, 1012, 1.3,1.7","1004, 1036,1.7","1002, 1012, 1.3,1.7","1002, 1012, 1.3,1.7","1005, 1012, 1013, 1037,1.7","1011, 1022,1.7",null,{"$f":"SUM(H10:I10,K10:L10,N10:O10)","v":0},{"$f":"ROUND(H10*5/12+I10*7/12*10000,2)","v":0}]
[null,null,null,null,null,null,null,null,null,null,null,null,null,null,null,null,0,null,null,null,null,0,2.12,"2.11, 2.5, 1.2,1.7",1025,"2.9.1","2.9.1,2.10.1","1002, 1012, 1.3,1.7","1002, 1012, 1.3,1.7","1003, 1024, 1034, 1035,1.7","1002, 1012, 1.3,1.7","1002, 1012, 1.3,1.7","1004, 1036,1.7","1002, 1012, 1.3,1.7","1002, 1012, 1.3,1.7","1005, 1012, 1013, 1037,1.7","1011, 1022,1.7",null,0,0]
[null,null,null,null,null,null,null,null,null,null,null,null,null,null,null,null,0,null,null,null,null,0,2.12,"2.11, 2.5, 1.2,1.7",1025,"2.9.1","2.9.1,2.10.1","1002, 1012, 1.3,1.7","1002, 1012, 1.3,1.7","1003, 1024, 1034, 1035,1.7","1002, 1012, 1.3,1.7","1002, 1012, 1.3,1.7","1004, 1036,1.7","1002, 1012, 1.3,1.7","1002, 1012, 1.3,1.7","1005, 1012, 1013, 1037,1.7","1011, 1022,1.7",null,0,0]
[null,null,null,null,null,null,null,null,null,null,null,null,null,null,null,null,0,null,null,null,null,0,2.12,"2.11, 2.5, 1.2,1.7",1025,"2.9.1","2.9.1,2.10.1","1002, 1012, 1.3,1.7","1002, 1012, 1.3,1.7","1003, 1024, 1034, 1035,1.7","1002, 1012, 1.3,1.7","1002, 1012, 1.3,1.7","1004, 1036,1.7","1002, 1012, 1.3,1.7","1002, 1012, 1.3,1.7","1005, 1012, 1013, 1037,1.7","1011, 1022,1.7",null,0,0]
[null,null,null,null,null,null,null,null,null,null,null,null,null,null,null,null,0,null,null,null,null,0,2.12,"2.11, 2.5, 1.2,1.7",1025,"2.9.1","2.9.1,2.10.1","1002, 1012, 1.3,1.7","1002, 1012, 1.3,1.7","1003, 1024, 1034, 1035,1.7","1002, 1012, 1.3,1.7","1002, 1012, 1.3,1.7","1004, 1036,1.7","1002, 1012, 1.3,1.7","1002, 1012, 1.3,1.7","1005, 1012, 1013, 1037,1.7","1011, 1022,1.7",null,0,0]
[null,null,null,null,null,null,null,null,null,null,null,null,null,null,null,null,0,null,null,null,null,0,2.12,"2.11, 2.5, 1.2,1.7",1025,"2.9.1","2.9.1,2.10.1","1002, 1012, 1.3,1.7","1002, 1012, 1.3,1.7","1003, 1024, 1034, 1035,1.7","1002, 1012, 1.3,1.7","1002, 1012, 1.3,1.7","1004, 1036,1.7","1002, 1012, 1.3,1.7","1002, 1012, 1.3,1.7","1005, 1012, 1013, 1037,1.7","1011, 1022,1.7",null,0,0]
{"$rows_left_out":195}
{"sheet":"Early Years Proforma","index":4,"n_rows":63,"n_cols":41,"rows_kept":63,"cut":false,"hidden":false,"merged":[[38,4,38,14],[38,25,38,35],[39,4,39,14],[39,25,39,35],[54,25,54,35],[50,4,50,14],[58,25,58,35],[41,4,41,14],[41,25,41,35],[42,4,42,14],[42,25,42,35],[46,4,46,14],[46,25,46,35],[47,4,47,14],[47,25,47,35],[49,4,49,14],[49,25,49,35],[50,25,50,35],[58,15,58,17],[45,3,45,14],[45,15,45,17],[48,1,48,2],[48,3,48,14],[48,15,48,17],[45,1,45,2],[62,4,62,18],[54,15,54,17],[57,3,57,14],[57,15,57,17],[53,1,53,2],[57,1,57,2],[53,3,53,14],[53,15,53,17],[35,15,35,18],[5,14,5,17],[35,20,36,20],[27,9,27,11],[27,20,28,20],[12,20,13,20],[7,20,8,20],[27,15,27,18],[28,12,28,14],[7,15,7,18],[20,15,20,17],[12,5,12,7],[12,9,12,14],[12,15,12,18],[22,12,22,14],[13,12,13,14],[12,8,13,8],[35,1,36,2],[35,3,36,14],[24,1,24,2],[27,1,28,2],[27,3,28,3],[27,4,28,4],[27,5,27,7],[27,8,28,8],[12,1,13,2],[12,3,13,3],[12,4,13,4],[30,1,30,3],[29,1,29,2],[23,1,23,2],[22,1,22,2],[14,1,14,3],[0,33,0,35],[0,36,0,39],[0,22,1,23],[0,24,1,24],[0,25,1,25],[0,26,0,28],[0,29,1,29],[0,30,0,32],[7,1,8,2],[7,3,8,3],[7,9,7,11],[7,12,7,14],[9,1,9,2],[7,5,7,7],[7,4,8,4],[7,8,8,8]]}
[null,"S251 Budget 2022-23",null,null,null,null,null,null,null,null,null,null,null,null,null,null,null,null,null,null,null,null,"EYSFF (3 & 4 year olds): \nBase rate",null,"Row No.","Description","Unit Value (£)",null,null,"Unit\nApplied","Number of Units (Universal 15 hours)",null,null,"Number of Units (Additional 15 hours)",null,null,"Anticipated Budget (£)"]
[null,"Early Years Proforma Table",null,null,null,null,null,null,null,null,null,null,null,null,null,null,null,null,null,null,null,null,null,null,null,null,"PVI","Nursery School","Primary Nursery Class",null,"PVI","Nursery School","Primary Nursery Class","PVI","Nursery School","Primary Nursery Class","PVI","Nursery School","Primary Nursery Class","TOTAL","Is Data Present on Row?"]
[null,null,null,null,null,null,null,null,null,null,null,null,null,null,null,null,null,null,"EYP Errors:",null,null,null,null,null,"Count of headings:",{"$f":"COUNTIF(U:U,\"Error Cell Reference and Description\")","v":11}]
[null,null,null,null,null,null,null,null,null,null,null,null,null,null,null,null,null,null,null,null,null,null,null,null,"Count of cells with errors:",{"$f":"COUNTIF(U:U,\"<>\")-Z3","v":0}]
[null,null,null,null,null,null,null,null,null,null,null,null,null,null,null,null,null,null,null,null,"Error Cell Reference and Description"]
[null,null,null,null,null,null,null,null,null,null,null,null,null,null,"Pass-through rate for delivering government funded hours:",null,null,null,{"$f":"IF(AND(LANumber<>\"\",LANumber<> 201,LANumber<> 420,SUM(Total1a)<>0),(SUM(Total1, Total2, Total37a8)-VLOOKUP(LANumber,'Admin-Lists'!A:D,4,FALSE))/SUM(Total1a)/VLOOKUP(LANumber,'Admin-Lists'!A:D,3,FALSE),\"\")","v":""},null,null,null,null,null,null,null,null,null,null,null,null,null,null,null,null,null,null,null,null,1023]
[]
[null,"EYSFF (3 & 4 year olds): \nBase rate",null,"Row No.","Description","Unit Value (£)",null,null,"Unit\nApplied","Number of Units (Universal 15 hours)",null,null,"Number of Units (Additional 15 hours)",null,null,"Anticipated Budget (£)",null,null,null,null,"Error Cell Reference and Description"]
[null,null,null,null,null,"PVI","Nursery School","Primary Nursery Class",null,"PVI","Nursery School","Primary Nursery Class","PVI","Nursery School","Primary Nursery Class","PVI","Nursery School","Primary Nursery Class","TOTAL"]
["EY1","1. Base Rate(s) per hour, per provider type  ",null,1,null,null,null,null,null,null,null,null,null,null,null,{"$f":"IF(AND(F10=\"\",J10=\"\",M10=\"\"),\"\",F10*(J10+M10))","v":""},{"$f":"IF(AND(G10=\"\",K10=\"\",N10=\"\"),\"\",G10*(K10+N10))","v":""},{"$f":"IF(AND(H10=\"\",L10=\"\",O10=\"\"),\"\",H10*(L10+O10))","v":""},{"$f":"IF(AND(P10=\"\",Q10=\"\",R10=\"\"),\"\",SUM(P10:R10))","v":""},null,null,null,1.1000000000000001,null,1.1000000000000001,"5.0.13, 5.0.14, 1009, 1010","5.0.0, 5.07, 5.0.8, 5.0.11, 1038, 1039","5.0.0, 5.07, 5.0.8, 5.0.11, 1038, 1039","5.0.0, 5.07, 5.0.8, 5.0.11, 1038, 1039","5.0.0, 5.07,  5.0.11, 5.0.12, 1039","5.0.0, 5.0.10, 5.0.12, 1040, 1039","5.0.0, 5.0.10, 5.0.12, 1040, 1039","5.0.0, 5.0.10, 5.0.12, 1040, 1039","5.0.0, 5.0.10, 5.0.12, 1040, 1039","5.0.0, 5.0.10, 5.0.12, 1040, 1039","5.0.0, 5.0.10, 5.0.12, 1040, 1039",null,null,null,null,{"$f":"IF(F10&G10&H10&I10&J10&K10&L10&M10&N10&O10&P10&Q10&R10&S10=\"\",0,1)","v":0}]
[null,null,"End of section 1"]
[]
[null,"EYSFF (3 & 4 year olds):\nOther formula factors",null,null,"Description","Unit Value (£)",null,null,"Unit\nApplied","Number of Units (Universal & Additional 15 hours)",null,null,null,null,null,"Anticipated Budget (£)",null,null,null,null,"Error Cell Reference and Description"]
[null,null,null,null,null,"PVI","Nursery School","Primary Nursery Class",null,"PVI","Nursery School","Primary Nursery Class","Not used",null,null,"PVI","Nursery School","Primary Nursery Class","TOTAL"]
[null,"2. Supplements (please provide in written format a short explanation of your supplement payments)"]
{"$rows_left_out":49}
{"sheet":"Admin-Lists","index":5,"n_rows":1676,"n_cols":18,"rows_kept":1676,"cut":false,"hidden":true,"merged":[[0,16,0,17],[0,9,0,14]]}
["Local Authority List",null,"EYNFF_Hourly_Rate","MNS_Supp_Funding",null,"School States",null,"SchoolTypes",null,"School List for Pre-population",null,null,null,null,null,null,"Section Names For EY Dropdowns"]
[201,"City of London",0,0,null,"Open",null,"Mainstream",null,"LA Number","School Name","DFE Number","School Type\n","O/C","O/C Date",null,"Section Name","Abbreviation"]
[202,"Camden",8.51,0,null,"Closed",null,"Hospital",null,202,"CCfL Key Stage 4 PRU",1100,"Pupil Referral Unit","O","1999-09-01",null,"1 - EYSFF (3 and 4 year olds) base rate(s) per hour","EY1"]
[203,"Greenwich",6.48,630306,null,"Converter",null,"Pupil Referral Unit",null,202,"Camden Primary Pupil Referral Unit",1101,"Pupil Referral Unit","O",null,null,"2a - Supplements: deprivation","EY2a"]
[204,"Hackney",6.14,525198,null,null,null,"Special",null,202,"CCfL Key Stage 3 PRU",1103,"Pupil Referral Unit","O","2003-09-01",null,"2b - Supplements: quality","EY2b"]
[205,"Hammersmith and Fulham",8.23,733134,null,null,null,null,null,202,"Netley Primary School & Centre for Autism",2436,"Mainstream","O",null,null,"2c - Supplements: flexibility","EY2c"]
[206,"Islington",7.81,334659,null,null,null,null,null,202,"Primrose Hill School",2475,"Mainstream","O",null,null,"2d - Supplements: rurality/sparsity","EY2d"]
[207,"Kensington and Chelsea",8.1999999999999993,561266,null,null,null,"RED = OLD DATA",null,202,"Rhyl Community Primary School",2502,"Mainstream","O",null,null,"2e - Supplements: EAL","EY2e"]
[208,"Lambeth",7.32,523805,null,null,null,null,null,202,"Torriano Primary School",2603,"Mainstream","O",null,null,"3 - Maintained nursery school (MNS) lump sums","EY3"]
[209,"Lewisham",5.93,407984,null,null,null,null,null,202,"Kentish Town Church of England Primary School",3370,"Mainstream","O",null,null,"4 - Hours above universal/additional 15 hours","EY4"]
[210,"Southwark",6.86,1354987,null,null,null,null,null,202,"Regent High School",4196,"Mainstream","O",null,null,"5 - EYSFF (2 year olds) base rate(s) per hour","EY5"]
[211,"Tower Hamlets",8.06,525449,null,null,null,null,null,202,"Acland Burghley School",4285,"Mainstream","O",null,null,"6a - Quality supplements","EY6a"]
[212,"Wandsworth",6.79,406450,null,null,null,null,null,202,"Children's Hospital School at Gt Ormond Street and UCH",5950,"Hospital ","O",null,null,"6b - Other supplements","EY6b"]
[213,"Westminster",7.86,1389182,null,null,null,null,null,202,"Frank Barnes School for Deaf Children",7008,"Special","O",null,null,"7ai - SEN Inclusion (3 and 4 year olds) funding allocated from EY block","EY7ai"]
[301,"Barking and Dagenham",5.81,0,null,null,null,null,null,202,"Camden Centre for Learning (CCfL) Special School",7137,"Special","O",null,null,"7aii - SEN Inclusion (3 and 4 year olds) funding allocated from HN block","EY7aii"]
{"$rows_left_out":1662}
{"sheet":"Admin-MissingRowCheck","index":6,"n_rows":129,"n_cols":14,"rows_kept":129,"cut":false,"hidden":true,"merged":[]}
["LA Table - Error 1033 information for error message",null,null,"Missing rows",null,null,null,"EY table - Error 1043",null,null,"Missing rows",null,"1011 Error","1010 Value"]
["Required Row Numbers","Are they present? If not output the number in column C to add to end of 1033 error message","Check for isna",{"$f":"_xlfn.CONCAT(C3:C149)","v":""},null,null,null,"Required Rows","Are they present? If not output the number in column C to add to end of 1033 error message","Check for isna",{"$f":"_xlfn.CONCAT(J3:J150)","v":""},null,{"$f":"IF(ISERR(ABS('LA Table'!M73 - 'LA Table'!K88)), \"\", IF(ABS('LA Table'!M73 - 'LA Table'!K88) > 10000, \"Y\", \"\"))","v":""},{"$f":"IF(ISERR(ABS('LA Table'!M73-'LA Table'!K88)),\"\",ABS('LA Table'!M73-'LA Table'!K88))","v":0}]
[1,{"$f":"VLOOKUP(A3,LARowCount,1,FALSE)","v":1},{"$f":"IF(ISNA(B3),\", \"&A3,\"\")","v":""},null,null,null,null,"EY1",{"$f":"VLOOKUP(H3,'Early Years Proforma'!A:A,1,FALSE)","v":"EY1"},{"$f":"IF(ISNA(I3),\", \"&MID(H3,3,10),\"\")","v":""}]
[2,{"$f":"VLOOKUP(A4,LARowCount,1,FALSE)","v":2},{"$f":"IF(ISNA(B4),\", \"&A4,\"\")","v":""},null,null,null,null,"EY2a",{"$f":"VLOOKUP(H4,'Early Years Proforma'!A:A,1,FALSE)","v":"EY2a"},{"$f":"IF(ISNA(I4),\", \"&MID(H4,3,10),\"\")","v":""}]
[3,3,"",null,null,null,null,"EY2b",{"$f":"VLOOKUP(H5,'Early Years Proforma'!A:A,1,FALSE)","v":"EY2b"},""]
[6,6,"",null,null,null,null,"EY2c",{"$f":"VLOOKUP(H6,'Early Years Proforma'!A:A,1,FALSE)","v":"EY2c"},""]
[7,7,"",null,null,null,null,"EY2d",{"$f":"VLOOKUP(H7,'Early Years Proforma'!A:A,1,FALSE)","v":"EY2d"},""]
[8,8,"",null,null,null,null,"EY2e",{"$f":"VLOOKUP(H8,'Early Years Proforma'!A:A,1,FALSE)","v":"EY2e"},""]
["1.0.1","1.0.1","",null,null,null,null,"EY3",{"$f":"VLOOKUP(H9,'Early Years Proforma'!A:A,1,FALSE)","v":"EY3"},""]
["1.0.2","1.0.2","",null,null,null,null,"EY4",{"$f":"VLOOKUP(H10,'Early Years Proforma'!A:A,1,FALSE)","v":"EY4"},""]
["1.1.1","1.1.1","",null,null,null,null,"EY5",{"$f":"VLOOKUP(H11,'Early Years Proforma'!A:A,1,FALSE)","v":"EY5"},""]
["1.1.2","1.1.2","",null,null,null,null,"EY6a",{"$f":"VLOOKUP(H12,'Early Years Proforma'!A:A,1,FALSE)","v":"EY6a"},""]
["1.1.3","1.1.3","",null,null,null,null,"EY6b",{"$f":"VLOOKUP(H13,'Early Years Proforma'!A:A,1,FALSE)","v":"EY6b"},""]
["1.1.4","1.1.4","",null,null,null,null,"EY7ai",{"$f":"VLOOKUP(H14,'Early Years Proforma'!A:A,1,FALSE)","v":"EY7ai"},""]
["1.1.5","1.1.5","",null,null,null,null,"EY7aii",{"$f":"VLOOKUP(H15,'Early Years Proforma'!A:A,1,FALSE)","v":"EY7aii"},""]
{"$rows_left_out":114}