{"text_format":"1","workbook":"xlsx","n_sheets":5,"sheets":["Read me First","Request Guidance","Request Form","Providers","Summary"],"not_rendered":{"charts":0,"images":3,"macros":1,"external_links":0,"defined_names":6,"comments":0,"pivot_tables":0},"unopened":[],"bounds":{"document_bytes":16777216,"sheet_cells":100000,"rows_first":2000,"rows_last":500,"rows_between":2000,"halvings":0,"cell_chars":16384,"cell_head_chars":4096},"cells_cut":0,"cells_raw":0,"read":"whole","date_system":"1900"}

{"sheet":"Read me First","index":0,"n_rows":79,"n_cols":2,"rows_kept":79,"cut":false,"hidden":false,"merged":[]}
[]
[null,"BACKGROUND"]
[null,"The ESFA would like to increase the opportunities available to 16 to 18-year-olds who would benefit from a traineeship programme. We are therefore offering providers the opportunity to apply for a standalone traineeship contract to deliver traineeships to 16 to 18-year-olds. The new contracts are each worth up to £300,000 per provider and are on standard terms, subject to meeting the relevant eligibility criteria. Traineeships delivered under the new contracts are exclusively for 16 to 18-year-olds. \n\nTo apply for a new traineeship contract, you must meet the eligibility criteria, be an existing provider and you must submit a full and complete application by 5pm on 22 October 2021 to be considered for a contract. The deadline of 5pm on 22 October 2021 will be strictly applied, as we will not accept any applications received after the deadline. We recommend you submit your application in advance to avoid any delay that could lead to missing the submission deadline or failing to complete the application properly."]
[null,"Traineeships offer a flexible intervention which develops young peoples employment skills and experience to support their progression into an apprenticeship, work or further learning. Full details are set out in the Traineeship Framework for Delivery."]
[]
[null,"Traineeship Framework for delivery"]
[]
[null,"The government wants traineeships to move young people towards work or an apprenticeship more than ever before. The Plan for Jobs included a commitment to provide thousands of new Traineeships to get young people aged 16 to 24 (up to 25 for those with an EHCP) in England into work."]
[]
[null,"To support the expansion of places and better enable delivery of traineeships post covid-19, training organisations shall quickly establish, strong relationships with employers, jobcentres, the National Careers Service (NCS), Local Enterprise Partnerships and other local partners, enabling the contractor and employers to:"]
[]
[null,"* recruit learners to their programme, including through referrals from Jobcentres, the NCS and other local partners;"]
[]
[null,"* work together to tailor theirpProgramme to real-time needs of both the learner and the local labour market; and"]
[]
[null,"* establish and utilise links to lead sector skills bodies where there is an opportunity to establish good practice in delivery of traineeships leading to occupations in that sector. "]
[]
[null,"The contract will provide an opportunity to significantly increase capacity among providers who can drive participation by young people and demand by employers. It is intended to support high quality growth of the programme with funding available to support providers between the service start date 1 December 2021 and the end of the academic year, 31 July 2022."]
[]
[null,"TRAINEESHIP OVERVIEW"]
[]
[null,"16 to 18 traineeships are programmes of activity for young people with qualifications up to and including level 3 and help prepare them for an apprenticeship, other sustainable employment where training is in a workplace or further learning. Traineeships should last for a minimum of 6 weeks and a maximum of 12 months."]
[]
[null,"The core aim of a traineeship is a high-quality work placement with an employer of between 70 and 240 hours, which can be undertaken as multiple shorter placements in different organisations. This would need careful planning to ensure it adds up to the high-quality work experience we expect for all learners. Longer placements may be necessary to prepare learners for work, but these would need to be based on clearly identified learner needs."]
[]
[null,"Providers and employers can bring work preparation training, and English, maths and digital where required, together in the best way to engage and support individual learners. This should be integrated with other support and training, such as mentoring, careers guidance, job search support and sector-focused vocational learning that prepares the learner for occupational standards within apprenticeships. Each trainee should have a learning plan that shows how the different elements of the traineeship, including the work experience placement(s), will come together to meet the young person’s needs and aspiration(s)."]
[]
[null,"We want traineeships to support as many young people as possible into apprenticeships and sustainable employment. Funding has been made available for providers to start or expand traineeship programmes. Providers should ensure opportunities are responsive and available in occupations where there is local employer demand, in the post covid-19 labour market."]
[]
[null,"Further information can be found in the "]
[]
[null,"Traineeship framework for delivery"]
[]
[null,"CONTRACT PERIOD"]
[]
[null,"The initial contract period will be from the service start date 1 December 2021 until 31 July 2022. We intend to communicate future funding allocations under the contract for the 2022 to 2023 delivery in Spring 2022. "]
[]
[null,"FINANCIAL YEAR SPLIT"]
[]
[null,"Please enter the total value of your 16 to 18 traineeship request for the 2021 to 2022 funding year. NOTE – The maximum funding you can apply for is £300,000 for the entire 2021 to 2022 funding year. "]
{"$rows_left_out":40}
{"sheet":"Request Guidance","index":1,"n_rows":40,"n_cols":3,"rows_kept":40,"cut":false,"hidden":false,"merged":[[7,1,7,2],[14,1,14,2],[10,1,12,2]]}
[]
[]
[]
[]
[]
[]
[]
[]
[]
[]
[null,"16 to 18 traineeship market entry 2021 to 2022\n\nProviders can submit a traineeship request form from 29 September to 22 October 2021 to secure a 16 to 18 traineeship only contract. You must complete and submit by 5pm on 22 October 2021. We will not accept a request form received after the deadline or submitted to a different email address. We recommend you submit your application in advance to avoid any delay that could lead to missing the submission deadline.\n\nThe maximum allocation you can apply for is £300,000. The full value of your request is not guaranteed, and your award may be lower than the value you have requested if the total combined level of requests are higher than the funding available. If this happens each provider's allocation will be reduced by an equal percentage.\n\nWe aim to notify all providers of the outcome w/c 15 November 2021, with contracts to start from 1 December 2021.\n\nTo take part in the market entry exercise, a training provider must meet all the following criteria:\n\n▪ have an ESFA contract, funding agreement or grant for the 2021 to 2022 academic year\n▪ have a current Ofsted grade 1 (outstanding) or grade 2 (Good). Alternatively, we will consider existing traineeship providers that have a 19 to 24 traineeship 2021/22 contract without an Ofsted grade 1 or 2\n▪ not be in formal intervention for minimum standards or inspection \n▪ not been issued with a notice to improve, additional conditions of funding or additional contractual obligations prohibiting you from growth\n▪ not be subject to an investigation for breach of contract and/or failed audit in the past 3 years\n▪ not have a financial health grade of inadequate\n\nPlease do not include any personal or sensitive data about your students when submitting your case. Personal data is information relating to a living individual who is, or can be, identified from the data provided. Personal data can be information about the individual, their families or circumstances. This may include names, contact details, gender or date of birth."]
[]
[]
[null,"Returning the form"]
[null,"Once all the required yellow boxes are complete, the completion status will change to COMPLETE.  The macro to send the email will not work unless the Completion Status is COMPLETE. We will validate all information you enter therefore you must ensure it is accurate, any incorrect information may result in exclusion from market entry.\n\nEmail the completed form to Enquiries.ESFA@education.gov.uk or using the online enquiry form. Please ensure the subject title includes your request type. (16 to 18 traineeship market entry)\n\nIf you have enabled the macros, clicking the button at the bottom of the request will automatically create an email and add this form to the email as an attachment. Please ensure you make your territorial manager aware that you have submitted a request for a 16 to 18 traineeship contract.\n\nIf the macro does not work, for some reason, please attach the form to an email manually."]
[null,"Completing the form"]
[]
[null,"Field","Description"]
[null,"Completion status","This box stays INCOMPLETE until all the yellow boxes are complete. Once all the required yellow boxes are complete, it will change to COMPLETE. We will not accept incomplete forms."]
[null,"Provider name","Use the drop-down box to select your provider name from a list. If your provider name is not listed, please email your Territorial Team Manager for advice (please quote your UKPRN)."]
[null,"UK Provider Registration Number (UKPRN)","This box will be completed automatically with your UKPRN as it appears on the UK Register of Learning Providers (UKRLP) once provider name is selected."]
[null,"Funding stream in question","16 to 18 traineeships"]
[null,"Do you currently hold an ESFA contract or funding agreement to deliver in 2021 to 2022?","You must hold an ESFA contract, funding agreement or grant for the 2021 to 2022 academic year.\nYou must select Yes or No.\n*If you have 16 to 18 traineeships without a 16 to 19 study programme funding agreement or a 16 to 19 Study Programme you are not able to request a 16 to 18 traineeship contract as you already have a contract to deliver to this age group."]
[null,"Do you have a 19-24 (procured) 2021/22 traineeship contract?","You must select Yes or No"]
[null,"Do you currently have a contract to deliver 16-19 Study Programme or 16-18 standalone traineeship activity?","You must select Yes or No"]
[null,"What is your current Ofsted grade?","You must select your current Ofsted grade from the drop down menu"]
[null,"Has your current financial health grade been assessed as 'Inadequate' by the ESFA?","You must select Yes or No"]
[null,"Have you been issued with a notice to improve or do you have contractual obligations prohibiting you from growth?","You must select Yes or No"]
[null,"Have you been subject to an investigation for breach of contract and/or failed audit in the past 3 years?","You must select Yes or No"]
[null,"Is this request for direct delivery or subcontracted?","You must select if the funding you are requesting is for Direct Delivery (delivered wholly by you) or Subcontracted"]
[null,"£ Value 2021/22 request","You must enter the value you are requesting. The maximum you can request is £300,000 in total (the minimum you can request is £100,000)"]
[null,"Number of starts","You must enter the planned number of starts you want to engage for the 2021 to 2022 funding year between 1 December 2021 to 31 March 2022 and between 1 April 2022 to 31 July 2022"]
[null,"Supporting Information","You must use the supporting information boxes to provide information about your traineeship programme to satisfy us that it will meet the key objectives of a traineeship. "]
[null,"Supporting Information Text Box 1","You need to provide information to support your request, there is a limit of the amount of characters that can be used.\n\nProvide a description of your delivery model and how this links to your longer term goal for traineeships."]
[null,"Supporting Information Text Box 2","You need to provide information to support your request, there is a limit of the amount of characters that can be used.\n\nProvide details of your capacity and capability to deliver and whether you have evidence of learner demand. This should include details of resources, infrastructure and how you can build the on demand.\n"]
[null,"Supporting Information Text Box 3","You need to provide information to support your request, there is a limit of the amount of characters that can be used.\n\nHow will you work with employers and referral agencies to secure the work placement? This needs to include information on employment sectors and geographical areas for your delivery and where possible employers that are interested in providing traineeship placements.\n"]
[null,"Supporting Information Text Box 4","You need to provide information to support your request, there is a limit of the amount of characters that can be used.\n\nWhat arrangements do you have in place to ensure successful outcomes? how will your offer and enhance the choice and quality of provision for trainees? how will you support trainees in to an apprenticeship, sustainable job or further education?"]
[null,"Authority tick box","You must tick to confirm that you have answered questions truthfully and have the authority to act on behalf of the applicant organisation named in this form. Failure to do so may result in a withdrawal of contract offer or a termintaion of contract."]
[null,"Request completed by","You must ensure you enter your:\nName\nPosition in Organisation\nDate of Request"]
[null,"Email","You must enter the email address for those in your organisation who wish to receive replies or outcome letter"]
{"$rows_left_out":1}
{"sheet":"Request Form","index":2,"n_rows":70,"n_cols":10,"rows_kept":70,"cut":false,"hidden":false,"merged":[[2,0,2,7],[3,0,3,7],[30,1,30,2],[31,1,31,2],[63,2,63,7],[32,1,32,2],[43,1,43,7],[47,1,47,7],[51,1,51,7],[55,1,55,7],[45,1,45,9],[49,1,49,9],[69,2,69,7],[8,2,8,7],[10,2,10,3],[17,1,17,2],[17,3,17,7],[65,2,65,7],[67,2,67,4]]}
[]
[null,null,null,null,null,null,null,null,null,"Completion status"]
["Market Entry - 16-18 Traineeships",null,null,null,null,null,null,null,null,{"$f":"IF(COUNTIFS(J6:J75,\"✔\")=COUNTA(J6:J75),\"Complete\",\"Incomplete\")","v":"Incomplete"}]
[]
[null,"Please read the 'Read me First' and 'Request Guidance' before completing this form. Please complete ALL of the cells highlighted yellow."]
[]
[null,"Section 1. provider details"]
[]
[null,"Provider name",null,null,null,null,null,null,null,{"$f":"IF(C9=0, \"✖\", \"✔\")","v":"✖"}]
[]
[null,"UKPRN",{"$f":"IFERROR(VLOOKUP(C9,Providers!A:B,2,FALSE),\"\")","v":""}]
[]
[]
[null,"Section 2. request"]
[]
[null,"We will validate all information you enter therefore we ask you to ensure it is accurate. Any incorrect information may result in exclusion from market entry."]
[]
[null,"Funding stream",null,"16-18 Traineeships (Only)",null,null,null,null,null,{"$f":"IF(D18=0, \"✖\", \"✔\")","v":"✔"}]
[null,"Do you have an ESFA contract, funding agreement or grant for the 2021/22 academic year?",null,null,null,null,null,null,null,{"$f":"IF(OR(ISBLANK(H19),AND(H20=\"no\",H19=\"no\")), \"✖\", \"✔\")","v":"✖"}]
[null,"Do you have a 19 to 24 (procured) 2021/22 traineeship contract?",null,null,null,null,null,null,null,{"$f":"IF(OR(ISBLANK(H20),AND(H20=\"no\",H19=\"no\")), \"✖\", \"✔\")","v":"✖"}]
[null,"Do you currently have a contract to deliver 16-19 Study Programme or 16-18 standalone traineeship activity?",null,null,null,null,null,null,null,{"$f":"IF(OR(ISBLANK(H21),H21=\"Yes\"),\"✖\", \"✔\")","v":"✖"}]
[null,"What is your current Ofsted grade?",null,null,null,null,null,null,null,{"$f":"IF(ISBLANK(H22), \"✖\", \"✔\")","v":"✖"}]
[null,"Has your current financial health grade been assessed as 'Inadequate' by the ESFA?",null,null,null,null,null,null,null,{"$f":"IF(OR(ISBLANK(H23),H23=\"Yes\"),\"✖\", \"✔\")","v":"✖"}]
[null,"Have you been issued with a notice to improve or do you have contractual obligations prohibiting you from growth?",null,null,null,null,null,null,null,{"$f":"IF(OR(ISBLANK(H24),H24=\"Yes\"),\"✖\", \"✔\")","v":"✖"}]
[null,"Have you been subject to an investigation for breach of contract and/or failed audit in the past 3 years?",null,null,null,null,null,null,null,{"$f":"IF(OR(ISBLANK(H25),H25=\"Yes\"),\"✖\", \"✔\")","v":"✖"}]
[null,"Is this request for direct delivery or through a subcontract?",null,null,null,null,null,null,null,{"$f":"IF(ISBLANK(H26), \"✖\", \"✔\")","v":"✖"}]
[]
[]
[null,"Total requested for 2021 to 2022 funding year"]
[]
[null,null,null,"2021/22 request","December to March ","April to July","Total"]
[null,"Enter allocation value request £",null,null,{"$f":"IF(D32=\"\",\"\",ROUND(D32*49.79%,0))","v":""},{"$f":"IFERROR(D32-E32,\"\")","v":""},{"$f":"SUM(E32:F32)","v":0},null,null,{"$f":"IF(AND(ISBLANK(D32),ISBLANK(D32)),\"✖\", \"✔\")","v":"✖"}]
[null,"Number of starts",null,null,null,null,null,null,null,{"$f":"IF(AND(ISBLANK(D33),ISBLANK(D33)),\"✖\", \"✔\")","v":"✖"}]
[null,"The maximum you can request is £300,000 and the minimum is £100,000"]
[]
[null,"Section 3. supporting information"]
[]
[null,"Please provide details for each of the following questions.  We will not accept any information outside of this form. We will contact you if we require further information."]
[]
[null,"Each question has a maximum of 250 words."]
{"$rows_left_out":31}
{"sheet":"Providers","index":3,"n_rows":2019,"n_cols":5,"rows_kept":2019,"cut":false,"hidden":true,"merged":[]}
["1ST CARE TRAINING LIMITED",10046498]
["1ST2 ACHIEVE TRAINING LIMITED",10031126,null,null,"ESFA Funded Adult Education Budget (AEB)"]
["3 SPIRIT ENTERPRISE UK LIMITED",10061435,null,null,"16-18 Traineeships "]
["360 RECRUITMENT LIMITED",10061102,null,null,"19-24 traineeships"]
["5 E LTD.",10000020]
["8POINT8 TRAINING LIMITED",10057068,null,null,"Do not meet the track record criteria"]
["A R C ACADEMY UK LIMITED",10038023,null,null,"Data error"]
["A S TRAINING (INTERNATIONAL) LIMITED",10037198,null,null,"Technical error"]
["A W JENKINSON TRANSPORT LIMITED",10064431,null,null,"Exemption from auto reduction in Performance Review"]
["ABACUS TRAINING GROUP LIMITED",10035281,null,null,"Exceed the maximum growth"]
["ABBEYDALE VETLINK VETERINARY TRAINING LIMITED",10028269,null,null,"Have not met the threshold for growth"]
["ABELLIO EAST MIDLANDS LIMITED",10084402,null,null,"More than one of the above (please detail below)"]
["ABINGDON AND WITNEY COLLEGE",10000055,null,null,"I confirm I have authority"]
["ABM TRAINING (UK) LTD",10029426,null,null,"I do not have authority"]
["ABSOLUTE CARE TRAINING & EDUCATION LTD",10036227]
["ABSOLUTE HR SOLUTIONS LTD.",10061857]
["ACACIA TRAINING AND DEVELOPMENT LTD",10000060]
["ACACIA TRAINING LIMITED",10000061]
["ACADEMIES ENTERPRISE TRUST",10033736]
["ACADEMY 1 SPORTS LTD",10052799]
["ACADEMY FOR PROJECT MANAGEMENT LTD",10053076]
["ACADEMY OF PLAY AND CHILD PSYCHOTHERAPY LIMITED",10067447]
["ACADEMY TRAINING HAIR AND BEAUTY LIMITED",10046146]
["ACADEMY TRANSFORMATION TRUST",10039859]
["ACCESS SKILLS LTD",10024806]
["ACCESS TO MUSIC LIMITED",10000080]
["ACCESS TRAINING (EAST MIDLANDS) LTD",10010584]
["ACCESS TRAINING LIMITED",10009059]
["ACCIPIO LIMITED",10058012]
["ACCOUNTANCY LEARNING LTD",10042735]
["ACE TRAINING AND CONSULTANCY LIMITED",10034055]
["ACHIEVE TRAINING (STAFFORDSHIRE) LIMITED",10005250]
["ACHIEVEMENT TRAINING & SKILLS LTD",10053951]
["ACHIEVEMENT TRAINING LIMITED",10000099]
["ACHIEVING EXCELLENCE UK LTD",10023357]
["ACHIEVING FOR CHILDREN COMMUNITY INTEREST COMPANY",10047071]
["ACORN TRAINING CONSULTANTS LIMITED",10000108]
["ACORN TRAINING LTD",10023489]
["ACTIV FIRST LIMITED",10034423]
["ACTIVATE COMMUNITY AND EDUCATION SERVICES",10019237]
{"$rows_left_out":1980}
{"sheet":"Summary","index":4,"n_rows":16,"n_cols":22,"rows_kept":16,"cut":false,"hidden":true,"merged":[]}
["First time"]
["Provider Name","UKPRN","Request type","Funding stream","Do you currently hold an ESFA funded AEB allocation?","Is this request for direct delivery or subcontracted?","Value","Volume","Q1","Q2","Q3","Q4","Name","Position in Organisation","Date of Request","Authority"]
[{"$f":"#REF!","v":{"$error":"#REF!"}},{"$f":"#REF!","v":{"$error":"#REF!"}},{"$f":"#REF!","v":{"$error":"#REF!"}},{"$f":"#REF!","v":{"$error":"#REF!"}},{"$f":"'Request Form'!H19","v":0},{"$f":"'Request Form'!H26","v":0},{"$f":"'Request Form'!D32","v":0},{"$f":"'Request Form'!D33","v":0},{"$f":"'Request Form'!B44","v":0},{"$f":"'Request Form'!B48","v":0},{"$f":"'Request Form'!B52","v":0},{"$f":"'Request Form'!B56","v":0},{"$f":"'Request Form'!C64","v":0},{"$f":"'Request Form'!C66","v":0},{"$f":"'Request Form'!C68","v":"00:00:00"},{"$f":"'Request Form'!J62","v":"✖"}]
[]
[]
[]
[]
["Top Up"]
["Provider Name","UKPRN","Request type","Funding stream","Do you currently hold an ESFA funded AEB allocation?","Is this request for direct delivery or subcontracted?","Current Value £","Request £","New Value £","Volume","Q1","Q2","Q3","Q4","Name","Position in Organisation","Date of Request","Authority"]
[{"$f":"#REF!","v":{"$error":"#REF!"}},{"$f":"#REF!","v":{"$error":"#REF!"}},{"$f":"#REF!","v":{"$error":"#REF!"}},{"$f":"#REF!","v":{"$error":"#REF!"}},{"$f":"#REF!","v":{"$error":"#REF!"}},{"$f":"#REF!","v":{"$error":"#REF!"}},{"$f":"#REF!","v":{"$error":"#REF!"}},{"$f":"#REF!","v":{"$error":"#REF!"}},{"$f":"#REF!","v":{"$error":"#REF!"}},{"$f":"#REF!","v":{"$error":"#REF!"}},{"$f":"#REF!","v":{"$error":"#REF!"}},{"$f":"#REF!","v":{"$error":"#REF!"}},{"$f":"#REF!","v":{"$error":"#REF!"}},{"$f":"#REF!","v":{"$error":"#REF!"}},{"$f":"#REF!","v":{"$error":"#REF!"}},{"$f":"#REF!","v":{"$error":"#REF!"}},{"$f":"#REF!","v":{"$error":"#REF!"}},{"$f":"#REF!","v":{"$error":"#REF!"}}]
[]
[]
[]
["16-18 Traineeships"]
["Provider Name","UKPRN","Funding stream","Do you currently hold an ESFA contract or funding agreement to deliver in 2021/22?","Do you have a 19 to 24 (procured) 2021/22 traineeship contract?","Do you currently have a contract to deliver 16-19 Study Programme or 16-18 standalone traineeship activity?","What is your current Ofsted grade?","What is the your latest financial health grade assessed by the ESFA?","Have you been issued with a notice to improve or do you have contractual obligations prohibiting you from growth?","Have you been subject to an investigation for breach of contract and/or failed audit in the past 3 years?","Is this request for direct delivery or through a subcontract?","Request","Volume","Q1","Q2","Q3","Q4","Name","Position in Organisation","Date of Request","emails","Authority"]
[{"$f":"'Request Form'!$C$9","v":0},{"$f":"'Request Form'!$C$11","v":""},{"$f":"'Request Form'!$D$18","v":"16-18 Traineeships (Only)"},{"$f":"'Request Form'!H19","v":0},{"$f":"'Request Form'!H20","v":0},{"$f":"'Request Form'!H21","v":0},{"$f":"'Request Form'!H22","v":0},{"$f":"'Request Form'!H23","v":0},{"$f":"'Request Form'!H24","v":0},{"$f":"'Request Form'!H25","v":0},{"$f":"'Request Form'!H26","v":0},{"$f":"'Request Form'!D32","v":0},{"$f":"'Request Form'!D33","v":0},{"$f":"'Request Form'!B44","v":0},{"$f":"'Request Form'!B48","v":0},{"$f":"'Request Form'!B52","v":0},{"$f":"'Request Form'!B56","v":0},{"$f":"'Request Form'!C64","v":0},{"$f":"'Request Form'!C66","v":0},{"$f":"'Request Form'!C68","v":"00:00:00"},{"$f":"'Request Form'!C70","v":0},{"$f":"'Request Form'!H62","v":0}]