﻿Application Source,Representedresented Status,Final Decision,Scheme,Gender,Age,Main Injury,Rejection Reason,First Decision,Review Decision,Appeal Decision,Value of Award,Days to First Decision
On-line application,Represented,Full Award,2012 Scheme,Male,23,BLUR/DOUBLE VISION MODERATE,,Full Award,Full Award,,6800,1627
On-line application,,Full Award,2012 Scheme,Male,38,BLUR/DOUBLE VISION MODERATE,,Full Award,,,6920,290
On-line application,Represented,Full Award,2012 Scheme,Male,40,BLUR/DOUBLE VISION MODERATE,,Full Award,Full Award,Full Award,7475,435
On-line application,Represented,Full Award,2012 Scheme,Male,42,BLUR/DOUBLE VISION MODERATE,,Full Award,Full Award,Full Award,8420,504
On-line application,Represented,Full Award,2012 Scheme,Male,64,BLUR/DOUBLE VISION MODERATE,,Full Award,Full Award,,6875,619
On-line application,,Full Award,2012 Scheme,Male,40,BLUR/DOUBLE VISION MODERATE,,Full Award,Full Award,Full Award,6650,384
On-line application,,Full Award,2012 Scheme,Male,53,BLUR/DOUBLE VISION MODERATE,,Full Award,,,7020,968
On-line application,,Full Award,2012 Scheme,Male,23,BLUR/DOUBLE VISION MODERATE,,Full Award,,,6200,819
On-line application,,Full Award,2012 Scheme,Male,54,BLUR/DOUBLE VISION MODERATE,,Full Award,,,7145,280
On-line application,,Full Award,2012 Scheme,Male,47,BLUR/DOUBLE VISION SLIGHT,,Full Award,Full Award,,3345,321
On-line application,,Full Award,2012 Scheme,Male,35,BLUR/DOUBLE VISION SLIGHT,,Full Award,,,3345,743
On-line application,Represented,Full Award,2012 Scheme,Male,25,BLUR/DOUBLE VISION SLIGHT,,Full Award,Full Award,Full Award,3345,462
On-line application,,Full Award,2012 Scheme,Male,60,BLUR/DOUBLE VISION SLIGHT,,Full Award,,,2850,289
On-line application,,Full Award,2012 Scheme,Female,24,BLUR/DOUBLE VISION SLIGHT,,Full Award,,,2700,293
On-line application,Represented,Full Award,2012 Scheme,Male,24,BLUR/DOUBLE VISION SLIGHT,,Full Award,,,3270,348
On-line application,,Full Award,2012 Scheme,Male,30,BLUR/DOUBLE VISION SLIGHT,,Full Award,,,2400,1189
On-line application,,Full Award,2012 Scheme,Male,20,BLUR/DOUBLE VISION SLIGHT,,Full Award,,,3120,365
On-line application,Represented,Full Award,2012 Scheme,Male,44,BLUR/DOUBLE VISION SLIGHT,,Full Award,,,2400,387
On-line application,,Full Award,2012 Scheme,Male,49,BLUR/DOUBLE VISION SLIGHT,,Full Award,,,2700,696
On-line application,,Full Award,2012 Scheme,Male,40,BLUR/DOUBLE VISION SLIGHT,,Full Award,,,2850,701
On-line application,,Full Award,2012 Scheme,Male,26,BLUR/DOUBLE VISION SLIGHT,,Full Award,Full Award,,3120,324
On-line application,,Full Award,2012 Scheme,Female,21,BLUR/DOUBLE VISION SLIGHT,,Full Award,,,3120,325
On-line application,Represented,Full Award,2012 Scheme,Male,45,BLUR/DOUBLE VISION SLIGHT,,Nil Award,Full Award,,3345,179
On-line application,,Full Award,2012 Scheme,Male,52,BLUR/DOUBLE VISION SLIGHT,,Full Award,,,3345,591
On-line application,,Full Award,2012 Scheme,Male,46,BLUR/DOUBLE VISION SLIGHT,,Full Award,,,350,642
On-line application,Represented,Reduced Award,2012 Scheme,Male,46,BLUR/DOUBLE VISION SLIGHT,"Conduct before, during or after the incident",Reduced Award,,,2379.5,847
On-line application,Represented,Full Award,2012 Scheme,Male,39,BLUR/DOUBLE VISION SLIGHT,,Full Award,Full Award,,3025,1361
On-line application,Represented,Full Award,2012 Scheme,Female,29,BLUR/DOUBLE VISION SLIGHT,,Full Award,,,3345,368
On-line application,Represented,Full Award,2012 Scheme,Male,26,BLUR/DOUBLE VISION SLIGHT,,Full Award,,,3070,344
On-line application,,Full Award,2012 Scheme,Male,25,BLUR/DOUBLE VISION SLIGHT,,Full Award,,,3070,338
On-line application,,Full Award,2012 Scheme,Female,30,BLUR/DOUBLE VISION SLIGHT,,Full Award,,,2700,257
On-line application,,Full Award,2012 Scheme,Male,57,BLUR/DOUBLE VISION SLIGHT,,Full Award,Full Award,,3075,295
On-line application,Represented,Full Award,2012 Scheme,Male,38,BLUR/DOUBLE VISION SLIGHT,,Full Award,,,3120,519
On-line application,,Full Award,2012 Scheme,Male,50,BLUR/DOUBLE VISION SLIGHT,,Nil Award,Full Award,,3390,6
On-line application,,Full Award,2012 Scheme,Male,36,BLUR/DOUBLE VISION SLIGHT,,Full Award,,,3120,188
On-line application,,Full Award,2012 Scheme,Male,45,BLUR/DOUBLE VISION SLIGHT,,Full Award,,,2700,186
On-line application,Represented,Full Award,2012 Scheme,Male,37,BLUR/DOUBLE VISION SLIGHT,,Full Award,,,1900,657
On-line application,,Full Award,2012 Scheme,Male,23,BLUR/DOUBLE VISION SLIGHT,,Full Award,Full Award,,3345,309
On-line application,,Full Award,2012 Scheme,Male,41,BLUR/DOUBLE VISION SLIGHT,,Full Award,,,3270,908
On-line application,,Full Award,2012 Scheme,Male,49,BLUR/DOUBLE VISION SLIGHT,,Full Award,Full Award,,3345,707
On-line application,,Full Award,2012 Scheme,Male,35,BLUR/DOUBLE VISION SLIGHT,,Full Award,,,3075,495
On-line application,,Full Award,2012 Scheme,Male,36,BLUR/DOUBLE VISION SLIGHT,,Full Award,,,2845,1103
On-line application,,Full Award,2012 Scheme,Male,26,BLUR/DOUBLE VISION SLIGHT,,Full Award,,,2850,184
On-line application,,Full Award,2012 Scheme,Male,48,BLUR/DOUBLE VISION SLIGHT,,Full Award,,,3075,436
On-line application,Represented,Full Award,2012 Scheme,Male,37,BLUR/DOUBLE VISION SLIGHT,,Full Award,,,3390,293
On-line application,Represented,Full Award,2012 Scheme,Male,48,BLUR/DOUBLE VISION SLIGHT,,Full Award,,,3345,596
On-line application,Represented,Full Award,2012 Scheme,Male,48,BLUR/DOUBLE VISION SLIGHT,,Full Award,,,3270,184
On-line application,,Full Award,2012 Scheme,Female,37,BLUR/DOUBLE VISION SLIGHT,,Full Award,,,3075,1267
On-line application,Represented,Full Award,2012 Scheme,Not recorded,38,BLUR/DOUBLE VISION SLIGHT,,Full Award,,,3345,768
On-line application,,Full Award,2012 Scheme,Male,24,BLUR/DOUBLE VISION SLIGHT,,Full Award,,,3270,353
On-line application,,Full Award,2012 Scheme,Male,28,BLUR/DOUBLE VISION SLIGHT,,Full Award,,,2945,1909
Telephone application,Represented,Full Award,2001 Scheme,Male,41,BRAIN DAMAGE MODERATE,,Full Award,,,4709,5196
On-line application,Represented,Reduced Award,2012 Scheme,Male,21,BURNS FACE MODERATE,Applicants criminal record/character,Reduced Award,Reduced Award,,2748,687
On-line application,,Full Award,2012 Scheme,Male,52,BURNS FACE MODERATE,,Full Award,Full Award,,3500,389
On-line application,Represented,Full Award,2012 Scheme,Female,38,BURNS FACE MODERATE,,Full Award,,,3500,465
On-line application,,Full Award,2012 Scheme,Male,14,BURNS FACE MODERATE,,Full Award,,,3500,240
On-line application,Represented,Full Award,2012 Scheme,Male,37,BURNS FACE MODERATE,,Full Award,,,4220,299
On-line application,,Full Award,2012 Scheme,Female,43,BURNS FACE MODERATE,,Full Award,,,3500,372
On-line application,Represented,Full Award,2012 Scheme,Male,22,CLICKING JAW PERMANENT,,Full Award,,,4040,469
On-line application,Represented,Full Award,2012 Scheme,Male,29,CLICKING JAW PERMANENT,,Full Award,,,4190,770
On-line application,,Full Award,2012 Scheme,Male,46,CLICKING JAW PERMANENT,,Full Award,Full Award,,4265,392
On-line application,,Full Award,2012 Scheme,Male,23,CLICKING JAW PERMANENT,,Nil Award,Full Award,,3500,334
On-line application,,Full Award,2012 Scheme,Male,64,CLICKING JAW PERMANENT,,Full Award,Full Award,Full Award,3290,1028
On-line application,Represented,Full Award,2012 Scheme,Male,54,CLICKING JAW PERMANENT,,Full Award,,,3750,380
On-line application,,Full Award,2012 Scheme,Male,34,CLICKING JAW PERMANENT,,Full Award,,,3500,662
On-line application,,Full Award,2012 Scheme,Male,22,CLICKING JAW PERMANENT,,Full Award,,,3950,623
On-line application,,Full Award,2012 Scheme,Male,31,CLICKING JAW PERMANENT,,Full Award,Full Award,,3800,311
On-line application,,Full Award,2012 Scheme,Male,18,CLICKING JAW PERMANENT,,Full Award,,,4265,230
On-line application,Represented,Full Award,2012 Scheme,Male,21,CLICKING JAW PERMANENT,,Full Award,Full Award,,3490,370
On-line application,,Full Award,2012 Scheme,Male,27,CLICKING JAW PERMANENT,,Full Award,,,3950,1723
On-line application,,Full Award,2012 Scheme,Male,27,CLICKING JAW PERMANENT,,Full Award,,,3250,1614
On-line application,,Full Award,2012 Scheme,Male,24,CLICKING JAW PERMANENT,,Full Award,,,4265,352
On-line application,Represented,Full Award,2012 Scheme,Male,43,CLICKING JAW PERMANENT,,Full Award,,,4220,1763
On-line application,,Full Award,2012 Scheme,Male,34,CLICKING JAW PERMANENT,,Full Award,,,4040,667
On-line application,,Full Award,2012 Scheme,Male,24,CLICKING JAW PERMANENT,,Reduced Award,Full Award,,2040,458
On-line application,Represented,Full Award,2012 Scheme,Male,44,CLICKING JAW PERMANENT,,Full Award,,,4265,335
On-line application,,Full Award,2012 Scheme,Male,43,CLICKING JAW PERMANENT,,Full Award,Full Award,,4175,138
On-line application,Represented,Full Award,2012 Scheme,Male,37,CLICKING JAW PERMANENT,,Nil Award,Full Award,,4370,673
On-line application,,Full Award,2012 Scheme,Male,18,CLICKING JAW PERMANENT,,Full Award,,,3500,915
On-line application,,Full Award,2012 Scheme,Male,35,CLICKING JAW PERMANENT,,Full Award,,,4100,497
On-line application,Represented,Full Award,2012 Scheme,Male,33,CLICKING JAW PERMANENT,,Full Award,Full Award,,4040,455
On-line application,,Full Award,2012 Scheme,Female,42,CLICKING JAW PERMANENT,,Nil Award,Full Award,,3950,221
On-line application,Represented,Full Award,2012 Scheme,Male,21,CLICKING JAW PERMANENT,,Full Award,Full Award,,4226,1517
On-line application,,Full Award,2012 Scheme,Male,29,CLICKING JAW PERMANENT,,Full Award,,,3500,1234
On-line application,,Full Award,2012 Scheme,Male,15,CLICKING JAW PERMANENT,,Full Award,,,4100,901
On-line application,Represented,Full Award,2012 Scheme,Male,30,CLICKING JAW PERMANENT,,Full Award,Full Award,,4580,575
On-line application,,Full Award,2012 Scheme,Male,24,CLICKING JAW PERMANENT,,Full Award,,,3990,26
On-line application,,Full Award,2012 Scheme,Male,47,CLICKING JAW PERMANENT,,Full Award,,,3500,21
On-line application,,Full Award,2012 Scheme,Male,35,CLICKING JAW PERMANENT,,Full Award,,,4445,236
On-line application,,Full Award,2012 Scheme,Male,23,CLICKING JAW PERMANENT,,Full Award,,,4175,935
On-line application,Represented,Full Award,2012 Scheme,Male,25,CLICKING JAW PERMANENT,,Nil Award,Full Award,,1702,602
On-line application,Represented,Full Award,2012 Scheme,Male,31,COLLAPSED LUNG,,Full Award,,,2100,307
On-line application,,Full Award,2012 Scheme,Male,33,COLLAPSED LUNG,,Full Award,Full Award,,2100,289
On-line application,,Full Award,2012 Scheme,Male,19,COLLAPSED LUNG,,Full Award,Full Award,,2250,253
On-line application,Represented,Full Award,2012 Scheme,Male,23,COLLAPSED LUNG,,Full Award,,,2250,322
On-line application,Represented,Full Award,2012 Scheme,Male,48,COLLAPSED LUNG,,Nil Award,Full Award,,2250,407
On-line application,,Full Award,2012 Scheme,Male,31,COLLAPSED LUNG,,Full Award,,,1800,190
On-line application,Represented,Full Award,2012 Scheme,Female,26,COLLAPSED LUNG,,Full Award,,,1800,322
On-line application,,Full Award,2012 Scheme,Male,58,COLLAPSED LUNG,,Full Award,,,2053.2,336
On-line application,,Full Award,2012 Scheme,Male,18,COLLAPSED LUNG,,Full Award,,,2250,360
On-line application,Represented,Full Award,2012 Scheme,Male,36,COLLAPSED LUNG,,Full Award,,,1800,527
On-line application,,Full Award,2012 Scheme,Male,50,COLLAPSED LUNG,,Full Award,,,2250,561
On-line application,Represented,Full Award,2012 Scheme,Male,53,COLLAPSED LUNG,,Full Award,,,2075,544
On-line application,,Full Award,2012 Scheme,Male,19,COLLAPSED LUNG,,Full Award,Full Award,,1800,254
On-line application,,Full Award,2012 Scheme,Male,15,COLLAPSED LUNG,,Full Award,,,2100,329
On-line application,,Full Award,2012 Scheme,Male,16,COLLAPSED LUNG,,Full Award,,,1800,674
On-line application,,Full Award,2012 Scheme,Male,42,COLLAPSED LUNG,,Full Award,,,1750,207
On-line application,,Full Award,2012 Scheme,Male,70,COLLAPSED LUNG,,Full Award,,,1800,172
On-line application,,Full Award,2012 Scheme,Male,68,COLLAPSED LUNG,,Full Award,,,2250,315
On-line application,Represented,Full Award,2012 Scheme,Female,35,COLLAPSED LUNG,,Full Award,,,1550,227
On-line application,,Full Award,2012 Scheme,Male,71,COLLAPSED LUNG,,Full Award,,,1800,88
On-line application,Represented,Full Award,2012 Scheme,Male,76,COLLAPSED LUNG,,Full Award,,,1800,192
On-line application,Represented,Full Award,2012 Scheme,Male,28,COLLAPSED LUNG,,Full Award,,,2100,687
On-line application,,Full Award,2012 Scheme,Female,44,COLLAPSED LUNG,,Full Award,,,2100,337
On-line application,,Full Award,2012 Scheme,Male,16,COLLAPSED LUNG,,Full Award,,,2250,341
On-line application,,Full Award,2012 Scheme,Male,21,COLLAPSED LUNG,,Full Award,,,2250,366
On-line application,,Reduced Award,2012 Scheme,Male,32,COLLAPSED LUNG,Multiple,Reduced Award,,,1155,376
On-line application,Represented,Full Award,2012 Scheme,Male,49,COLLAPSED LUNG,,Full Award,,,1800,183
On-line application,Represented,Full Award,2012 Scheme,Male,42,COLLAPSED LUNG,,Full Award,,,1800,244
On-line application,,Full Award,2012 Scheme,Male,22,COLLAPSED LUNG,,Full Award,,,2100,365
On-line application,Represented,Full Award,2012 Scheme,Male,26,COLLAPSED LUNG,,Full Award,,,2340,163
On-line application,,Full Award,2012 Scheme,Male,17,COLLAPSED LUNG,,Full Award,,,2100,363
On-line application,,Full Award,2012 Scheme,Male,49,COLLAPSED LUNG,,Full Award,,,2100,341
On-line application,Represented,Full Award,2012 Scheme,Male,21,COLLAPSED LUNG,,Full Award,,,1800,523
On-line application,,Full Award,2012 Scheme,Male,26,COLLAPSED LUNG,,Full Award,,,2490,365
On-line application,Represented,Full Award,2012 Scheme,Male,51,COLLAPSED LUNG,,Full Award,,,2100,213
On-line application,,Full Award,2012 Scheme,Male,55,COLLAPSED LUNG,,Full Award,,,1761,188
On-line application,Represented,Full Award,2012 Scheme,Male,18,COLLAPSED LUNG,,Full Award,,,2250,984
On-line application,,Reduced Award,2012 Scheme,Male,23,COLLAPSED LUNG,Applicants criminal record/character,Reduced Award,,,1800,1014
On-line application,Represented,Full Award,2012 Scheme,Female,36,COLLAPSED LUNG,,Full Award,,,2050,510
On-line application,,Full Award,2012 Scheme,Male,57,COLLAPSED LUNG,,Full Award,,,1780,620
On-line application,Represented,Full Award,2012 Scheme,Male,16,COLLAPSED LUNG,,Full Award,,,2100,245
On-line application,Represented,Full Award,2012 Scheme,Female,32,COLLAPSED LUNG,,Full Award,,,2400,709
On-line application,,Full Award,2012 Scheme,Male,34,COLLAPSED LUNG,,Full Award,,,2100,337
On-line application,,Full Award,2012 Scheme,Male,40,COLLAPSED LUNG,,Full Award,,,2250,326
On-line application,Represented,Full Award,2012 Scheme,Male,28,COLLAPSED LUNG,,Full Award,,,1750,305
On-line application,Represented,Full Award,2012 Scheme,Male,28,COLLAPSED LUNG,,Full Award,,,2100,260
On-line application,,Reduced Award,2012 Scheme,Male,32,COLLAPSED LUNG,Applicants criminal record/character,Reduced Award,,,1260,350
On-line application,,Full Award,2012 Scheme,Male,20,COLLAPSED LUNG,,Full Award,,,2100,774
On-line application,,Full Award,2012 Scheme,Male,32,COLLAPSED LUNG,,Full Award,,,2100,308
On-line application,,Full Award,2012 Scheme,Male,58,COLLAPSED LUNG,,Full Award,,,2490,165
On-line application,,Full Award,2012 Scheme,Male,24,COLLAPSED LUNG,,Full Award,,,2200,1133
On-line application,Represented,Full Award,2012 Scheme,Male,18,COLLAPSED LUNG,,Full Award,,,2100,883
On-line application,,Full Award,2012 Scheme,Male,20,COLLAPSED LUNG,,Full Award,,,2250,230
On-line application,,Full Award,2012 Scheme,Male,57,COLLAPSED LUNG,,Full Award,,,2100,360
On-line application,,Full Award,2012 Scheme,Male,74,COLLAPSED LUNG,,Full Award,,,1800,136
On-line application,,Full Award,2012 Scheme,Male,39,COLLAPSED LUNG,,Full Award,Full Award,,2100,10
On-line application,Represented,Full Award,2012 Scheme,Male,23,COLLAPSED LUNG,,Full Award,,,2100,366
On-line application,,Full Award,2012 Scheme,Male,32,COLLAPSED LUNGS,,Full Award,,,7145,1630
On-line application,,Full Award,2012 Scheme,Female,36,COLLAPSED LUNGS,,Full Award,Full Award,,29582,451
On-line application,Represented,Full Award,2012 Scheme,Male,21,COLLAPSED LUNGS,,Full Award,Full Award,,8160,363
On-line application,,Full Award,2012 Scheme,Male,46,COLLAPSED LUNGS,,Full Award,,,8210,959
On-line application,Represented,Full Award,2012 Scheme,Male,32,COLLAPSED LUNGS,,Full Award,Full Award,,8160,421
On-line application,,Full Award,2012 Scheme,Female,63,COLLAPSED LUNGS,,Full Award,,,11467,631
On-line application,,Full Award,2012 Scheme,Male,49,COLLAPSED LUNGS,,Full Award,,,5980,324
On-line application,Represented,Full Award,2012 Scheme,Male,30,DAMAGE TOOTH/TEETH REQ CROWNS,,Full Award,,,960,405
On-line application,,Full Award,2012 Scheme,Female,35,DAMAGE TOOTH/TEETH REQ CROWNS,,Full Award,,,1000,359
On-line application,Represented,Full Award,2012 Scheme,Female,26,DAMAGE TOOTH/TEETH REQ CROWNS,,Full Award,,,1000,16
On-line application,Represented,Full Award,2012 Scheme,Male,34,DAMAGE TOOTH/TEETH REQ CROWNS,,Full Award,,,1000,205
On-line application,,Full Award,2012 Scheme,Male,20,DAMAGE TOOTH/TEETH REQ CROWNS,,Full Award,,,1000,758
On-line application,,Full Award,2012 Scheme,Male,38,DAMAGE TOOTH/TEETH REQ CROWNS,,Full Award,,,1000,292
On-line application,,Full Award,2012 Scheme,Male,40,DAMAGE TOOTH/TEETH REQ CROWNS,,Full Award,Full Award,,1000,163
On-line application,,Full Award,2012 Scheme,Male,27,DAMAGE TOOTH/TEETH REQ CROWNS,,Full Award,,,1000,186
On-line application,Represented,Full Award,2012 Scheme,Male,20,DAMAGE TOOTH/TEETH REQ CROWNS,,Nil Award,Full Award,,1000,323
On-line application,,Full Award,2012 Scheme,Male,20,DAMAGE TOOTH/TEETH REQ CROWNS,,Full Award,,,1000,476
On-line application,,Full Award,2012 Scheme,Male,52,DAMAGE TOOTH/TEETH REQ CROWNS,,Full Award,,,1000,493
On-line application,Represented,Full Award,2012 Scheme,Male,20,DAMAGE TOOTH/TEETH REQ CROWNS,,Full Award,,,1000,1003
On-line application,,Full Award,2012 Scheme,Male,51,DAMAGE TOOTH/TEETH REQ CROWNS,,Full Award,Full Award,,1000,1166
On-line application,,Full Award,2012 Scheme,Female,55,DAMAGE TOOTH/TEETH REQ CROWNS,,Full Award,,,950,692
On-line application,,Full Award,2012 Scheme,Male,28,DAMAGE TOOTH/TEETH REQ CROWNS,,Full Award,,,1000,542
On-line application,,Full Award,2012 Scheme,Male,22,DAMAGE TOOTH/TEETH REQ CROWNS,,Full Award,,,1000,148
On-line application,Represented,Full Award,2012 Scheme,Female,20,DAMAGE TOOTH/TEETH REQ CROWNS,,Full Award,,,1000,300
On-line application,,Full Award,2012 Scheme,Male,21,DAMAGE TOOTH/TEETH REQ CROWNS,,Full Award,,,1000,291
On-line application,Represented,Full Award,2012 Scheme,Male,30,DAMAGE TOOTH/TEETH REQ CROWNS,,Full Award,,,1000,367
On-line application,,Full Award,2012 Scheme,Male,32,DAMAGE TOOTH/TEETH REQ CROWNS,,Full Award,,,1000,369
On-line application,,Full Award,2012 Scheme,Female,21,DAMAGE TOOTH/TEETH REQ CROWNS,,Full Award,,,800,316
On-line application,,Full Award,2012 Scheme,Male,48,DAMAGE TOOTH/TEETH REQ CROWNS,,Full Award,,,600,179
On-line application,,Full Award,2012 Scheme,Male,19,DAMAGE TOOTH/TEETH REQ CROWNS,,Nil Award,Full Award,Full Award,1000,20
On-line application,,Full Award,2012 Scheme,Male,24,DAMAGE TOOTH/TEETH REQ CROWNS,,Nil Award,Full Award,,1000,143
On-line application,,Reduced Award,2008 Scheme,Male,54,DAMAGE TOOTH/TEETH REQ CROWNS,Applicants criminal record/character,Nil Award,Nil Award,Reduced Award,2015,107
On-line application,,Full Award,2012 Scheme,Female,19,DAMAGE TOOTH/TEETH REQ CROWNS,,Full Award,,,1000,329
On-line application,,Full Award,2012 Scheme,Male,20,DAMAGE TOOTH/TEETH REQ CROWNS,,Full Award,,,1000,163
On-line application,,Full Award,2012 Scheme,Female,28,DAMAGE TOOTH/TEETH REQ CROWNS,,Full Award,,,1000,568
On-line application,,Full Award,2012 Scheme,Male,22,DAMAGE TOOTH/TEETH REQ CROWNS,,Full Award,,,1000,292
On-line application,,Full Award,2012 Scheme,Male,21,DAMAGE TOOTH/TEETH REQ CROWNS,,Full Award,,,1000,925
On-line application,,Full Award,2012 Scheme,Male,24,DAMAGE TOOTH/TEETH REQ CROWNS,,Full Award,,,1000,318
On-line application,,Full Award,2012 Scheme,Male,23,DAMAGE TOOTH/TEETH REQ CROWNS,,Full Award,,,1000,387
On-line application,Represented,Full Award,2012 Scheme,Male,18,DAMAGE TOOTH/TEETH REQ CROWNS,,Full Award,,,1000,397
On-line application,,Full Award,2012 Scheme,Male,26,DAMAGE TOOTH/TEETH REQ CROWNS,,Full Award,,,1000,390
On-line application,Represented,Full Award,2012 Scheme,Male,20,DAMAGE TOOTH/TEETH REQ CROWNS,,Full Award,,,950,175
On-line application,Represented,Full Award,2012 Scheme,Male,16,DAMAGE TOOTH/TEETH REQ CROWNS,,Full Award,Full Award,Full Award,975,568
On-line application,Represented,Full Award,2012 Scheme,Male,20,DAMAGE TOOTH/TEETH REQ CROWNS,,Full Award,,,1000,314
On-line application,Represented,Full Award,2012 Scheme,Male,21,DETACHED RETINA ONE EYE,,Nil Award,Full Award,,4370,1338
On-line application,,Full Award,2012 Scheme,Male,42,DETACHED RETINA ONE EYE,,Full Award,,,4100,1402
On-line application,,Full Award,2012 Scheme,Male,40,DETACHED RETINA ONE EYE,,Full Award,,,3500,1280
On-line application,Represented,Full Award,2012 Scheme,Male,46,DETACHED RETINA ONE EYE,,Full Award,,,3750,534
On-line application,Represented,Full Award,2012 Scheme,Male,42,DETACHED RETINA ONE EYE,,Full Award,,,3800,357
On-line application,,Full Award,2012 Scheme,Male,50,DETACHED RETINA ONE EYE,,Full Award,,,4445,365
On-line application,Represented,Full Award,2012 Scheme,Male,17,DETACHED RETINA ONE EYE,,Full Award,,,4100,376
On-line application,Represented,Full Award,2012 Scheme,Male,15,DETACHED RETINA ONE EYE,,Full Award,,,3500,277
On-line application,,Full Award,2012 Scheme,Male,55,DETACHED RETINA ONE EYE,,Full Award,,,4175,278
On-line application,,Full Award,2012 Scheme,Male,28,DIS/FRAC ELBOW SUBSTANTIAL REC,,Full Award,,,1500,327
On-line application,,Full Award,2012 Scheme,Male,25,DIS/FRAC ELBOW SUBSTANTIAL REC,,Full Award,,,1500,469
On-line application,Represented,Full Award,2012 Scheme,Male,41,DIS/FRAC ELBOW SUBSTANTIAL REC,,Full Award,,,1500,175
On-line application,Represented,Reduced Award,2012 Scheme,Male,44,DIS/FRAC ELBOW SUBSTANTIAL REC,Applicants criminal record/character,Reduced Award,,,900,1513
On-line application,,Full Award,2012 Scheme,Male,75,DIS/FRAC ELBOW SUBSTANTIAL REC,,Full Award,,,1500,225
On-line application,,Full Award,2012 Scheme,Female,70,DIS/FRAC ELBOW SUBSTANTIAL REC,,Full Award,,,1500,116
On-line application,,Full Award,2012 Scheme,Male,28,DIS/FRAC ELBOW SUBSTANTIAL REC,,Full Award,,,1500,327
On-line application,,Full Award,2012 Scheme,Male,42,DIS/FRAC ELBOW SUBSTANTIAL REC,,Full Award,,,1500,256
On-line application,,Full Award,2012 Scheme,Female,37,DIS/FRAC ELBOW SUBSTANTIAL REC,,Full Award,,,1650,466
On-line application,,Full Award,2012 Scheme,Female,73,DIS/FRAC ELBOW SUBSTANTIAL REC,,Full Award,,,1500,92
On-line application,Represented,Full Award,2012 Scheme,Not recorded,63,DIS/FRAC ELBOW SUBSTANTIAL REC,,Full Award,,,1950,799
On-line application,,Full Award,2012 Scheme,Male,57,DIS/FRAC ELBOW SUBSTANTIAL REC,,Full Award,Full Award,Full Award,1950,386
On-line application,,Full Award,2012 Scheme,Male,67,DIS/FRAC ELBOW SUBSTANTIAL REC,,Full Award,,,1500,275
On-line application,Represented,Full Award,2012 Scheme,Male,27,DIS/FRAC ELBOW SUBSTANTIAL REC,,Full Award,Full Award,,1500,209
On-line application,Represented,Full Award,2012 Scheme,Male,53,DIS/FRAC ELBOW SUBSTANTIAL REC,,Full Award,,,1500,1548
On-line application,,Full Award,2012 Scheme,Male,49,DIS/FRAC ELBOW SUBSTANTIAL REC,,Full Award,,,1500,140
On-line application,,Full Award,2012 Scheme,Male,43,DIS/FRAC ELBOW SUBSTANTIAL REC,,Full Award,,,1100,221
On-line application,,Full Award,2012 Scheme,Male,24,DIS/FRAC ELBOW SUBSTANTIAL REC,,Full Award,,,1500,339
On-line application,,Full Award,2012 Scheme,Male,26,DIS/FRAC ELBOW SUBSTANTIAL REC,,Full Award,,,1500,154
On-line application,,Full Award,2012 Scheme,Male,67,DIS/FRAC ELBOW SUBSTANTIAL REC,,Full Award,,,1500,211