﻿Application Source,Represented Status,Final Award Decision,Scheme,Gender,Age,Main Injury,Rejection Reason,First Decision,Review Decision,Appeal Decision,Value of Award,Days to First Decision
On-line application,,Reduced Award,2012 Scheme,Male,28,BLUR/DOUBLE VISION MODERATE,Applicants criminal record/character,Reduced Award,Reduced Award,Reduced Award,7244.5,188
On-line application,,Full Award,2012 Scheme,Male,62,BLUR/DOUBLE VISION MODERATE,,Full Award,,,7145,343
On-line application,Represented,Full Award,2012 Scheme,Male,33,BLUR/DOUBLE VISION MODERATE,,Full Award,Full Award,Full Award,6895,1427
On-line application,,Full Award,2012 Scheme,Female,37,BLUR/DOUBLE VISION MODERATE,,Full Award,,,6500,461
On-line application,Represented,Full Award,2012 Scheme,Male,34,BLUR/DOUBLE VISION MODERATE,,Full Award,,,6450,417
On-line application,,Full Award,2012 Scheme,Male,88,BLUR/DOUBLE VISION MODERATE,,Full Award,Full Award,Full Award,6100,351
On-line application,Represented,Full Award,2012 Scheme,Male,25,BLUR/DOUBLE VISION MODERATE,,Full Award,Full Award,,7145,287
On-line application,Represented,Full Award,2012 Scheme,Male,21,BLUR/DOUBLE VISION MODERATE,,Nil Award,Full Award,Full Award,6150,60
On-line application,,Full Award,2012 Scheme,Male,30,BLUR/DOUBLE VISION MODERATE,,Full Award,,,6920,405
On-line application,,Full Award,2012 Scheme,Male,43,BLUR/DOUBLE VISION MODERATE,,Full Award,,,6650,657
On-line application,Represented,Full Award,2012 Scheme,Male,30,BLUR/DOUBLE VISION MODERATE,,Full Award,,,7250,1083
On-line application,Represented,Full Award,2012 Scheme,Male,52,BLUR/DOUBLE VISION MODERATE,,Full Award,,,6650,596
On-line application,,Full Award,2012 Scheme,Male,33,BLUR/DOUBLE VISION SLIGHT,,Full Award,,,2700,472
On-line application,Represented,Full Award,2012 Scheme,Male,57,qh,,Full Award,,,2400,734
On-line application,,Full Award,2012 Scheme,Male,41,BLUR/DOUBLE VISION SLIGHT,,Full Award,,,3120,1061
On-line application,,Full Award,2012 Scheme,Female,25,BLUR/DOUBLE VISION SLIGHT,,Full Award,,,3270,412
On-line application,,Full Award,2012 Scheme,Male,32,BLUR/DOUBLE VISION SLIGHT,,Full Award,Full Award,,3120,342
On-line application,,Full Award,2012 Scheme,Female,38,BLUR/DOUBLE VISION SLIGHT,,Full Award,,,2850,355
On-line application,,Reduced Award,2012 Scheme,Male,29,BLUR/DOUBLE VISION SLIGHT,"Conduct before, during or after the incident",Nil Award,Reduced Award,,2034,340
On-line application,,Full Award,2012 Scheme,Male,20,BLUR/DOUBLE VISION SLIGHT,,Full Award,Full Award,,3000,736
On-line application,,Full Award,2012 Scheme,Male,28,BLUR/DOUBLE VISION SLIGHT,,Full Award,Full Award,,3345,545
On-line application,Represented,Full Award,2012 Scheme,Male,38,BLUR/DOUBLE VISION SLIGHT,,Full Award,Full Award,,3390,323
On-line application,Represented,Full Award,2012 Scheme,Male,29,BLUR/DOUBLE VISION SLIGHT,,Full Award,,,1700,436
On-line application,,Full Award,2012 Scheme,Male,46,BLUR/DOUBLE VISION SLIGHT,,Full Award,,,3345,446
On-line application,,Full Award,2012 Scheme,Male,28,BLUR/DOUBLE VISION SLIGHT,,Full Award,,,3120,195
On-line application,,Reduced Award,2012 Scheme,Male,47,BLUR/DOUBLE VISION SLIGHT,Applicants criminal record/character,Reduced Award,,,2280,277
On-line application,Represented,Full Award,2012 Scheme,Male,81,BLUR/DOUBLE VISION SLIGHT,,Full Award,,,2400,223
On-line application,,Full Award,2012 Scheme,Male,21,BLUR/DOUBLE VISION SLIGHT,,Full Award,,,3270,393
On-line application,,Full Award,2012 Scheme,Male,28,BLUR/DOUBLE VISION SLIGHT,,Nil Award,Full Award,,3120,161
On-line application,,Full Award,2012 Scheme,Female,33,BLUR/DOUBLE VISION SLIGHT,,Full Award,,,2850,417
On-line application,,Full Award,2012 Scheme,Male,22,BLUR/DOUBLE VISION SLIGHT,,Nil Award,Full Award,,3120,1
On-line application,,Full Award,2012 Scheme,Male,51,BLUR/DOUBLE VISION SLIGHT,,Full Award,Full Award,,2700,597
On-line application,,Full Award,2012 Scheme,Female,49,BLUR/DOUBLE VISION SLIGHT,,Full Award,,,2625,559
On-line application,Represented,Full Award,2012 Scheme,Male,26,BLUR/DOUBLE VISION SLIGHT,,Full Award,,,3070,449
On-line application,,Full Award,2012 Scheme,Male,48,BLUR/DOUBLE VISION SLIGHT,,Full Award,,,3120,533
On-line application,,Full Award,2012 Scheme,Male,45,BLUR/DOUBLE VISION SLIGHT,,Nil Award,Full Award,,2850,314
On-line application,Represented,Full Award,2012 Scheme,Male,20,BLUR/DOUBLE VISION SLIGHT,,Full Award,,,2400,386
On-line application,,Full Award,2012 Scheme,Male,65,BLUR/DOUBLE VISION SLIGHT,,Full Award,,,1345,720
On-line application,,Full Award,2012 Scheme,Male,22,BLUR/DOUBLE VISION SLIGHT,,Full Award,,,3070,1057
On-line application,,Full Award,2012 Scheme,Male,35,BLUR/DOUBLE VISION SLIGHT,,Full Award,,,2850,558
On-line application,,Full Award,2012 Scheme,Male,44,BLUR/DOUBLE VISION SLIGHT,,Full Award,Full Award,,3345,882
On-line application,,Full Award,2012 Scheme,Female,44,BLUR/DOUBLE VISION SLIGHT,,Full Award,,,3070,905
On-line application,,Full Award,2012 Scheme,Male,28,BLUR/DOUBLE VISION SLIGHT,,Full Award,,,3025,532
On-line application,,Full Award,2012 Scheme,Male,22,BLUR/DOUBLE VISION SLIGHT,,Full Award,Full Award,,3390,976
On-line application,,Reduced Award,2012 Scheme,Male,20,BLUR/DOUBLE VISION SLIGHT,Applicants criminal record/character,Reduced Award,,,2280,684
On-line application,,Full Award,2012 Scheme,Male,42,BLUR/DOUBLE VISION SLIGHT,,Full Award,Full Award,,5003,482
On-line application,,Full Award,2012 Scheme,Male,42,BLUR/DOUBLE VISION SLIGHT,,Full Award,,,3000,355
On-line application,,Full Award,2012 Scheme,Male,23,BLUR/DOUBLE VISION SLIGHT,,Full Award,,,2700,270
On-line application,,Full Award,2012 Scheme,Male,44,BLUR/DOUBLE VISION SLIGHT,,Full Award,Full Award,,3120,415
On-line application,,Full Award,2012 Scheme,Female,30,BLUR/DOUBLE VISION SLIGHT,,Full Award,,,2700,287
On-line application,,Full Award,2012 Scheme,Male,21,BLUR/DOUBLE VISION SLIGHT,,Full Award,,,2840,989
On-line application,,Full Award,2012 Scheme,Male,41,BLUR/DOUBLE VISION SLIGHT,,Full Award,,,3345,320
On-line application,,Full Award,2012 Scheme,Male,31,BLUR/DOUBLE VISION SLIGHT,,Full Award,,,3120,226
On-line application,Represented,Reduced Award,2012 Scheme,Male,55,BLUR/DOUBLE VISION SLIGHT,"Conduct before, during or after the incident",Nil Award,Reduced Award,,1425,1295
On-line application,Represented,Full Award,2012 Scheme,Male,61,BLUR/DOUBLE VISION SLIGHT,,Full Award,Full Award,,3000,243
On-line application,Represented,Full Award,2012 Scheme,Male,23,BLUR/DOUBLE VISION SLIGHT,,Full Award,,,2400,360
On-line application,,Full Award,2012 Scheme,Female,3,BURNS - OVER 25% OF BODY,,Full Award,Full Award,,33000,717
On-line application,,Full Award,2012 Scheme,Male,37,BURNS - OVER 25% OF BODY,,Full Award,,,43923,981
On-line application,Represented,Full Award,2012 Scheme,Female,45,BURNS - OVER 25% OF BODY,,Full Award,,,37950,648
On-line application,Represented,Full Award,2012 Scheme,Female,65,BURNS - OVER 25% OF BODY,,Full Award,Full Award,,33000,324
On-line application,,Full Award,2012 Scheme,Male,37,BURNS - OVER 25% OF BODY,,Full Award,,,33720,516
On-line application,Represented,Full Award,2012 Scheme,Female,17,BURNS - OVER 25% OF BODY,,Full Award,,,39025,1820
On-line application,,Full Award,2012 Scheme,Female,32,BURNS - OVER 25% OF BODY,,Full Award,,,32950,1469
On-line application,,Full Award,2012 Scheme,Male,26,BURNS - OVER 25% OF BODY,,Full Award,,,33000,426
On-line application,Represented,Full Award,2012 Scheme,Male,71,BURNS - OVER 25% OF BODY,,Full Award,Full Award,,35790,354
On-line application,Represented,Full Award,2012 Scheme,Male,23,BURNS FACE MODERATE,,Full Award,,,3500,448
On-line application,Represented,Full Award,2012 Scheme,Male,24,BURNS FACE MODERATE,,Full Award,,,4580,393
On-line application,,Full Award,2012 Scheme,Male,40,BURNS FACE MODERATE,,Full Award,,,3500,410
On-line application,Represented,Full Award,2012 Scheme,Male,23,BURNS FACE MODERATE,,Full Award,Full Award,,3800,616
On-line application,,Full Award,2012 Scheme,Female,28,BURNS FACE MODERATE,,Full Award,,,3500,162
On-line application,,Full Award,2012 Scheme,Female,28,BURNS FACE MODERATE,,Full Award,,,3500,224
On-line application,Represented,Full Award,2012 Scheme,Female,40,BURNS FACE MODERATE,,Full Award,,,3450,876
On-line application,Represented,Full Award,2012 Scheme,Male,36,BURNS FACE MODERATE,,Full Award,,,3500,513
On-line application,Represented,Full Award,2012 Scheme,Male,28,BURNS FACE MODERATE,,Full Award,,,3750,444
On-line application,,Full Award,2012 Scheme,Female,72,BURNS FACE MODERATE,,Full Award,,,3500,399
On-line application,Represented,Full Award,2012 Scheme,Female,18,BURNS FACE MODERATE,,Full Award,,,3500,728
On-line application,,Full Award,2012 Scheme,Male,26,BURNS FACE MODERATE,,Full Award,,,4220,542
On-line application,Represented,Full Award,2012 Scheme,Male,38,BURNS FACE MODERATE,,Full Award,,,3450,452
On-line application,,Full Award,2012 Scheme,Male,40,BURNS FACE MODERATE,,Full Award,,,3500,217
On-line application,Represented,Full Award,2012 Scheme,Male,36,BURNS FACE SEVERE DISFIGUREMENT,,Full Award,,,31950,1745
On-line application,,Full Award,2012 Scheme,Male,36,BURNS FACE SEVERE DISFIGUREMENT,,Full Award,,,28080,463
On-line application,,Full Award,2012 Scheme,Male,23,BURNS FACE SEVERE DISFIGUREMENT,,Full Award,Full Award,Full Award,31275,474
On-line application,,Full Award,2012 Scheme,Male,34,BURNS FACE SEVERE DISFIGUREMENT,,Full Award,,,33600,350
On-line application,,Full Award,2012 Scheme,Female,54,BURNS FACE SEVERE DISFIGUREMENT,,Full Award,,,27720,496
On-line application,Represented,Full Award,2012 Scheme,Female,44,BURNS FACE SEVERE DISFIGUREMENT,,Full Award,,,31950,549
On-line application,Represented,Reduced Award,2012 Scheme,Male,21,BURNS FACE SEVERE DISFIGUREMENT,"Conduct before, during or after the incident",Nil Award,Reduced Award,,29611.5,546
On-line application,,Full Award,2012 Scheme,Male,29,BURNS FACE SEVERE DISFIGUREMENT,,Full Award,,,35250,1563
On-line application,,Full Award,2012 Scheme,Male,31,BURNS FACE SEVERE DISFIGUREMENT,,Full Award,,,33600,436
On-line application,,Full Award,2012 Scheme,Male,46,CATARACTS 1 EYE OPERATION REQD,,Full Award,,,1800,486
On-line application,,Full Award,2012 Scheme,Male,68,CATARACTS 1 EYE OPERATION REQD,,Full Award,Full Award,,1600,309
On-line application,Represented,Full Award,2012 Scheme,Male,46,CATARACTS 1 EYE OPERATION REQD,,Nil Award,Full Award,,1500,48
On-line application,,Full Award,2012 Scheme,Male,50,CATARACTS 1 EYE OPERATION REQD,,Full Award,,,1500,355
On-line application,,Full Award,2012 Scheme,Male,54,CATARACTS 1 EYE OPERATION REQD,,Full Award,,,1500,1627
On-line application,,Full Award,2012 Scheme,Male,54,CATARACTS 1 EYE OPERATION REQD,,Full Award,,,1500,463
On-line application,,Full Award,2012 Scheme,Male,38,CLICKING JAW PERMANENT,,Full Award,Full Award,,4265,233
On-line application,Represented,Full Award,2012 Scheme,Female,20,CLICKING JAW PERMANENT,,Nil Award,Full Award,,3990,454
On-line application,,Full Award,2012 Scheme,Male,26,CLICKING JAW PERMANENT,,Full Award,,,3950,399
On-line application,,Full Award,2012 Scheme,Male,22,CLICKING JAW PERMANENT,,Full Award,,,3490,507
On-line application,,Full Award,2012 Scheme,Female,49,CLICKING JAW PERMANENT,,Full Award,,,3500,115
On-line application,,Full Award,2012 Scheme,Female,60,CLICKING JAW PERMANENT,,Full Award,,,3500,654
On-line application,Represented,Full Award,2012 Scheme,Male,16,CLICKING JAW PERMANENT,,Full Award,,,3890,429
On-line application,,Full Award,2012 Scheme,Male,28,CLICKING JAW PERMANENT,,Nil Award,Full Award,,3400,318
On-line application,,Full Award,2012 Scheme,Male,40,CLICKING JAW PERMANENT,,Full Award,,,3700,553
On-line application,Represented,Full Award,2012 Scheme,Male,18,CLICKING JAW PERMANENT,,Full Award,,,4265,359
On-line application,,Full Award,2012 Scheme,Female,52,CLICKING JAW PERMANENT,,Full Award,,,3950,374
On-line application,,Full Award,2012 Scheme,Male,41,CLICKING JAW PERMANENT,,Full Award,,,4100,476
On-line application,,Full Award,2012 Scheme,Male,49,CLICKING JAW PERMANENT,,Full Award,,,2980,467
On-line application,,Full Award,2012 Scheme,Female,21,CLICKING JAW PERMANENT,,Full Award,,,4040,540
On-line application,Represented,Full Award,2012 Scheme,Male,31,CLICKING JAW PERMANENT,,Full Award,,,4265,504
On-line application,,Reduced Award,2012 Scheme,Male,34,CLICKING JAW PERMANENT,"Conduct before, during or after the incident",Reduced Award,Reduced Award,,3434,544
On-line application,,Full Award,2012 Scheme,Male,21,CLICKING JAW PERMANENT,,Full Award,,,3950,294
On-line application,,Full Award,2012 Scheme,Male,22,CLICKING JAW PERMANENT,,Full Award,Full Award,,4265,984
On-line application,Represented,Full Award,2012 Scheme,Male,22,CLICKING JAW PERMANENT,,Full Award,Full Award,,4215,395
On-line application,,Full Award,2012 Scheme,Female,49,CLICKING JAW PERMANENT,,Full Award,,,3950,411
On-line application,Represented,Full Award,2012 Scheme,Male,17,CLICKING JAW PERMANENT,,Full Award,Full Award,,4244,336
On-line application,,Full Award,2012 Scheme,Male,49,CLICKING JAW PERMANENT,,Full Award,Full Award,,4490,392
On-line application,,Full Award,2012 Scheme,Male,18,CLICKING JAW PERMANENT,,Full Award,,,3950,301
Telephone application,,Full Award,2012 Scheme,Male,19,CLICKING JAW PERMANENT,,Full Award,,,4185,1688
On-line application,,Full Award,2012 Scheme,Male,57,CLICKING JAW PERMANENT,,Full Award,,,3050,1582
On-line application,,Full Award,2012 Scheme,Male,27,CLICKING JAW PERMANENT,,Full Award,,,3950,195
On-line application,Represented,Full Award,2012 Scheme,Male,33,CLICKING JAW PERMANENT,,Full Award,Full Award,,4215,674
On-line application,,Full Award,2012 Scheme,Male,32,CLICKING JAW PERMANENT,,Full Award,,,3800,829
On-line application,Represented,Full Award,2012 Scheme,Male,27,CLICKING JAW PERMANENT,,Full Award,,,4040,1651
On-line application,,Full Award,2012 Scheme,Female,29,CLICKING JAW PERMANENT,,Full Award,,,3500,704
On-line application,Represented,Full Award,2012 Scheme,Male,17,CLICKING JAW PERMANENT,,Full Award,,,3500,639
On-line application,,Full Award,2012 Scheme,Female,30,CLICKING JAW PERMANENT,,Full Award,,,3990,405
On-line application,Represented,Full Award,2012 Scheme,Male,39,CLICKING JAW PERMANENT,,Full Award,,,3500,854
On-line application,,Full Award,2012 Scheme,Male,29,CLICKING JAW PERMANENT,,Full Award,,,3500,341
On-line application,Represented,Full Award,2012 Scheme,Male,28,CLICKING JAW PERMANENT,,Full Award,,,4220,363
On-line application,,Full Award,2012 Scheme,Male,23,CLICKING JAW PERMANENT,,Full Award,Full Award,,1765,446
On-line application,,Full Award,2012 Scheme,Male,56,CLICKING JAW PERMANENT,,Full Award,,,3950,205
On-line application,,Full Award,2012 Scheme,Male,46,CLICKING JAW PERMANENT,,Nil Award,Full Award,,3500,34
On-line application,,Full Award,2012 Scheme,Male,18,CLICKING JAW PERMANENT,,Full Award,,,3990,688
On-line application,,Full Award,2012 Scheme,Male,19,CLICKING JAW PERMANENT,,Full Award,,,4170,857
On-line application,,Full Award,2012 Scheme,Male,32,CLICKING JAW PERMANENT,,Full Award,,,3890,1568
On-line application,,Full Award,2012 Scheme,Male,18,CLICKING JAW PERMANENT,,Nil Award,Full Award,,4040,42
On-line application,,Full Award,2012 Scheme,Male,44,CLICKING JAW PERMANENT,,Full Award,,,4220,499
On-line application,,Full Award,2012 Scheme,Male,23,CLICKING JAW PERMANENT,,Full Award,Full Award,,4040,194
On-line application,Represented,Full Award,2012 Scheme,Male,30,CLICKING JAW PERMANENT,,Nil Award,Full Award,Full Award,4265,838
On-line application,Represented,Full Award,2012 Scheme,Male,28,CLICKING JAW PERMANENT,,Full Award,,,2750,1205
On-line application,,Full Award,2012 Scheme,Male,37,CLICKING JAW PERMANENT,,Full Award,Full Award,,4220,387
On-line application,,Full Award,2012 Scheme,Male,58,CLICKING JAW PERMANENT,,Full Award,Full Award,Full Award,0,265
On-line application,,Reduced Award,2012 Scheme,Male,30,CLICKING JAW PERMANENT,Applicants criminal record/character,Reduced Award,,,3280,2383
On-line application,Represented,Full Award,2012 Scheme,Male,24,CLICKING JAW PERMANENT,,Full Award,Full Award,,4040,377
On-line application,,Full Award,2012 Scheme,Male,30,CLICKING JAW PERMANENT,,Full Award,Full Award,,4040,469
On-line application,,Full Award,2012 Scheme,Male,24,CLICKING JAW PERMANENT,,Nil Award,Full Award,,3500,11
On-line application,,Full Award,2012 Scheme,Female,25,CLICKING JAW PERMANENT,,Full Award,Full Award,,4490,1332
On-line application,Represented,Full Award,2012 Scheme,Male,19,CLICKING JAW PERMANENT,,Full Award,Full Award,,4395,1003
On-line application,,Full Award,2012 Scheme,Male,53,CLICKING JAW PERMANENT,,Full Award,Full Award,,4265,257
On-line application,,Full Award,2012 Scheme,Male,28,CLICKING JAW PERMANENT,,Full Award,,,4040,357
On-line application,,Full Award,2012 Scheme,Male,76,CLICKING JAW PERMANENT,,Full Award,,,4370,345
On-line application,,Full Award,2012 Scheme,Male,30,CLICKING JAW PERMANENT,,Full Award,,,4490,338
On-line application,,Full Award,2012 Scheme,Male,16,CLICKING JAW PERMANENT,,Full Award,,,3950,374
On-line application,,Full Award,2012 Scheme,Male,21,CLICKING JAW PERMANENT,,Nil Award,Full Award,,2790,255
On-line application,Represented,Full Award,2012 Scheme,Male,44,CLICKING JAW PERMANENT,,Full Award,,,3450,571
On-line application,,Full Award,2012 Scheme,Male,23,CLICKING JAW PERMANENT,,Full Award,,,4370,575
On-line application,Represented,Full Award,2012 Scheme,Female,47,CLICKING JAW PERMANENT,,Nil Award,Full Award,,3450,539
On-line application,,Full Award,2012 Scheme,Male,32,CLICKING JAW PERMANENT,,Full Award,,,4040,398
On-line application,,Full Award,2012 Scheme,Male,28,CLICKING JAW PERMANENT,,Full Award,,,3500,377
On-line application,,Full Award,2012 Scheme,Female,31,COLLAPSED LUNG,,Full Award,,,1800,359
On-line application,,Full Award,2012 Scheme,Male,18,COLLAPSED LUNG,,Full Award,,,2050,1481
On-line application,,Reduced Award,2012 Scheme,Male,17,COLLAPSED LUNG,Applicants criminal record/character,Reduced Award,,,1260,1157
On-line application,Represented,Full Award,2012 Scheme,Male,49,COLLAPSED LUNG,,Nil Award,Full Award,,1800,100
On-line application,,Full Award,2012 Scheme,Male,36,COLLAPSED LUNG,,Full Award,,,2100,468
On-line application,Represented,Full Award,2012 Scheme,Male,37,COLLAPSED LUNG,,Full Award,,,800,242
On-line application,Represented,Full Award,2012 Scheme,Male,56,COLLAPSED LUNG,,Full Award,,,1800,736
On-line application,,Full Award,2012 Scheme,Male,31,COLLAPSED LUNG,,Full Award,,,2100,279
On-line application,,Full Award,2012 Scheme,Male,31,COLLAPSED LUNG,,Full Award,Full Award,,2000,319
On-line application,,Full Award,2012 Scheme,Male,28,COLLAPSED LUNG,,Full Award,,,1800,602
On-line application,Represented,Full Award,2012 Scheme,Male,39,COLLAPSED LUNG,,Full Award,,,1800,136
On-line application,Represented,Reduced Award,2012 Scheme,Female,33,COLLAPSED LUNG,"Conduct before, during or after the incident",Reduced Award,Reduced Award,,337.5,600
On-line application,Represented,Full Award,2012 Scheme,Male,33,COLLAPSED LUNG,,Full Award,,,1800,343
On-line application,Represented,Full Award,2012 Scheme,Male,70,COLLAPSED LUNG,,Full Award,,,1800,112
On-line application,Represented,Full Award,2012 Scheme,Male,35,COLLAPSED LUNG,,Full Award,,,2490,345
On-line application,,Full Award,2012 Scheme,Male,21,COLLAPSED LUNG,,Full Award,,,1770,882
On-line application,Represented,Full Award,2012 Scheme,Male,59,COLLAPSED LUNG,,Full Award,Full Award,,2050,353
On-line application,Represented,Full Award,2012 Scheme,Male,47,COLLAPSED LUNG,,Full Award,,,2430,343
On-line application,Represented,Full Award,2012 Scheme,Male,64,COLLAPSED LUNG,,Full Award,,,2100,219
On-line application,Represented,Reduced Award,2012 Scheme,Male,28,COLLAPSED LUNG,Applicants criminal record/character,Reduced Award,Reduced Award,,1800,100
On-line application,,Full Award,2012 Scheme,Male,42,COLLAPSED LUNG,,Full Award,,,2100,433
On-line application,,Full Award,2012 Scheme,Male,39,COLLAPSED LUNG,,Full Award,,,2340,746
On-line application,,Full Award,2012 Scheme,Male,62,COLLAPSED LUNG,,Nil Award,Full Award,,1800,34
On-line application,Represented,Full Award,2012 Scheme,Male,15,COLLAPSED LUNG,,Full Award,,,2100,612
On-line application,,Full Award,2012 Scheme,Male,27,COLLAPSED LUNG,,Full Award,,,2100,450
On-line application,,Full Award,2012 Scheme,Male,59,COLLAPSED LUNG,,Full Award,,,2200,356
On-line application,Represented,Full Award,2012 Scheme,Male,21,COLLAPSED LUNG,,Full Award,Full Award,,2100,347
On-line application,Represented,Full Award,2012 Scheme,Male,28,COLLAPSED LUNG,,Full Award,,,2490,387
On-line application,,Full Award,2012 Scheme,Male,47,COLLAPSED LUNG,,Full Award,,,1800,616
On-line application,,Full Award,2012 Scheme,Male,40,COLLAPSED LUNG,,Full Award,,,2250,617
On-line application,,Full Award,2012 Scheme,Male,19,COLLAPSED LUNG,,Full Award,,,2100,359
On-line application,,Full Award,2012 Scheme,Male,53,COLLAPSED LUNG,,Full Award,,,1800,375
On-line application,Represented,Full Award,2012 Scheme,Female,16,COLLAPSED LUNG,,Full Award,,,2100,463
On-line application,,Full Award,2012 Scheme,Male,19,COLLAPSED LUNG,,Full Award,,,2070,351
On-line application,,Full Award,2012 Scheme,Male,33,COLLAPSED LUNG,,Full Award,,,2100,214
On-line application,Represented,Full Award,2012 Scheme,Male,23,COLLAPSED LUNG,,Full Award,,,1800,689
On-line application,,Full Award,2012 Scheme,Male,44,COLLAPSED LUNG,,Full Award,,,2250,233
On-line application,,Full Award,2012 Scheme,Male,19,COLLAPSED LUNG,,Full Award,Full Award,,2490,385
On-line application,,Full Award,2012 Scheme,Male,20,COLLAPSED LUNG,,Full Award,,,1750,409
On-line application,Represented,Full Award,2012 Scheme,Male,19,COLLAPSED LUNG,,Nil Award,Full Award,,2050,185
On-line application,Represented,Reduced Award,2012 Scheme,Female,38,COLLAPSED LUNG,"Conduct before, during or after the incident",Reduced Award,,,1075,337
On-line application,Represented,Full Award,2012 Scheme,Male,39,COLLAPSED LUNG,,Full Award,,,2061,339
On-line application,,Full Award,2012 Scheme,Male,16,COLLAPSED LUNG,,Full Award,,,2100,346
On-line application,,Full Award,2012 Scheme,Male,25,COLLAPSED LUNG,,Full Award,,,2100,585
On-line application,Represented,Full Award,2012 Scheme,Male,18,COLLAPSED LUNG,,Nil Award,Full Award,,2100,153
On-line application,Represented,Reduced Award,2012 Scheme,Male,44,COLLAPSED LUNG,"Conduct before, during or after the incident",Reduced Award,,,1572,437
On-line application,,Full Award,2012 Scheme,Male,28,COLLAPSED LUNG,,Full Award,,,2250,393
On-line application,,Reduced Award,2012 Scheme,Male,26,COLLAPSED LUNG,"Conduct before, during or after the incident",Reduced Award,,,2160,596
On-line application,Represented,Full Award,2012 Scheme,Male,49,COLLAPSED LUNG,,Full Award,,,2100,353
On-line application,,Full Award,2012 Scheme,Male,37,COLLAPSED LUNG,,Full Award,Full Award,,2250,114
On-line application,Represented,Full Award,2012 Scheme,Male,29,COLLAPSED LUNG,,Nil Award,Full Award,,2400,296
On-line application,Represented,Full Award,2012 Scheme,Male,20,COLLAPSED LUNG,,Full Award,,,2610,1353
On-line application,Represented,Full Award,2012 Scheme,Male,54,COLLAPSED LUNG,,Full Award,,,2490,1210
On-line application,Represented,Full Award,2012 Scheme,Female,50,COLLAPSED LUNG,,Full Award,,,2100,196
On-line application,,Full Award,2012 Scheme,Male,46,COLLAPSED LUNG,,Full Award,Full Award,,2100,499
On-line application,,Full Award,2012 Scheme,Male,34,COLLAPSED LUNG,,Full Award,,,2100,736
On-line application,,Full Award,2012 Scheme,Male,18,COLLAPSED LUNG,,Full Award,,,2100,591
On-line application,Represented,Full Award,2012 Scheme,Male,29,COLLAPSED LUNG,,Full Award,,,2050,807
On-line application,Represented,Full Award,2012 Scheme,Female,24,COLLAPSED LUNG,,Full Award,Full Award,,2440,708