﻿Application Channel,Representative Status,Final Decision,Scheme,Gender,Age,Main Injury,Rejection Reasons,First Decision,Review Decision,Appeal Decision,Value of Award,Days to First Decision
On-line application,Represented,Full Award,2012 Scheme,Male,46,BLUR/DOUBLE VISION MODERATE,,Full Award,,,"£6,200",600
On-line application,Represented,Full Award,2012 Scheme,Female,11,BLUR/DOUBLE VISION MODERATE,,Full Award,,,"£6,650",395
On-line application,Represented,Full Award,2012 Scheme,Male,12,BLUR/DOUBLE VISION MODERATE,,Full Award,,,"£6,150",343
On-line application,Not Represented,Full Award,2012 Scheme,Female,26,BLUR/DOUBLE VISION MODERATE,,Full Award,,,"£7,145",822
On-line application,Not Represented,Full Award,2012 Scheme,Male,20,BLUR/DOUBLE VISION MODERATE,,Full Award,,,"£6,800",967
On-line application,Not Represented,Full Award,2012 Scheme,Female,29,BLUR/DOUBLE VISION MODERATE,,Full Award,Full Award,,"£7,070",647
Telephone application,Not Represented,Full Award,2012 Scheme,Male,52,BLUR/DOUBLE VISION MODERATE,,Full Award,,,"£16,041",1388
On-line application,Not Represented,Full Award,2012 Scheme,Female,20,BLUR/DOUBLE VISION SLIGHT,,Full Award,,,"£3,120",34
On-line application,Not Represented,Full Award,2012 Scheme,Male,46,BLUR/DOUBLE VISION SLIGHT,,Full Award,Full Award,,"£3,000",735
On-line application,Not Represented,Full Award,2012 Scheme,Female,24,BLUR/DOUBLE VISION SLIGHT,,Full Award,,,"£3,345",435
On-line application,Not Represented,Full Award,2012 Scheme,Male,59,BLUR/DOUBLE VISION SLIGHT,,Nil Award,Full Award,,"£3,120",163
On-line application,Not Represented,Full Award,2012 Scheme,Female,27,BLUR/DOUBLE VISION SLIGHT,,Full Award,,,"£3,295",302
On-line application,Not Represented,Full Award,2012 Scheme,Female,26,BLUR/DOUBLE VISION SLIGHT,,Full Award,Full Award,,"£3,120",601
On-line application,Not Represented,Full Award,2012 Scheme,Male,21,BLUR/DOUBLE VISION SLIGHT,,Full Award,,,"£3,390",964
On-line application,Represented,Full Award,2012 Scheme,Male,27,BLUR/DOUBLE VISION SLIGHT,,Full Award,,,"£2,400",286
On-line application,Not Represented,Full Award,2012 Scheme,Male,45,BLUR/DOUBLE VISION SLIGHT,,Full Award,,,"£3,000",349
On-line application,Not Represented,Full Award,2012 Scheme,Male,48,BLUR/DOUBLE VISION SLIGHT,,Full Award,Full Award,,"£2,850",504
On-line application,Not Represented,Full Award,2012 Scheme,Male,23,BLUR/DOUBLE VISION SLIGHT,,Full Award,,,"£2,850",804
On-line application,Represented,Full Award,2012 Scheme,Male,36,BLUR/DOUBLE VISION SLIGHT,,Full Award,Full Award,,"£3,075",329
On-line application,Represented,Full Award,2012 Scheme,Male,48,BLUR/DOUBLE VISION SLIGHT,,Full Award,,,"£3,070",272
On-line application,Represented,Full Award,2012 Scheme,Female,24,BLUR/DOUBLE VISION SLIGHT,,Nil Award,Full Award,,"£2,400",200
On-line application,Not Represented,Full Award,2012 Scheme,Female,61,BLUR/DOUBLE VISION SLIGHT,,Full Award,,,"£3,270",881
On-line application,Not Represented,Full Award,2012 Scheme,Male,35,BLUR/DOUBLE VISION SLIGHT,,Full Award,,,"£3,000",513
On-line application,Not Represented,Full Award,2012 Scheme,Male,55,BLUR/DOUBLE VISION SLIGHT,,Full Award,,,"£3,345",269
On-line application,Represented,Full Award,2012 Scheme,Male,46,BLUR/DOUBLE VISION SLIGHT,,Full Award,,,"£3,345",595
On-line application,Represented,Full Award,2012 Scheme,Male,45,BLUR/DOUBLE VISION SLIGHT,,Full Award,,,"£3,345",1177
On-line application,Not Represented,Full Award,2012 Scheme,Male,36,BLUR/DOUBLE VISION SLIGHT,,Full Award,Full Award,,"£2,320",659
On-line application,Represented,Full Award,2012 Scheme,Male,46,BLUR/DOUBLE VISION SLIGHT,,Full Award,,,"£2,400",508
On-line application,Represented,Full Award,2012 Scheme,Male,31,BLUR/DOUBLE VISION SLIGHT,,Full Award,,,"£3,000",607
On-line application,Represented,Full Award,2012 Scheme,Male,32,BLUR/DOUBLE VISION SLIGHT,,Full Award,,,"£3,295",542
On-line application,Not Represented,Full Award,2012 Scheme,Male,21,BLUR/DOUBLE VISION SLIGHT,,Full Award,Full Award,,"£2,850",602
On-line application,Not Represented,Full Award,2012 Scheme,Male,26,BLUR/DOUBLE VISION SLIGHT,,Full Award,,,"£3,000",989
On-line application,Not Represented,Full Award,2012 Scheme,Male,32,BLUR/DOUBLE VISION SLIGHT,,Full Award,,,"£2,300",805
On-line application,Represented,Full Award,2012 Scheme,Male,39,BLUR/DOUBLE VISION SLIGHT,,Full Award,,,"£2,700",434
On-line application,Represented,Full Award,2012 Scheme,Male,40,BLUR/DOUBLE VISION SLIGHT,,Full Award,Full Award,,"£2,650",721
On-line application,Represented,Full Award,2012 Scheme,Female,39,BLUR/DOUBLE VISION SLIGHT,,Full Award,,,"£3,120",1486
On-line application,Not Represented,Full Award,2012 Scheme,Male,53,BLUR/DOUBLE VISION SLIGHT,,Full Award,,,"£2,800",531
On-line application,Not Represented,Full Award,2012 Scheme,Male,39,BLUR/DOUBLE VISION SLIGHT,,Full Award,,,"£3,120",484
On-line application,Represented,Full Award,2012 Scheme,Male,42,BLUR/DOUBLE VISION SLIGHT,,Full Award,,,"£3,120",660
On-line application,Not Represented,Full Award,2012 Scheme,Male,31,BLUR/DOUBLE VISION SLIGHT,,Full Award,Full Award,,"£3,345",318
On-line application,Not Represented,Full Award,2012 Scheme,Male,60,BLUR/DOUBLE VISION SLIGHT,,Nil Award,Full Award,,"£2,400",980
On-line application,Not Represented,Full Award,2001 Scheme,Female,3,BRAIN DAMAGE SERIOUS,,Full Award,,,"£416,042",3714
On-line application,Represented,Full Award,2001 Scheme,Male,17,BRAIN DAMAGE SERIOUS,,Full Award,Full Award,Full Award,"£500,000",1075
On-line application,Represented,Full Award,2001 Scheme,Male,35,BRAIN DAMAGE SERIOUS,,Full Award,Full Award,,"£500,000",1360
On-line application,Represented,Full Award,2001 Scheme,Female,2,BRAIN DAMAGE SERIOUS,,Full Award,Full Award,Full Award,"£410,034",1686
On-line application,Represented,Full Award,2001 Scheme,Male,1,BRAIN DAMAGE SERIOUS,,Full Award,Full Award,,"£135,180",4034
On-line application,Not Represented,Full Award,2008 Scheme,Female,35,BRAIN INJURY OVER 28 WEEKS,,Full Award,,,"£77,277",2392
On-line application,Not Represented,Full Award,2008 Scheme,Female,25,BRAIN INJURY OVER 28 WEEKS,,Nil Award,Full Award,,"£3,300",1202
Telephone application,Not Represented,Full Award,2008 Scheme,Male,35,BRAIN INJURY OVER 28 WEEKS,,Full Award,Full Award,,"£3,600",636
On-line application,Not Represented,Full Award,2008 Scheme,Male,33,BRAIN INJURY OVER 28 WEEKS,,Full Award,,,"£6,203",2370
On-line application,Represented,Full Award,2012 Scheme,Female,33,BURNS FACE MODERATE,,Full Award,,,"£3,450",125
On-line application,Represented,Full Award,2012 Scheme,Male,35,BURNS FACE MODERATE,,Full Award,,,"£3,500",409
On-line application,Not Represented,Full Award,2012 Scheme,Male,47,BURNS FACE MODERATE,,Full Award,,,"£3,500",1028
On-line application,Represented,Full Award,2012 Scheme,Male,48,BURNS FACE MODERATE,,Nil Award,Full Award,,"£3,500",376
On-line application,Represented,Reduced Award,2012 Scheme,Male,46,CLICKING JAW PERMANENT,Applicants criminal record/character,Reduced Award,,,"£4,041",1525
On-line application,Not Represented,Full Award,2012 Scheme,Male,31,CLICKING JAW PERMANENT,,Full Award,,,"£3,461",320
On-line application,Not Represented,Full Award,2012 Scheme,Male,43,CLICKING JAW PERMANENT,,Full Award,,,"£4,100",457
On-line application,Not Represented,Full Award,2012 Scheme,Male,29,CLICKING JAW PERMANENT,,Nil Award,Full Award,,"£2,000",669
On-line application,Not Represented,Full Award,2012 Scheme,Male,20,CLICKING JAW PERMANENT,,Full Award,Full Award,,"£1,990",604
On-line application,Represented,Full Award,2012 Scheme,Male,19,CLICKING JAW PERMANENT,,Full Award,Full Award,,"£4,265",615
On-line application,Not Represented,Full Award,2012 Scheme,Female,20,CLICKING JAW PERMANENT,,Full Award,,,"£3,500",759
On-line application,Represented,Full Award,2012 Scheme,Female,41,CLICKING JAW PERMANENT,,Full Award,,,"£3,500",306
On-line application,Not Represented,Full Award,2012 Scheme,Female,23,CLICKING JAW PERMANENT,,Full Award,,,"£2,720",356
On-line application,Represented,Full Award,2012 Scheme,Male,29,CLICKING JAW PERMANENT,,Full Award,,,"£3,950",324
On-line application,Not Represented,Full Award,2012 Scheme,Male,26,CLICKING JAW PERMANENT,,Full Award,,,"£4,040",312
On-line application,Represented,Full Award,2012 Scheme,Male,60,CLICKING JAW PERMANENT,,Full Award,,,"£4,220",358
On-line application,Not Represented,Full Award,2012 Scheme,Male,37,CLICKING JAW PERMANENT,,Full Award,,,"£3,500",1077
On-line application,Not Represented,Full Award,2012 Scheme,Female,21,CLICKING JAW PERMANENT,,Full Award,,,"£3,500",424
On-line application,Not Represented,Full Award,2012 Scheme,Female,33,CLICKING JAW PERMANENT,,Full Award,,,"£3,450",736
On-line application,Represented,Full Award,2012 Scheme,Female,17,CLICKING JAW PERMANENT,,Full Award,,,"£2,040",1242
On-line application,Not Represented,Full Award,2012 Scheme,Female,30,CLICKING JAW PERMANENT,,Full Award,,,"£3,500",1032
On-line application,Not Represented,Full Award,2012 Scheme,Male,23,CLICKING JAW PERMANENT,,Full Award,,,"£4,265",310
On-line application,Not Represented,Full Award,2012 Scheme,Male,29,CLICKING JAW PERMANENT,,Full Award,,,"£3,695",492
On-line application,Represented,Reduced Award,2012 Scheme,Male,23,CLICKING JAW PERMANENT,Applicants criminal record/character,Reduced Award,Reduced Award,Reduced Award,"£2,622",524
On-line application,Not Represented,Full Award,2012 Scheme,Male,31,CLICKING JAW PERMANENT,,Full Award,,,"£4,040",855
On-line application,Represented,Full Award,2012 Scheme,Male,30,CLICKING JAW PERMANENT,,Full Award,,,"£3,500",795
On-line application,Not Represented,Full Award,2012 Scheme,Female,24,CLICKING JAW PERMANENT,,Full Award,,,"£3,500",254
On-line application,Represented,Full Award,2012 Scheme,Female,29,CLICKING JAW PERMANENT,,Full Award,,,"£3,900",720
On-line application,Not Represented,Full Award,2012 Scheme,Male,41,CLICKING JAW PERMANENT,,Full Award,,,"£3,500",560
On-line application,Not Represented,Full Award,2012 Scheme,Male,25,CLICKING JAW PERMANENT,,Full Award,,,"£4,265",319
On-line application,Not Represented,Full Award,2012 Scheme,Male,45,CLICKING JAW PERMANENT,,Full Award,,,"£3,500",850
On-line application,Not Represented,Full Award,2012 Scheme,Female,21,CLICKING JAW PERMANENT,,Full Award,,,"£3,400",1073
On-line application,Not Represented,Full Award,2012 Scheme,Male,33,CLICKING JAW PERMANENT,,Full Award,,,"£4,215",834
On-line application,Not Represented,Full Award,2012 Scheme,Male,21,CLICKING JAW PERMANENT,,Nil Award,Full Award,,"£4,040",580
On-line application,Not Represented,Reduced Award,2012 Scheme,Male,22,CLICKING JAW PERMANENT,Applicants criminal record/character,Reduced Award,,,"£3,376",558
On-line application,Not Represented,Full Award,2012 Scheme,Male,40,CLICKING JAW PERMANENT,,Full Award,,,"£4,395",867
On-line application,Represented,Full Award,2012 Scheme,Female,19,CLICKING JAW PERMANENT,,Nil Award,Full Award,,"£4,040",97
On-line application,Not Represented,Full Award,2012 Scheme,Male,27,CLICKING JAW PERMANENT,,Full Award,,,"£3,950",1037
On-line application,Not Represented,Full Award,2012 Scheme,Male,50,CLICKING JAW PERMANENT,,Full Award,,,"£3,985",315
On-line application,Not Represented,Full Award,2012 Scheme,Female,52,CLICKING JAW PERMANENT,,Full Award,,,"£3,500",456
On-line application,Not Represented,Full Award,2012 Scheme,Male,23,CLICKING JAW PERMANENT,,Full Award,Full Award,,"£3,950",843
On-line application,Not Represented,Full Award,2012 Scheme,Male,36,CLICKING JAW PERMANENT,,Full Award,,,"£4,445",418
On-line application,Represented,Full Award,2012 Scheme,Male,28,CLICKING JAW PERMANENT,,Nil Award,Full Award,,"£4,490",271
On-line application,Represented,Full Award,2012 Scheme,Male,27,CLICKING JAW PERMANENT,,Full Award,Full Award,,"£4,040",645
On-line application,Not Represented,Full Award,2012 Scheme,Female,33,CLICKING JAW PERMANENT,,Full Award,,,"£3,500",461
On-line application,Represented,Full Award,2012 Scheme,Male,22,CLICKING JAW PERMANENT,,Full Award,,,"£3,500",461
On-line application,Not Represented,Full Award,2012 Scheme,Male,22,CLICKING JAW PERMANENT,,Full Award,,,"£4,100",834
On-line application,Not Represented,Full Award,2012 Scheme,Male,18,CLICKING JAW PERMANENT,,Full Award,,,"£4,265",756
On-line application,Represented,Full Award,2012 Scheme,Female,21,CLICKING JAW PERMANENT,,Full Award,,,"£3,500",1315
On-line application,Represented,Reduced Award,2012 Scheme,Male,43,COLLAPSED LUNG,Applicants criminal record/character,Reduced Award,,,"£1,750",835
On-line application,Not Represented,Full Award,2012 Scheme,Male,30,COLLAPSED LUNG,,Full Award,,,"£2,100",313
On-line application,Represented,Full Award,2012 Scheme,Male,16,COLLAPSED LUNG,,Full Award,,,"£1,750",801
On-line application,Represented,Reduced Award,2012 Scheme,Male,29,COLLAPSED LUNG,Applicants criminal record/character,Reduced Award,,,"£1,080",607
On-line application,Not Represented,Full Award,2012 Scheme,Male,21,COLLAPSED LUNG,,Full Award,,,"£2,250",765
On-line application,Represented,Reduced Award,2012 Scheme,Male,24,COLLAPSED LUNG,Applicants criminal record/character,Reduced Award,Reduced Award,,"£1,260",420
On-line application,Represented,Full Award,2012 Scheme,Male,18,COLLAPSED LUNG,,Full Award,,,"£2,225",323
On-line application,Not Represented,Full Award,2012 Scheme,Male,57,COLLAPSED LUNG,,Full Award,,,"£2,340",837
On-line application,Not Represented,Full Award,2012 Scheme,Female,51,COLLAPSED LUNG,,Full Award,,,"£1,800",787
On-line application,Not Represented,Full Award,2012 Scheme,Male,73,COLLAPSED LUNG,,Full Award,,,"£1,800",637
On-line application,Not Represented,Full Award,2012 Scheme,Male,48,COLLAPSED LUNG,,Full Award,,,"£2,100",336
On-line application,Not Represented,Full Award,2012 Scheme,Male,57,COLLAPSED LUNG,,Full Award,,,"£1,750",581
On-line application,Not Represented,Full Award,2012 Scheme,Male,46,COLLAPSED LUNG,,Full Award,,,"£2,100",262
On-line application,Not Represented,Reduced Award,2012 Scheme,Male,49,COLLAPSED LUNG,Applicants criminal record/character,Reduced Award,,,"£1,680",691
On-line application,Represented,Full Award,2012 Scheme,Female,72,COLLAPSED LUNG,,Full Award,,,"£2,400",433
On-line application,Represented,Full Award,2012 Scheme,Male,93,COLLAPSED LUNG,,Full Award,,,"£2,250",226
On-line application,Not Represented,Full Award,2012 Scheme,Male,44,COLLAPSED LUNG,,Full Award,,,"£1,800",401
On-line application,Represented,Full Award,2012 Scheme,Male,28,COLLAPSED LUNG,,Full Award,,,"£1,790",1160
On-line application,Not Represented,Reduced Award,2012 Scheme,Male,44,COLLAPSED LUNG,"Conduct before, during or after the incident",Reduced Award,,,"£1,300",319
On-line application,Not Represented,Full Award,2012 Scheme,Male,47,COLLAPSED LUNG,,Full Award,,,"£1,750",595
On-line application,Not Represented,Reduced Award,2012 Scheme,Male,17,COLLAPSED LUNG,"Conduct before, during or after the incident",Nil Award,Reduced Award,,"£1,575",294
On-line application,Represented,Full Award,2012 Scheme,Male,47,COLLAPSED LUNG,,Full Award,,,"£2,071",910
On-line application,Not Represented,Reduced Award,2012 Scheme,Male,42,COLLAPSED LUNG,"Conduct before, during or after the incident",Reduced Award,,,"£1,870",1917
On-line application,Represented,Full Award,2012 Scheme,Male,26,COLLAPSED LUNG,,Full Award,,,"£2,100",1282
On-line application,Not Represented,Full Award,2012 Scheme,Female,19,COLLAPSED LUNG,,Full Award,Full Award,,£100,1513
On-line application,Not Represented,Reduced Award,2012 Scheme,Male,37,COLLAPSED LUNG,Applicants criminal record/character,Reduced Award,,,"£1,030",961
On-line application,Not Represented,Full Award,2012 Scheme,Female,42,COLLAPSED LUNG,,Full Award,,,"£1,800",653
On-line application,Not Represented,Full Award,2012 Scheme,Female,36,COLLAPSED LUNG,,Full Award,,,"£2,250",179
On-line application,Represented,Full Award,2012 Scheme,Female,18,COLLAPSED LUNG,,Full Award,,,"£2,490",687
On-line application,Represented,Full Award,2012 Scheme,Male,51,COLLAPSED LUNG,,Full Award,,,"£2,050",1480
On-line application,Represented,Full Award,2012 Scheme,Female,54,COLLAPSED LUNG,,Full Award,,,"£2,400",953
On-line application,Represented,Reduced Award,2012 Scheme,Female,43,COLLAPSED LUNG,Applicants criminal record/character,Reduced Award,,,"£1,640",293
On-line application,Not Represented,Full Award,2012 Scheme,Male,41,COLLAPSED LUNG,,Full Award,,,"£2,295",322
On-line application,Not Represented,Full Award,2012 Scheme,Male,42,COLLAPSED LUNG,,Full Award,,,"£2,565",435
On-line application,Represented,Full Award,2012 Scheme,Male,19,COLLAPSED LUNG,,Full Award,,,"£1,761",735
On-line application,Represented,Reduced Award,2012 Scheme,Male,42,COLLAPSED LUNG,Applicants criminal record/character,Reduced Award,,,"£1,440",808
On-line application,Not Represented,Full Award,2012 Scheme,Male,22,COLLAPSED LUNG,,Full Award,Full Award,,"£2,100",86
On-line application,Represented,Full Award,2012 Scheme,Male,27,COLLAPSED LUNG,,Full Award,,,"£2,100",216
On-line application,Represented,Full Award,2012 Scheme,Male,65,COLLAPSED LUNG,,Full Award,,,"£2,100",239
On-line application,Represented,Full Award,2012 Scheme,Male,52,COLLAPSED LUNG,,Full Award,,,"£2,100",320
On-line application,Not Represented,Full Award,2012 Scheme,Male,17,COLLAPSED LUNG,,Nil Award,Full Award,,"£2,100",98
On-line application,Not Represented,Full Award,2012 Scheme,Male,52,COLLAPSED LUNG,,Full Award,,,"£2,400",383
On-line application,Represented,Full Award,2012 Scheme,Female,53,COLLAPSED LUNG,,Full Award,,,"£2,400",826
On-line application,Represented,Full Award,2012 Scheme,Male,23,COLLAPSED LUNG,,Full Award,,,"£2,050",414
On-line application,Represented,Full Award,2012 Scheme,Female,27,COLLAPSED LUNG,,Full Award,,,"£2,050",198
On-line application,Represented,Full Award,2012 Scheme,Male,26,COLLAPSED LUNG,,Full Award,,,"£1,800",105
On-line application,Represented,Full Award,2012 Scheme,Male,31,COLLAPSED LUNGS,,Full Award,,,"£6,200",795
On-line application,Represented,Full Award,2012 Scheme,Female,33,COLLAPSED LUNGS,,Full Award,Full Award,,"£7,560",341
On-line application,Not Represented,Full Award,2012 Scheme,Female,24,COLLAPSED LUNGS,,Full Award,Full Award,,"£6,600",785
On-line application,Not Represented,Full Award,2012 Scheme,Male,22,COLLAPSED LUNGS,,Full Award,,,"£7,070",545
On-line application,Not Represented,Reduced Award,2012 Scheme,Male,30,COLLAPSED LUNGS,"Conduct before, during or after the incident",Nil Award,Reduced Award,,"£3,250",399
On-line application,Represented,Full Award,2012 Scheme,Male,40,COLLAPSED LUNGS,,Full Award,,,"£7,610",54
On-line application,Not Represented,Full Award,2012 Scheme,Male,27,COLLAPSED LUNGS,,Full Award,,,"£7,610",1606
On-line application,Not Represented,Full Award,2012 Scheme,Female,20,COLLAPSED LUNGS,,Full Award,,,"£7,740",1315
On-line application,Not Represented,Full Award,2012 Scheme,Female,25,DAMAGE TOOTH/TEETH REQ CROWNS,,Full Award,,,"£1,000",1478
On-line application,Represented,Full Award,2012 Scheme,Female,74,DAMAGE TOOTH/TEETH REQ CROWNS,,Full Award,,,"£1,000",230
On-line application,Not Represented,Reduced Award,2012 Scheme,Male,20,DAMAGE TOOTH/TEETH REQ CROWNS,Applicants criminal record/character,Reduced Award,,,£800,1150
On-line application,Not Represented,Full Award,2012 Scheme,Male,26,DAMAGE TOOTH/TEETH REQ CROWNS,,Full Award,Full Award,Full Award,"£1,000",263
On-line application,Not Represented,Full Award,2012 Scheme,Male,27,DAMAGE TOOTH/TEETH REQ CROWNS,,Full Award,Full Award,,"£1,000",295
On-line application,Represented,Full Award,2012 Scheme,Male,47,DAMAGE TOOTH/TEETH REQ CROWNS,,Full Award,,,"£1,000",1157
On-line application,Represented,Full Award,2012 Scheme,Male,15,DAMAGE TOOTH/TEETH REQ CROWNS,,Full Award,,,£950,410
On-line application,Not Represented,Full Award,2012 Scheme,Male,19,DAMAGE TOOTH/TEETH REQ CROWNS,,Full Award,,,"£1,000",733
On-line application,Not Represented,Full Award,2012 Scheme,Male,70,DAMAGE TOOTH/TEETH REQ CROWNS,,Full Award,,,£500,917
On-line application,Represented,Reduced Award,2012 Scheme,Male,15,DAMAGE TOOTH/TEETH REQ CROWNS,"Conduct before, during or after the incident",Reduced Award,Reduced Award,,£711,201
On-line application,Represented,Full Award,2012 Scheme,Male,19,DAMAGE TOOTH/TEETH REQ CROWNS,,Full Award,,,"£1,000",611
On-line application,Not Represented,Reduced Award,2012 Scheme,Male,22,DAMAGE TOOTH/TEETH REQ CROWNS,Applicants criminal record/character,Reduced Award,,,£500,278
On-line application,Not Represented,Full Award,2012 Scheme,Male,26,DAMAGE TOOTH/TEETH REQ CROWNS,,Full Award,,,"£1,000",684
On-line application,Represented,Full Award,2012 Scheme,Male,20,DAMAGE TOOTH/TEETH REQ CROWNS,,Full Award,,,"£1,000",1205
On-line application,Not Represented,Full Award,2012 Scheme,Male,22,DAMAGE TOOTH/TEETH REQ CROWNS,,Full Award,,,"£1,000",105
On-line application,Not Represented,Full Award,2012 Scheme,Male,13,DAMAGE TOOTH/TEETH REQ CROWNS,,Full Award,,,"£1,000",918
On-line application,Not Represented,Full Award,2012 Scheme,Male,18,DAMAGE TOOTH/TEETH REQ CROWNS,,Full Award,,,£950,516
On-line application,Not Represented,Full Award,2012 Scheme,Male,24,DAMAGE TOOTH/TEETH REQ CROWNS,,Full Award,,,"£1,000",166
On-line application,Represented,Full Award,2012 Scheme,Male,16,DAMAGE TOOTH/TEETH REQ CROWNS,,Full Award,,,"£1,000",695
Telephone application,Not Represented,Full Award,2012 Scheme,Female,46,DAMAGE TOOTH/TEETH REQ CROWNS,,Full Award,Full Award,,"£1,000",988
On-line application,Represented,Full Award,2012 Scheme,Male,23,DAMAGE TOOTH/TEETH REQ CROWNS,,Full Award,,,"£1,000",479
On-line application,Represented,Full Award,2012 Scheme,Male,34,DAMAGE TOOTH/TEETH REQ CROWNS,,Full Award,Full Award,,£950,1027
On-line application,Not Represented,Full Award,2012 Scheme,Male,22,DAMAGE TOOTH/TEETH REQ CROWNS,,Nil Award,Full Award,,£950,318
On-line application,Not Represented,Full Award,2012 Scheme,Male,20,DAMAGE TOOTH/TEETH REQ CROWNS,,Full Award,,,"£1,000",1213
On-line application,Not Represented,Full Award,2012 Scheme,Male,19,DAMAGE TOOTH/TEETH REQ CROWNS,,Full Award,,,£980,404
On-line application,Represented,Full Award,2012 Scheme,Male,40,DAMAGE TOOTH/TEETH REQ CROWNS,,Full Award,,,"£1,000",371
On-line application,Not Represented,Full Award,2012 Scheme,Male,39,DAMAGE TOOTH/TEETH REQ CROWNS,,Full Award,,,"£1,000",815
On-line application,Not Represented,Full Award,2012 Scheme,Male,24,DAMAGE TOOTH/TEETH REQ CROWNS,,Full Award,,,"£1,000",313
On-line application,Not Represented,Full Award,2012 Scheme,Male,20,DAMAGE TOOTH/TEETH REQ CROWNS,,Full Award,,,"£1,000",393
On-line application,Represented,Full Award,2012 Scheme,Female,30,DAMAGE TOOTH/TEETH REQ CROWNS,,Full Award,,,£950,622
On-line application,Represented,Full Award,2012 Scheme,Male,54,DAMAGE TOOTH/TEETH REQ CROWNS,,Full Award,,,£0,975
On-line application,Not Represented,Full Award,2012 Scheme,Male,23,DAMAGE TOOTH/TEETH REQ CROWNS,,Full Award,,,"£1,000",1124
On-line application,Represented,Full Award,2012 Scheme,Female,20,DAMAGE TOOTH/TEETH REQ CROWNS,,Full Award,,,"£1,000",496
On-line application,Represented,Full Award,2012 Scheme,Male,47,DAMAGE TOOTH/TEETH REQ CROWNS,,Full Award,,,"£1,000",203
On-line application,Represented,Full Award,2012 Scheme,Male,18,DAMAGE TOOTH/TEETH REQ CROWNS,,Full Award,,,"£1,000",409
On-line application,Not Represented,Full Award,2012 Scheme,Male,22,DAMAGE TOOTH/TEETH REQ CROWNS,,Full Award,,,"£1,250",789
On-line application,Represented,Full Award,2012 Scheme,Male,19,DAMAGE TOOTH/TEETH REQ CROWNS,,Full Award,,,"£1,000",97
On-line application,Not Represented,Reduced Award,2012 Scheme,Male,16,DAMAGE TOOTH/TEETH REQ CROWNS,Applicants criminal record/character,Nil Award,Reduced Award,,£800,719
On-line application,Represented,Full Award,2012 Scheme,Male,17,DAMAGE TOOTH/TEETH REQ CROWNS,,Nil Award,Full Award,,"£1,000",336