{"text_format":"1","workbook":"xlsx","n_sheets":13,"sheets":["Welcome","1a) Model guide","1b) Model steps","1c) Example","1d) Disclaimer","2a) Interventions","2b) Population","2c) Intervention costs","2d) Outcomes","3a) Results summary","3b) Results charts","3c) Sensitivity analysis","Calculations"],"not_rendered":{"charts":6,"images":2,"macros":1,"external_links":0,"defined_names":15,"comments":5,"pivot_tables":0},"unopened":[],"bounds":{"document_bytes":16777216,"sheet_cells":100000,"rows_first":2000,"rows_last":500,"rows_between":2000,"halvings":0,"cell_chars":16384,"cell_head_chars":4096},"cells_cut":0,"cells_raw":0,"read":"whole","date_system":"1900"}

{"sheet":"Welcome","index":0,"n_rows":59,"n_cols":18,"rows_kept":59,"cut":false,"hidden":false,"merged":[[58,11,58,12],[50,11,50,12],[3,7,3,9],[37,17,37,19],[48,6,49,19],[52,6,54,19],[44,6,45,19],[8,6,36,19],[39,6,42,19],[37,6,37,16]]}
[]
[]
[null,null,null,null,null,null,null,"Older Adults' NHS and Social Care ROI Tool "]
[null,null,null,null,null,null,null,"January, 2020"]
[]
[]
[]
[]
[null,null,null,null,null,null,"This is a tool that has been designed for local authorities and other stakeholders in England who wish to assess the return on investment from interventions to reduce the need for social care and health services in older people. The tool has been commissioned by Public Health England and developed by York Health Economics Consortium. The aim of the tool is to aid decision-making and increase the uptake of cost-effective programmes aimed at reducing the need for social care and health services in older people in the community. In total, nine separate programmes are included. These programmes are:\n\n- Community singing\n- Help at home scheme\n- Befriending\n- Dementia (nursing homes)\n- Hospital discharge support\n- Bundle of VCS services for people with long-term conditions\n- Interprofessional working (health coaching)\n- Self-management of COPD\n- Reablement\n\nUsing pre-populated English data, the tool analyses the return on investment for adopting each programme within a specific geographical area (e.g. an individual local authority). It is important to note that, dependent on the nature of the intervention, a positive return on investment may not lead to cash releasing savings. The 'return' may be in the form of increased capacity to cope with rising demand, or may be a contribution towards improved quality of life. \n\nThe model allows users to enter their own data if this is more specific to the local population under investigation and where appropriate includes options to change several model input parameters (e.g. intervention unit costs). The nine programmes included in the tool are not necessarily 'the best' interventions in social care, but those with quality economic evidence suitable for return on investment calculations. The model allows users to enter information on additional interventions through completion of a 'user defined intervention form'. Once completed, the model automatically establishes the return on investment for the user defined intervention in the specified population. The tool contains an in-built user guide providing a step-by-step explanation of how to undertake an analysis, including required methods to update the data. It is recommended that the 'Information' section is read before undertaking any form of analysis which can be accessed using the button on the left. "]
[]
[]
[]
[]
[]
[]
[]
[]
[]
[]
[]
[]
[]
[]
[]
[]
[]
[]
[]
[]
[]
[]
[]
[]
[]
[]
[]
[]
[null,null,null,null,null,null,"For more information on the tool, or to provide feedback on its usability, please contact us at:  ",null,null,null,null,null,null,null,null,null,null,"healtheconomics@phe.gov.uk"]
[]
[null,null,null,null,null,null,"Please note that relevant interventions aimed at older people, covered in other RoI tools published by PHE, were outside the scope of modelling in this tool, in order to avoid duplication. This tool aims to address the gap in the evidence covered by other resources. There are several resources that commissioners interested in older people’s health and social care needs may be interested in looking at in the first instance:"]
[]
[]
[]
[]
[null,null,null,null,null,null,"‒ Falls prevention is very relevant to improving the health of older adults. The Falls Prevention ROI tool looks at four interventions, all of which were shown to be cost-effective in comparison with usual care."]
[]
[null,null,null,null,null,null,"The Falls Prevention ROI tool is available:",null,null,null,null,null,"here"]
[]
[null,null,null,null,null,null,"‒ PHE’s Mental Health ROI tool provides evidence for an intervention addressing loneliness in older people and an intervention aiming to improve the Mental Health of people with long-term physical Health problems."]
[]
[null,null,null,null,null,null,"The Mental Health ROI tool is available:",null,null,null,null,"here"]
[]
[null,null,null,null,null,null,"‒ The Health Economics Evidence Resource (HEER) is a compilation of economic evidence of interventions covering the areas in the Public Health Grant.  Some interventions in the HEER are directly targeted at older adults, eg. a community-based walking programme to improve the mental wellbeing of older people is targeted at sedentary older people has an estimated cost/QALY of £7,300."]
[]
[]
[null,null,null,null,null,null,"The HEER tool is available:",null,null,null,"here "]
[]
[null,null,null,null,null,null,"‒ The cardiovascular disease RoI tool calculates the costs and benefits of secondary prevention of cardiovascular disease."]
[null,null,null,null,null,null,"The Cardiovascular ROI Tool is available:",null,null,null,null,"here"]

{"sheet":"1a) Model guide","index":1,"n_rows":35,"n_cols":9,"rows_kept":35,"cut":false,"hidden":false,"merged":[[12,6,12,8],[13,6,13,8],[15,6,15,8],[16,6,16,8],[10,6,10,8],[18,8,20,8],[22,8,26,8],[28,8,31,8],[33,6,33,8],[34,6,34,8]]}
[]
[]
[]
[]
[]
[]
[]
[]
[]
[null,null,null,null,null,null,"Tool sections:"]
[null,null,null,null,null,null,"The tool is separated into three main sections: Information (currently selected), Inputs and Results. You can navigate between these using the buttons on the left-hand side. Within each section there are also a number of sub-sections and it is possible to navigate amongst them using the buttons at the top of each page (as seen above). It is also possible to navigate across each of the tool's sections and sub-sections using the tabs at the bottom of the page. These tabs are colour coded based on the section that is chosen (i.e. Information, Inputs and Results)."]
[]
[null,null,null,null,null,null,"Navigating around the tool:"]
[null,null,null,null,null,null,"When entering the 'Inputs' section each sub-section should be viewed in-turn (moving from left to right) in order to ensure the inputs for the tool are setup in the appropriate way to generate relevant results. More information on how to setup the tool is given in the remaining pages in this section and also using the in-built user guide. Each sub-section within 'Inputs' has its own user guide which can be selected to explain the information that is presented in that sub-section and how the default data can be updated to model new scenarios (i.e. ones specific to your local area)."]
[]
[null,null,null,null,null,null,"Colour-coding system:"]
[null,null,null,null,null,null,"There are three different types of cells in the tool (inputs, calculations and results) and there is a colour-coding system in place to help distinguish between them:  "]
[]
[null,null,null,null,null,null,null,null,"Input cells contain data for the tool input parameters (e.g. unit costs, efficacy data) and are shown by a yellow background. These cells can be updated if you want to use new values to estimate the tool's results. "]
[]
[]
[]
[null,null,null,null,null,null,null,null,"Calculation cells contain equations that are used to estimate specific inputs that drive the tool's results. For example, to estimate the cost of staff time for a specific intervention the total number of hours required for one staff type (e.g. nurse) will be multiplied by the hourly rate for that staff member. These cells are shown by a light blue background and the values in these cells shouldn't be altered as this will affect the overall results. "]
[]
[]
[]
[]
[]
[null,null,null,null,null,null,null,null,"Result cells contain the main outputs from the tool (e.g. total costs) and these can all be found within the 'Results' section. These cells are shown by a light orange background and, as with the calculation cells, the values presented in these cells should not be altered."]
[]
[]
[]
[]
[null,null,null,null,null,null,"Other features:"]
[null,null,null,null,null,null,"The tool also contains a number of other features that allow for simple operation, including comment boxes that contain information about specific input parameters (an example can be found above this paragraph, viewable by hovering over the red triangle) and dropdown boxes that can be used to select from a number of different options from a pre-defined list (e.g. selected intervention, geographical area)."]

{"sheet":"1b) Model steps","index":2,"n_rows":44,"n_cols":7,"rows_kept":44,"cut":false,"hidden":false,"merged":[]}
[]
[]
[]
[]
[]
[]
[]
[]
[null,null,null,null,null,null,"A number of steps must be followed in order to generate relevant results regarding the return on investment for commissioning each of the interventions included in the tool. If you do not wish to update the data sources used for the tool input parameters then it will be possible to generate results using the default data once a small number of variables have been chosen (e.g. geographical location, intervention choice). However, if you wish to update the values using data specific to your local area this will require further steps to generate appropriate results. These steps are summarised below and more information on updating input parameters is given in the in-built user guide."]
[]
[null,null,null,null,null,null,"INPUTS"]
[]
[null,null,null,null,null,null,"Intervention (2a)"]
[null,null,null,null,null,null,"The return on investment for each included intervention must be assessed individually. Therefore, only one intervention can be chosen for the analysis and this choice should be made using the dropdown menu on the 'Interventions' (2a) page. Within the tool each intervention is compared to current usual care, which is assumed to be no specific interventions to reduce use of social care and health services in older people."]
[]
[]
[null,null,null,null,null,null,"Population (2b)"]
[null,null,null,null,null,null,"Each analysis will be undertaken for a specific population. Therefore, the size of this population must be selected. Once you have navigated to the 'Population' (2b) page a specific geographical area can be selected from a pre-defined list using the dropdown menu. The population is then further refined based on assumption regarding eligibility for and uptake of the intervention. Both of eligibility and uptake can be user entered. It will also be possible to input a new value into the 'user defined' cell if you wish to test a population size that isn't included in the list."]
[]
[]
[null,null,null,null,null,null,"Intervention costs (2c)"]
[null,null,null,null,null,null,"It is important to accurately capture the cost of each of the interventions included in the tool. Intervention costs have already been entered based on information available in the literature . Intervention costs are estimated based on resource units for the intervention (e.g. the number of staff required to administer the intervention). It is recommended that resource units are left unchanged. However, if you may wish to enter unit costs if these are available for your local area, this can be achieved by viewing the cost breakdown section within the 'Intervention costs' (2c) page. "]
[]
[]
[]
[null,null,null,null,null,null,"Outcomes (2d)"]
[null,null,null,null,null,null,"The 'Outcomes' (2d) page includes the change in overall cost per patient and other outcome measures relevant to the intervention of interest, such as quality-adjusted life years (QALYs). As with the resource units, it is not recommended that the values presented in this page are updated. If you wish to examine the impact of alternative values (i.e. an increase or reduction in effectiveness for one intervention) then this can be explored in the sensitivity analyses in the results section. "]
[]
[]
[null,null,null,null,null,null,"RESULTS"]
[]
[null,null,null,null,null,null,"Results summary (3a)"]
[null,null,null,null,null,null,"The tool will automatically produce results based on the parameters that are selected in the Inputs section. This means you can switch between the Inputs and Results at any point to examine the impact of changing the value of the input parameters. The main metric for the tool with be the return on investment for each intervention, should it be implemented in the selected geographical area. The return on investment is calculated using the equation outlined below and will be shown on the 'Results summary' (3a) page. "]
[]
[]
[]
[]
[null,null,null,null,null,null,"Results charts (3b)"]
[null,null,null,null,null,null,"The 'Results charts' (3b) page contains graphical depictions of the main results for the tool and, as with the other results pages, the charts will automatically update based on the parameters selected in the Inputs section. "]
[]
[]
[]
[null,null,null,null,null,null,"Sensitivity analysis (3c)"]
[null,null,null,null,null,null,"It is necessary to examine the impact of changes in the values adopted for the tool input parameters. This is because there is often uncertainty regarding the value that should be applied and, therefore, it is important to highlight the parameters that have the largest impact on the results. Sensitivity analysis allows an examination of the impact of these changes and is achieved by setting a range, rather than a point estimate, for each input parameter and the tool results update accordingly. The ranges used in the 'Sensitivity analysis' (3d) page establish a threshold value for the model parameters where the return on investment would be equal to £1 (i.e. £1 spent produces £1 saved). Threshold values close to the default (base case) parameter value indicate that only small changes are required in the parameter value to change the return on investment result (i.e. where costs > benefits). In contrast, threshold values a long way from the default (base case) parameter value suggest large changes are required in the initial parameter value for interventions not to produce a return on investment. Care should be taken when looking to implement an intervention which has parameters with wide confidence intervals and threshold values close to the base case as uncertainty in the initial parameter value has the potential to influence the ROI result. "]

{"sheet":"1c) Example","index":3,"n_rows":0,"n_cols":0,"rows_kept":0,"cut":false,"hidden":false,"merged":[]}

{"sheet":"1d) Disclaimer","index":4,"n_rows":17,"n_cols":7,"rows_kept":17,"cut":false,"hidden":false,"merged":[]}
[]
[]
[]
[]
[]
[]
[]
[]
[]
[null,null,null,null,null,null,"Disclaimer:"]
[null,null,null,null,null,null,"Public Health England has provided this tool to aid decision-making and cannot be held liable for any investment or other decisions that are made using the information presented. The best available evidence has been used in this tool and assumptions are clearly stated. Local authorities using this tool are advised to seek the support of their Public Health team."]
[]
[null,null,null,null,null,null,"Acknowledgements:"]
[null,null,null,null,null,null,"We would like to thank all of the individuals who contributed towards the development of the tool throughout the testing and quality assurance process. This includes all members of the Steering Group and User Group who provided advice and expertise."]
[]
[null,null,null,null,null,null,"Citation:"]
[null,null,null,null,null,null,"If you wish to cite this tool please use the following: Public Health England. The Older Adults' Social Care return on investment tool. 2019"]

{"sheet":"2a) Interventions","index":5,"n_rows":222,"n_cols":14,"rows_kept":222,"cut":false,"hidden":false,"merged":[[215,7,215,8],[20,6,27,8],[222,6,227,8],[38,7,38,8],[192,7,192,8],[219,7,219,8],[216,7,216,8],[217,7,217,8],[218,7,218,8],[195,6,197,8],[200,6,203,8],[206,6,211,8],[214,7,214,8],[44,6,47,8],[58,6,58,13],[39,7,41,8],[39,6,41,6],[3,15,4,22],[30,6,32,8],[35,7,35,8],[36,7,36,8],[37,7,37,8],[14,6,17,8]]}
[]
[]
[]
[]
[]
[]
[]
[]
[]
[]
[]
[null,null,null,null,null,null,"Select intervention:"]
[]
[null,null,null,null,null,null,"Study underpinning analysis:"]
[null,null,null,null,null,null,{"$f":"CHOOSE(IntChoice,I88,I89,I90,I91,I92,I93,I94,I95,I96,I97)","v":"Dayson et al. (2014). The social and economic impact of the Rotherham Social Prescribing Pilot: main evaluation report."}]
[]
[]
[]
[]
[null,null,null,null,null,null,"Intervention as described in study:"]
[null,null,null,null,null,null,{"$f":"CHOOSE(IntChoice,J88,J89,J90,J91,J92,J93,J94,J95,J96,J97)","v":"A bundle of voluntary and community sector (VCS) services aimed at patients with long-term conditions (LTCs), using social prescribing and other approaches to put patients in touch with services. The scheme was administered by the VCS liaison service in Rotherham providing patients with a range of services including: befriending, arts and crafts groups, exercise classes, complementary therapy and counselling."}]
[]
[]
[]
[]
[]
[]
[]
[]
[null,null,null,null,null,null,"Target population:"]
[null,null,null,null,null,null,{"$f":"CHOOSE(IntChoice,H88,H89,H90,H91,H92,H93,H94,H95,H96,H97)","v":"People with long term health conditions. Typically an older population (87% were 60+)."}]
[]
[]
[]
[null,null,null,null,null,null,"Study characteristics:"]
[null,null,null,null,null,null,"Type of study",{"$f":"VLOOKUP($G$85,$F$100:$K$109,3)","v":"Uncontrolled before-after study"}]
[null,null,null,null,null,null,"Country/Region",{"$f":"VLOOKUP($G$85,$F$100:$K$109,4)","v":"UK: Rotherham"}]
[null,null,null,null,null,null,"Sample size",{"$f":"VLOOKUP($G$85,$F$100:$K$109,5)","v":1607}]
[null,null,null,null,null,null,"Time at which outcomes are reported",{"$f":"VLOOKUP($G$85,$F$100:$K$109,6)","v":"1 & 2 years post-baseline"}]
[null,null,null,null,null,null,"Comparator ",{"$f":"VLOOKUP($G$85,$F$100:$L$109,7)","v":"No comparator group, scores compared for individuals before and after receiving the intervention"}]
[]
[]
[]
[null,null,null,null,null,null,"Study limitations:"]
[null,null,null,null,null,null,{"$f":"CHOOSE(IntChoice,N100,N101,N102,N103,N104,N105,N106,N107,N108,N109)","v":"Uncontrolled before and after study design. QALYs were not measured directly but derived based on scores on a well-being tool developed specifically for the Social Prescribing pilot study. "}]
[]
[]
[]
[]
[null,null,null,null,null,null,"Link to study:"]
[null,null,null,null,null,null,"https://www.ncbi.nlm.nih.gov/pubmed/26089304"]
[null,null,null,null,null,null,"https://www.ncbi.nlm.nih.gov/pubmed/27400985"]
[null,null,null,null,null,null,"http://eprints.lse.ac.uk/32311/"]
[null,null,null,null,null,null,"https://www.ncbi.nlm.nih.gov/pubmed/29408901"]
[null,null,null,null,null,null,"https://www.ncbi.nlm.nih.gov/pubmed/19574331"]
[null,null,null,null,null,null,"http://www.instituteofhealthequity.org/resources-reports/the-social-and-economic-impact-of-the-rotherham-social-prescribing-pilot-main-evaluation-report"]
[null,null,null,null,null,null,"https://www.ncbi.nlm.nih.gov/pubmed/30183219"]
[null,null,null,null,null,null,"https://www.ncbi.nlm.nih.gov/pubmed/23265228"]
[null,null,null,null,null,null,"https://pure.york.ac.uk/portal/en/publications/home-care-reablement-services(058c2053-3860-4ae3-aa76-0e3347515289)/export.html"]
[null,null,null,null,null,null,"N/A"]
[]
[]
[]
[]
[]
[]
[]
[]
[]
[]
[]
[]
[]
[]
[]
[]
[]
[]
[]
[]
[]
[]
[]
[]
[null,null,null,null,null,null,6,{"$f":"CHOOSE(IntChoice,G88,G89,G90,G91,G92,G93,G94,G95,G96,G97)","v":"Bundle of VCS services for people with LTCs"},null,null,"User int tick box",false]
[]
[null,null,null,null,null,null,"Intervention","Target population","Study","Description"]
[null,null,null,null,null,1,"Community singing","All those expressing an interest and aged 60 or over.","Coulton et al. Effectiveness and cost-effectiveness of community singing on mental health-related quality of life of older people: randomised controlled trial. Br J Psychiatry. 2015;207(3):250-55.","A 14-week 90-minute programme of participative singing for older people, to improve mental health-related quality of life.  Groups are led by facilitators over 90-minute sessions.  Participants volunteered for the programme on the basis of publicity.  Took place in five centres in East Kent."]
[null,null,null,null,null,2,"Help at home scheme","People age 55 or over requiring help with day to day activities in their own homes.  ","Bauer et al. (2017). Costs and economic consequences of a help‐at‐home scheme for older people in England. Health & social care in the community, 25(2), 780-789.","Intervention package comprised: A volunteer-provided face-to-face and telephone befriending scheme; a practical home help service for gardening, shopping and cleaning; and welfare benefit advice service. "]
[null,null,null,null,null,3,"Befriending","People aged over 50 who are lonely/isolated.","Knapp et al. (2011). Mental Health Promotion and Prevention: The Economic Case. London: Personal Social Services Research Unit, London School of Economics and Political Science.","A befriender visits person in their home on a 1:1 basis either for 1hr/week or 1hr/fortnightly. Participants are matched on interests. Visits are unstructured and aim to develop a natural relationship between participants promoting social inclusion, mental health and reducing loneliness. "]
[null,null,null,null,null,4,"Dementia: nursing homes","People with dementia who are currently living in a nursing home.","Ballard et al. (2018). Impact of person-centred care training and person-centred activities on quality of life, agitation, and antipsychotic use in people with dementia living in nursing homes: A cluster-randomised controlled trial. PLoS medicine, 15(2), e1002500.","The WHELD programme, an intervention which aims to reduce agitation in people with dementia living in nursing homes. Provides training for nursing staff in person centred care, social interaction and guidance on the use of antipsychotic medications. "]
[null,null,null,null,null,5,"Hospital discharge support","People with (stage 2 or 3) COPD with impaired exercise capacity.","Hoogendoorn et al. (2010). Is INTERdisciplinary COMmunity-based COPD management (INTERCOM) cost-effective?. European Respiratory Journal, 35(1), 79-87.","The INTERCOM programme: Interdisciplinary community-based COPD management. 4-month programme consisting of exercise training, education, nutritional therapy and smoking cessation counselling offered by community based physiotherapists and dieticians and hospital-based respiratory nurses."]
[null,null,null,null,null,6,"Bundle of VCS services for people with LTCs","People with long term health conditions. Typically an older population (87% were 60+).","Dayson et al. (2014). The social and economic impact of the Rotherham Social Prescribing Pilot: main evaluation report.","A bundle of voluntary and community sector (VCS) services aimed at patients with long-term conditions (LTCs), using social prescribing and other approaches to put patients in touch with services. The scheme was administered by the VCS liaison service in Rotherham providing patients with a range of services including: befriending, arts and crafts groups, exercise classes, complementary therapy and counselling."]
[null,null,null,null,null,7,"Interprofessional working (health coaching)","People aged 65 or over who have two or more existing long term conditions.","Bower et al. (2018). Improving care for older people with long-term conditions and social care needs in Salford: the CLASSIC mixed-methods study, including RCT. Health Services and Delivery Research.","Health coaching was introduced as one of several interventions in the Salford Integrated Care Programme which aimed to join together professionals to provide integrated health and social care services. Health coaching involved a regular series of phone calls between patient and professionals to provide support and encouragement to the patient, and promote healthy behaviours such as treatment control, healthy diet, physical activity and mobility, rehabilitation, and good mental health.  "]
[null,null,null,null,null,8,"Self-management of COPD","People with moderate to severe COPD (average age 69).","Taylor et al. (2012). Self-management support for moderate-to-severe chronic obstructive pulmonary disease: a pilot randomised controlled trial. Br J Gen Pract, 62(603), e687-e695.","The Better Living with Long term Airways disease (BELLA) intervention addressed five core self-management skills: defining the problem, decision making, finding and using resources, forming partnerships with healthcare providers, and taking action. Each course involved two trained lay (peer) tutors (at least one of whom had COPD), who delivered a structured, manualised, 3-hour session once a week for 7 weeks at a local community centre.  One of the sessions included input from a respiratory consultant.  "]
[null,null,null,null,null,9,"Reablement","Older people struggling to cope with day to day activities without relying on social care services.","Glendinning et al. (2010). Home care re-ablement services: investigating the longer-term impacts (prospective longitudinal study). York/Canterburry: Social Policy Research Unit (SPRU)/Personal Social Service Research Unit (PSSRU).","Homecare reablement is an approach within home care services which aims to help people do things for themselves rather than relying on social support. The intervention was delivered across five different sites for a period of up to six weeks. A range of interventions were offered including personal care (e.g. assistance with washing and dressing), practical support (e.g. meal preparation), prompting medication, information, psychological and emotional support, increasing social engagements, and advice to reduce the risk of falls."]
[null,null,null,null,null,10,{"$f":"IF($L$85=TRUE,H193,\"User defined intervention\")","v":"User defined intervention"},{"$f":"IF($L$85=TRUE,G196,\"Please complete user intervention form\")","v":"Please complete user intervention form"},{"$f":"IF($L$85=TRUE,G201,\"Please complete user intervention form\")","v":"Please complete user intervention form"},{"$f":"IF($L$85=TRUE,G207,\"Please complete user intervention form\")","v":"Please complete user intervention form"}]
[]
[null,null,null,null,null,null,null,"Type of study","Country/Region","Sample size","Time at which outcomes reported","Comparator","Time Horizon (months)","Study limitations"]
[null,null,null,null,null,1,"Community singing","Pilot, pragmatic randomised controlled trial","UK: East Kent",258,"6 months post-baseline","Usual care",6,"Small pilot study with relatively short time horizon (6-months)."]
[null,null,null,null,null,2,"Help at home scheme","Cross sectional survey & economic model","UK: Shropshire",856,"Retrospective questionnaire (prior 6 months of resource use)","New service users who have just started using the scheme",6,"The study was not randomised. The comparator was a relatively small group of new service users. QALYs were not derived directly from a HRQoL questionnaire. Outcomes were not measured at baseline. "]
[null,null,null,null,null,3,"Befriending","Economic model","UK","N/A","1 year time horizon","Usual care",12,"The study is reported in very little detail as it is one of several interventions summarised in a larger report.  It is not possible to appraise the validity of methods/results. "]
[null,null,null,null,null,4,"Dementia: Nursing homes","Randomised controlled cluster trial","UK: South London, North London, Buckinghamshire",847,"9 months post-baseline","Treatment as Usual",9,"Relatively short time horizon (9-months)."]
[null,null,null,null,null,5,"Hospital discharge support","Single blinded, prospective RCT","Netherlands",199,"2 years post-baseline","Usual care",24,"Results may not be generalisable to the UK as the study was conducted in the Netherlands. Outcomes reported as mean across study time horizon and not adjusted for baseline characteristics. "]
[null,null,null,null,null,6,"Social prescribing","Uncontrolled before-after study","UK: Rotherham",1607,"1 & 2 years post-baseline","No comparator group, scores compared for individuals before and after receiving the intervention",24,"Uncontrolled before and after study design. QALYs were not measured directly but derived based on scores on a well-being tool developed specifically for the Social Prescribing pilot study. "]
[null,null,null,null,null,7,"Interprofessional working (health coaching)","Randomised controlled trial and cost-effectiveness analysis ","UK: Salford",1306,"Multiple time points over 20 month time horizon","Usual care",20,"Results may not be generalisable to all regions of the UK as the study was conducted in a location with high levels of deprivation. Intervention benefits were not statistically significant for clinical or economic endpoints. "]
[null,null,null,null,null,8,"Self-management of COPD","Pilot randomised controlled study and cost-effectiveness analysis ","UK",78,"2 and 6-months post baseline","Usual care",6,"The study was a small pilot RCT therefore results may not be generalisable in the wider population. Clinical benefits were not statistically significant possibly due to the small sample size. "]
[null,null,null,null,null,9,"Reablement","A non-randomised comparative study","UK",1015,"8 weeks and 12 months post intervention","Usual care",12,"The study was not randomised. Impact of intervention on costs and QALYs was not statistically significant."]
[null,null,null,null,null,10,{"$f":"IF($L$85=TRUE,H193,\"\")","v":""},{"$f":"IF($L$85=TRUE,H215,\"Please complete user intervention form\")","v":"Please complete user intervention form"},{"$f":"IF($L$85=TRUE,H216,\"Please complete user intervention form\")","v":"Please complete user intervention form"},{"$f":"IF($L$85=TRUE,H217,\"Please complete user intervention form\")","v":"Please complete user intervention form"},{"$f":"IF($L$85=TRUE,H218,\"Please complete user intervention form\")","v":"Please complete user intervention form"},{"$f":"IF($L$85=TRUE,H219,\"Please complete user intervention form\")","v":"Please complete user intervention form"},{"$f":"IF($L$85=TRUE,H220,\"Please complete user intervention form\")","v":"Please complete user intervention form"},{"$f":"IF($L$85=TRUE,G223,\"Please complete user intervention form\")","v":"Please complete user intervention form"}]
[]
[]
[]
[]
[]
[]
[]
[]
[]
[]
[]
[]
[]
[]
[]
[]
[]
[]
[]
[]
[]
[]
[]
[]
[]
[]
[]
[]
[]
[]
[]
[]
[]
[]
[]
[]
[]
[]
[]
[]
[]
[]
[]
[]
[]
[]
[]
[]
[]
[]
[]
[]
[]
[]
[]
[]
[]
[]
[]
[]
[]
[]
[]
[]
[]
[]
[]
[]
[]
[]
[]
[]
[]
[]
[]
[]
[null,null,null,null,null,null,"USER INTERVENTION FORM"]
[]
[]
[]
[]
[]
[]
[null,null,null,null,null,null,"Name of Intervention:"]
[]
[null,null,null,null,null,null,"Target population:"]
[]
[]
[]
[]
[null,null,null,null,null,null,"Study underpinning analysis:"]
[]
[]
[]
[]
[]
[null,null,null,null,null,null,"Intervention as described in study:"]
[]
[]
[]
[]
[]
[]
[]
[null,null,null,null,null,null,"Study characteristics:"]
[null,null,null,null,null,null,"Type of study"]
[null,null,null,null,null,null,"Country/Region"]
[null,null,null,null,null,null,"Sample size"]
[null,null,null,null,null,null,"Time at which outcomes are reported"]
[null,null,null,null,null,null,"Comparator "]
[null,null,null,null,null,null,"Time horizon (months)"]
[]
[null,null,null,null,null,null,"Study limitations:"]

{"sheet":"2b) Population","index":6,"n_rows":1641,"n_cols":29,"rows_kept":1641,"cut":false,"hidden":false,"merged":[[1625,4,1625,6],[1626,4,1626,6],[1627,4,1627,6],[1628,4,1628,6],[1632,3,1632,6],[1637,3,1637,6],[1638,3,1638,6],[1639,3,1639,6],[1248,3,1248,6],[1249,3,1249,6],[1250,3,1250,6],[1254,3,1254,6],[1255,3,1255,6],[1256,3,1256,6],[1227,3,1227,6],[1228,3,1228,6],[1229,3,1229,6],[1230,3,1230,6],[1231,3,1231,6],[1232,3,1232,6],[1233,3,1233,6],[1234,3,1234,6],[1237,3,1237,6],[1238,3,1238,6],[1239,3,1239,6],[1240,3,1240,6],[1241,3,1241,6],[1242,3,1242,6],[1243,3,1243,6],[1244,3,1244,6],[1245,3,1245,6],[1306,3,1306,6],[901,4,901,6],[896,3,896,6],[899,4,899,6],[1222,4,1222,6],[1213,4,1213,6],[1214,4,1214,6],[1215,4,1215,6],[1216,4,1216,6],[1217,4,1217,6],[1218,4,1218,6],[1219,4,1219,6],[1220,4,1220,6],[1221,4,1221,6],[1204,4,1204,6],[1205,4,1205,6],[1206,4,1206,6],[1207,4,1207,6],[1208,4,1208,6],[1209,4,1209,6],[1210,4,1210,6],[1211,4,1211,6],[1212,4,1212,6],[1195,4,1195,6],[1196,4,1196,6],[1197,4,1197,6],[1198,4,1198,6],[1199,4,1199,6],[1200,4,1200,6],[1201,4,1201,6],[1202,4,1202,6],[1203,4,1203,6],[1186,4,1186,6],[1187,4,1187,6],[1188,4,1188,6],[1189,4,1189,6],[1190,4,1190,6],[1191,4,1191,6],[1192,4,1192,6],[1193,4,1193,6],[1194,4,1194,6],[1177,4,1177,6],[1178,4,1178,6],[1179,4,1179,6],[1180,4,1180,6],[1181,4,1181,6],[1182,4,1182,6],[1183,4,1183,6],[1184,4,1184,6],[1185,4,1185,6],[1168,4,1168,6],[1169,4,1169,6],[1170,4,1170,6],[1171,4,1171,6],[1172,4,1172,6],[1173,4,1173,6],[1174,4,1174,6],[1175,4,1175,6],[1176,4,1176,6],[1159,4,1159,6],[1160,4,1160,6],[1161,4,1161,6],[1162,4,1162,6],[1163,4,1163,6],[1164,4,1164,6],[1165,4,1165,6],[1166,4,1166,6],[1167,4,1167,6],[1150,4,1150,6],[1151,4,1151,6],[1152,4,1152,6],[1153,4,1153,6],[1154,4,1154,6],[1155,4,1155,6],[1156,4,1156,6],[1157,4,1157,6],[1158,4,1158,6],[1141,4,1141,6],[1142,4,1142,6],[1143,4,1143,6],[1144,4,1144,6],[1145,4,1145,6],[1146,4,1146,6],[1147,4,1147,6],[1148,4,1148,6],[1149,4,1149,6],[1132,4,1132,6],[1133,4,1133,6],[1134,4,1134,6],[1135,4,1135,6],[1136,4,1136,6],[1137,4,1137,6],[1138,4,1138,6],[1139,4,1139,6],[1140,4,1140,6],[1123,4,1123,6],[1124,4,1124,6],[1125,4,1125,6],[1126,4,1126,6],[1127,4,1127,6],[1128,4,1128,6],[1129,4,1129,6],[1130,4,1130,6],[1131,4,1131,6],[1114,4,1114,6],[1115,4,1115,6],[1116,4,1116,6],[1117,4,1117,6],[1118,4,1118,6],[1119,4,1119,6],[1120,4,1120,6],[1121,4,1121,6],[1122,4,1122,6],[1105,4,1105,6],[1106,4,1106,6],[1107,4,1107,6],[1108,4,1108,6],[1109,4,1109,6],[1110,4,1110,6],[1111,4,1111,6],[1112,4,1112,6],[1113,4,1113,6],[1096,4,1096,6],[1097,4,1097,6],[1098,4,1098,6],[1099,4,1099,6],[1100,4,1100,6],[1101,4,1101,6],[1102,4,1102,6],[1103,4,1103,6],[1104,4,1104,6],[1087,4,1087,6],[1088,4,1088,6],[1089,4,1089,6],[1090,4,1090,6],[1091,4,1091,6],[1092,4,1092,6],[1093,4,1093,6],[1094,4,1094,6],[1095,4,1095,6],[1078,4,1078,6],[1079,4,1079,6],[1080,4,1080,6],[1081,4,1081,6],[1082,4,1082,6],[1083,4,1083,6],[1084,4,1084,6],[1085,4,1085,6],[1086,4,1086,6],[1069,4,1069,6],[1070,4,1070,6],[1071,4,1071,6],[1072,4,1072,6],[1073,4,1073,6],[1074,4,1074,6],[1075,4,1075,6],[1076,4,1076,6],[1077,4,1077,6],[1060,4,1060,6],[1061,4,1061,6],[1062,4,1062,6],[1063,4,1063,6],[1064,4,1064,6],[1065,4,1065,6],[1066,4,1066,6],[1067,4,1067,6],[1068,4,1068,6],[1051,4,1051,6],[1052,4,1052,6],[1053,4,1053,6],[1054,4,1054,6],[1055,4,1055,6],[1056,4,1056,6],[1057,4,1057,6],[1058,4,1058,6],[1059,4,1059,6],[1042,4,1042,6],[1043,4,1043,6],[1044,4,1044,6],[1045,4,1045,6],[1046,4,1046,6],[1047,4,1047,6],[1048,4,1048,6],[1049,4,1049,6],[1050,4,1050,6],[1033,4,1033,6],[1034,4,1034,6],[1035,4,1035,6],[1036,4,1036,6],[1037,4,1037,6],[1038,4,1038,6],[1039,4,1039,6],[1040,4,1040,6],[1041,4,1041,6],[1024,4,1024,6],[1025,4,1025,6],[1026,4,1026,6],[1027,4,1027,6],[1028,4,1028,6],[1029,4,1029,6],[1030,4,1030,6],[1031,4,1031,6],[1032,4,1032,6],[1015,4,1015,6],[1016,4,1016,6],[1017,4,1017,6],[1018,4,1018,6],[1019,4,1019,6],[1020,4,1020,6],[1021,4,1021,6],[1022,4,1022,6],[1023,4,1023,6],[1006,4,1006,6],[1007,4,1007,6],[1008,4,1008,6],[1009,4,1009,6],[1010,4,1010,6],[1011,4,1011,6],[1012,4,1012,6],[1013,4,1013,6],[1014,4,1014,6],[997,4,997,6],[998,4,998,6],[999,4,999,6],[1000,4,1000,6],[1001,4,1001,6],[1002,4,1002,6],[1003,4,1003,6],[1004,4,1004,6],[1005,4,1005,6],[988,4,988,6],[989,4,989,6],[990,4,990,6],[991,4,991,6],[992,4,992,6],[993,4,993,6],[994,4,994,6],[995,4,995,6],[996,4,996,6],[979,4,979,6],[980,4,980,6],[981,4,981,6],[982,4,982,6],[983,4,983,6],[984,4,984,6],[985,4,985,6],[986,4,986,6],[987,4,987,6],[970,4,970,6],[971,4,971,6],[972,4,972,6],[973,4,973,6],[974,4,974,6],[975,4,975,6],[976,4,976,6],[977,4,977,6],[978,4,978,6],[961,4,961,6],[962,4,962,6],[963,4,963,6],[964,4,964,6],[965,4,965,6],[966,4,966,6],[967,4,967,6],[968,4,968,6],[969,4,969,6],[952,4,952,6],[953,4,953,6],[954,4,954,6],[955,4,955,6],[956,4,956,6],[957,4,957,6],[958,4,958,6],[959,4,959,6],[960,4,960,6],[943,4,943,6],[944,4,944,6],[945,4,945,6],[946,4,946,6],[947,4,947,6],[948,4,948,6],[949,4,949,6],[950,4,950,6],[951,4,951,6],[930,4,930,6],[931,4,931,6],[936,4,936,6],[937,4,937,6],[938,4,938,6],[939,4,939,6],[940,4,940,6],[941,4,941,6],[942,4,942,6],[1215,2,1215,3],[1216,2,1216,3],[1217,2,1217,3],[1218,2,1218,3],[1219,2,1219,3],[1220,2,1220,3],[1221,2,1221,3],[1222,2,1222,3],[1207,2,1207,3],[1208,2,1208,3],[1209,2,1209,3],[1210,2,1210,3],[1211,2,1211,3],[1212,2,1212,3],[1213,2,1213,3],[1214,2,1214,3],[1194,2,1194,3],[1195,2,1195,3],[1196,2,1196,3],[1179,2,1179,3],[1180,2,1180,3],[1181,2,1181,3],[1182,2,1182,3],[906,4,906,6],[907,4,907,6],[908,4,908,6],[909,4,909,6],[910,4,910,6],[911,4,911,6],[912,4,912,6],[913,4,913,6],[914,4,914,6],[915,4,915,6],[916,4,916,6],[917,4,917,6],[918,4,918,6],[919,4,919,6],[920,4,920,6],[921,4,921,6],[1206,2,1206,3],[1197,2,1197,3],[1198,2,1198,3],[1199,2,1199,3],[1200,2,1200,3],[1201,2,1201,3],[1202,2,1202,3],[1203,2,1203,3],[1204,2,1204,3],[1205,2,1205,3],[1188,2,1188,3],[1189,2,1189,3],[1190,2,1190,3],[1191,2,1191,3],[1192,2,1192,3],[1193,2,1193,3],[1183,2,1183,3],[1184,2,1184,3],[1185,2,1185,3],[1186,2,1186,3],[1187,2,1187,3],[1170,2,1170,3],[1171,2,1171,3],[1172,2,1172,3],[1173,2,1173,3],[1174,2,1174,3],[1175,2,1175,3],[1176,2,1176,3],[1177,2,1177,3],[1178,2,1178,3],[1161,2,1161,3],[1162,2,1162,3],[1163,2,1163,3],[1164,2,1164,3],[1165,2,1165,3],[1166,2,1166,3],[1167,2,1167,3],[1168,2,1168,3],[1169,2,1169,3],[1152,2,1152,3],[1153,2,1153,3],[1154,2,1154,3],[1155,2,1155,3],[1156,2,1156,3],[1157,2,1157,3],[1158,2,1158,3],[1159,2,1159,3],[1160,2,1160,3],[1143,2,1143,3],[1144,2,1144,3],[1145,2,1145,3],[1146,2,1146,3],[1147,2,1147,3],[1148,2,1148,3],[1149,2,1149,3],[1150,2,1150,3],[1151,2,1151,3],[1134,2,1134,3],[1135,2,1135,3],[1136,2,1136,3],[1137,2,1137,3],[1138,2,1138,3],[1139,2,1139,3],[1140,2,1140,3],[1141,2,1141,3],[1142,2,1142,3],[1125,2,1125,3],[1126,2,1126,3],[1127,2,1127,3],[1128,2,1128,3],[1129,2,1129,3],[1130,2,1130,3],[1131,2,1131,3],[1132,2,1132,3],[1133,2,1133,3],[1116,2,1116,3],[1117,2,1117,3],[1118,2,1118,3],[1119,2,1119,3],[1120,2,1120,3],[1121,2,1121,3],[1122,2,1122,3],[1123,2,1123,3],[1124,2,1124,3],[1107,2,1107,3],[1108,2,1108,3],[1109,2,1109,3],[1110,2,1110,3],[1111,2,1111,3],[1112,2,1112,3],[1113,2,1113,3],[1114,2,1114,3],[1115,2,1115,3],[1098,2,1098,3],[1099,2,1099,3],[1100,2,1100,3],[1101,2,1101,3],[1102,2,1102,3],[1103,2,1103,3],[1104,2,1104,3],[1105,2,1105,3],[1106,2,1106,3],[1089,2,1089,3],[1090,2,1090,3],[1091,2,1091,3],[1092,2,1092,3],[1093,2,1093,3],[1094,2,1094,3],[1095,2,1095,3],[1096,2,1096,3],[1097,2,1097,3],[1080,2,1080,3],[1081,2,1081,3],[1082,2,1082,3],[1083,2,1083,3],[1084,2,1084,3],[1085,2,1085,3],[1086,2,1086,3],[1087,2,1087,3],[1088,2,1088,3],[1071,2,1071,3],[1072,2,1072,3],[1073,2,1073,3],[1074,2,1074,3],[1075,2,1075,3],[1076,2,1076,3],[1077,2,1077,3],[1078,2,1078,3],[1079,2,1079,3],[1062,2,1062,3],[1063,2,1063,3],[1064,2,1064,3],[1065,2,1065,3],[1066,2,1066,3],[1067,2,1067,3],[1068,2,1068,3],[1069,2,1069,3],[1070,2,1070,3],[1053,2,1053,3],[1054,2,1054,3],[1055,2,1055,3],[1056,2,1056,3],[1057,2,1057,3],[1058,2,1058,3],[1059,2,1059,3],[1060,2,1060,3],[1061,2,1061,3],[1044,2,1044,3],[1045,2,1045,3],[1046,2,1046,3],[1047,2,1047,3],[1048,2,1048,3],[1049,2,1049,3],[1050,2,1050,3],[1051,2,1051,3],[1052,2,1052,3],[1035,2,1035,3],[1036,2,1036,3],[1037,2,1037,3],[1038,2,1038,3],[1039,2,1039,3],[1040,2,1040,3],[1041,2,1041,3],[1042,2,1042,3],[1043,2,1043,3],[1026,2,1026,3],[1027,2,1027,3],[1028,2,1028,3],[1029,2,1029,3],[1030,2,1030,3],[1031,2,1031,3],[1032,2,1032,3],[1033,2,1033,3],[1034,2,1034,3],[1017,2,1017,3],[1018,2,1018,3],[1019,2,1019,3],[1020,2,1020,3],[1021,2,1021,3],[1022,2,1022,3],[1023,2,1023,3],[1024,2,1024,3],[1025,2,1025,3],[1008,2,1008,3],[1009,2,1009,3],[1010,2,1010,3],[1011,2,1011,3],[1012,2,1012,3],[1013,2,1013,3],[1014,2,1014,3],[1015,2,1015,3],[1016,2,1016,3],[999,2,999,3],[1000,2,1000,3],[1001,2,1001,3],[1002,2,1002,3],[1003,2,1003,3],[1004,2,1004,3],[1005,2,1005,3],[1006,2,1006,3],[1007,2,1007,3],[990,2,990,3],[991,2,991,3],[992,2,992,3],[993,2,993,3],[994,2,994,3],[995,2,995,3],[996,2,996,3],[997,2,997,3],[998,2,998,3],[981,2,981,3],[982,2,982,3],[983,2,983,3],[984,2,984,3],[985,2,985,3],[986,2,986,3],[987,2,987,3],[988,2,988,3],[989,2,989,3],[972,2,972,3],[973,2,973,3],[974,2,974,3],[975,2,975,3],[976,2,976,3],[977,2,977,3],[978,2,978,3],[979,2,979,3],[980,2,980,3],[963,2,963,3],[964,2,964,3],[965,2,965,3],[966,2,966,3],[967,2,967,3],[968,2,968,3],[969,2,969,3],[970,2,970,3],[971,2,971,3],[954,2,954,3],[955,2,955,3],[956,2,956,3],[957,2,957,3],[958,2,958,3],[959,2,959,3],[960,2,960,3],[961,2,961,3],[962,2,962,3],[945,2,945,3],[946,2,946,3],[947,2,947,3],[948,2,948,3],[949,2,949,3],[950,2,950,3],[951,2,951,3],[952,2,952,3],[953,2,953,3],[936,2,936,3],[937,2,937,3],[938,2,938,3],[939,2,939,3],[940,2,940,3],[941,2,941,3],[942,2,942,3],[943,2,943,3],[944,2,944,3],[923,2,923,3],[924,2,924,3],[925,2,925,3],[926,2,926,3],[927,2,927,3],[928,2,928,3],[929,2,929,3],[930,2,930,3],[931,2,931,3],[932,2,932,3],[933,2,933,3],[934,2,934,3],[935,2,935,3],[914,2,914,3],[915,2,915,3],[916,2,916,3],[917,2,917,3],[918,2,918,3],[919,2,919,3],[920,2,920,3],[921,2,921,3],[922,2,922,3],[906,2,906,3],[907,2,907,3],[908,2,908,3],[909,2,909,3],[910,2,910,3],[911,2,911,3],[912,2,912,3],[913,2,913,3],[712,16,712,18],[728,16,728,18],[727,16,727,18],[726,16,726,18],[725,16,725,18],[724,16,724,18],[723,16,723,18],[692,14,692,15],[691,14,691,15],[849,4,849,6],[850,4,850,6],[851,4,851,6],[852,4,852,6],[853,4,853,6],[844,4,844,6],[845,4,845,6],[846,4,846,6],[847,4,847,6],[848,4,848,6],[839,4,839,6],[840,4,840,6],[841,4,841,6],[842,4,842,6],[843,4,843,6],[829,4,829,6],[830,4,830,6],[831,4,831,6],[832,4,832,6],[833,4,833,6],[824,4,824,6],[825,4,825,6],[826,4,826,6],[879,4,879,6],[677,4,677,7],[874,4,874,6],[875,4,875,6],[876,4,876,6],[877,4,877,6],[878,4,878,6],[869,4,869,6],[870,4,870,6],[871,4,871,6],[872,4,872,6],[873,4,873,6],[864,4,864,6],[865,4,865,6],[866,4,866,6],[867,4,867,6],[868,4,868,6],[859,4,859,6],[860,4,860,6],[861,4,861,6],[862,4,862,6],[863,4,863,6],[854,4,854,6],[855,4,855,6],[856,4,856,6],[857,4,857,6],[858,4,858,6],[834,4,834,6],[835,4,835,6],[836,4,836,6],[837,4,837,6],[838,4,838,6],[827,4,827,6],[828,4,828,6],[819,4,819,6],[820,4,820,6],[821,4,821,6],[822,4,822,6],[823,4,823,6],[814,4,814,6],[815,4,815,6],[816,4,816,6],[817,4,817,6],[818,4,818,6],[809,4,809,6],[810,4,810,6],[811,4,811,6],[812,4,812,6],[813,4,813,6],[804,4,804,6],[805,4,805,6],[806,4,806,6],[807,4,807,6],[808,4,808,6],[799,4,799,6],[800,4,800,6],[801,4,801,6],[802,4,802,6],[803,4,803,6],[794,4,794,6],[795,4,795,6],[796,4,796,6],[797,4,797,6],[798,4,798,6],[789,4,789,6],[790,4,790,6],[791,4,791,6],[792,4,792,6],[793,4,793,6],[784,4,784,6],[785,4,785,6],[786,4,786,6],[787,4,787,6],[788,4,788,6],[779,4,779,6],[780,4,780,6],[781,4,781,6],[782,4,782,6],[783,4,783,6],[774,4,774,6],[775,4,775,6],[776,4,776,6],[777,4,777,6],[778,4,778,6],[769,4,769,6],[770,4,770,6],[771,4,771,6],[772,4,772,6],[773,4,773,6],[761,4,761,6],[762,4,762,6],[763,4,763,6],[754,4,754,6],[755,4,755,6],[756,4,756,6],[757,4,757,6],[758,4,758,6],[729,4,729,6],[730,4,730,6],[749,4,749,6],[750,4,750,6],[751,4,751,6],[752,4,752,6],[753,4,753,6],[744,4,744,6],[745,4,745,6],[746,4,746,6],[747,4,747,6],[748,4,748,6],[739,4,739,6],[740,4,740,6],[741,4,741,6],[742,4,742,6],[743,4,743,6],[724,4,724,6],[725,4,725,6],[726,4,726,6],[727,4,727,6],[728,4,728,6],[719,4,719,6],[720,4,720,6],[721,4,721,6],[722,4,722,6],[723,4,723,6],[684,4,684,6],[685,4,685,6],[686,4,686,6],[687,4,687,6],[688,4,688,6],[699,4,699,6],[710,4,710,6],[711,4,711,6],[712,4,712,6],[713,4,713,6],[704,4,704,6],[705,4,705,6],[706,4,706,6],[707,4,707,6],[708,4,708,6],[700,4,700,6],[701,4,701,6],[702,4,702,6],[703,4,703,6],[879,2,879,3],[684,14,684,15],[680,2,680,3],[874,2,874,3],[875,2,875,3],[876,2,876,3],[877,2,877,3],[878,2,878,3],[869,2,869,3],[870,2,870,3],[871,2,871,3],[872,2,872,3],[873,2,873,3],[864,2,864,3],[865,2,865,3],[866,2,866,3],[867,2,867,3],[689,4,689,6],[690,4,690,6],[868,2,868,3],[859,2,859,3],[860,2,860,3],[861,2,861,3],[862,2,862,3],[863,2,863,3],[854,2,854,3],[855,2,855,3],[856,2,856,3],[857,2,857,3],[858,2,858,3],[733,4,733,6],[849,2,849,3],[850,2,850,3],[851,2,851,3],[852,2,852,3],[853,2,853,3],[844,2,844,3],[845,2,845,3],[846,2,846,3],[847,2,847,3],[848,2,848,3],[839,2,839,3],[840,2,840,3],[841,2,841,3],[842,2,842,3],[843,2,843,3],[834,2,834,3],[835,2,835,3],[836,2,836,3],[837,2,837,3],[838,2,838,3],[829,2,829,3],[830,2,830,3],[831,2,831,3],[832,2,832,3],[833,2,833,3],[824,2,824,3],[825,2,825,3],[826,2,826,3],[827,2,827,3],[828,2,828,3],[819,2,819,3],[820,2,820,3],[821,2,821,3],[822,2,822,3],[823,2,823,3],[814,2,814,3],[815,2,815,3],[816,2,816,3],[817,2,817,3],[818,2,818,3],[809,2,809,3],[810,2,810,3],[811,2,811,3],[812,2,812,3],[813,2,813,3],[804,2,804,3],[805,2,805,3],[806,2,806,3],[807,2,807,3],[808,2,808,3],[799,2,799,3],[800,2,800,3],[801,2,801,3],[802,2,802,3],[803,2,803,3],[794,2,794,3],[795,2,795,3],[796,2,796,3],[797,2,797,3],[798,2,798,3],[789,2,789,3],[790,2,790,3],[791,2,791,3],[792,2,792,3],[793,2,793,3],[784,2,784,3],[785,2,785,3],[786,2,786,3],[787,2,787,3],[788,2,788,3],[779,2,779,3],[780,2,780,3],[781,2,781,3],[782,2,782,3],[783,2,783,3],[774,2,774,3],[775,2,775,3],[776,2,776,3],[777,2,777,3],[778,2,778,3],[769,2,769,3],[770,2,770,3],[771,2,771,3],[772,2,772,3],[773,2,773,3],[764,2,764,3],[765,2,765,3],[766,2,766,3],[767,2,767,3],[768,2,768,3],[759,2,759,3],[760,2,760,3],[761,2,761,3],[762,2,762,3],[763,2,763,3],[754,2,754,3],[755,2,755,3],[756,2,756,3],[757,2,757,3],[758,2,758,3],[749,2,749,3],[750,2,750,3],[751,2,751,3],[752,2,752,3],[753,2,753,3],[744,2,744,3],[745,2,745,3],[746,2,746,3],[747,2,747,3],[748,2,748,3],[740,2,740,3],[741,2,741,3],[742,2,742,3],[743,2,743,3],[734,2,734,3],[735,2,735,3],[736,2,736,3],[737,2,737,3],[738,2,738,3],[731,2,731,3],[732,2,732,3],[733,2,733,3],[724,2,724,3],[725,2,725,3],[726,2,726,3],[727,2,727,3],[728,2,728,3],[739,2,739,3],[722,2,722,3],[723,2,723,3],[714,2,714,3],[715,2,715,3],[716,2,716,3],[717,2,717,3],[718,2,718,3],[729,2,729,3],[730,2,730,3]],"merged_total":1582,"flags":["merged_cut"]}
[]
[]
[]
[]
[]
[]
[]
[]
[]
[]
[]
[null,null,null,null,null,null,"Select intervention:"]
[]
[null,null,null,null,null,null,"Select population source:"]
[]
[]
[null,null,null,null,null,null,"LEVEL OF ANALYSIS"]
[]
[null,null,null,null,null,null,"Select National, LA, CCG or STP level analysis: "]
[]
[null,null,null,null,null,null,null,"Select Nation:"]
[]
[null,null,null,null,null,null,null,"Select Local Authority:"]
[]
[null,null,null,null,null,null,null,"Select CCG:"]
[]
[null,null,null,null,null,null,null,"Select STP:"]
[]
[]
[]
[null,null,null,null,null,null,"ELIGIBILITY "]
[]
[null,null,null,null,null,null,"Study population:",null,{"$f":"CHOOSE('2a) Interventions'!G85,'2a) Interventions'!H88,'2a) Interventions'!H89,'2a) Interventions'!H90,'2a) Interventions'!H91,'2a) Interventions'!H92,'2a) Interventions'!H93,'2a) Interventions'!H94,'2a) Interventions'!H95,'2a) Interventions'!H96,'2a) Interventions'!H97)","v":"People with long term health conditions. Typically an older population (87% were 60+)."}]
[]
[]
[]
[null,null,null,null,null,null,"Select age bracket eligible for intervention:"]
[]
[null,null,null,null,null,null,"Select method to establish eligible population:"]
[]
[null,null,null,null,null,null,null,"% of population eligible for intervention: ",null,null,{"$f":"CHOOSE(IntChoice,'2b) Population'!J251,'2b) Population'!J252,'2b) Population'!J253,'2b) Population'!J254,'2b) Population'!J255,'2b) Population'!J256,'2b) Population'!J257,'2b) Population'!J258,'2b) Population'!J259,'2b) Population'!J260)","v":0.05}]
[]
[null,null,null,null,null,null,null,"Click to view data sources and assumptions:"]
[]
[null,null,null,null,null,null,null,"Enter % eligible for intervention:",null,null,0.1]
[]
[]
[]
[null,null,null,null,null,null,"UPTAKE"]
[]
[null,null,null,null,null,null,"Enter % uptake of intervention in eligible population:",null,null,null,0.08]
[]
[null,null,null,null,null,null,"Enter proportion of eligible, willing population selected for final analysis",null,null,null,1]
[]
[]
[]
[]
[null,null,null,null,null,null,"POPULATION VALUES "]
[]
[null,null,null,null,null,null,"Estimated population (total size):",null,null,{"$f":"IF(G266=1,VLOOKUP(B273,A276:D282,IF(J266=1,3,4)),IF(G266=2,VLOOKUP(G273,F276:I657,IF(J266=1,3,4)),IF(G266=3,VLOOKUP(M273,L276:O470,IF(J266=1,3,4)),IF(G266=4,VLOOKUP(R273,Q276:T319,IF(J266=1,3,4))))))","v":175537}]
[]
[null,null,null,null,null,null,"User-defined intervention population:"]
[]
[null,null,null,null,null,null,"Total population included in analysis:",null,null,{"$f":"IF(D266=2,J62,IF(AND(D266=1,I266=1),J60*K53*K51*K41,IF(AND(D266=1,I266=2),J60*K53*K51*K45)))","v":702.14800000000014}]
[]
[]
[]
[]
[]
[]
[]
[]
[]
[]
[]
[]
[]
[]
[]
[]
[]
[]
[]
[]
[]
[]
[]
[]
[]
[]
[]
[]
[]
[]
[]
[]
[]
[]
[]
[]
[]
[]
[]
[]
[]
[]
[]
[]
[]
[]
[]
[]
[]
[]
[]
[]
[]
[]
[]
[]
[]
[]
[]
[]
[]
[]
[]
[]
[]
[]
[]
[]
[]
[]
[]
[]
[]
[]
[]
[]
[]
[]
[]
[]
[]
[]
[]
[]
[]
[]
[]
[]
[]
[]
[]
[]
[]
[]
[]
[]
[]
[]
[]
[]
[]
[]
[]
[]
[]
[]
[]
[]
[]
[]
[]
[]
[]
[]
[]
[]
[]
[]
[]
[]
[]
[]
[]
[null,null,null,null,null,null,null,"Selected intervention:"]
[]
[null,null,null,null,null,null,null,"Summary of study population:"]
[null,null,null,null,null,null,null,{"$f":"CHOOSE(IntChoice,I236,I237,I238,I239,I240,I241,I242,I243,I244,I245)","v":"People with long term health conditions. Typically an older population (87% were 60+)."}]
[]
[]
[]
[null,null,null,null,null,null,null,"Summary of methods used to estimate the eligible population: "]
[null,null,null,null,null,null,null,{"$f":"CHOOSE(IntChoice,J236,J237,J238,J239,J240,J241,J242,J243,J244,J245)","v":"Study eligibility is established using a risk stratification tool to identify the 5% most intensive service users. Therefore eligibility is assumed to be consistent across level and age of analysis (i.e. equal to 5% of the total population). "}]
[]
[]
[]
[]
[]
[null,null,null,null,null,null,null,"Data sources used to estimate the eligible population: "]
[null,null,null,null,null,null,null,{"$f":"CHOOSE(IntChoice,L236,L237,L238,L239,L240,L241,L242,L243,L244,L245)","v":"None required. "}]
[]
[]
[]
[]
[]
[null,null,null,null,null,null,null,"Summary of data availability for eligible population by level of analysis:"]
[null,null,null,null,null,null,null,"Level","Data available","Eligible % uses"]
[null,null,null,null,null,null,null,"National ",{"$f":"VLOOKUP(IntChoice,$N$236:$W$245,3)","v":"Yes"},{"$f":"IF(I211=\"Yes\",\"N/A\",VLOOKUP(IntChoice,$N$236:$W$245,7))","v":"N/A"}]
[null,null,null,null,null,null,null,"Local Authority",{"$f":"VLOOKUP(IntChoice,$N$236:$W$245,4)","v":"Yes"},{"$f":"IF(I212=\"Yes\",\"N/A\",VLOOKUP(IntChoice,$N$236:$W$245,8))","v":"N/A"}]
[null,null,null,null,null,null,null,"CCG",{"$f":"VLOOKUP(IntChoice,$N$236:$W$245,5)","v":"Yes"},{"$f":"IF(I213=\"Yes\",\"N/A\",VLOOKUP(IntChoice,$N$236:$W$245,9))","v":"N/A"}]
[null,null,null,null,null,null,null,"STP",{"$f":"VLOOKUP(IntChoice,$N$236:$W$245,6)","v":"Yes"},{"$f":"IF(I214=\"Yes\",\"N/A\",VLOOKUP(IntChoice,$N$236:$W$245,10))","v":"N/A"}]
[]
[null,null,null,null,null,null,null,"Summary of data availability for eligible population by age:"]
[null,null,null,null,null,null,null,"Level","Age"]
[null,null,null,null,null,null,null,"National ",{"$f":"VLOOKUP(IntChoice,$N$235:$AA$245,11,FALSE)","v":"65+ & 80+ data available"}]
[null,null,null,null,null,null,null,"Local Authority",{"$f":"VLOOKUP(IntChoice,$N$235:$AA$245,12,FALSE)","v":"65+ & 80+ data available"}]
[null,null,null,null,null,null,null,"CCG",{"$f":"VLOOKUP(IntChoice,$N$235:$AA$245,13,FALSE)","v":"65+ & 80+ data available"}]
[null,null,null,null,null,null,null,"STP",{"$f":"VLOOKUP(IntChoice,$N$235:$AA$245,14,FALSE)","v":"65+ & 80+ data available"}]
[]
[]
[]
[]
[]
[]
[]
[]
[]
[]
[]
[]
[null,null,null,null,null,null,null,null,null,null,null,null,null,null,null,"Data Available",null,null,null,"Eligible Sources",null,null,null,"Age"]
[null,null,null,null,null,null,null,"Intervention","Target population","Summary of methods",null,"Data Sources",null,null,"Intervention","National","LA","CCG","STP","National","LA","CCG","STP","National","LA","CCG","STP"]
[null,null,null,null,null,null,1,{"$f":"'2a) Interventions'!G88","v":"Community singing"},{"$f":"'2a) Interventions'!H88","v":"All those expressing an interest and aged 60 or over."},"No further methods required as 100% of the general population is eligible for this intervention. ",null,"No additional sources required.",null,1,{"$f":"'2a) Interventions'!G100","v":"Community singing"},"Yes","Yes","Yes","Yes","N/A","N/A","N/A","N/A","65+ & 80+ data available","65+ & 80+ data available","65+ & 80+ data available","65+ & 80+ data available"]
[null,null,null,null,null,null,2,{"$f":"'2a) Interventions'!G89","v":"Help at home scheme"},{"$f":"'2a) Interventions'!H89","v":"People age 55 or over requiring help with day to day activities in their own homes.  "},"Uses study by Wittenberg et al. (2018) to estimate % who require help performing at least one Activity of Daily Living (ADL) or Instrumental Activity of Daily Living (IADL) for 65+. Age adjustments are made by multiplying by relative risk in 80+ group using Health Survey for England Data. ",null,"Wittenberg et al. (2018). Projections of demand and expenditure on adult social care 2015 to 2040.\nHealth Survey England 2016: Social care for older adults. Health Survey England 2016: Social care for older adults. \nhttps://digital.nhs.uk/data-and-information/publications/statistical/health-survey-for-england/health-survey-for-england-2016",null,2,{"$f":"'2a) Interventions'!G101","v":"Help at home scheme"},"Yes","No","No","No","N/A","National data","National data","National data","Derived using relative risks from national data","Derived using relative risks from national data","Derived using relative risks from national data","Derived using relative risks from national data"]
[null,null,null,null,null,null,3,{"$f":"'2a) Interventions'!G90","v":"Befriending"},{"$f":"'2a) Interventions'!H90","v":"People aged over 50 who are lonely/isolated."},"GP patient questionnaire item identifies % of individauls reporting to feel socially isolated in local populations.  Age adjustments are made by multiplying by the relative risk of social isolation in 65+/80+ age groups vs. isolation across all age ranges using national data.  ",null,"GP Patient Survey (2019). https://www.gp-patient.co.uk/. \nQuestion 32 \"Have you experienced any of the following over the past 12 months?\"; Answer 3: \"Feeling isolated from others\"",null,3,{"$f":"'2a) Interventions'!G102","v":"Befriending"},"Yes","No","Yes","Yes","N/A","Regional data","N/A","N/A","Derived using relative risks from national data. ","Derived using relative risks from national data. ","Derived using relative risks from national data. ","Derived using relative risks from national data. "]
[null,null,null,null,null,null,4,{"$f":"'2a) Interventions'!G91","v":"Dementia: nursing homes"},{"$f":"'2a) Interventions'!H91","v":"People with dementia who are currently living in a nursing home."},"Identifies the prevalence of dementia in the selected population and multiplies by the proportion of dementia patients who reside in nursing homes. Note all nursing home rates are based on UK averages. ",null,"Prevalence of dementia (National, CCG and STP): Dementia UK update (2014) Appendix A, Alzheimer's Society. \nRates of dementia in nursing homes: Dementia UK update (2014), Alzheimer's Society. ",null,4,{"$f":"'2a) Interventions'!G103","v":"Dementia: Nursing homes"},"Yes","No","Yes","Yes","N/A","National data","N/A","N/A","65+ & 80+ data available ","Assumes national rates","65+ & 80+ data available ","65+ & 80+ data available "]
[null,null,null,null,null,null,5,{"$f":"'2a) Interventions'!G92","v":"Hospital discharge support"},{"$f":"'2a) Interventions'!H92","v":"People with (stage 2 or 3) COPD with impaired exercise capacity."},"Identifies the prevalence of COPD in the local population and multiplies by the % of COPD cases with moderate or worse symptoms of breathlessness (dyspnea scale >=3). Age adjustments are made by multiplying by the relative risk of COPD in 65+/80+ age groups vs. COPD across all age ranges using results from a UK population study.  ",null,"Prevalence of COPD (National, LA, CCG and STP) & prevalence of COPD with level >=3 dyspnea: NHS Digital online (2018): Quality and Outcomes Framework, Achievement, prevalence and exceptions data - 2017 -18 [PAS] [online]; \nPrevalence rates of COPD by age group: British Lung Foundation Chronic obstructive pulmonary disease statistics (2012) [online].",null,5,{"$f":"'2a) Interventions'!G104","v":"Hospital discharge support"},"Yes","No","Yes","Yes","N/A","Regional data","N/A","N/A","Derived using relative risks from UK data. ","Derived using relative risks from UK data. ","Derived using relative risks from UK data. ","Derived using relative risks from UK data. "]
[null,null,null,null,null,null,6,{"$f":"'2a) Interventions'!G93","v":"Bundle of VCS services for people with LTCs"},{"$f":"'2a) Interventions'!H93","v":"People with long term health conditions. Typically an older population (87% were 60+)."},"Study eligibility is established using a risk stratification tool to identify the 5% most intensive service users. Therefore eligibility is assumed to be consistent across level and age of analysis (i.e. equal to 5% of the total population). ",null,"None required. ",null,6,{"$f":"'2a) Interventions'!G105","v":"Social prescribing"},"Yes","Yes","Yes","Yes","N/A","N/A","N/A","N/A","65+ & 80+ data available","65+ & 80+ data available","65+ & 80+ data available","65+ & 80+ data available"]
[null,null,null,null,null,null,7,{"$f":"'2a) Interventions'!G94","v":"Interprofessional working (health coaching)"},{"$f":"'2a) Interventions'!H94","v":"People aged 65 or over who have two or more existing long term conditions."},"Multimorbidity (2 or more health conditions) estimates for the UK obtained directly for 65+ and 80+ age groups from Kingston et al. ",null,"Kingston, et al. (2018). Projections of multi-morbidity in the older population in England to 2035: estimates from the Population Ageing and Care Simulation (PACSim) model. Age and ageing, 47(3), 374-380.",null,7,{"$f":"'2a) Interventions'!G106","v":"Interprofessional working (health coaching)"},"Yes","No","No","No","N/A","National data","National data","National data","65+ & 80+ data available","Assumes national rates","Assumes national rates","Assumes national rates"]
[null,null,null,null,null,null,8,{"$f":"'2a) Interventions'!G95","v":"Self-management of COPD"},{"$f":"'2a) Interventions'!H95","v":"People with moderate to severe COPD (average age 69)."},"Identifies the prevalence of COPD in the local population and multiplies by the % of COPD cases with moderate or worse symptoms of breathlessness (dyspnea scale >=3). Age adjustments are made by multiplying by the relative risk of COPD in 65+/80+ age groups vs. COPD across all age ranges using results from a UK population study.  ",null,"Prevalence of COPD (National, LA, CCG and STP) & prevalence of COPD with level >=3 dyspnea: NHS Digital online (2018): Quality and Outcomes Framework, Achievement, prevalence and exceptions data - 2017 -18 [PAS] [online]; \nPrevalence rates of COPD by age group: British Lung Foundation Chronic obstructive pulmonary disease statistics (2012) [online].",null,8,{"$f":"'2a) Interventions'!G107","v":"Self-management of COPD"},"Yes","No","Yes","Yes","N/A","Regional data","N/A","N/A","Derived using relative risks from UK data. ","Derived using relative risks from UK data. ","Derived using relative risks from UK data. ","Derived using relative risks from UK data. "]
[null,null,null,null,null,null,9,{"$f":"'2a) Interventions'!G96","v":"Reablement"},{"$f":"'2a) Interventions'!H96","v":"Older people struggling to cope with day to day activities without relying on social care services."},"Eligibility for social services estimated as % who require help performing at least one Activity of Daily Living (ADL) or Instrumental Activity of Daily Living (IADL) for 65+ age group (Wittenberg et al.). Age adjustments are made by multiplying by relative risk in 80+ group using Health Survey for England Data. ",null,"Wittenberg et al. (2018). Projections of demand and expenditure on adult social care 2015 to 2040.\nHealth Survey England 2016: Social care for older adults. Health Survey England 2016: Social care for older adults. \nhttps://digital.nhs.uk/data-and-information/publications/statistical/health-survey-for-england/health-survey-for-england-2016",null,9,{"$f":"'2a) Interventions'!G108","v":"Reablement"},"Yes","No","No","No","N/A","National data","National data","National data","Derived using relative risks from national data","Derived using relative risks from national data","Derived using relative risks from national data","Derived using relative risks from national data"]
[null,null,null,null,null,null,10,{"$f":"'2a) Interventions'!G97","v":"User defined intervention"},"N/A","N/A",null,"N/A",null,10,"User defined ","N/A","N/A","N/A","N/A","N/A","N/A","N/A","N/A","N/A","N/A","N/A","N/A"]
[]
[]
[]
[]
[null,null,null,null,null,null,null,"Intervention",null,"Eligible population "]
[null,null,null,null,null,null,null,{"$f":"'2a) Interventions'!G88","v":"Community singing"},null,1]
[null,null,null,null,null,null,null,{"$f":"'2a) Interventions'!G89","v":"Help at home scheme"},null,{"$f":"CHOOSE(G266,J1626,J1627,J1628,J1629)","v":0.37527311679943509}]
[null,null,null,null,null,null,null,{"$f":"'2a) Interventions'!G90","v":"Befriending"},null,{"$f":"CHOOSE(G266,J1273,J1274,J1275,J1276)","v":4.2703783338892576E-2}]
[null,null,null,null,null,null,null,{"$f":"'2a) Interventions'!G91","v":"Dementia: nursing homes"},null,{"$f":"CHOOSE(G266,J670,J671,J672,J673)","v":1.1041209607801425E-2}]
[null,null,null,null,null,null,null,{"$f":"'2a) Interventions'!G92","v":"Hospital discharge support"},null,{"$f":"CHOOSE(G266,J891,J892,J893,J894)","v":3.2032693418400482E-2}]
[null,null,null,null,null,null,null,{"$f":"'2a) Interventions'!G93","v":"Bundle of VCS services for people with LTCs"},1,0.05]
[null,null,null,null,null,null,null,{"$f":"'2a) Interventions'!G94","v":"Interprofessional working (health coaching)"},null,{"$f":"CHOOSE(G266,J642,J643,J644,J645)","v":0.54}]
[null,null,null,null,null,null,null,{"$f":"'2a) Interventions'!G95","v":"Self-management of COPD"},null,{"$f":"CHOOSE(G266,J891,J892,J893,J894)","v":3.2032693418400482E-2}]
[null,null,null,null,null,null,null,{"$f":"'2a) Interventions'!G96","v":"Reablement"},null,{"$f":"CHOOSE(G266,J1626,J1627,J1628,J1629)","v":0.37527311679943509}]
[null,null,null,null,null,null,null,{"$f":"'2a) Interventions'!G97","v":"User defined intervention"},1,"Select user defined"]
[]
[]
[]
["Drop Down Selections: "]
[null,null,null,"Population selector",null,null,"Level of Analysis",null,"Eligible selector","Age selector"]
[null,null,null,1,null,null,4,null,1,1]
[null,null,null,"Model calculated",null,null,"National",null,"Model calculated","65+"]
[null,null,null,"User defined",null,null,"Local Authority",null,"User defined","80+"]
[null,null,null,null,null,null,"CCG"]
[null,null,null,null,null,null,"STP",null,"Final Model value eligibility "]
[null,null,null,null,null,null,null,null,1]
["Population Sources for Level of analysis (National/LA/CCG/STP) "]
[null,1,{"$f":"VLOOKUP(B273,A276:B279,2)","v":"England"},null,null,null,317,{"$f":"VLOOKUP(G273,F276:G657,2)","v":"York"},null,null,null,null,25,{"$f":"VLOOKUP(M273,L276:M470,2)","v":"NHS Cambridgeshire and Peterborough "},null,null,null,43,{"$f":"VLOOKUP(R273,Q276:R319,2)","v":"The Black Country & West Birmingham"}]
[null,"Nation"]
[null,null,"65+","80+",null,null,"Local authority","65+","80+",null,null,null,"CCG","65+","80+",null,null,"STP","65+","80+"]
[1,"England",10179253,2768734,null,1,"Adur",14970,4317,null,null,1,"NHS Airedale, Wharfedale and Craven ",35409,10097,null,1,"Bath, NE Somerset, Swindon and Wiltshire",174727,47814,null,null,null,null,null,null,null,1,"Bath, NE Somerset, Swindon and Wiltshire"]
[null,null,null,null,null,2,"Allerdale",23691,6230,null,null,2,"NHS Ashford ",24576,6272,null,2,"Bedfordshire, Luton and Milton Keynes",143040,37446,null,null,null,null,null,null,null,2,"Birmingham and Solihull"]
[null,null,null,null,null,3,"Amber Valley",27977,6797,null,null,3,"NHS Barking and Dagenham ",19796,5875,null,3,"Birmingham and Solihull",175537,51327,null,null,null,null,null,null,null,3,"Bristol, North Somerset and South Gloucestershire"]
[null,null,null,null,null,4,"Arun",45866,13503,null,null,4,"NHS Barnet ",55055,16238,null,4,"Bristol, North Somerset and South Gloucestershire",162251,45758,null,null,null,null,null,null,null,4,"Buckinghamshire, Oxfordshire and Berkshire West"]
[null,null,null,null,null,5,"Ashfield",24375,5854,null,null,5,"NHS Barnsley ",46532,11682,null,5,"Buckinghamshire, Oxfordshire and Berkshire West",162251,45758,null,null,null,null,null,null,null,5,"Cambridgeshire and Peterborough"]
[null,null,null,null,null,6,"Ashford",24971,6396,null,null,6,"NHS Basildon and Brentwood ",47366,13681,null,6,"Cambridgeshire and Peterborough",157562,42719,null,null,null,null,null,null,null,6,"Cheshire and Merseyside"]
[null,null,null,null,null,7,"Aylesbury Vale",33405,8665,null,null,7,"NHS Bassetlaw ",24935,6208,null,7,"Cheshire and Merseyside",483463,129717,null,null,null,null,null,null,null,7,"Cornwall and the Isles of Scilly"]
[null,null,null,null,null,8,"Babergh",23756,6398,null,null,8,"NHS Bath and North East Somerset ",35659,10249,null,8,"Cornwall and the Isles of Scilly",137951,35365,null,null,null,null,null,null,null,8,"Coventry and Warwickshire"]
[null,null,null,null,null,9,"Barking and Dagenham",19755,5823,null,null,9,"NHS Bedfordshire ",79330,20932,null,9,"Coventry and Warwickshire",166315,45316,null,null,null,null,null,null,null,9,"Derbyshire (Joined Up Care)"]
[null,null,null,null,null,10,"Barnet",56221,16519,null,null,10,"NHS Berkshire West ",78019,20927,null,10,"Derbyshire (Joined Up Care)",204103,53198,null,null,null,null,null,null,null,10,"Devon"]
[null,null,null,null,null,11,"Barnsley",47287,11891,null,null,11,"NHS Bexley ",40622,12279,null,11,"Devon",279889,77322,null,null,null,null,null,null,null,11,"Dorset"]
[null,null,null,null,null,12,"Barrow-in-Furness",14454,3527,null,null,12,"NHS Birmingham and Solihull ",175537,51327,null,12,"Dorset",190793,56232,null,null,null,null,null,null,null,12,"Durham, Darlington, Teesside, Hambleton, Richmondshire and Whitby"]
[null,null,null,null,null,13,"Basildon",31922,8853,null,null,13,"NHS Blackburn with Darwen ",21291,5129,null,13,"Durham, Darlington, Teesside, Hambleton, Richmondshire and Whitby",190793,56232,null,null,null,null,null,null,null,13,"Frimley Health"]
[null,null,null,null,null,14,"Basingstoke and Deane",30241,7611,null,null,14,"NHS Blackpool ",28544,7628,null,14,"East London",198823,55627,null,null,null,null,null,null,null,14,"Gloucestershire"]
[null,null,null,null,null,15,"Bassetlaw",25512,6399,null,null,15,"NHS Bolton ",48502,11718,null,15,"Frimley Health",115823,32085,null,null,null,null,null,null,null,15,"Greater Manchester"]
[null,null,null,null,null,16,"Bath and North East Somerset",36260,10587,null,null,16,"NHS Bradford City ",5812,1531,null,16,"Gloucestershire",132212,35667,null,null,null,null,null,null,null,16,"Hampshire and the Isle of Wight"]
[null,null,null,null,null,17,"Bedford",30229,8625,null,null,17,"NHS Bradford Districts ",50264,13654,null,17,"Greater Manchester",447218,113822,null,null,null,null,null,null,null,17,"Herefordshire and Worcestershire"]
[null,null,null,null,null,18,"Bexley",40764,12517,null,null,18,"NHS Brent ",38727,10642,null,18,"Hampshire and the Isle of Wight",364675,102155,null,null,null,null,null,null,null,18,"Hertfordshire and West Essex"]
[null,null,null,null,null,19,"Birmingham",147944,43429,null,null,19,"NHS Brighton and Hove ",38330,11303,null,19,"Herefordshire and Worcestershire",176391,47229,null,null,null,null,null,null,null,19,"Humber, Coast and Vale"]
[null,null,null,null,null,20,"Blaby",20390,5467,null,null,20,"NHS Bristol, North Somerset and South Gloucestershire ",162251,45758,null,20,"Hertfordshire and West Essex",251011,74312,null,null,null,null,null,null,null,20,"Kent and Medway"]
[null,null,null,null,null,21,"Blackburn with Darwen",21543,5202,null,null,21,"NHS Bromley ",57626,17062,null,21,"Humber, Coast and Vale",483463,129717,null,null,null,null,null,null,null,21,"Lancashire and South Cumbria"]
[null,null,null,null,null,22,"Blackpool",28402,7595,null,null,22,"NHS Buckinghamshire ",100000,28354,null,22,"Kent and Medway",287237,75847,null,null,null,null,null,null,null,22,"Leicester, Leicestershire and Rutland"]
[null,null,null,null,null,23,"Bolsover",15878,3831,null,null,23,"NHS Bury ",34158,8601,null,23,"Lancashire and South Cumbria",341854,88672,null,null,null,null,null,null,null,23,"Lincolnshire"]
[null,null,null,null,null,24,"Bolton",49120,12031,null,null,24,"NHS Calderdale ",38345,9581,null,24,"Leicester, Leicestershire and Rutland",190488,50424,null,null,null,null,null,null,null,24,"Mid and South Essex"]
[null,null,null,null,null,25,"Boston",14433,3778,null,null,25,"NHS Cambridgeshire and Peterborough ",157562,42719,null,25,"Lincolnshire",173972,44503,null,null,null,null,null,null,null,25,"Bedfordshire, Luton and Milton Keynes"]
[null,null,null,null,null,26,"Bournemouth, Christchurch and Poole",85245,26299,null,null,26,"NHS Camden ",30098,8003,null,26,"Mid and South Essex",227017,61478,null,null,null,null,null,null,null,26,"Norfolk and Waveney"]
[null,null,null,null,null,27,"Bracknell Forest",17592,4612,null,null,27,"NHS Cannock Chase ",26496,6451,null,27,"Norfolk and Waveney",143040,37446,null,null,null,null,null,null,null,27,"North London"]
[null,null,null,null,null,28,"Bradford",79463,21810,null,null,28,"NHS Canterbury and Coastal ",44591,12234,null,28,"North Cumbria",73130,19213,null,null,null,null,null,null,null,28,"East London"]
[null,null,null,null,null,29,"Braintree",30475,7869,null,null,29,"NHS Castle Point and Rochford ",42230,11019,null,29,"North London",175711,48424,null,null,null,null,null,null,null,29,"North West London"]
[null,null,null,null,null,30,"Breckland",34484,9531,null,null,30,"NHS Central London (Westminster) ",23427,6548,null,30,"North West London",264876,72112,null,null,null,null,null,null,null,30,"Northamptonshire"]
[null,null,null,null,null,31,"Brent",39992,10970,null,null,31,"NHS Chorley and South Ribble ",33856,7809,null,31,"Northamptonshire",127479,31280,null,null,null,null,null,null,null,31,"Northumberland, Tyne and Wear and North Durham"]
[null,null,null,null,null,32,"Brentwood",15561,4976,null,null,32,"NHS City and Hackney ",21876,5564,null,32,"Northumberland, Tyne and Wear and North Durham",127479,31280,null,null,null,null,null,null,null,32,"Nottingham and Nottinghamshire"]
[null,null,null,null,null,33,"Brighton and Hove",38504,11333,null,null,33,"NHS Coastal West Sussex ",131391,39047,null,33,"Nottingham and Nottinghamshire",180220,47725,null,null,null,null,null,null,null,33,"Shropshire and Telford and Wrekin"]
[null,null,null,null,null,34,"Bristol, City of",59950,17284,null,null,34,"NHS Corby ",9750,2299,null,34,"Shropshire and Telford and Wrekin",105647,26909,null,null,null,null,null,null,null,34,"Somerset"]
[null,null,null,null,null,35,"Broadland",33204,9397,null,null,35,"NHS Coventry and Rugby ",69841,19496,null,35,"Somerset",134127,36796,null,null,null,null,null,null,null,35,"South East London"]
[null,null,null,null,null,36,"Bromley",57786,17247,null,null,36,"NHS Crawley ",14870,4413,null,36,"South East London",207462,58546,null,null,null,null,null,null,null,36,"South West London"]
[null,null,null,null,null,37,"Bromsgrove",22168,6450,null,null,37,"NHS Croydon ",51384,14332,null,37,"South West London",192289,53182,null,null,null,null,null,null,null,37,"South Yorkshire and Bassetlaw"]
[null,null,null,null,null,38,"Broxbourne",17305,5042,null,null,38,"NHS Darlington ",21284,5872,null,38,"South Yorkshire and Bassetlaw",273430,72190,null,null,null,null,null,null,null,38,"Staffordshire and Stoke on Trent "]
[null,null,null,null,null,39,"Broxtowe",23807,6293,null,null,39,"NHS Dartford, Gravesham and Swanley ",45046,12623,null,39,"Staffordshire and Stoke on Trent ",229076,57516,null,null,null,null,null,null,null,39,"Suffolk and North East Essex"]
[null,null,null,null,null,40,"Burnley",16422,4084,null,null,40,"NHS Doncaster ",58002,15242,null,40,"Suffolk and North East Essex",217111,59268,null,null,null,null,null,null,null,40,"Surrey Heartlands"]
[null,null,null,null,null,41,"Bury",34658,8800,null,null,41,"NHS Dorset ",190793,56232,null,41,"Surrey Heartlands",160136,48500,null,null,null,null,null,null,null,41,"Sussex and East Surrey"]
[null,null,null,null,null,42,"Calderdale",38892,9698,null,null,42,"NHS Dudley ",64683,17464,null,42,"Sussex and East Surrey",404928,118801,null,null,null,null,null,null,null,42,"The Black Country & West Birmingham"]
[null,null,null,null,null,43,"Cambridge",16122,5074,null,null,43,"NHS Durham Dales, Easington and Sedgefield ",57565,14267,null,43,"The Black Country & West Birmingham",175537,51327,null,null,null,null,null,null,null,43,"West Yorkshire & Harrogate"]
[null,null,null,null,null,44,"Camden",31168,8328,null,null,44,"NHS Ealing ",42527,11605,null,44,"West Yorkshire & Harrogate",427856,114178,null,null,null,null,null,null,null,44,"North Cumbria"]
[null,null,null,null,null,45,"Cannock Chase",18944,4718,null,null,45,"NHS East and North Hertfordshire ",96452,28594]
[null,null,null,null,null,46,"Canterbury",33574,9442,null,null,46,"NHS East Berkshire ",60726,16868]
[null,null,null,null,null,47,"Carlisle",23363,6353,null,null,47,"NHS East Lancashire ",71670,17868]
[null,null,null,null,null,48,"Castle Point",22734,5821,null,null,48,"NHS East Leicestershire and Rutland ",71648,19632]
[null,null,null,null,null,49,"Central Bedfordshire",50602,12883,null,null,49,"NHS East Riding of Yorkshire ",80510,20714]
[null,null,null,null,null,50,"Charnwood",33041,8728,null,null,50,"NHS East Staffordshire ",24522,6393]
[null,null,null,null,null,51,"Chelmsford",33879,9503,null,null,51,"NHS East Surrey ",33277,9613]
[null,null,null,null,null,52,"Cheltenham",22519,6780,null,null,52,"NHS Eastbourne, Hailsham and Seaford ",51711,16209]
[null,null,null,null,null,53,"Cherwell",26959,7396,null,null,53,"NHS Eastern Cheshire ",47151,13409]
[null,null,null,null,null,54,"Cheshire East",86688,23737,null,null,54,"NHS Enfield ",43259,12238]
[null,null,null,null,null,55,"Cheshire West and Chester",72945,19408,null,null,55,"NHS Erewash ",18513,5062]
[null,null,null,null,null,56,"Chesterfield",21921,5757,null,null,56,"NHS Fareham and Gosport ",43643,12205]
[null,null,null,null,null,57,"Chichester",32532,9755,null,null,57,"NHS Fylde and Wyre ",51629,14534]
[null,null,null,null,null,58,"Chiltern",20517,6473,null,null,58,"NHS Gloucestershire ",132212,35667]
[null,null,null,null,null,59,"Chorley",23015,5248,null,null,59,"NHS Great Yarmouth and Waveney ",55071,15132]
[null,null,null,null,null,60,"City of London",1564,398,null,null,60,"NHS Greater Huddersfield ",44127,11126]
[null,null,null,null,null,61,"Colchester",33169,8658,null,null,61,"NHS Greater Preston ",34751,9378]
[null,null,null,null,null,62,"Copeland",15289,3894,null,null,62,"NHS Greenwich ",29365,7740]
[null,null,null,null,null,63,"Corby",10020,2365,null,null,63,"NHS Guildford and Waverley ",38738,11901]
[null,null,null,null,null,64,"Cornwall",139632,35569,null,null,64,"NHS Halton ",22775,5205]
[null,null,null,null,null,65,"Cotswold",22760,6236,null,null,65,"NHS Hambleton, Richmondshire and Whitby ",37394,9565]
[null,null,null,null,null,66,"County Durham",108590,26958,null,null,66,"NHS Hammersmith and Fulham ",19334,4858]
[null,null,null,null,null,67,"Coventry",49968,14086,null,null,67,"NHS Hardwick ",23531,5678]
[null,null,null,null,null,68,"Craven",15199,4168,null,null,68,"NHS Haringey ",26628,6658]
[null,null,null,null,null,69,"Crawley",15048,4376,null,null,69,"NHS Harrogate and Rural District ",36531,10585]
[null,null,null,null,null,70,"Croydon",52154,14605,null,null,70,"NHS Harrow ",38417,11194]
[null,null,null,null,null,71,"Dacorum",26479,7697,null,null,71,"NHS Hartlepool and Stockton-on-Tees ",52719,14002]
[null,null,null,null,null,72,"Darlington",21588,5951,null,null,72,"NHS Hastings and Rother ",48106,13599]
[null,null,null,null,null,73,"Dartford",15651,4503,null,null,73,"NHS Havering ",46418,14378]
[null,null,null,null,null,74,"Daventry",17270,4055,null,null,74,"NHS Herefordshire ",45758,12450]
[null,null,null,null,null,75,"Derby",41876,12471,null,null,75,"NHS Herts Valleys ",98843,29601]
[null,null,null,null,null,76,"Derbyshire Dales",19442,5053,null,null,76,"NHS Heywood, Middleton and Rochdale ",35427,8923]
[null,null,null,null,null,77,"Doncaster",58810,15357,null,null,77,"NHS High Weald Lewes Havens ",40653,11151]
[null,null,null,null,null,78,"Dorset",107816,30335,null,null,78,"NHS Hillingdon ",40087,11673]
[null,null,null,null,null,79,"Dover",27222,7056,null,null,79,"NHS Horsham and Mid Sussex ",46590,13466]
[null,null,null,null,null,80,"Dudley",65175,17869,null,null,80,"NHS Hounslow ",31770,8074]
[null,null,null,null,null,81,"Ealing",43741,12060,null,null,81,"NHS Hull ",38690,10134]
[null,null,null,null,null,82,"East Cambridgeshire",17842,4777,null,null,82,"NHS Ipswich and East Suffolk ",91505,25287]
[null,null,null,null,null,83,"East Devon",43489,12988,null,null,83,"NHS Isle of Wight ",38533,10208]
[null,null,null,null,null,84,"East Hampshire",27999,7888,null,null,84,"NHS Islington ",20671,5287]
[null,null,null,null,null,85,"East Hertfordshire",26528,7423,null,null,85,"NHS Kernow ",137951,35365]
[null,null,null,null,null,86,"East Lindsey",41889,10091,null,null,86,"NHS Kingston ",23745,6778]
[null,null,null,null,null,87,"East Northamptonshire",19554,4846,null,null,87,"NHS Knowsley ",25209,7012]
[null,null,null,null,null,88,"East Riding of Yorkshire",87485,22725,null,null,88,"NHS Lambeth ",26112,7024]
[null,null,null,null,null,89,"East Staffordshire",22681,5950,null,null,89,"NHS Leeds ",121601,33575]
[null,null,null,null,null,90,"East Suffolk",67323,19010,null,null,90,"NHS Leicester City ",41536,11576]
[null,null,null,null,null,91,"Eastbourne",25720,8372,null,null,91,"NHS Lewisham ",28088,7779]
[null,null,null,null,null,92,"Eastleigh",25677,7135,null,null,92,"NHS Lincolnshire East ",62640,15578]
[null,null,null,null,null,93,"Eden",14048,3687,null,null,93,"NHS Lincolnshire West ",48262,12578]
[null,null,null,null,null,94,"Elmbridge",24985,7796,null,null,94,"NHS Liverpool ",71793,19438]
[null,null,null,null,null,95,"Enfield",43903,12512,null,null,95,"NHS Luton ",26419,7777]
[null,null,null,null,null,96,"Epping Forest",25733,7535,null,null,96,"NHS Manchester ",50614,13321]
[null,null,null,null,null,97,"Epsom and Ewell",14652,4181,null,null,97,"NHS Mansfield and Ashfield ",38015,9459]
[null,null,null,null,null,98,"Erewash",23387,6507,null,null,98,"NHS Medway ",43696,10642]
[null,null,null,null,null,99,"Exeter",20766,6244,null,null,99,"NHS Merton ",25639,7102]
[null,null,null,null,null,100,"Fareham",27214,7810,null,null,100,"NHS Mid Essex ",79152,20877]
[null,null,null,null,null,101,"Fenland",23008,6324,null,null,101,"NHS Milton Keynes ",37291,8737]
[null,null,null,null,null,102,"Folkestone and Hythe",27530,7264,null,null,102,"NHS Morecambe Bay ",75442,19909]
[null,null,null,null,null,103,"Forest of Dean",21034,5122,null,null,103,"NHS Nene ",117729,28981]
[null,null,null,null,null,104,"Fylde",21724,6207,null,null,104,"NHS Newark and Sherwood ",26597,6688]
[null,null,null,null,null,105,"Gateshead",39257,10949,null,null,105,"NHS Newcastle Gateshead ",81820,23008]
[null,null,null,null,null,106,"Gedling",24585,6576,null,null,106,"NHS Newham ",25417,6211]
[null,null,null,null,null,107,"Gloucester",21570,5859,null,null,107,"NHS North Cumbria ",73130,19213]
[null,null,null,null,null,108,"Gosport",17064,4626,null,null,108,"NHS North Derbyshire ",63290,16164]
[null,null,null,null,null,109,"Gravesham",18450,5237,null,null,109,"NHS North Durham ",49314,12133]
[null,null,null,null,null,110,"Great Yarmouth",24020,6300,null,null,110,"NHS North East Essex ",75278,20252]
[null,null,null,null,null,111,"Greenwich",29780,7785,null,null,111,"NHS North East Hampshire and Farnham ",36688,9956]
[null,null,null,null,null,112,"Guildford",24482,7086,null,null,112,"NHS North East Lincolnshire ",31898,8825]
[null,null,null,null,null,113,"Hackney",21105,5345,null,null,113,"NHS North Hampshire ",40117,10264]
[null,null,null,null,null,114,"Halton",23256,5282,null,null,114,"NHS North Kirklees ",31647,8024]
[null,null,null,null,null,115,"Hambleton",23597,6278,null,null,115,"NHS North Lincolnshire ",35410,9021]
[null,null,null,null,null,116,"Hammersmith and Fulham",19853,5037,null,null,116,"NHS North Norfolk ",51095,14052]
[null,null,null,null,null,117,"Harborough",20173,5308,null,null,117,"NHS North Staffordshire ",47869,12233]
[null,null,null,null,null,118,"Haringey",27326,6926,null,null,118,"NHS North Tyneside ",40476,10952]
[null,null,null,null,null,119,"Harlow",13285,3990,null,null,119,"NHS North West Surrey ",61965,18728]
[null,null,null,null,null,120,"Harrogate",37120,10919,null,null,120,"NHS Northern, Eastern and Western Devon ",204802,56693]
[null,null,null,null,null,121,"Harrow",39202,11418,null,null,121,"NHS Northumberland ",76259,19243]
[null,null,null,null,null,122,"Hart",18900,5119,null,null,122,"NHS Norwich ",39426,11830]
[null,null,null,null,null,123,"Hartlepool",17959,4944,null,null,123,"NHS Nottingham City ",37788,10775]
[null,null,null,null,null,124,"Hastings",18367,4867,null,null,124,"NHS Nottingham North and East ",30086,7792]
[null,null,null,null,null,125,"Havant",29352,8581,null,null,125,"NHS Nottingham West ",23423,6170]
[null,null,null,null,null,126,"Havering",46436,14370,null,null,126,"NHS Oldham ",37253,9179]
[null,null,null,null,null,127,"Herefordshire, County of",46625,12610,null,null,127,"NHS Oxfordshire ",120225,33978]
[null,null,null,null,null,128,"Hertsmere",18941,5772,null,null,128,"NHS Portsmouth ",30026,8423]
[null,null,null,null,null,129,"High Peak",19291,4619,null,null,129,"NHS Redbridge ",37455,10626]
[null,null,null,null,null,130,"Hillingdon",40634,11908,null,null,130,"NHS Redditch and Bromsgrove ",36971,9823]
[null,null,null,null,null,131,"Hinckley and Bosworth",24529,6015,null,null,131,"NHS Richmond ",30176,8077]
[null,null,null,null,null,132,"Horsham",31981,9118,null,null,132,"NHS Rotherham ",51023,12783]
[null,null,null,null,null,133,"Hounslow",32606,8290,null,null,133,"NHS Rushcliffe ",24311,6841]
[null,null,null,null,null,134,"Huntingdonshire",35209,8852,null,null,134,"NHS Salford ",36264,9566]
[null,null,null,null,null,135,"Hyndburn",14838,3654,null,null,135,"NHS Sandwell and West Birmingham ",65031,18363]
[null,null,null,null,null,136,"Ipswich",22622,6638,null,null,136,"NHS Scarborough and Ryedale ",28542,7550]
[null,null,null,null,null,137,"Isle of Wight",39294,10359,null,null,137,"NHS Sheffield ",92938,26275]
[null,null,null,null,null,138,"Isles of Scilly",576,155,null,null,138,"NHS Shropshire ",76030,20056]
[null,null,null,null,null,139,"Islington",21003,5351,null,null,139,"NHS Somerset ",134127,36796]
[null,null,null,null,null,140,"Kensington and Chelsea",24481,6211,null,null,140,"NHS South Cheshire ",38193,9830]
[null,null,null,null,null,141,"Kettering",18643,4582,null,null,141,"NHS South Devon and Torbay ",75087,20629]
[null,null,null,null,null,142,"King's Lynn and West Norfolk",39184,10570,null,null,142,"NHS South East Staffordshire and Seisdon Peninsula ",49600,12240]
[null,null,null,null,null,143,"Kingston upon Hull, City of",38997,10076,null,null,143,"NHS South Eastern Hampshire ",49305,14115]
[null,null,null,null,null,144,"Kingston upon Thames",24185,6800,null,null,144,"NHS South Kent Coast ",48877,12883]
[null,null,null,null,null,145,"Kirklees",76848,19652,null,null,145,"NHS South Lincolnshire ",35016,9528]
[null,null,null,null,null,146,"Knowsley",25513,7052,null,null,146,"NHS South Norfolk ",56057,15260]
[null,null,null,null,null,147,"Lambeth",26920,7275,null,null,147,"NHS South Sefton ",32288,9188]
[null,null,null,null,null,148,"Lancaster",28706,7793,null,null,148,"NHS South Tees ",52532,13804]
[null,null,null,null,null,149,"Leeds",122414,33873,null,null,149,"NHS South Tyneside ",29725,8137]
[null,null,null,null,null,150,"Leicester",42304,11614,null,null,150,"NHS South Warwickshire ",58138,16385]
[null,null,null,null,null,151,"Lewes",26241,7839,null,null,151,"NHS South West Lincolnshire ",28054,6819]
[null,null,null,null,null,152,"Lewisham",28481,7919,null,null,152,"NHS South Worcestershire ",69084,18879]
[null,null,null,null,null,153,"Lichfield",24650,6053,null,null,153,"NHS Southampton ",33214,9319]
[null,null,null,null,null,154,"Lincoln",15049,4199,null,null,154,"NHS Southend ",34798,10145]
[null,null,null,null,null,155,"Liverpool",72608,19593,null,null,155,"NHS Southern Derbyshire ",98769,26294]
[null,null,null,null,null,156,"Luton",26620,7947,null,null,156,"NHS Southport and Formby ",31019,9632]
[null,null,null,null,null,157,"Maidstone",32563,8808,null,null,157,"NHS Southwark ",25649,6662]
[null,null,null,null,null,158,"Maldon",16065,3922,null,null,158,"NHS St Helens ",36455,8877]
[null,null,null,null,null,159,"Malvern Hills",21826,6236,null,null,159,"NHS Stafford and Surrounds ",35053,8793]
[null,null,null,null,null,160,"Manchester",50967,13340,null,null,160,"NHS Stockport ",57643,16307]
[null,null,null,null,null,161,"Mansfield",20771,5312,null,null,161,"NHS Stoke on Trent ",45536,11406]
[null,null,null,null,null,162,"Medway",44209,10835,null,null,162,"NHS Sunderland ",53209,13487]
[null,null,null,null,null,163,"Melton",11526,2850,null,null,163,"NHS Surrey Downs ",59433,17871]
[null,null,null,null,null,164,"Mendip",26478,7152,null,null,164,"NHS Surrey Heath ",18409,5261]
[null,null,null,null,null,165,"Merton",26003,7187,null,null,165,"NHS Sutton ",30857,8902]
[null,null,null,null,null,166,"Mid Devon",19075,4979,null,null,166,"NHS Swale ",21280,4995]
[null,null,null,null,null,167,"Mid Suffolk",24911,6333,null,null,167,"NHS Swindon ",35302,9375]
[null,null,null,null,null,168,"Mid Sussex",30496,8824,null,null,168,"NHS Tameside and Glossop ",45662,10847]
[null,null,null,null,null,169,"Middlesbrough",22767,6162,null,null,169,"NHS Telford and Wrekin ",29617,6853]
[null,null,null,null,null,170,"Milton Keynes",37032,8669,null,null,170,"NHS Thanet ",32940,8822]
[null,null,null,null,null,171,"Mole Valley",20322,6189,null,null,171,"NHS Thurrock ",23471,5756]
[null,null,null,null,null,172,"New Forest",51897,15941,null,null,172,"NHS Tower Hamlets ",19066,5019]
[null,null,null,null,null,173,"Newark and Sherwood",26480,6665,null,null,173,"NHS Trafford ",40619,11916]
[null,null,null,null,null,174,"Newcastle upon Tyne",43227,12441,null,null,174,"NHS Vale of York ",72187,19603]
[null,null,null,null,null,175,"Newcastle-under-Lyme",26362,7142,null,null,175,"NHS Vale Royal ",20809,5096]
[null,null,null,null,null,176,"Newham",26229,6476,null,null,176,"NHS Wakefield ",64120,16005]
[null,null,null,null,null,177,"North Devon",24125,6587,null,null,177,"NHS Walsall ",49773,13840]
[null,null,null,null,null,178,"North East Derbyshire",24703,6124,null,null,178,"NHS Waltham Forest ",28795,7954]
[null,null,null,null,null,179,"North East Lincolnshire",32299,8984,null,null,179,"NHS Wandsworth ",30488,7991]
[null,null,null,null,null,180,"North Hertfordshire",25243,7482,null,null,180,"NHS Warrington ",38303,9458]
[null,null,null,null,null,181,"North Kesteven",27146,6919,null,null,181,"NHS Warwickshire North ",38336,9435]
[null,null,null,null,null,182,"North Lincolnshire",36049,9176,null,null,182,"NHS West Cheshire ",50646,13735]
[null,null,null,null,null,183,"North Norfolk",34313,9881,null,null,183,"NHS West Essex ",55716,16117]
[null,null,null,null,null,184,"North Somerset",50947,14222,null,null,184,"NHS West Hampshire ",129837,37621]
[null,null,null,null,null,185,"North Tyneside",41165,11052,null,null,185,"NHS West Kent ",92687,25904]
[null,null,null,null,null,186,"North Warwickshire",14079,3550,null,null,186,"NHS West Lancashire ",24671,6417]
[null,null,null,null,null,187,"North West Leicestershire",20367,4766,null,null,187,"NHS West Leicestershire ",77304,19216]
[null,null,null,null,null,188,"Northampton",34227,8783,null,null,188,"NHS West London ",30587,7518]
[null,null,null,null,null,189,"Northumberland",77725,19558,null,null,189,"NHS West Norfolk ",46008,12406]
[null,null,null,null,null,190,"Norwich",20950,6156,null,null,190,"NHS West Suffolk ",50328,13729]
[null,null,null,null,null,191,"Nottingham",38200,10813,null,null,191,"NHS Wigan Borough ",61076,13444]
[null,null,null,null,null,192,"Nuneaton and Bedworth",24758,6115,null,null,192,"NHS Wiltshire ",103766,28190]
[null,null,null,null,null,193,"Oadby and Wigston",12264,3993,null,null,193,"NHS Wirral ",68822,18837]
[null,null,null,null,null,194,"Oldham",37840,9473,null,null,194,"NHS Wolverhampton ",43303,12784]
[null,null,null,null,null,195,"Oxford",18767,5497,null,null,195,"NHS Wyre Forest ",24578,6077]
[null,null,null,null,null,196,"Pendle",17005,4200]
[null,null,null,null,null,197,"Peterborough",29510,8137]
[null,null,null,null,null,198,"Plymouth",48001,13086]
[null,null,null,null,null,199,"Portsmouth",30259,8474]
[null,null,null,null,null,200,"Preston",20835,5715]
[null,null,null,null,null,201,"Reading",20020,5789]
[null,null,null,null,null,202,"Redbridge",38022,10775]
[null,null,null,null,null,203,"Redcar and Cleveland",30435,7912]
[null,null,null,null,null,204,"Redditch",15450,3440]
[null,null,null,null,null,205,"Reigate and Banstead",26721,7981]
[null,null,null,null,null,206,"Ribble Valley",14154,3814]
[null,null,null,null,null,207,"Richmond upon Thames",30749,8221]
[null,null,null,null,null,208,"Richmondshire",11234,2840]
[null,null,null,null,null,209,"Rochdale",35943,8972]
[null,null,null,null,null,210,"Rochford",20026,5406]
[null,null,null,null,null,211,"Rossendale",13068,3068]
[null,null,null,null,null,212,"Rother",30500,8922]
[null,null,null,null,null,213,"Rotherham",51693,13220]
[null,null,null,null,null,214,"Rugby",20361,5604]
[null,null,null,null,null,215,"Runnymede",14863,4529]
[null,null,null,null,null,216,"Rushcliffe",24700,6945]
[null,null,null,null,null,217,"Rushmoor",13829,3567]
[null,null,null,null,null,218,"Rutland",9878,2669]
[null,null,null,null,null,219,"Ryedale",14599,3859]
[null,null,null,null,null,220,"Salford",36420,9658]
[null,null,null,null,null,221,"Sandwell",49258,13769]
[null,null,null,null,null,222,"Scarborough",29295,7718]
[null,null,null,null,null,223,"Sedgemoor",28905,7676]
[null,null,null,null,null,224,"Sefton",64032,19169]
[null,null,null,null,null,225,"Selby",17926,4397]
[null,null,null,null,null,226,"Sevenoaks",25784,7287]
[null,null,null,null,null,227,"Sheffield",93631,26624]
[null,null,null,null,null,228,"Shropshire",77788,20627]
[null,null,null,null,null,229,"Slough",14856,3912]
[null,null,null,null,null,230,"Solihull",45226,13167]
[null,null,null,null,null,231,"Somerset West and Taunton",39198,11327]
[null,null,null,null,null,232,"South Bucks",14759,4771]
[null,null,null,null,null,233,"South Cambridgeshire",30583,8343]
[null,null,null,null,null,234,"South Derbyshire",19084,4493]
[null,null,null,null,null,235,"South Gloucestershire",52750,14662]
[null,null,null,null,null,236,"South Hams",24159,6164]
[null,null,null,null,null,237,"South Holland",22703,6283]
[null,null,null,null,null,238,"South Kesteven",32272,8254]
[null,null,null,null,null,239,"South Lakeland",29329,8095]
[null,null,null,null,null,240,"South Norfolk",33105,9079]
[null,null,null,null,null,241,"South Northamptonshire",18946,4530]
[null,null,null,null,null,242,"South Oxfordshire",29322,8289]
[null,null,null,null,null,243,"South Ribble",23358,5895]
[null,null,null,null,null,244,"South Somerset",42280,11280]
[null,null,null,null,null,245,"South Staffordshire",27238,7095]
[null,null,null,null,null,246,"South Tyneside",30035,8121]
[null,null,null,null,null,247,"Southampton",33508,9302]
[null,null,null,null,null,248,"Southend-on-Sea",35097,10133]
[null,null,null,null,null,249,"Southwark",26367,6764]
[null,null,null,null,null,250,"Spelthorne",18459,5497]
[null,null,null,null,null,251,"St Albans",25026,7540]
[null,null,null,null,null,252,"St. Helens",36788,9145]
[null,null,null,null,null,253,"Stafford",30271,7762]
[null,null,null,null,null,254,"Staffordshire Moorlands",24426,6007]
[null,null,null,null,null,255,"Stevenage",13341,4037]
[null,null,null,null,null,256,"Stockport",58064,16544]
[null,null,null,null,null,257,"Stockton-on-Tees",35672,9340]
[null,null,null,null,null,258,"Stoke-on-Trent",43447,10822]
[null,null,null,null,null,259,"Stratford-on-Avon",32366,9119]
[null,null,null,null,null,260,"Stroud",26618,6847]
[null,null,null,null,null,261,"Sunderland",53952,13800]
[null,null,null,null,null,262,"Surrey Heath",17351,5133]
[null,null,null,null,null,263,"Sutton",31149,8948]
[null,null,null,null,null,264,"Swale",28374,6801]
[null,null,null,null,null,265,"Swindon",35174,9306]
[null,null,null,null,null,266,"Tameside",39711,9613]
[null,null,null,null,null,267,"Tamworth",14336,3218]
[null,null,null,null,null,268,"Tandridge",18140,5232]
[null,null,null,null,null,269,"Teignbridge",34921,9487]
[null,null,null,null,null,270,"Telford and Wrekin",30241,7020]
[null,null,null,null,null,271,"Tendring",43069,11757]
[null,null,null,null,null,272,"Test Valley",26992,7398]
[null,null,null,null,null,273,"Tewkesbury",20472,5504]
[null,null,null,null,null,274,"Thanet",33226,8786]
[null,null,null,null,null,275,"Three Rivers",16891,5117]
[null,null,null,null,null,276,"Thurrock",23788,5785]
[null,null,null,null,null,277,"Tonbridge and Malling",24537,6587]
[null,null,null,null,null,278,"Torbay",35907,9993]
[null,null,null,null,null,279,"Torridge",18495,4639]
[null,null,null,null,null,280,"Tower Hamlets",19931,5108]
[null,null,null,null,null,281,"Trafford",40778,11993]
[null,null,null,null,null,282,"Tunbridge Wells",22609,6736]
[null,null,null,null,null,283,"Uttlesford",17382,4753]
[null,null,null,null,null,284,"Vale of White Horse",26764,7634]
[null,null,null,null,null,285,"Wakefield",65208,16389]
[null,null,null,null,null,286,"Walsall",49866,14023]
[null,null,null,null,null,287,"Waltham Forest",29346,8192]
[null,null,null,null,null,288,"Wandsworth",31004,8179]
[null,null,null,null,null,289,"Warrington",38883,9740]
[null,null,null,null,null,290,"Warwick",26680,7700]
[null,null,null,null,null,291,"Watford",12651,3767]
[null,null,null,null,null,292,"Waverley",27514,8582]
[null,null,null,null,null,293,"Wealden",41533,11487]
[null,null,null,null,null,294,"Wellingborough",15246,3675]
[null,null,null,null,null,295,"Welwyn Hatfield",18837,6069]
[null,null,null,null,null,296,"West Berkshire",29919,7581]
[null,null,null,null,null,297,"West Devon",15241,3961]
[null,null,null,null,null,298,"West Lancashire",24966,6570]
[null,null,null,null,null,299,"West Lindsey",23172,5599]
[null,null,null,null,null,300,"West Oxfordshire",23615,6628]
[null,null,null,null,null,301,"West Suffolk",37451,10485]
[null,null,null,null,null,302,"Westminster",31353,8563]
[null,null,null,null,null,303,"Wigan",61837,13751]
[null,null,null,null,null,304,"Wiltshire",105837,28752]
[null,null,null,null,null,305,"Winchester",26288,7710]
[null,null,null,null,null,306,"Windsor and Maidenhead",28032,8383]
[null,null,null,null,null,307,"Wirral",69811,19056]
[null,null,null,null,null,308,"Woking",17238,5182]
[null,null,null,null,null,309,"Wokingham",29521,8250]
[null,null,null,null,null,310,"Wolverhampton",43446,12868]
[null,null,null,null,null,311,"Worcester",17298,4747]
[null,null,null,null,null,312,"Worthing",24630,7646]
[null,null,null,null,null,313,"Wychavon",31544,8287]
[null,null,null,null,null,314,"Wycombe",32356,9161]
[null,null,null,null,null,315,"Wyre",30553,8494]
[null,null,null,null,null,316,"Wyre Forest",24814,6227]
[null,null,null,null,null,317,"York",38290,11150]
[]
[]
[]
[]
[]
[]
[]
[]
[]
[]
[]
[]
[]
[]
[]
[]
[]
[]
[]
[]
[]
[]
[]
[]
[]
[]
[]
[]
[]
[]
[]
[]
[]
[]
[]
[]
[]
[]
[]
[]
[]
[]
[]
[]
[]
[]
[]
[null,"Intervention: Interprofessional working "]
[null,"Eligible population: ",null,null,null,null,null,"65+","80+","Selection(age)"]
[null,null,null,null,"National",null,null,0.54,0.68700000000000006,{"$f":"IF($J$266=1,H642,I642)","v":0.54}]
[null,null,null,null,"LA",null,null,0.54,0.68700000000000006,{"$f":"IF($J$266=1,H643,I643)","v":0.54}]
[null,null,null,null,"CCG",null,null,0.54,0.68700000000000006,0.54]
[null,null,null,null,"STP",null,null,0.54,0.68700000000000006,0.54]
[]
[]
[]
[]
[]
[]
[]
[]
[]
[]
[]
[]
[]
[]
["Population Sources: Eligibility for Intervention"]
[]
[null,"Intervention:",null,"Dementia (nursing homes)"]
[]
[null,"Summary: ",null,"In-built model population estimated by identfiying the prevalence of dementia and multiplying by the % of dementia patients who live in nursing homes."]
[]
[null,"Data availability:",null,"Prevalence data: ",null,null,null,"Derived by dividing total number with dementia by total population. Data available nationally and locally for CCGs and STPs by age (65+ and 80+). Not available for local authorities so LA level analysis assumes national prevalence rates."]
[null,null,null,"% in nursing homes: ",null,null,null,"Only national data available."]
[]
[null,"Eligible population: ",null,null,null,null,null,"65+","80+","Selection(age)"]
[null,null,null,null,"National",null,null,{"$f":"K681*$D$676","v":1.1044842432507682E-2},{"$f":"L681*$D$676","v":2.711377915259517E-2},{"$f":"IF($J$266=1,H670,I670)","v":1.1044842432507682E-2}]
[null,null,null,null,"LA",null,null,{"$f":"K681*$D$676","v":1.1044842432507682E-2},{"$f":"L681*$D$676","v":2.711377915259517E-2},{"$f":"IF($J$266=1,H671,I671)","v":1.1044842432507682E-2}]
[null,null,null,null,"CCG",null,null,{"$f":"IF(C684=\"Not available\",K681*$D$676,C684*$D$676)","v":1.0963648873479928E-2},{"$f":"IF(D684=\"Not available\",L681*$D$676,D684*$D$676)","v":2.700572416361614E-2},1.0963648873479928E-2]
[null,null,null,null,"STP",null,null,{"$f":"IF(O684=\"Not available\",$K$681*$D$676,O684*$D$676)","v":1.1041209607801425E-2},{"$f":"IF(P684=\"Not available\",$L$681*$D$676,P684*$D$676)","v":2.6502913004718107E-2},1.1041209607801425E-2]
[]
[null,null,null,"Proportion in nursing homes"]
[null,null,"UK",0.16085518130682117]
[]
[null,"Dementia Rates:",null,null,"Number with dementia",null,null,null,"Population size",null,"Dementia Prevalence"]
[]
[null,null,"National ",null,"65+",null,null,"80+","65+","80+","65+","80+"]
[null,1,"England",null,638924,null,null,427828,9305179,2538132,{"$f":"E681/I681","v":6.8663268057497867E-2},{"$f":"H681/J681","v":0.16856018520707355}]
[]
[null,null,"Vlookup",null,null,null,null,null,null,null,null,null,null,null,"Vlookup"]
[null,null,{"$f":"VLOOKUP($M$273,$B$686:$L$880,10,FALSE)","v":6.8158506206694433E-2},{"$f":"VLOOKUP($M$273,$B$686:$L$880,11,FALSE)","v":0.16788843196853209},null,null,null,null,null,null,null,null,null,null,{"$f":"VLOOKUP($R$273,$N$686:$X$729,10,FALSE)","v":6.8640683614294096E-2},{"$f":"VLOOKUP($R$273,$N$686:$X$729,11,FALSE)","v":0.16476256959460611}]
[null,null,"CCGs","CCGs",null,null,null,null,null,null,null,null,null,null,"STPs"]
[null,1,"NHS Airedale, Wharfedale and Craven CCG","NHS Airedale, Wharfedale and Craven CCG",2376,2376,2376,1641,32854,9480,{"$f":"IF(E686=\"N/A\",\"Not available\",E686/I686)","v":7.2319961039751635E-2},{"$f":"IF(H686=\"N/A\",\"Not available\",H686/J686)","v":0.17310126582278482},null,1,"Bath, NE Somerset, Swindon and Wiltshire",null,11076,null,null,7519,159770,44571,{"$f":"IF(Q686=\"N/A\",\"Not available\",Q686/U686)","v":6.9324654190398696E-2},{"$f":"IF(Q686=\"N/A\",\"Not available\",T686/V686)","v":0.16869713490834848}]
[null,2,"NHS Ashford CCG","NHS Ashford CCG",1475,1475,1475,989,22192,5823,{"$f":"IF(E687=\"N/A\",\"Not available\",E687/I687)","v":6.6465392934390771E-2},{"$f":"IF(H687=\"N/A\",\"Not available\",H687/J687)","v":0.16984372316675253},null,2,"Bedfordshire, Luton and Milton Keynes",null,8338,null,null,5410,128293,33063,{"$f":"IF(Q687=\"N/A\",\"Not available\",Q687/U687)","v":6.4991854582868908E-2},{"$f":"IF(Q687=\"N/A\",\"Not available\",T687/V687)","v":0.16362701509239935}]
[null,3,"NHS Barking and Dagenham CCG","NHS Barking and Dagenham CCG",1496,1496,1496,1056,19549,6108,7.6525653486111817E-2,0.17288801571709234,null,3,"Birmingham and Solihull",null,"N/A",null,null,null,null,null,"Not available","Not available"]
[null,4,"NHS Barnet CCG","NHS Barnet CCG",3769,3769,3769,2655,50495,15272,7.4641053569660359E-2,0.17384756416972236,null,4,"Bristol, North Somerset and South Gloucestershire",null,4380,null,null,3094,152482,43233,2.8724701932031322E-2,7.1565702125691022E-2]
[null,5,"NHS Barnsley CCG","NHS Barnsley CCG",2740,2740,2740,1741,42877,10715,6.3903724607598481E-2,0.16248250116658888,null,5,"Buckinghamshire, Oxfordshire and Berkshire West",null,7681,null,null,5226,109834,30812,6.993280769160734E-2,0.1696092431520187]
[null,6,"NHS Basildon and Brentwood CCG","NHS Basildon and Brentwood CCG",3143,3143,3143,2112,45212,12763,6.9516942404671322E-2,0.1654783358144637,null,6,"Cambridgeshire and Peterborough",null,9768,null,null,6573,143313,39151,6.8158506206694433E-2,0.16788843196853209]
[null,7,"NHS Bassetlaw CCG","NHS Bassetlaw CCG",1462,1462,1462,944,22759,5663,6.4238323300672265E-2,0.16669609747483666,null,7,"Cheshire and Merseyside",null,30277,null,null,19804,450459,119433,6.7213664284651878E-2,0.16581681779742616]
[null,8,"NHS Bath and North East Somerset CCG","NHS Bath and North East Somerset CCG",2482,2482,2482,1736,33914,10145,7.3185115291619973E-2,0.17111877772301626,null,8,"Cornwall and the Isles of Scilly",null,8489,null,null,5683,126001,33335,6.7372481170784357E-2,0.17048147592620369]
[null,9,"NHS Bedfordshire CCG","NHS Bedfordshire CCG",4633,4633,4633,3020,71206,18475,6.5064741735247025E-2,0.16346414073071719,null,9,"Coventry and Warwickshire",null,10712,null,null,7204,155597,42146,6.8844514997075779E-2,0.17092962558724434]
[null,10,"NHS Berkshire West CCG","NHS Berkshire West CCG","N/A","N/A","N/A","N/A",71299,18790,"Not available","Not available",null,10,"Derbyshire (Joined Up Care)",null,12748,null,null,8477,189179,50249,6.7385914927132501E-2,0.16869987462437064]
[null,11,"NHS Bexley CCG","NHS Bexley CCG",2814,2814,2814,1908,39217,11454,7.175459622102659E-2,0.16657936092194867,null,11,"Devon",null,18528,null,null,12793,259134,73846,7.1499687420407979E-2,0.17323890258104704]
[null,12,"NHS Birmingham and Solihull CCG","NHS Birmingham and Solihull CCG","N/A","N/A","N/A","N/A",169348,49388,"Not available","Not available",null,12,"Dorset",null,13336,null,null,9438,178274,54583,7.4806197202059749E-2,0.17291097960903579]
[null,13,"NHS Blackburn with Darwen CCG","NHS Blackburn with Darwen CCG",1336,1336,1336,866,20201,5068,6.6135339834661647E-2,0.17087608524072612,null,13,"Durham, Darlington, Teesside, Hambleton, Richmondshire and Whitby",null,13536,null,null,8714,205985,53110,6.5713522829332238E-2,0.16407456222933534]
[null,14,"NHS Blackpool CCG","NHS Blackpool CCG",1992,1992,1992,1335,28181,7658,7.0685923139704052E-2,0.174327500652912,null,14,"East London",null,12914,null,null,8674,184415,52077,7.0026841634357295E-2,0.16656105382414502]
[null,15,"NHS Bolton CCG","NHS Bolton CCG",2940,2940,2940,1897,45676,11206,6.436640686575007E-2,0.1692843119757273,null,15,"Frimley Health",null,3400,null,null,2246,50757,13278,6.6985834466182004E-2,0.16915198071998794]
[null,16,"NHS Bradford City CCG","NHS Bradford City CCG",402,402,402,264,5596,1504,7.1837026447462468E-2,0.17553191489361702,null,16,"Gloucestershire",null,8431,null,null,5741,120377,33443,7.0038296352293208E-2,0.17166522142152318]
[null,17,"NHS Bradford Districts CCG","NHS Bradford Districts CCG",3248,3248,3248,2146,47221,12881,6.87829567353508E-2,0.16660197189659187,null,17,"Greater Manchester",null,24454,null,null,15858,372674,94311,6.561767120861664E-2,0.16814581544040461]
[null,18,"NHS Brent CCG","NHS Brent CCG",2222,2222,2222,1388,34518,8923,6.4372211599745058E-2,0.15555306511263028,null,18,"Hampshire and the Isle of Wight",null,23743,null,null,16256,337150,95346,7.0422660536853032E-2,0.17049482935833701]
[null,19,"NHS Brighton and Hove CCG","NHS Brighton and Hove CCG",2848,2848,2848,2034,37197,11526,7.6565314407075841E-2,0.17647058823529413,null,19,"Herefordshire and Worcestershire",null,10891,null,null,7299,160323,43215,6.7931613056142912E-2,0.16889968760846927]
[null,20,"NHS Bristol, North Somerset and South Gloucestershire CCG","NHS Bristol, North Somerset and South Gloucestershire CCG",4380,4380,4380,3094,152482,43233,2.8724701932031322E-2,7.1565702125691022E-2,null,20,"Hertfordshire and West Essex",null,16806,null,null,11518,235869,68937,7.1251414980349259E-2,0.16708008761622931]
[null,21,"NHS Bromley CCG","NHS Bromley CCG",4051,4051,4051,2829,55419,16805,7.3097674082895761E-2,0.16834275513240107,null,21,"Humber, Coast and Vale",null,17923,null,null,11781,266527,70387,6.7246470338839973E-2,0.16737465725204939]
[null,22,"NHS Buckinghamshire CCG","NHS Buckinghamshire CCG","N/A","N/A","N/A","N/A",92305,25091,"Not available","Not available",null,22,"Kent and Medway",null,22237,null,null,14938,326839,88203,6.8036556224930322E-2,0.16935931884403024]
[null,23,"NHS Bury CCG","NHS Bury CCG",2067,2067,2067,1321,31915,7852,6.4765784114052954E-2,0.16823739174732552,null,23,"Lancashire and South Cumbria",null,18348,null,null,12033,320050,83806,5.7328542415247617E-2,0.14358160513567048]
[null,24,"NHS Calderdale CCG","NHS Calderdale CCG",2360,2360,2360,1568,35258,9111,6.6935163650802654E-2,0.17209965975194819,null,24,"Leicester, Leicestershire and Rutland",null,11786,null,null,7875,173356,47006,6.7987263204042553E-2,0.16753180445049567]
[null,25,"NHS Cambridgeshire and Peterborough CCG","NHS Cambridgeshire and Peterborough CCG",9768,9768,9768,6573,143313,39151,6.8158506206694433E-2,0.16788843196853209,null,25,"Lincolnshire",null,10481,null,null,6850,159968,41275,6.551935387077415E-2,0.16596002422774075]
[null,26,"NHS Camden CCG","NHS Camden CCG",1743,1743,1743,1159,26192,7003,6.6547037263286493E-2,0.16550049978580608,null,26,"Mid and South Essex",null,14366,null,null,9641,211518,57468,6.7918569578002824E-2,0.16776292893436348]
[null,27,"NHS Cannock Chase CCG","NHS Cannock Chase CCG",1516,1516,1516,959,24258,5821,6.2494847060763463E-2,0.16474832503006356,null,27,"Norfolk and Waveney",null,15924,null,null,10761,229834,64162,6.9284788151448437E-2,0.16771609363797887]
[null,28,"NHS Canterbury and Coastal CCG","NHS Canterbury and Coastal CCG",2931,2931,2931,2032,41211,11770,7.112178787217005E-2,0.17264231096006796,null,28,"North Cumbria",null,1117,null,null,732,67532,17727,1.6540306817508735E-2,4.1292942968353362E-2]
[null,29,"NHS Castle Point and Rochford CCG","NHS Castle Point and Rochford CCG",2542,2542,2542,1638,39412,10041,6.4498122399269261E-2,0.16313116223483717,null,29,"North London",null,11093,null,null,7428,160524,44190,6.9104931349829313E-2,0.16809232858112697]
[null,30,"NHS Central London (Westminster) CCG","NHS Central London (Westminster) CCG",1374,1374,1374,908,20389,5616,6.7389278532542063E-2,0.16168091168091167,null,30,"North West London",null,15960,null,null,10373,239459,63382,6.6650240751026268E-2,0.16365845192641443]
[null,31,"NHS Chorley and South Ribble CCG","NHS Chorley and South Ribble CCG",1887,1887,1887,1193,30523,7127,6.1822232414900237E-2,0.16739160937280764,null,31,"Northamptonshire",null,7443,null,null,4923,114003,29135,6.5287755585379331E-2,0.1689720267719238]
[null,32,"NHS City and Hackney CCG","NHS City and Hackney CCG",1229,1229,1229,767,19491,4856,6.3054743214817091E-2,0.1579489291598023,null,32,"Northumberland, Tyne and Wear and North Durham",null,16358,null,null,10626,308274,81287,5.306318405055243E-2,0.13072200966944283]
[null,33,"NHS Coastal West Sussex CCG","NHS Coastal West Sussex CCG",9138,9138,9138,6472,122626,37420,7.4519269975372268E-2,0.17295563869588457,null,33,"Nottingham and Nottinghamshire",null,11354,null,null,7529,167977,45256,6.7592587080374092E-2,0.16636468092628601]
[null,34,"NHS Corby CCG","NHS Corby CCG",544,544,544,331,8963,2127,6.0693964074528615E-2,0.15561824165491303,null,34,"Shropshire and Telford and Wrekin",null,6228,null,null,4073,95073,24321,6.5507557350667378E-2,0.16746844290941984]
[null,35,"NHS Coventry and Rugby CCG","NHS Coventry and Rugby CCG",4753,4753,4753,3238,66828,18607,7.1122882624049796E-2,0.1740205299080991,null,35,"Somerset",null,8588,null,null,5915,121149,34585,7.0887914881674632E-2,0.17102790226977013]
[null,36,"NHS Crawley CCG","NHS Crawley CCG",1075,1075,1075,767,14172,4555,7.585379621789444E-2,0.16838638858397365,null,36,"South East London",null,13897,null,null,9398,197057,55778,7.052274215074826E-2,0.16848936856825272]
[null,37,"NHS Croydon CCG","NHS Croydon CCG",3250,3250,3250,2154,47512,12901,6.8403771678733793E-2,0.16696380125571661,null,37,"South West London",null,12637,null,null,8606,178658,50080,7.0732908685869095E-2,0.1718450479233227]
[null,38,"NHS Darlington CCG","NHS Darlington CCG",1360,1360,1360,905,19658,5315,6.9183029809746666E-2,0.17027281279397929,null,38,"South Yorkshire and Bassetlaw",null,17259,null,null,11272,257646,67298,6.6987261591485991E-2,0.16749383339772356]
[null,39,"NHS Dartford, Gravesham and Swanley CCG","NHS Dartford, Gravesham and Swanley CCG",2857,2857,2857,1875,42554,11490,6.7138224373736899E-2,0.16318537859007834,null,39,"Staffordshire and Stoke on Trent ",null,13655,null,null,8783,211765,52817,6.4481854886312653E-2,0.16629115625650831]
[null,40,"NHS Doncaster CCG","NHS Doncaster CCG",3614,3614,3614,2348,54297,14311,6.6559846768698083E-2,0.16406959681363986,null,40,"Suffolk and North East Essex",null,13731,null,null,9309,198341,54913,6.9229256684195398E-2,0.16952269954291332]
[null,41,"NHS Dorset CCG","NHS Dorset CCG",13336,13336,13336,9438,178274,54583,7.4806197202059749E-2,0.17291097960903579,null,41,"Surrey Heartlands",null,11230,null,null,7860,151048,45304,7.4347227371431596E-2,0.1734946141621049]
[null,42,"NHS Dudley CCG","NHS Dudley CCG",4070,4070,4070,2623,61403,16068,6.6283406348224022E-2,0.163243714214588,null,42,"Sussex and East Surrey",null,28085,null,null,19911,376857,114359,7.4524289053938236E-2,0.17410960221757799]
[null,43,"NHS Durham Dales, Easington and Sedgefield CCG","NHS Durham Dales, Easington and Sedgefield CCG",3482,3482,3482,2221,53630,13465,6.4926347193734843E-2,0.16494615670256219,null,43,"The Black Country & West Birmingham",null,14748,null,null,9677,214858,58733,6.8640683614294096E-2,0.16476256959460611]
[null,44,"NHS Ealing CCG","NHS Ealing CCG",2576,2576,2576,1670,38442,10095,6.7010041100879242E-2,0.1654284299157999,null,44,"West Yorkshire & Harrogate",null,21347,null,null,14114,398892,106325,5.3515738595910675E-2,0.13274394545027041]
[null,45,"NHS East and North Hertfordshire CCG","NHS East and North Hertfordshire CCG",6334,6334,6334,4279,90350,25987,7.0105146651909242E-2,0.16465925270327472]
[null,46,"NHS East Berkshire CCG","NHS East Berkshire CCG","N/A","N/A","N/A","N/A",56148,15540,"Not available","Not available"]
[null,47,"NHS East Lancashire CCG","NHS East Lancashire CCG",4378,4378,4378,2878,66341,16868,6.5992372740838995E-2,0.17061892340526441]
[null,48,"NHS East Leicestershire and Rutland CCG","NHS East Leicestershire and Rutland CCG",4420,4420,4420,2944,65179,17765,6.7813252734776536E-2,0.16571911061075148]
[null,49,"NHS East Riding of Yorkshire CCG","NHS East Riding of Yorkshire CCG",4806,4806,4806,3103,73526,18626,6.5364632918967436E-2,0.16659508214324062]
[null,50,"NHS East Staffordshire CCG","NHS East Staffordshire CCG",1486,1486,1486,965,22666,5875,6.5560751786817265E-2,0.16425531914893618]
[null,51,"NHS East Surrey CCG","NHS East Surrey CCG",2244,2244,2244,1579,30887,9093,7.2651924757988803E-2,0.17365006048608819]
[null,52,"NHS Eastbourne, Hailsham and Seaford CCG","NHS Eastbourne, Hailsham and Seaford CCG",3807,3807,3807,2781,47948,15669,7.9398515057979471E-2,0.17748420448018382]
[null,53,"NHS Eastern Cheshire CCG","NHS Eastern Cheshire CCG",3044,3044,3044,2072,43363,12169,7.0198095150243292E-2,0.1702687155887912]
[null,54,"NHS Enfield CCG","NHS Enfield CCG",2877,2877,2877,1931,40920,11407,7.0307917888563054E-2,0.16928201981239591]
[null,55,"NHS Erewash CCG","NHS Erewash CCG",1172,1172,1172,778,17395,4646,6.737568266743317E-2,0.16745587602238485]
[null,56,"NHS Fareham and Gosport CCG","NHS Fareham and Gosport CCG",2755,2755,2755,1851,40125,11109,6.8660436137071651E-2,0.16662165811504187]
[null,57,"NHS Fylde and Wyre CCG","NHS Fylde and Wyre CCG",3046,3046,3046,2065,48051,13580,6.3390980416640652E-2,0.15206185567010308]
[null,58,"NHS Gloucestershire CCG","NHS Gloucestershire CCG",8431,8431,8431,5741,120377,33443,7.0038296352293208E-2,0.17166522142152318]
[null,59,"NHS Great Yarmouth and Waveney CCG","NHS Great Yarmouth and Waveney CCG",3580,3580,3580,2426,51539,14383,6.9461960845185203E-2,0.16867134811930751]
[null,60,"NHS Greater Huddersfield CCG","NHS Greater Huddersfield CCG",2660,2660,2660,1731,40484,10204,6.5704969864637877E-2,0.16963935711485692]
[null,61,"NHS Greater Preston CCG","NHS Greater Preston CCG",2248,2248,2248,1482,32788,8814,6.8561668903257295E-2,0.16814159292035399]
[null,62,"NHS Greenwich CCG","NHS Greenwich CCG",1929,1929,1929,1299,27616,7458,6.9850811123986098E-2,0.1741753821399839]
[null,63,"NHS Guildford and Waverley CCG","NHS Guildford and Waverley CCG",2831,2831,2831,2000,36541,11180,7.7474617552885802E-2,0.17889087656529518]
[null,64,"NHS Halton CCG","NHS Halton CCG",1244,1244,1244,770,20306,4721,6.1262680980990837E-2,0.16310103791569583]
[null,65,"NHS Hambleton, Richmondshire and Whitby CCG","NHS Hambleton, Richmondshire and Whitby CCG",2211,2211,2211,1430,34023,8596,6.4985451018428717E-2,0.16635644485807352]
[null,66,"NHS Hammersmith and Fulham CCG","NHS Hammersmith and Fulham CCG",1129,1129,1129,728,17517,4417,{"$f":"IF(E751=\"N/A\",\"Not available\",E751/I751)","v":6.4451675515213788E-2},{"$f":"IF(H751=\"N/A\",\"Not available\",H751/J751)","v":0.16481774960380349}]
[null,67,"NHS Hardwick CCG","NHS Hardwick CCG",1442,1442,1442,937,21975,5490,6.562002275312856E-2,0.17067395264116575]
[null,68,"NHS Haringey CCG","NHS Haringey CCG",1478,1478,1478,905,23774,5700,6.2168755783629175E-2,0.1587719298245614]
[null,69,"NHS Harrogate and Rural District CCG","NHS Harrogate and Rural District CCG",2407,2407,2407,1657,33609,9597,7.1617721443660923E-2,0.17265812232989475]
[null,70,"NHS Harrow CCG","NHS Harrow CCG",2480,2480,2480,1655,35499,9994,6.9861122848530938E-2,0.16559935961576946]
[null,71,"NHS Hartlepool and Stockton-on-Tees CCG","NHS Hartlepool and Stockton-on-Tees CCG",3197,3197,3197,2043,48997,12843,6.5248892789354446E-2,0.15907498248072879]
[null,72,"NHS Hastings and Rother CCG","NHS Hastings and Rother CCG",3346,3346,3346,2386,44350,13205,7.5445321307779034E-2,0.18068913290420296]
[null,73,"NHS Havering CCG","NHS Havering CCG",3275,3275,3275,2260,44822,13696,7.3066797554772203E-2,0.16501168224299065]
[null,74,"NHS Herefordshire CCG","NHS Herefordshire CCG",2877,2877,2877,1928,42000,11487,6.8500000000000005E-2,0.16784190824410203]
[null,75,"NHS Herts Valleys CCG","NHS Herts Valleys CCG",6763,6763,6763,4691,92901,27708,7.2797924672500833E-2,0.16930128482748666]
[null,76,"NHS Heywood, Middleton and Rochdale CCG","NHS Heywood, Middleton and Rochdale CCG",2170,2170,2170,1409,33048,8493,6.5662067296054227E-2,0.16590133050747674]
[null,77,"NHS High Weald Lewes Havens CCG","NHS High Weald Lewes Havens CCG",2588,2588,2588,1775,37151,10406,6.9661651099566638E-2,0.17057466846050356]
[null,78,"NHS Hillingdon CCG","NHS Hillingdon CCG",2614,2614,2614,1738,37544,10462,6.9624973364585549E-2,0.16612502389600459]
[null,79,"NHS Horsham and Mid Sussex CCG","NHS Horsham and Mid Sussex CCG",3039,3039,3039,2117,42526,12485,7.1462164323002397E-2,0.16956347617140569]
[null,80,"NHS Hounslow CCG","NHS Hounslow CCG",1870,1870,1870,1198,28618,7333,6.5343490111118882E-2,0.16337106232101459]
[null,81,"NHS Hull CCG","NHS Hull CCG",2566,2566,2566,1688,37631,10147,6.8188461640668593E-2,0.16635458756282645]
[null,82,"NHS Ipswich and East Suffolk CCG","NHS Ipswich and East Suffolk CCG",5804,5804,5804,3959,83113,23430,6.9832637493532898E-2,0.16897140418267179]
[null,83,"NHS Isle of Wight CCG","NHS Isle of Wight CCG",2534,2534,2534,1759,35369,9928,7.1644660578472671E-2,0.17717566478646252]
[null,84,"NHS Islington CCG","NHS Islington CCG",1226,1226,1226,778,19143,4808,6.4044298176879275E-2,0.16181364392678868]
[null,85,"NHS Kernow CCG","NHS Kernow CCG",8489,8489,8489,5683,126001,33335,6.7372481170784357E-2,0.17048147592620369]
[null,86,"NHS Kingston CCG","NHS Kingston CCG",1621,1621,1621,1147,21786,6412,7.4405581566143394E-2,0.1788833437305053]
[null,87,"NHS Knowsley CCG","NHS Knowsley CCG",1584,1584,1584,994,24032,6446,6.5912117177097204E-2,0.15420415761712691]
[null,88,"NHS Lambeth CCG","NHS Lambeth CCG",1616,1616,1616,1050,24222,6415,6.6716208405581706E-2,0.16367887763055339]
[null,89,"NHS Leeds CCG","NHS Leeds CCG",2193,2193,2193,1461,115466,31602,1.8992603883394247E-2,4.6231251186633758E-2]
[null,90,"NHS Leicester City CCG","NHS Leicester City CCG",2794,2794,2794,1903,38776,11258,7.2054879306787709E-2,0.169035352638124]
[null,91,"NHS Lewisham CCG","NHS Lewisham CCG",1906,1906,1906,1270,27081,7435,7.0381448247849046E-2,0.17081371889710828]
[null,92,"NHS Lincolnshire East CCG","NHS Lincolnshire East CCG",3742,3742,3742,2400,58277,14641,6.4210580503457626E-2,0.16392322928761696]
[null,93,"NHS Lincolnshire West CCG","NHS Lincolnshire West CCG",2930,2930,2930,1934,44178,11596,6.6322604011046227E-2,0.16678164884442911]
[null,94,"NHS Liverpool CCG","NHS Liverpool CCG",4597,4597,4597,2953,68325,18138,6.7281375777533847E-2,0.16280736575146101]
[null,95,"NHS Luton CCG","NHS Luton CCG",1676,1676,1676,1072,24978,6700,6.7099047161502126E-2,0.16]
[null,96,"NHS Manchester CCG","NHS Manchester CCG","N/A","N/A","N/A","N/A",48988,13387,"Not available","Not available"]
[null,97,"NHS Mansfield and Ashfield CCG","NHS Mansfield and Ashfield CCG",2276,2276,2276,1469,35233,8938,6.4598529787415204E-2,0.16435444170955471]
[null,98,"NHS Medway CCG","NHS Medway CCG",2552,2552,2552,1621,40547,9807,6.2939305004069357E-2,0.16529009890894258]
[null,99,"NHS Merton CCG","NHS Merton CCG",1722,1722,1722,1167,24194,6926,7.1174671406133747E-2,0.16849552411204158]
[null,100,"NHS Mid Essex CCG","NHS Mid Essex CCG",4783,4783,4783,3192,72231,19060,6.6218105799448992E-2,0.16747114375655825]
[null,101,"NHS Milton Keynes CCG","NHS Milton Keynes CCG",2029,2029,2029,1318,32109,7888,6.3191005637048797E-2,0.1670892494929006]
[null,102,"NHS Morecambe Bay CCG","NHS Morecambe Bay CCG",2029,2029,2029,1318,71299,19260,2.8457622126537539E-2,6.8431983385254413E-2]
[null,103,"NHS Nene CCG","NHS Nene CCG",6899,6899,6899,4592,105040,27008,6.5679741051028181E-2,0.17002369668246445]
[null,104,"NHS Newark and Sherwood CCG","NHS Newark and Sherwood CCG",1570,1570,1570,1017,24190,6099,6.4902852418354695E-2,0.16674864731923267]
[null,105,"NHS Newcastle Gateshead CCG","NHS Newcastle Gateshead CCG",1170,1170,1170,789,78013,21663,1.4997500416597235E-2,3.6421548262013569E-2]
[null,106,"NHS Newham CCG","NHS Newham CCG",1392,1392,1392,870,21852,5331,6.3701263042284462E-2,0.16319639842431063]
[null,107,"NHS North Cumbria CCG","NHS North Cumbria CCG",1117,1117,1117,732,67532,17727,1.6540306817508735E-2,4.1292942968353362E-2]
[null,108,"NHS North Derbyshire CCG","NHS North Derbyshire CCG",3912,3912,3912,2597,58459,15339,6.6918695153868529E-2,0.16930699524088924]
[null,109,"NHS North Durham CCG","NHS North Durham CCG",2884,2884,2884,1822,45381,11004,6.3550825235230604E-2,0.16557615412577245]
[null,110,"NHS North East Essex CCG","NHS North East Essex CCG",4867,4867,4867,3305,69736,19301,6.9791786164965008E-2,0.17123465105434951]
[null,111,"NHS North East Hampshire and Farnham CCG","NHS North East Hampshire and Farnham CCG",2269,2269,2269,1504,33792,8781,6.7146070075757569E-2,0.17127889761986106]
[null,112,"NHS North East Lincolnshire CCG","NHS North East Lincolnshire CCG",2061,2061,2061,1355,30155,8142,6.8346874481843803E-2,0.16642102677474821]
[null,113,"NHS North Hampshire CCG","NHS North Hampshire CCG",2313,2313,2313,1506,36130,9115,6.4018820924439529E-2,0.16522216127262754]
[null,114,"NHS North Kirklees CCG","NHS North Kirklees CCG",1867,1867,1867,1192,29126,7215,6.4100803405891638E-2,0.1652113652113652]
[null,115,"NHS North Lincolnshire CCG","NHS North Lincolnshire CCG",2153,2153,2153,1409,32512,8416,6.6221702755905512E-2,0.16741920152091255]
[null,116,"NHS North Norfolk CCG","NHS North Norfolk CCG",3249,3249,3249,2194,46970,12961,6.9171811794762617E-2,0.16927706195509606]
[null,117,"NHS North Staffordshire CCG","NHS North Staffordshire CCG",2879,2879,2879,1861,44227,11111,6.5095982092386998E-2,0.16749167491674916]
[null,118,"NHS North Tyneside CCG","NHS North Tyneside CCG",2613,2613,2613,1748,37838,10491,6.9057561181880653E-2,0.16661900676770566]
[null,119,"NHS North West Surrey CCG","NHS North West Surrey CCG",4276,4276,4276,2956,58639,17339,7.2920752400279676E-2,0.17048272680085358]
[null,120,"NHS Northern, Eastern and Western Devon CCG","NHS Northern, Eastern and Western Devon CCG",13478,13478,13478,9267,189623,53726,7.1077875574165575E-2,0.17248631947288093]
[null,121,"NHS Northumberland CCG","NHS Northumberland CCG",4498,4498,4498,2921,69006,17547,6.518273773295076E-2,0.16646720237077564]
[null,122,"NHS Norwich CCG","NHS Norwich CCG",2617,2617,2617,1846,37744,11559,6.9335523526918186E-2,0.15970239640107275]
[null,123,"NHS Nottingham City CCG","NHS Nottingham City CCG",2689,2689,2689,1854,36665,10980,7.3339697258966316E-2,0.16885245901639345]
[null,124,"NHS Nottingham North and East CCG","NHS Nottingham North and East CCG",1829,1829,1829,1189,27742,7120,6.5928916444380356E-2,0.16699438202247191]
[null,125,"NHS Nottingham West CCG","NHS Nottingham West CCG",1459,1459,1459,966,21802,5809,6.6920466012292457E-2,0.16629368221724911]
[null,126,"NHS Oldham CCG","NHS Oldham CCG",2313,2313,2313,1496,35357,8727,6.5418446135135894E-2,0.17142202360490433]
[null,127,"NHS Oxfordshire CCG","NHS Oxfordshire CCG",7681,7681,7681,5226,109834,30812,6.993280769160734E-2,0.1696092431520187]
[null,128,"NHS Portsmouth CCG","NHS Portsmouth CCG",2132,2132,2132,1485,28966,8371,7.3603535179175589E-2,0.1773981603153745]
[null,129,"NHS Redbridge CCG","NHS Redbridge CCG",2553,2553,2553,1768,35051,10178,7.2836723631280131E-2,0.17370799764197289]
[null,130,"NHS Redditch and Bromsgrove CCG","NHS Redditch and Bromsgrove CCG",2294,2294,2294,1555,33442,9072,{"$f":"IF(E815=\"N/A\",\"Not available\",E815/I815)","v":6.859637581484361E-2},{"$f":"IF(H815=\"N/A\",\"Not available\",H815/J815)","v":0.17140652557319225}]
[null,131,"NHS Richmond CCG","NHS Richmond CCG",2000,2000,2000,1416,27460,7906,7.2833211944646759E-2,0.17910447761194029]
[null,132,"NHS Rotherham CCG","NHS Rotherham CCG",3107,3107,3107,1991,47823,11802,6.496873889132844E-2,0.16870022030164378]
[null,133,"NHS Rushcliffe CCG","NHS Rushcliffe CCG",1531,1531,1531,1034,22345,6310,6.8516446632356232E-2,0.16386687797147384]
[null,134,"NHS Salford CCG","NHS Salford CCG",2415,2415,2415,1608,34882,9286,6.9233415515165417E-2,0.17316390264914927]
[null,135,"NHS Sandwell and West Birmingham CCG","NHS Sandwell and West Birmingham CCG",4442,4442,4442,2931,63550,17565,6.9897718332022032E-2,0.16686592655849702]
[null,136,"NHS Scarborough and Ryedale CCG","NHS Scarborough and Ryedale CCG",1812,1812,1812,1206,26381,7110,6.868579659603502E-2,0.16962025316455695]
[null,137,"NHS Sheffield CCG","NHS Sheffield CCG",6336,6336,6336,4248,89890,24807,7.0486149738569356E-2,0.17124198814850647]
[null,138,"NHS Shropshire CCG","NHS Shropshire CCG",4631,4631,4631,3088,68683,18293,6.7425709418633434E-2,0.16880774066582846]
[null,139,"NHS Somerset CCG","NHS Somerset CCG",8588,8588,8588,5915,121149,34585,7.0887914881674632E-2,0.17102790226977013]
[null,140,"NHS South Cheshire CCG","NHS South Cheshire CCG",2252,2252,2252,1470,34683,8892,6.4930945996597753E-2,0.16531713900134953]
[null,141,"NHS South Devon and Torbay CCG","NHS South Devon and Torbay CCG",5050,5050,5050,3526,69511,20120,7.2650371883586765E-2,0.17524850894632207]
[null,142,"NHS South East Staffordshire and Seisdon Peninsula CCG","NHS South East Staffordshire and Seisdon Peninsula CCG",2837,2837,2837,1797,45232,10851,6.2721082419525995E-2,0.16560685651092066]
[null,143,"NHS South Eastern Hampshire CCG","NHS South Eastern Hampshire CCG",3163,3163,3163,2143,45553,12948,6.9435602485017456E-2,0.16550818659252395]
[null,144,"NHS South Kent Coast CCG","NHS South Kent Coast CCG",3132,3132,3132,2148,44884,12386,6.9779877016308708E-2,0.17342160503794607]
[null,145,"NHS South Lincolnshire CCG","NHS South Lincolnshire CCG",2166,2166,2166,1453,31951,8710,6.7791305436449567E-2,0.16681974741676234]
[null,146,"NHS South Norfolk CCG","NHS South Norfolk CCG",3566,3566,3566,2361,50715,13541,7.031450261263926E-2,0.17435935307584374]
[null,147,"NHS South Sefton CCG","NHS South Sefton CCG",2120,2120,2120,1380,30919,8523,6.8566253759824058E-2,0.16191481872580077]
[null,148,"NHS South Tees CCG","NHS South Tees CCG",3286,3286,3286,2115,49677,12891,6.6147311633150144E-2,0.16406795438678148]
[null,149,"NHS South Tyneside CCG","NHS South Tyneside CCG",1989,1989,1989,1334,28214,7974,7.0496916424470119E-2,0.1672937045397542]
[null,150,"NHS South Warwickshire CCG","NHS South Warwickshire CCG",3749,3749,3749,2554,53732,14947,6.9772202784188192E-2,0.17087040877768114]
[null,151,"NHS South West Lincolnshire CCG","NHS South West Lincolnshire CCG",1643,1643,1643,1063,25562,6328,6.4275095845395508E-2,0.1679835651074589]
[null,152,"NHS South Worcestershire CCG","NHS South Worcestershire CCG",4298,4298,4298,2900,62537,17228,6.8727313430449175E-2,0.16833062456466219]
[null,153,"NHS Southampton CCG","NHS Southampton CCG",2368,2368,2368,1654,32148,9617,7.3659325619012075E-2,0.17198710616616408]
[null,154,"NHS Southend CCG","NHS Southend CCG",2470,2470,2470,1759,32825,9990,7.5247524752475245E-2,0.17607607607607609]
[null,155,"NHS Southern Derbyshire CCG","NHS Southern Derbyshire CCG",6222,6222,6222,4165,91350,24774,6.8111658456486049E-2,0.16811980301929441]
[null,156,"NHS Southport and Formby CCG","NHS Southport and Formby CCG",2157,2157,2157,1484,29283,8754,7.3660485605982998E-2,0.16952250399817226]
[null,157,"NHS Southwark CCG","NHS Southwark CCG",1581,1581,1581,1042,23502,6211,6.7270870564207302E-2,0.16776686523909193]
[null,158,"NHS St Helens CCG","NHS St Helens CCG",2118,2118,2118,1310,33973,7987,6.2343625820504518E-2,0.16401652685614124]
[null,159,"NHS Stafford and Surrounds CCG","NHS Stafford and Surrounds CCG",2103,2103,2103,1368,32235,8068,6.5239646347138205E-2,0.16955875061973227]
[null,160,"NHS Stockport CCG","NHS Stockport CCG",3757,3757,3757,2505,54498,15094,6.8938309662739922E-2,0.16595998409964224]
[null,161,"NHS Stoke on Trent CCG","NHS Stoke on Trent CCG",2834,2834,2834,1833,43147,11091,6.5682434468213313E-2,0.16526913713822017]
[null,162,"NHS Sunderland CCG","NHS Sunderland CCG",3204,3204,3204,2012,49822,12608,6.4308939825779773E-2,0.15958121827411167]
[null,163,"NHS Surrey Downs CCG","NHS Surrey Downs CCG",4123,4123,4123,2904,55868,16785,7.3798954678885947E-2,0.17301161751563895]
[null,164,"NHS Surrey Heath CCG","NHS Surrey Heath CCG",1131,1131,1131,742,16965,4497,6.6666666666666666E-2,0.16499888814765398]
[null,165,"NHS Sutton CCG","NHS Sutton CCG",2096,2096,2096,1433,29412,8455,7.1263429892560862E-2,0.16948551153163807]
[null,166,"NHS Swale CCG","NHS Swale CCG",1173,1173,1173,741,19082,4529,6.1471543863326698E-2,0.16361227644071538]
[null,167,"NHS Swindon CCG","NHS Swindon CCG",2152,2152,2152,1426,32215,8744,6.6801179574732264E-2,0.16308325709057639]
[null,168,"NHS Tameside and Glossop CCG","NHS Tameside and Glossop CCG",2710,2710,2710,1728,42597,10205,6.3619503720919318E-2,0.16932876041156297]
[null,169,"NHS Telford and Wrekin CCG","NHS Telford and Wrekin CCG",1597,1597,1597,985,26390,6028,6.0515346722243277E-2,0.16340411413404113]
[null,170,"NHS Thanet CCG","NHS Thanet CCG",2226,2226,2226,1556,30532,8772,7.2907113847766283E-2,0.1773825809393525]
[null,171,"NHS Thurrock CCG","NHS Thurrock CCG",1428,1428,1428,940,21838,5614,6.5390603535122258E-2,0.16743854649091558]
[null,172,"NHS Tower Hamlets CCG","NHS Tower Hamlets CCG",1084,1084,1084,694,16622,4440,6.5214775598604266E-2,0.15630630630630632]
[null,173,"NHS Trafford CCG","NHS Trafford CCG",2734,2734,2734,1861,38445,11171,7.1114579269085709E-2,0.16659206874944052]
[null,174,"NHS Vale of York CCG","NHS Vale of York CCG",4525,4525,4525,3020,66322,17946,6.8227737402370259E-2,0.168282625654742]
[null,175,"NHS Vale Royal CCG","NHS Vale Royal CCG",1212,1212,1212,786,18857,4697,6.42732141910166E-2,0.16734085586544603]
[null,176,"NHS Wakefield CCG","NHS Wakefield CCG",3834,3834,3834,2454,59278,14731,6.4678295489051588E-2,0.166587468603625]
[null,177,"NHS Walsall CCG","NHS Walsall CCG",3213,3213,3213,2073,47914,12740,6.7057644947197056E-2,0.16271585557299842]
[null,178,"NHS Waltham Forest CCG","NHS Waltham Forest CCG",1885,1885,1885,1259,27028,7468,6.974248927038626E-2,0.16858596679164434]
[null,179,"NHS Wandsworth CCG","NHS Wandsworth CCG",1948,1948,1948,1289,28294,7480,6.884851912066163E-2,0.17232620320855616]
[null,180,"NHS Warrington CCG","NHS Warrington CCG",2203,2203,2203,1386,35055,8309,6.2844102125231782E-2,0.16680707666385847]
[null,181,"NHS Warwickshire North CCG","NHS Warwickshire North CCG",2210,2210,2210,1412,35037,8592,6.3076176613294524E-2,0.16433891992551211]
[null,182,"NHS West Cheshire CCG","NHS West Cheshire CCG",3189,3189,3189,2109,47022,12591,6.7819318616817656E-2,0.16750059566356923]
[null,183,"NHS West Essex CCG","NHS West Essex CCG",3709,3709,3709,2548,52618,15242,7.0489186210042187E-2,0.16716966277391418]
[null,184,"NHS West Hampshire CCG","NHS West Hampshire CCG",8478,8478,8478,5858,118859,34258,7.1328212419757869E-2,0.17099655554906884]
[null,185,"NHS West Kent CCG","NHS West Kent CCG",5891,5891,5891,3976,85837,23626,6.863007793841816E-2,0.16828917294506052]
[null,186,"NHS West Lancashire CCG","NHS West Lancashire CCG",1432,1432,1432,896,22666,5431,6.3178328774375722E-2,0.16497882526238261]
[null,187,"NHS West Leicestershire CCG","NHS West Leicestershire CCG",4572,4572,4572,3028,69401,17983,6.587801328511117E-2,0.1683812489573486]
[null,188,"NHS West London CCG","NHS West London CCG",1695,1695,1695,1088,26932,6542,6.293628397445418E-2,0.16630999694283094]
[null,189,"NHS West Norfolk CCG","NHS West Norfolk CCG",2912,2912,2912,1934,42866,11718,6.7932627257033543E-2,0.16504522956135859]
[null,190,"NHS West Suffolk CCG","NHS West Suffolk CCG",3060,3060,3060,2045,45492,12182,6.726457399103139E-2,0.16787062879658513]
[null,191,"NHS Wigan Borough CCG","NHS Wigan Borough CCG",3348,3348,3348,2033,56256,12277,5.9513651877133103E-2,0.16559420053759061]
[null,192,"NHS Wiltshire CCG","NHS Wiltshire CCG",6442,6442,6442,4357,93641,25682,6.879465191529352E-2,0.16965189626976093]
[null,193,"NHS Wirral CCG","NHS Wirral CCG",4557,4557,4557,3090,64641,18206,7.0497052954007516E-2,0.16972426672525542]
[null,194,"NHS Wolverhampton CCG","NHS Wolverhampton CCG",3023,3023,3023,2050,41991,12360,{"$f":"IF(E879=\"N/A\",\"Not available\",E879/I879)","v":7.1991617251315754E-2},{"$f":"IF(H879=\"N/A\",\"Not available\",H879/J879)","v":0.16585760517799353}]
[null,195,"NHS Wyre Forest CCG","NHS Wyre Forest CCG",1422,1422,1422,916,22344,5428,6.3641245972073046E-2,0.16875460574797346]
[]
[]
[null,"Intervention:",null,"Hospital Discharge Support; COPD Self-management"]
[]
[null,"Summary: ",null,"In-built model population estimated by identifying prevalence rates for COPD by nation/LA/CCG/STP and multiplying by (a) the national % of COPD by age (65+/80+) and (b) the national % of COPD patients with moderate levels of dyspnoea (>= level 3)"]
[]
[null,"Data availability:",null,"Prevalence data: ",null,null,null,"Derived by dividing total number with COPD by total population. Data available nationally, regionally and for CCGs and STPs by age (65+ and 80+). Not available for local authorities so LA level analysis assumes regional prevalence rates."]
[null,null,null,"Prevalence by age",null,null,null,"Only national data available."]
[null,null,null,"Prevalence by breathing symptoms",null,null,null,"Only national data available."]
[null,"Eligible population: ",null,null,null,null,null,"65+","80+","Selection(age)"]
[null,null,null,null,"National",null,null,{"$f":"D898*I902*M898","v":3.1315403404963978E-2},{"$f":"I902*D899*M898","v":3.7869917944943737E-2},{"$f":"IF($J$266=1,H891,I891)","v":3.1315403404963978E-2}]
[null,null,null,null,"LA",null,null,{"$f":"C905*M898*D898","v":3.8056002118144694E-2},{"$f":"C905*M898*D899","v":4.6021367149250758E-2},{"$f":"IF($J$266=1,H892,I892)","v":3.8056002118144694E-2}]
[null,null,null,null,"CCG",null,null,{"$f":"IF(M905=\"Not available\",H891,M905*M898*D898)","v":2.8377357512280887E-2},{"$f":"IF(M905=\"Not available\",H891,M905*M898*D899)","v":3.4316920225720658E-2},2.8377357512280887E-2]
[null,null,null,null,"STP",null,null,{"$f":"S905*M898*D898","v":3.2032693418400482E-2},{"$f":"S905*M898*D899","v":3.8737341353171716E-2},3.2032693418400482E-2]
[]
[]
[null,null,null,"% COPD attributable",null,null,null,null,null,null,null,null,"% COPD with dyspnoea>=3"]
[null,null,"65+",{"$f":"H1252","v":3.6525503168049518},null,null,null,null,null,null,null,null,0.45510760626009622]
[null,null,"80+",{"$f":"H1258","v":4.4170524964483011}]
[null,null,null,null,"N (Pop)",null,null,"N (COPD)","Prevalence"]
[null,null,"National "]
[null,null,"England",null,56236410,null,null,1059413,{"$f":"H902/E902","v":1.8838560285053759E-2}]
[]
[null,null,"Vlookup",null,null,null,null,null,null,null,null,null,"Vlookup",null,null,null,null,null,"Vlookup"]
[null,null,{"$f":"VLOOKUP(G273,B907:I1223,8,FALSE)","v":2.289353519862878E-2},null,null,null,null,null,null,null,null,null,{"$f":"VLOOKUP(M273,L907:P1223,5,FALSE)","v":1.7071105657252558E-2},null,null,null,null,null,{"$f":"VLOOKUP(R273,R907:W950,6,FALSE)","v":1.9270063944299247E-2}]
[null,null,"LA",null,null,null,null,null,null,null,null,null,"CCG","N (pop)","N (COPD)","Prevalence",null,null,"STP",null,"N (pop)","N (COPD)_","Prevalence"]
[null,1,"Adur",null,3792554,null,null,57516,{"$f":"H907/E907","v":1.5165505883370414E-2},null,null,1,"NHS Airedale, Wharfedale and Craven ",159064,3368,{"$f":"O907/N907","v":2.1173867122667604E-2},null,1,"Bath, NE Somerset, Swindon and Wiltshire",null,935271,15700,{"$f":"V907/U907","v":1.6786578435555043E-2}]
[null,2,"Allerdale",null,2548971,null,null,63681,{"$f":"H908/E908","v":2.4983022560868678E-2},null,null,2,"NHS Ashford ",133421,2322,{"$f":"O908/N908","v":1.7403557161166532E-2},null,2,"Bedfordshire, Luton and Milton Keynes",null,1008033,15456,1.5332831365639815E-2]
[null,3,"Amber Valley",null,3658214,null,null,75089,2.0526136524544492E-2,null,null,3,"NHS Barking and Dagenham ",223281,3430,1.5361808662626915E-2,null,3,"Birmingham and Solihull",null,1310060,21742,1.6596186434209119E-2]
[null,4,"Arun",null,3792554,null,null,57516,1.5165505883370414E-2,null,null,4,"NHS Barnet ",404533,4337,1.0721004219680471E-2,null,4,"Bristol, North Somerset and South Gloucestershire",null,1008028,17996,1.7852678695433062E-2]
[null,5,"Ashfield",null,3658214,null,null,75089,2.0526136524544492E-2,null,null,5,"NHS Barnsley ",265436,8475,3.1928600491267195E-2,null,5,"Buckinghamshire, Oxfordshire and Berkshire West",null,1286999,16719,1.2990686084449173E-2]
[null,6,"Ashford",null,3792554,null,null,57516,1.5165505883370414E-2,null,null,6,"NHS Basildon and Brentwood ",278874,5346,1.9169947718324403E-2,null,6,"Cambridgeshire and Peterborough",null,967307,16513,1.7071105657252558E-2]
[null,7,"Aylesbury Vale",null,3792554,null,null,57516,1.5165505883370414E-2,null,null,7,"NHS Bassetlaw ",123423,3006,2.435526603631414E-2,null,7,"Cheshire and Merseyside",null,2620326,66208,2.5267085087886013E-2]
[null,8,"Babergh",null,3658214,null,null,75089,2.0526136524544492E-2,null,null,8,"NHS Bath and North East Somerset ",207866,2939,1.4138916417307303E-2,null,8,"Cornwall and the Isles of Scilly",null,574407,12681,2.2076680820393903E-2]
[null,9,"Barking and Dagenham",null,3594509,null,null,41654,1.1588230826519004E-2,null,null,9,"NHS Bedfordshire ",480136,7872,1.639535464951597E-2,null,9,"Coventry and Warwickshire",null,991798,16330,1.6465046309833253E-2]
[null,10,"Barnet",null,3594509,null,null,41654,1.1588230826519004E-2,null,null,10,"NHS Berkshire West ",543512,6476,1.191510031057272E-2,null,10,"Derbyshire (Joined Up Care)",null,1048933,23103,2.20252389809454E-2]
[null,11,"Barnsley",null,5713447,null,null,130801,2.289353519862878E-2,null,null,11,"NHS Bexley ",245201,4408,1.7977088184795331E-2,null,11,"Devon",null,1224410,26947,2.2008150864498002E-2]
[null,12,"Barrow-in-Furness",null,2548971,null,null,63681,2.4983022560868678E-2,null,null,12,"NHS Birmingham and Solihull ",1310060,21742,1.6596186434209119E-2,null,12,"Dorset",null,800260,16798,2.0990678029640365E-2]
[null,13,"Basildon",null,3658214,null,null,75089,2.0526136524544492E-2,null,null,13,"NHS Blackburn with Darwen ",181165,3906,2.156045593795711E-2,null,13,"Durham, Darlington, Teesside, Hambleton, Richmondshire and Whitby",null,1138056,34785,3.0565279740188533E-2]
[null,14,"Basingstoke and Deane",null,3792554,null,null,57516,1.5165505883370414E-2,null,null,14,"NHS Blackpool ",177797,6415,3.608047379877051E-2,null,14,"East London",null,2169970,24661,1.1364673244330567E-2]
[null,15,"Bassetlaw",null,3658214,null,null,75089,2.0526136524544492E-2,null,null,15,"NHS Bolton ",309149,7080,2.2901578203390598E-2,null,15,"Frimley Health",null,783310,9893,1.2629737907086594E-2]
[null,16,"Bath and North East Somerset",null,3058462,null,null,65001,2.1252838845145044E-2,null,null,16,"NHS Bradford City ",140293,1770,1.2616452709686157E-2,null,16,"Gloucestershire",null,636319,11568,1.8179560880627485E-2]
[null,17,"Bedford",null,3658214,null,null,75089,2.0526136524544492E-2,null,null,17,"NHS Bradford Districts ",332487,8257,2.4834053662248449E-2,null,17,"Greater Manchester",null,3044238,70418,2.313156855672914E-2]
[null,18,"Bexley",null,3594509,null,null,41654,1.1588230826519004E-2,null,null,18,"NHS Brent ",380614,3023,7.942429863326099E-3,null,18,"Hampshire and the Isle of Wight",null,1870332,35355,1.890306106081701E-2]
[null,19,"Birmingham",null,3658214,null,null,75089,2.0526136524544492E-2,null,null,19,"NHS Brighton and Hove ",304185,4373,1.4376119795519175E-2,null,19,"Herefordshire and Worcestershire",null,792642,16408,2.070039185407788E-2]
[null,20,"Blaby",null,3658214,null,null,75089,2.0526136524544492E-2,null,null,20,"NHS Bristol, North Somerset and South Gloucestershire ",1008028,17996,1.7852678695433062E-2,null,20,"Hertfordshire and West Essex",null,1556569,23865,1.5331797048508611E-2]
[null,21,"Blackburn with Darwen",null,2548971,null,null,63681,2.4983022560868678E-2,null,null,21,"NHS Bromley ",349066,4781,1.3696550222594008E-2,null,21,"Humber, Coast and Vale",null,1428962,33077,2.3147571453964486E-2]
[null,22,"Blackpool",null,2548971,null,null,63681,2.4983022560868678E-2,null,null,22,"NHS Buckinghamshire ",null,null,"Not available",null,22,"Kent and Medway",null,1883947,37709,2.0015955862877247E-2]
[null,23,"Bolsover",null,3658214,null,null,75089,2.0526136524544492E-2,null,null,23,"NHS Bury ",203952,4365,2.1402094610496587E-2,null,23,"Lancashire and South Cumbria",null,1775251,44394,2.5007168000468667E-2]
[null,24,"Bolton",null,2548971,null,null,63681,2.4983022560868678E-2,null,null,24,"NHS Calderdale ",220461,4990,2.2634388848821334E-2,null,24,"Leicester, Leicestershire and Rutland",null,1130243,18923,1.6742417338572325E-2]
[null,25,"Boston",null,3658214,null,null,75089,2.0526136524544492E-2,null,null,25,"NHS Cambridgeshire and Peterborough ",967307,16513,1.7071105657252558E-2,null,25,"Lincolnshire",null,791178,17876,2.2594157067056971E-2]
[null,26,"Bournemouth, Christchurch and Poole",null,3058462,null,null,65001,2.1252838845145044E-2,null,null,26,"NHS Camden ",284506,3725,1.3092869746156496E-2,null,26,"Mid and South Essex",null,1219651,23153,1.8983299320871297E-2]
[null,27,"Bracknell Forest",null,3792554,null,null,57516,1.5165505883370414E-2,null,null,27,"NHS Cannock Chase ",133160,3321,2.4939921898468009E-2,null,27,"Norfolk and Waveney",null,1030405,22910,2.2233975960908575E-2]
[null,28,"Bradford",null,5713447,null,null,130801,2.289353519862878E-2,null,null,28,"NHS Canterbury and Coastal ",225726,4259,1.8868008116034483E-2,null,28,"North Cumbria",null,323943,7903,2.4396267244546108E-2]
[null,29,"Braintree",null,3658214,null,null,75089,2.0526136524544492E-2,null,null,29,"NHS Castle Point and Rochford ",185146,4271,2.3068281248312141E-2,null,29,"North London",null,1566590,18273,1.1664187821957245E-2]
[null,30,"Breckland",null,3658214,null,null,75089,2.0526136524544492E-2,null,null,30,"NHS Central London (Westminster) ",228808,2064,9.0206636131603783E-3,null,30,"North West London",null,2429144,24496,1.0084210734316286E-2]
[null,31,"Brent",null,3594509,null,null,41654,1.1588230826519004E-2,null,null,31,"NHS Chorley and South Ribble ",188203,4314,2.2922057565501083E-2,null,31,"Northamptonshire",null,764266,14593,1.9094137381487596E-2]
[null,32,"Brentwood",null,3658214,null,null,75089,2.0526136524544492E-2,null,null,32,"NHS City and Hackney ",318726,3457,1.0846306859183122E-2,null,32,"Northumberland, Tyne and Wear and North Durham",null,1770264,49080,2.7724678353059206E-2]
[null,33,"Brighton and Hove",null,3792554,null,null,57516,1.5165505883370414E-2,null,null,33,"NHS Coastal West Sussex ",514819,10492,2.037997820593257E-2,null,33,"Nottingham and Nottinghamshire",null,1084857,21048,1.940163542291749E-2]
[null,34,"Bristol, City of",null,3058462,null,null,65001,2.1252838845145044E-2,null,null,34,"NHS Corby ",78532,2260,2.8778077726277187E-2,null,34,"Shropshire and Telford and Wrekin",null,492954,9534,1.9340546988157108E-2]
[null,35,"Broadland",null,3658214,null,null,75089,2.0526136524544492E-2,null,null,35,"NHS Coventry and Rugby ",513026,7721,1.5049919497257449E-2,null,35,"Somerset",null,574614,12948,2.2533387630652924E-2]
[null,36,"Bromley",null,3594509,null,null,41654,1.1588230826519004E-2,null,null,36,"NHS Crawley ",133425,2061,1.5446880269814502E-2,null,36,"South East London",null,1959410,26135,1.3338198743499318E-2]
[null,37,"Bromsgrove",null,3658214,null,null,75089,2.0526136524544492E-2,null,null,37,"NHS Croydon ",408354,4909,1.2021432384646655E-2,null,37,"South West London",null,1658613,18388,1.1086371564674822E-2]
[null,38,"Broxbourne",null,3658214,null,null,75089,2.0526136524544492E-2,null,null,38,"NHS Darlington ",108273,2878,2.6580957394733682E-2,null,38,"South Yorkshire and Bassetlaw",null,1574811,40615,2.5790396434873773E-2]
[null,39,"Broxtowe",null,3658214,null,null,75089,2.0526136524544492E-2,null,null,39,"NHS Dartford, Gravesham and Swanley ",268798,4587,1.7064859113535072E-2,null,39,"Staffordshire and Stoke on Trent ",null,1150915,25285,2.1969476460033974E-2]
[null,40,"Burnley",null,2548971,null,null,63681,2.4983022560868678E-2,null,null,40,"NHS Doncaster ",322418,8939,2.7724878883933279E-2,null,40,"Suffolk and North East Essex",null,1009876,20652,2.045003544989682E-2]
[null,41,"Bury",null,2548971,null,null,63681,2.4983022560868678E-2,null,null,41,"NHS Dorset ",800260,16798,2.0990678029640365E-2,null,41,"Surrey Heartlands",null,903745,11465,1.2686100614664535E-2]
[null,42,"Calderdale",null,5713447,null,null,130801,2.289353519862878E-2,null,null,42,"NHS Dudley ",312824,6985,2.2328849448891391E-2,null,42,"Sussex and East Surrey",null,1929828,35207,1.8243594765958417E-2]
[null,43,"Cambridge",null,3658214,null,null,75089,2.0526136524544492E-2,null,null,43,"NHS Durham Dales, Easington and Sedgefield ",292023,10635,3.6418364306921032E-2,null,43,"The Black Country & West Birmingham",null,1452045,27981,1.9270063944299247E-2]
[null,44,"Camden",null,3594509,null,null,41654,1.1588230826519004E-2,null,null,44,"NHS Ealing ",436021,3960,9.0821313652324088E-3,null,44,"West Yorkshire & Harrogate",null,2710486,58626,2.1629331418793529E-2]
[null,45,"Cannock Chase",null,3658214,null,null,75089,2.0526136524544492E-2,null,null,45,"NHS East and North Hertfordshire ",597980,9386,1.5696177129669888E-2]
[null,46,"Canterbury",null,3792554,null,null,57516,1.5165505883370414E-2,null,null,46,"NHS East Berkshire ",459325,5096,1.1094540902411148E-2]
[null,47,"Carlisle",null,2548971,null,null,63681,2.4983022560868678E-2,null,null,47,"NHS East Lancashire ",381783,9910,2.5957153671064454E-2]
[null,48,"Castle Point",null,3658214,null,null,75089,2.0526136524544492E-2,null,null,48,"NHS East Leicestershire and Rutland ",331082,5820,1.7578726720268695E-2]
[null,49,"Central Bedfordshire",null,3658214,null,null,75089,2.0526136524544492E-2,null,null,49,"NHS East Riding of Yorkshire ",304028,7430,2.4438538555659348E-2]
[null,50,"Charnwood",null,3658214,null,null,75089,2.0526136524544492E-2,null,null,50,"NHS East Staffordshire ",141923,2629,1.8524129281370885E-2]
[null,51,"Chelmsford",null,3658214,null,null,75089,2.0526136524544492E-2,null,null,51,"NHS East Surrey ",181872,2582,1.4196797747866632E-2]
[null,52,"Cheltenham",null,3058462,null,null,65001,2.1252838845145044E-2,null,null,52,"NHS Eastbourne, Hailsham and Seaford ",196089,4470,2.2795771307926503E-2]
[null,53,"Cherwell",null,3792554,null,null,57516,1.5165505883370414E-2,null,null,53,"NHS Eastern Cheshire ",208295,3499,1.6798290885522937E-2]
[null,54,"Cheshire East",null,2548971,null,null,63681,2.4983022560868678E-2,null,null,54,"NHS Enfield ",321065,3604,1.1225141326522668E-2]
[null,55,"Cheshire West and Chester",null,2548971,null,null,63681,2.4983022560868678E-2,null,null,55,"NHS Erewash ",97481,2401,2.4630440803848956E-2]
[null,56,"Chesterfield",null,3658214,null,null,75089,2.0526136524544492E-2,null,null,56,"NHS Fareham and Gosport ",204781,4050,1.9777225426187001E-2]
[null,57,"Chichester",null,3792554,null,null,57516,1.5165505883370414E-2,null,null,57,"NHS Fylde and Wyre ",177376,5051,2.84762312826989E-2]
[null,58,"Chiltern",null,3792554,null,null,57516,1.5165505883370414E-2,null,null,58,"NHS Gloucestershire ",636319,11568,1.8179560880627485E-2]
[null,59,"Chorley",null,2548971,null,null,63681,2.4983022560868678E-2,null,null,59,"NHS Great Yarmouth and Waveney ",226999,6254,2.7550782162035957E-2]
[null,60,"City of London",null,3594509,null,null,41654,1.1588230826519004E-2,null,null,60,"NHS Greater Huddersfield ",248689,4488,1.8046636562131818E-2]
[null,61,"Colchester",null,3658214,null,null,75089,2.0526136524544492E-2,null,null,61,"NHS Greater Preston ",209377,4315,2.0608758364099207E-2]
[null,62,"Copeland",null,2548971,null,null,63681,2.4983022560868678E-2,null,null,62,"NHS Greenwich ",295451,4415,1.4943256242151828E-2]
[null,63,"Corby",null,3658214,null,null,75089,2.0526136524544492E-2,null,null,63,"NHS Guildford and Waverley ",225923,2740,1.212802592033569E-2]
[null,64,"Cornwall",null,3058462,null,null,65001,2.1252838845145044E-2,null,null,64,"NHS Halton ",131206,3658,2.7879822569089829E-2]
[null,65,"Cotswold",null,3058462,null,null,65001,2.1252838845145044E-2,null,null,65,"NHS Hambleton, Richmondshire and Whitby ",143884,3077,2.1385282588752049E-2]
[null,66,"County Durham",null,3006115,null,null,85265,{"$f":"H972/E972","v":2.8363851682320869E-2},null,null,66,"NHS Hammersmith and Fulham ",239980,2610,{"$f":"O972/N972","v":1.0875906325527127E-2}]
[null,67,"Coventry",null,3658214,null,null,75089,2.0526136524544492E-2,null,null,67,"NHS Hardwick ",104079,3253,3.1255104295775327E-2]
[null,68,"Craven",null,5713447,null,null,130801,2.289353519862878E-2,null,null,68,"NHS Haringey ",304286,2685,8.8239353765865013E-3]
[null,69,"Crawley",null,3792554,null,null,57516,1.5165505883370414E-2,null,null,69,"NHS Harrogate and Rural District ",162829,3028,1.8596196009310381E-2]
[null,70,"Croydon",null,3594509,null,null,41654,1.1588230826519004E-2,null,null,70,"NHS Harrow ",266622,2329,8.735213148202324E-3]
[null,71,"Dacorum",null,3658214,null,null,75089,2.0526136524544492E-2,null,null,71,"NHS Hartlepool and Stockton-on-Tees ",297143,8862,2.9824024123065326E-2]
[null,72,"Darlington",null,3006115,null,null,85265,2.8363851682320869E-2,null,null,72,"NHS Hastings and Rother ",188251,4858,2.5805971814226749E-2]
[null,73,"Dartford",null,3792554,null,null,57516,1.5165505883370414E-2,null,null,73,"NHS Havering ",277748,4797,1.727105145671616E-2]
[null,74,"Daventry",null,3658214,null,null,75089,2.0526136524544492E-2,null,null,74,"NHS Herefordshire ",187215,4286,2.289346473306092E-2]
[null,75,"Derby",null,3658214,null,null,75089,2.0526136524544492E-2,null,null,75,"NHS Herts Valleys ",645655,8954,1.3868087446081886E-2]
[null,76,"Derbyshire Dales",null,3658214,null,null,75089,2.0526136524544492E-2,null,null,76,"NHS Heywood, Middleton and Rochdale ",233290,5756,2.4673153585665908E-2]
[null,77,"Doncaster",null,5713447,null,null,130801,2.289353519862878E-2,null,null,77,"NHS High Weald Lewes Havens ",170423,3015,1.7691274065120319E-2]
[null,78,"Dorset",null,3058462,null,null,65001,2.1252838845145044E-2,null,null,78,"NHS Hillingdon ",312298,3970,1.2712217177183332E-2]
[null,79,"Dover",null,3792554,null,null,57516,1.5165505883370414E-2,null,null,79,"NHS Horsham and Mid Sussex ",240764,3356,1.3938960974232029E-2]
[null,80,"Dudley",null,3658214,null,null,75089,2.0526136524544492E-2,null,null,80,"NHS Hounslow ",315560,3347,1.0606540752947142E-2]
[null,81,"Ealing",null,3594509,null,null,41654,1.1588230826519004E-2,null,null,81,"NHS Hull ",299148,8196,2.739780977977456E-2]
[null,82,"East Cambridgeshire",null,3658214,null,null,75089,2.0526136524544492E-2,null,null,82,"NHS Ipswich and East Suffolk ",407512,7227,1.7734447083766858E-2]
[null,83,"East Devon",null,3058462,null,null,65001,2.1252838845145044E-2,null,null,83,"NHS Isle of Wight ",144464,3189,2.2074703732417766E-2]
[null,84,"East Hampshire",null,3792554,null,null,57516,1.5165505883370414E-2,null,null,84,"NHS Islington ",252200,3922,1.5551149881046788E-2]
[null,85,"East Hertfordshire",null,3658214,null,null,75089,2.0526136524544492E-2,null,null,85,"NHS Kernow ",574407,12681,2.2076680820393903E-2]
[null,86,"East Lindsey",null,3658214,null,null,75089,2.0526136524544492E-2,null,null,86,"NHS Kingston ",208930,2398,1.1477528358780452E-2]
[null,87,"East Northamptonshire",null,3658214,null,null,75089,2.0526136524544492E-2,null,null,87,"NHS Knowsley ",165042,5873,3.5584881424122347E-2]
[null,88,"East Riding of Yorkshire",null,5713447,null,null,130801,2.289353519862878E-2,null,null,88,"NHS Lambeth ",412559,3811,9.2374666411349643E-3]
[null,89,"East Staffordshire",null,3658214,null,null,75089,2.0526136524544492E-2,null,null,89,"NHS Leeds ",879936,17299,1.9659384318859552E-2]
[null,90,"East Suffolk",null,3658214,null,null,75089,2.0526136524544492E-2,null,null,90,"NHS Leicester City ",406597,5672,1.3949930766828088E-2]
[null,91,"Eastbourne",null,3792554,null,null,57516,1.5165505883370414E-2,null,null,91,"NHS Lewisham ",327782,4308,1.3142881549322416E-2]
[null,92,"Eastleigh",null,3792554,null,null,57516,1.5165505883370414E-2,null,null,92,"NHS Lincolnshire East ",250214,6864,2.7432517764793336E-2]
[null,93,"Eden",null,2548971,null,null,63681,2.4983022560868678E-2,null,null,93,"NHS Lincolnshire West ",240204,4883,2.0328554062380311E-2]
[null,94,"Elmbridge",null,3792554,null,null,57516,1.5165505883370414E-2,null,null,94,"NHS Liverpool ",532841,16208,3.0418079689813658E-2]
[null,95,"Enfield",null,3594509,null,null,41654,1.1588230826519004E-2,null,null,95,"NHS Luton ",233898,2852,1.2193349237701904E-2]
[null,96,"Epping Forest",null,3658214,null,null,75089,2.0526136524544492E-2,null,null,96,"NHS Manchester ",641098,12647,1.972709320571894E-2]
[null,97,"Epsom and Ewell",null,3792554,null,null,57516,1.5165505883370414E-2,null,null,97,"NHS Mansfield and Ashfield ",193778,4782,2.4677723993435787E-2]
[null,98,"Erewash",null,3658214,null,null,75089,2.0526136524544492E-2,null,null,98,"NHS Medway ",299341,5684,1.898837780324112E-2]
[null,99,"Exeter",null,3058462,null,null,65001,2.1252838845145044E-2,null,null,99,"NHS Merton ",226258,2479,1.0956518664533409E-2]
[null,100,"Fareham",null,3792554,null,null,57516,1.5165505883370414E-2,null,null,100,"NHS Mid Essex ",391186,6145,1.5708639879750297E-2]
[null,101,"Fenland",null,3658214,null,null,75089,2.0526136524544492E-2,null,null,101,"NHS Milton Keynes ",293999,4732,1.6095292841132113E-2]
[null,102,"Folkestone and Hythe",null,3792554,null,null,57516,1.5165505883370414E-2,null,null,102,"NHS Morecambe Bay ",345853,7879,2.2781355084385564E-2]
[null,103,"Forest of Dean",null,3058462,null,null,65001,2.1252838845145044E-2,null,null,103,"NHS Nene ",685734,12333,1.7985107928147066E-2]
[null,104,"Fylde",null,2548971,null,null,63681,2.4983022560868678E-2,null,null,104,"NHS Newark and Sherwood ",135004,2955,2.1888240348434122E-2]
[null,105,"Gateshead",null,3006115,null,null,85265,2.8363851682320869E-2,null,null,105,"NHS Newcastle Gateshead ",525902,12712,2.4171803872204328E-2]
[null,106,"Gedling",null,3658214,null,null,75089,2.0526136524544492E-2,null,null,106,"NHS Newham ",390564,3539,9.0612550055816712E-3]
[null,107,"Gloucester",null,3058462,null,null,65001,2.1252838845145044E-2,null,null,107,"NHS North Cumbria ",323943,7903,2.4396267244546108E-2]
[null,108,"Gosport",null,3792554,null,null,57516,1.5165505883370414E-2,null,null,108,"NHS North Derbyshire ",292498,6762,2.311810679047378E-2]
[null,109,"Gravesham",null,3792554,null,null,57516,1.5165505883370414E-2,null,null,109,"NHS North Durham ",259527,6256,2.4105391731881462E-2]
[null,110,"Great Yarmouth",null,3658214,null,null,75089,2.0526136524544492E-2,null,null,110,"NHS North East Essex ",351766,7974,2.2668478477169483E-2]
[null,111,"Greenwich",null,3594509,null,null,41654,1.1588230826519004E-2,null,null,111,"NHS North East Hampshire and Farnham ",227285,3571,1.5711551576214886E-2]
[null,112,"Guildford",null,3792554,null,null,57516,1.5165505883370414E-2,null,null,112,"NHS North East Lincolnshire ",169523,4312,2.5436076520590125E-2]
[null,113,"Hackney",null,3594509,null,null,41654,1.1588230826519004E-2,null,null,113,"NHS North Hampshire ",225922,3176,1.4057949203707475E-2]
[null,114,"Halton",null,2548971,null,null,63681,2.4983022560868678E-2,null,null,114,"NHS North Kirklees ",193485,4723,2.4410160994392329E-2]
[null,115,"Hambleton",null,5713447,null,null,130801,2.289353519862878E-2,null,null,115,"NHS North Lincolnshire ",178861,4159,2.3252693432330135E-2]
[null,116,"Hammersmith and Fulham",null,3594509,null,null,41654,1.1588230826519004E-2,null,null,116,"NHS North Norfolk ",164181,3576,2.1780839439399201E-2]
[null,117,"Harborough",null,3658214,null,null,75089,2.0526136524544492E-2,null,null,117,"NHS North Staffordshire ",218075,5231,2.3987160380603004E-2]
[null,118,"Haringey",null,3594509,null,null,41654,1.1588230826519004E-2,null,null,118,"NHS North Tyneside ",218862,5680,2.5952426643272929E-2]
[null,119,"Harlow",null,3658214,null,null,75089,2.0526136524544492E-2,null,null,119,"NHS North West Surrey ",370955,5036,1.3575770646035233E-2]
[null,120,"Harrogate",null,5713447,null,null,130801,2.289353519862878E-2,null,null,120,"NHS Northern, Eastern and Western Devon ",931004,19602,2.1054689346125258E-2]
[null,121,"Harrow",null,3594509,null,null,41654,1.1588230826519004E-2,null,null,121,"NHS Northumberland ",325159,8939,2.7491165860394452E-2]
[null,122,"Hart",null,3792554,null,null,57516,1.5165505883370414E-2,null,null,122,"NHS Norwich ",235628,4182,1.7748315140815183E-2]
[null,123,"Hartlepool",null,3006115,null,null,85265,2.8363851682320869E-2,null,null,123,"NHS Nottingham City ",379243,6381,1.6825623676640044E-2]
[null,124,"Hastings",null,3792554,null,null,57516,1.5165505883370414E-2,null,null,124,"NHS Nottingham North and East ",155762,3032,1.946559494613577E-2]
[null,125,"Havant",null,3792554,null,null,57516,1.5165505883370414E-2,null,null,125,"NHS Nottingham West ",94151,2024,2.1497381865301483E-2]
[null,126,"Havering",null,3594509,null,null,41654,1.1588230826519004E-2,null,null,126,"NHS Oldham ",255199,5959,2.3350404978075934E-2]
[null,127,"Herefordshire, County of",null,3658214,null,null,75089,2.0526136524544492E-2,null,null,127,"NHS Oxfordshire ",743487,10243,1.3776972563071043E-2]
[null,128,"Hertsmere",null,3658214,null,null,75089,2.0526136524544492E-2,null,null,128,"NHS Portsmouth ",230543,4761,2.0651245103950239E-2]
[null,129,"High Peak",null,3658214,null,null,75089,2.0526136524544492E-2,null,null,129,"NHS Redbridge ",320422,2580,8.0518815811648388E-3]
[null,130,"Hillingdon",null,3594509,null,null,41654,{"$f":"H1036/E1036","v":1.1588230826519004E-2},null,null,130,"NHS Redditch and Bromsgrove ",177616,3401,{"$f":"O1036/N1036","v":1.9148049725249978E-2}]
[null,131,"Hinckley and Bosworth",null,3658214,null,null,75089,2.0526136524544492E-2,null,null,131,"NHS Richmond ",217675,2242,1.0299758814746755E-2]
[null,132,"Horsham",null,3792554,null,null,57516,1.5165505883370414E-2,null,null,132,"NHS Rotherham ",263020,7741,2.9431221960307202E-2]
[null,133,"Hounslow",null,3594509,null,null,41654,1.1588230826519004E-2,null,null,133,"NHS Rushcliffe ",126919,1874,1.4765322764913056E-2]
[null,134,"Huntingdonshire",null,3658214,null,null,75089,2.0526136524544492E-2,null,null,134,"NHS Salford ",272631,6978,2.5595035047371723E-2]
[null,135,"Hyndburn",null,2548971,null,null,63681,2.4983022560868678E-2,null,null,135,"NHS Sandwell and West Birmingham ",570402,8766,1.5368108807472625E-2]
[null,136,"Ipswich",null,3658214,null,null,75089,2.0526136524544492E-2,null,null,136,"NHS Scarborough and Ryedale ",120364,2824,2.3462164766873815E-2]
[null,137,"Isle of Wight",null,3792554,null,null,57516,1.5165505883370414E-2,null,null,137,"NHS Sheffield ",600514,12454,2.0738900342040317E-2]
[null,138,"Isles of Scilly",null,3058462,null,null,65001,2.1252838845145044E-2,null,null,138,"NHS Shropshire ",306577,5588,1.8227068566787463E-2]
[null,139,"Islington",null,3594509,null,null,41654,1.1588230826519004E-2,null,null,139,"NHS Somerset ",574614,12948,2.2533387630652924E-2]
[null,140,"Kensington and Chelsea",null,3594509,null,null,41654,1.1588230826519004E-2,null,null,140,"NHS South Cheshire ",185737,3514,1.8919224494850246E-2]
[null,141,"Kettering",null,3658214,null,null,75089,2.0526136524544492E-2,null,null,141,"NHS South Devon and Torbay ",293406,7345,2.5033571228945558E-2]
[null,142,"King's Lynn and West Norfolk",null,3658214,null,null,75089,2.0526136524544492E-2,null,null,142,"NHS South East Staffordshire and Seisdon Peninsula ",217850,4008,1.8397980261647923E-2]
[null,143,"Kingston upon Hull, City of",null,5713447,null,null,130801,2.289353519862878E-2,null,null,143,"NHS South Eastern Hampshire ",215121,4757,2.2113136327927073E-2]
[null,144,"Kingston upon Thames",null,3594509,null,null,41654,1.1588230826519004E-2,null,null,144,"NHS South Kent Coast ",205585,5380,2.6169224408395555E-2]
[null,145,"Kirklees",null,5713447,null,null,130801,2.289353519862878E-2,null,null,145,"NHS South Lincolnshire ",167148,3368,2.0149807356354847E-2]
[null,146,"Knowsley",null,2548971,null,null,63681,2.4983022560868678E-2,null,null,146,"NHS South Norfolk ",227864,4311,1.8919179861671874E-2]
[null,147,"Lambeth",null,3594509,null,null,41654,1.1588230826519004E-2,null,null,147,"NHS South Sefton ",155072,4781,3.0830839867932315E-2]
[null,148,"Lancaster",null,2548971,null,null,63681,2.4983022560868678E-2,null,null,148,"NHS South Tees ",296733,9333,3.1452517920150441E-2]
[null,149,"Leeds",null,5713447,null,null,130801,2.289353519862878E-2,null,null,149,"NHS South Tyneside ",157145,5840,3.7163129593687359E-2]
[null,150,"Leicester",null,3658214,null,null,75089,2.0526136524544492E-2,null,null,150,"NHS South Warwickshire ",287232,4918,1.7122047682709446E-2]
[null,151,"Lewes",null,3792554,null,null,57516,1.5165505883370414E-2,null,null,151,"NHS South West Lincolnshire ",133612,2761,2.066431158877945E-2]
[null,152,"Lewisham",null,3594509,null,null,41654,1.1588230826519004E-2,null,null,152,"NHS South Worcestershire ",311530,6122,1.9651397939203286E-2]
[null,153,"Lichfield",null,3658214,null,null,75089,2.0526136524544492E-2,null,null,153,"NHS Southampton ",286789,5865,2.0450575161529906E-2]
[null,154,"Lincoln",null,3658214,null,null,75089,2.0526136524544492E-2,null,null,154,"NHS Southend ",188155,4037,2.1455714703303128E-2]
[null,155,"Liverpool",null,2548971,null,null,63681,2.4983022560868678E-2,null,null,155,"NHS Southern Derbyshire ",554875,10687,1.9260193737328228E-2]
[null,156,"Luton",null,3658214,null,null,75089,2.0526136524544492E-2,null,null,156,"NHS Southport and Formby ",125003,2624,2.0991496204091104E-2]
[null,157,"Maidstone",null,3792554,null,null,57516,1.5165505883370414E-2,null,null,157,"NHS Southwark ",329351,4412,1.3396042519986277E-2]
[null,158,"Maldon",null,3658214,null,null,75089,2.0526136524544492E-2,null,null,158,"NHS St Helens ",192527,5902,3.0655440535613188E-2]
[null,159,"Malvern Hills",null,3658214,null,null,75089,2.0526136524544492E-2,null,null,159,"NHS Stafford and Surrounds ",149092,2549,1.7096826120784482E-2]
[null,160,"Manchester",null,2548971,null,null,63681,2.4983022560868678E-2,null,null,160,"NHS Stockport ",311806,7171,2.2998274568160972E-2]
[null,161,"Mansfield",null,3658214,null,null,75089,2.0526136524544492E-2,null,null,161,"NHS Stoke on Trent ",290815,7547,2.5951206093220776E-2]
[null,162,"Medway",null,3792554,null,null,57516,1.5165505883370414E-2,null,null,162,"NHS Sunderland ",283669,9653,3.4029097292971738E-2]
[null,163,"Melton",null,3658214,null,null,75089,2.0526136524544492E-2,null,null,163,"NHS Surrey Downs ",306867,3689,1.2021494654035788E-2]
[null,164,"Mendip",null,3058462,null,null,65001,2.1252838845145044E-2,null,null,164,"NHS Surrey Heath ",96700,1226,1.2678386763185109E-2]
[null,165,"Merton",null,3594509,null,null,41654,1.1588230826519004E-2,null,null,165,"NHS Sutton ",194502,2874,1.4776197674059906E-2]
[null,166,"Mid Devon",null,3058462,null,null,65001,2.1252838845145044E-2,null,null,166,"NHS Swale ",113100,2720,2.404951370468612E-2]
[null,167,"Mid Suffolk",null,3658214,null,null,75089,2.0526136524544492E-2,null,null,167,"NHS Swindon ",237387,4011,1.689646021054228E-2]
[null,168,"Mid Sussex",null,3792554,null,null,57516,1.5165505883370414E-2,null,null,168,"NHS Tameside and Glossop ",247784,7233,2.9190746779453072E-2]
[null,169,"Middlesbrough",null,3006115,null,null,85265,2.8363851682320869E-2,null,null,169,"NHS Telford and Wrekin ",186377,3946,2.1172140339204944E-2]
[null,170,"Milton Keynes",null,3792554,null,null,57516,1.5165505883370414E-2,null,null,170,"NHS Thanet ",145497,4549,3.1265249455315232E-2]
[null,171,"Mole Valley",null,3792554,null,null,57516,1.5165505883370414E-2,null,null,171,"NHS Thurrock ",176290,3354,1.9025469397016281E-2]
[null,172,"New Forest",null,3792554,null,null,57516,1.5165505883370414E-2,null,null,172,"NHS Tower Hamlets ",324434,3934,1.2125732814686501E-2]
[null,173,"Newark and Sherwood",null,3658214,null,null,75089,2.0526136524544492E-2,null,null,173,"NHS Trafford ",241640,4738,1.9607680847541796E-2]
[null,174,"Newcastle upon Tyne",null,3006115,null,null,85265,2.8363851682320869E-2,null,null,174,"NHS Vale of York ",357038,6156,1.7241862210745074E-2]
[null,175,"Newcastle-under-Lyme",null,3658214,null,null,75089,2.0526136524544492E-2,null,null,175,"NHS Vale Royal ",106940,2494,2.3321488685244061E-2]
[null,176,"Newham",null,3594509,null,null,41654,1.1588230826519004E-2,null,null,176,"NHS Wakefield ",373242,10703,2.8675765321158925E-2]
[null,177,"North Devon",null,3058462,null,null,65001,2.1252838845145044E-2,null,null,177,"NHS Walsall ",288553,7119,2.4671377528564943E-2]
[null,178,"North East Derbyshire",null,3658214,null,null,75089,2.0526136524544492E-2,null,null,178,"NHS Waltham Forest ",314795,2924,9.2885846344446382E-3]
[null,179,"North East Lincolnshire",null,5713447,null,null,130801,2.289353519862878E-2,null,null,179,"NHS Wandsworth ",402894,3486,8.6523998868188647E-3]
[null,180,"North Hertfordshire",null,3658214,null,null,75089,2.0526136524544492E-2,null,null,180,"NHS Warrington ",218036,3971,1.8212588746812454E-2]
[null,181,"North Kesteven",null,3658214,null,null,75089,2.0526136524544492E-2,null,null,181,"NHS Warwickshire North ",191540,3691,1.9270126344366711E-2]
[null,182,"North Lincolnshire",null,5713447,null,null,130801,2.289353519862878E-2,null,null,182,"NHS West Cheshire ",263417,5151,1.9554546593424114E-2]
[null,183,"North Norfolk",null,3658214,null,null,75089,2.0526136524544492E-2,null,null,183,"NHS West Essex ",312934,5525,1.7655480069279784E-2]
[null,184,"North Somerset",null,3058462,null,null,65001,2.1252838845145044E-2,null,null,184,"NHS West Hampshire ",562712,9557,1.6983821208717782E-2]
[null,185,"North Tyneside",null,3006115,null,null,85265,2.8363851682320869E-2,null,null,185,"NHS West Kent ",492479,8208,1.666670050905724E-2]
[null,186,"North Warwickshire",null,3658214,null,null,75089,2.0526136524544492E-2,null,null,186,"NHS West Lancashire ",113697,2604,2.2902978970421383E-2]
[null,187,"North West Leicestershire",null,3658214,null,null,75089,2.0526136524544492E-2,null,null,187,"NHS West Leicestershire ",392564,7431,1.8929397499516002E-2]
[null,188,"Northampton",null,3658214,null,null,75089,2.0526136524544492E-2,null,null,188,"NHS West London ",249241,3193,1.281089387380086E-2]
[null,189,"Northumberland",null,3006115,null,null,85265,2.8363851682320869E-2,null,null,189,"NHS West Norfolk ",175733,4587,2.6102098069230025E-2]
[null,190,"Norwich",null,3658214,null,null,75089,2.0526136524544492E-2,null,null,190,"NHS West Suffolk ",250598,5451,2.1751969289459612E-2]
[null,191,"Nottingham",null,3658214,null,null,75089,2.0526136524544492E-2,null,null,191,"NHS Wigan Borough ",327689,8491,2.5911763898086294E-2]
[null,192,"Nuneaton and Bedworth",null,3658214,null,null,75089,2.0526136524544492E-2,null,null,192,"NHS Wiltshire ",490018,8750,1.785648690456269E-2]
[null,193,"Oadby and Wigston",null,3658214,null,null,75089,2.0526136524544492E-2,null,null,193,"NHS Wirral ",336210,8533,2.5379970851551113E-2]
[null,194,"Oldham",null,2548971,null,null,63681,{"$f":"H1100/E1100","v":2.4983022560868678E-2},null,null,194,"NHS Wolverhampton ",280266,5111,{"$f":"O1100/N1100","v":1.8236246993927199E-2}]
[null,195,"Oxford",null,3792554,null,null,57516,1.5165505883370414E-2,null,null,195,"NHS Wyre Forest ",116281,2599,2.2351028972919049E-2]
[null,196,"Pendle",null,2548971,null,null,63681,2.4983022560868678E-2]
[null,197,"Peterborough",null,3658214,null,null,75089,2.0526136524544492E-2]
[null,198,"Plymouth",null,3058462,null,null,65001,2.1252838845145044E-2]
[null,199,"Portsmouth",null,3792554,null,null,57516,1.5165505883370414E-2]
[null,200,"Preston",null,2548971,null,null,63681,2.4983022560868678E-2]
[null,201,"Reading",null,3792554,null,null,57516,1.5165505883370414E-2]
[null,202,"Redbridge",null,3594509,null,null,41654,1.1588230826519004E-2]
[null,203,"Redcar and Cleveland",null,3006115,null,null,85265,2.8363851682320869E-2]
[null,204,"Redditch",null,3658214,null,null,75089,2.0526136524544492E-2]
[null,205,"Reigate and Banstead",null,3792554,null,null,57516,1.5165505883370414E-2]
[null,206,"Ribble Valley",null,2548971,null,null,63681,2.4983022560868678E-2]
[null,207,"Richmond upon Thames",null,3594509,null,null,41654,1.1588230826519004E-2]
[null,208,"Richmondshire",null,5713447,null,null,130801,2.289353519862878E-2]
[null,209,"Rochdale",null,2548971,null,null,63681,2.4983022560868678E-2]
[null,210,"Rochford",null,3658214,null,null,75089,2.0526136524544492E-2]
[null,211,"Rossendale",null,2548971,null,null,63681,2.4983022560868678E-2]
[null,212,"Rother",null,3792554,null,null,57516,1.5165505883370414E-2]
[null,213,"Rotherham",null,5713447,null,null,130801,2.289353519862878E-2]
[null,214,"Rugby",null,3658214,null,null,75089,2.0526136524544492E-2]
[null,215,"Runnymede",null,3792554,null,null,57516,1.5165505883370414E-2]
[null,216,"Rushcliffe",null,3658214,null,null,75089,2.0526136524544492E-2]
[null,217,"Rushmoor",null,3792554,null,null,57516,1.5165505883370414E-2]
[null,218,"Rutland",null,3658214,null,null,75089,2.0526136524544492E-2]
[null,219,"Ryedale",null,5713447,null,null,130801,2.289353519862878E-2]
[null,220,"Salford",null,2548971,null,null,63681,2.4983022560868678E-2]
[null,221,"Sandwell",null,3658214,null,null,75089,2.0526136524544492E-2]
[null,222,"Scarborough",null,5713447,null,null,130801,2.289353519862878E-2]
[null,223,"Sedgemoor",null,3058462,null,null,65001,2.1252838845145044E-2]
[null,224,"Sefton",null,2548971,null,null,63681,2.4983022560868678E-2]
[null,225,"Selby",null,5713447,null,null,130801,2.289353519862878E-2]
[null,226,"Sevenoaks",null,3792554,null,null,57516,1.5165505883370414E-2]
[null,227,"Sheffield",null,5713447,null,null,130801,2.289353519862878E-2]
[null,228,"Shropshire",null,3658214,null,null,75089,2.0526136524544492E-2]
[null,229,"Slough",null,3792554,null,null,57516,1.5165505883370414E-2]
[null,230,"Solihull",null,3658214,null,null,75089,2.0526136524544492E-2]
[null,231,"Somerset West and Taunton",null,3058462,null,null,65001,2.1252838845145044E-2]
[null,232,"South Bucks",null,3792554,null,null,57516,1.5165505883370414E-2]
[null,233,"South Cambridgeshire",null,3658214,null,null,75089,2.0526136524544492E-2]
[null,234,"South Derbyshire",null,3658214,null,null,75089,2.0526136524544492E-2]
[null,235,"South Gloucestershire",null,3058462,null,null,65001,2.1252838845145044E-2]
[null,236,"South Hams",null,3058462,null,null,65001,2.1252838845145044E-2]
[null,237,"South Holland",null,3658214,null,null,75089,2.0526136524544492E-2]
[null,238,"South Kesteven",null,3658214,null,null,75089,2.0526136524544492E-2]
[null,239,"South Lakeland",null,2548971,null,null,63681,2.4983022560868678E-2]
[null,240,"South Norfolk",null,3658214,null,null,75089,2.0526136524544492E-2]
[null,241,"South Northamptonshire",null,3658214,null,null,75089,2.0526136524544492E-2]
[null,242,"South Oxfordshire",null,3792554,null,null,57516,1.5165505883370414E-2]
[null,243,"South Ribble",null,2548971,null,null,63681,2.4983022560868678E-2]
[null,244,"South Somerset",null,3058462,null,null,65001,2.1252838845145044E-2]
[null,245,"South Staffordshire",null,3658214,null,null,75089,2.0526136524544492E-2]
[null,246,"South Tyneside",null,3006115,null,null,85265,2.8363851682320869E-2]
[null,247,"Southampton",null,3792554,null,null,57516,1.5165505883370414E-2]
[null,248,"Southend-on-Sea",null,3658214,null,null,75089,2.0526136524544492E-2]
[null,249,"Southwark",null,3594509,null,null,41654,1.1588230826519004E-2]
[null,250,"Spelthorne",null,3792554,null,null,57516,1.5165505883370414E-2]
[null,251,"St Albans",null,3658214,null,null,75089,2.0526136524544492E-2]
[null,252,"St. Helens",null,2548971,null,null,63681,2.4983022560868678E-2]
[null,253,"Stafford",null,3658214,null,null,75089,2.0526136524544492E-2]
[null,254,"Staffordshire Moorlands",null,3658214,null,null,75089,2.0526136524544492E-2]
[null,255,"Stevenage",null,3658214,null,null,75089,2.0526136524544492E-2]
[null,256,"Stockport",null,2548971,null,null,63681,2.4983022560868678E-2]
[null,257,"Stockton-on-Tees",null,3006115,null,null,85265,2.8363851682320869E-2]
[null,258,"Stoke-on-Trent",null,3658214,null,null,75089,{"$f":"H1164/E1164","v":2.0526136524544492E-2}]
[null,259,"Stratford-on-Avon",null,3658214,null,null,75089,2.0526136524544492E-2]
[null,260,"Stroud",null,3058462,null,null,65001,2.1252838845145044E-2]
[null,261,"Sunderland",null,3006115,null,null,85265,2.8363851682320869E-2]
[null,262,"Surrey Heath",null,3792554,null,null,57516,1.5165505883370414E-2]
[null,263,"Sutton",null,3594509,null,null,41654,1.1588230826519004E-2]
[null,264,"Swale",null,3792554,null,null,57516,1.5165505883370414E-2]
[null,265,"Swindon",null,3058462,null,null,65001,2.1252838845145044E-2]
[null,266,"Tameside",null,2548971,null,null,63681,2.4983022560868678E-2]
[null,267,"Tamworth",null,3658214,null,null,75089,2.0526136524544492E-2]
[null,268,"Tandridge",null,3792554,null,null,57516,1.5165505883370414E-2]
[null,269,"Teignbridge",null,3058462,null,null,65001,2.1252838845145044E-2]
[null,270,"Telford and Wrekin",null,3658214,null,null,75089,2.0526136524544492E-2]
[null,271,"Tendring",null,3658214,null,null,75089,2.0526136524544492E-2]
[null,272,"Test Valley",null,3792554,null,null,57516,1.5165505883370414E-2]
[null,273,"Tewkesbury",null,3058462,null,null,65001,2.1252838845145044E-2]
[null,274,"Thanet",null,3792554,null,null,57516,1.5165505883370414E-2]
[null,275,"Three Rivers",null,3658214,null,null,75089,2.0526136524544492E-2]
[null,276,"Thurrock",null,3658214,null,null,75089,2.0526136524544492E-2]
[null,277,"Tonbridge and Malling",null,3792554,null,null,57516,1.5165505883370414E-2]
[null,278,"Torbay",null,3058462,null,null,65001,2.1252838845145044E-2]
[null,279,"Torridge",null,3058462,null,null,65001,2.1252838845145044E-2]
[null,280,"Tower Hamlets",null,3594509,null,null,41654,1.1588230826519004E-2]
[null,281,"Trafford",null,2548971,null,null,63681,2.4983022560868678E-2]
[null,282,"Tunbridge Wells",null,3792554,null,null,57516,1.5165505883370414E-2]
[null,283,"Uttlesford",null,3658214,null,null,75089,2.0526136524544492E-2]
[null,284,"Vale of White Horse",null,3792554,null,null,57516,1.5165505883370414E-2]
[null,285,"Wakefield",null,5713447,null,null,130801,2.289353519862878E-2]
[null,286,"Walsall",null,3658214,null,null,75089,2.0526136524544492E-2]
[null,287,"Waltham Forest",null,3594509,null,null,41654,1.1588230826519004E-2]
[null,288,"Wandsworth",null,3594509,null,null,41654,1.1588230826519004E-2]
[null,289,"Warrington",null,2548971,null,null,63681,2.4983022560868678E-2]
[null,290,"Warwick",null,3658214,null,null,75089,2.0526136524544492E-2]
[null,291,"Watford",null,3658214,null,null,75089,2.0526136524544492E-2]
[null,292,"Waverley",null,3792554,null,null,57516,1.5165505883370414E-2]
[null,293,"Wealden",null,3792554,null,null,57516,1.5165505883370414E-2]
[null,294,"Wellingborough",null,3658214,null,null,75089,2.0526136524544492E-2]
[null,295,"Welwyn Hatfield",null,3658214,null,null,75089,2.0526136524544492E-2]
[null,296,"West Berkshire",null,3792554,null,null,57516,1.5165505883370414E-2]
[null,297,"West Devon",null,3058462,null,null,65001,2.1252838845145044E-2]
[null,298,"West Lancashire",null,2548971,null,null,63681,2.4983022560868678E-2]
[null,299,"West Lindsey",null,3658214,null,null,75089,2.0526136524544492E-2]
[null,300,"West Oxfordshire",null,3792554,null,null,57516,1.5165505883370414E-2]
[null,301,"West Suffolk",null,3658214,null,null,75089,2.0526136524544492E-2]
[null,302,"Westminster",null,3594509,null,null,41654,1.1588230826519004E-2]
[null,303,"Wigan",null,2548971,null,null,63681,2.4983022560868678E-2]
[null,304,"Wiltshire",null,3058462,null,null,65001,2.1252838845145044E-2]
[null,305,"Winchester",null,3792554,null,null,57516,1.5165505883370414E-2]
[null,306,"Windsor and Maidenhead",null,3792554,null,null,57516,1.5165505883370414E-2]
[null,307,"Wirral",null,2548971,null,null,63681,2.4983022560868678E-2]
[null,308,"Woking",null,3792554,null,null,57516,1.5165505883370414E-2]
[null,309,"Wokingham",null,3792554,null,null,57516,1.5165505883370414E-2]
[null,310,"Wolverhampton",null,3658214,null,null,75089,2.0526136524544492E-2]
[null,311,"Worcester",null,3658214,null,null,75089,2.0526136524544492E-2]
[null,312,"Worthing",null,3792554,null,null,57516,1.5165505883370414E-2]
[null,313,"Wychavon",null,3658214,null,null,75089,2.0526136524544492E-2]
[null,314,"Wycombe",null,3792554,null,null,57516,1.5165505883370414E-2]
[null,315,"Wyre",null,2548971,null,null,63681,2.4983022560868678E-2]
[null,316,"Wyre Forest",null,3658214,null,null,75089,2.0526136524544492E-2]
[null,317,"York",null,5713447,null,null,130801,2.289353519862878E-2]
[]
[]
[null,null,"Releative Risk Calculations: "]
[]
[null,null,"Age bracket","COPD (rate per 100,000)"]
[null,null,"0-30",0]
[null,null,"31-40",23]
[null,null,"41-50",115]
[null,null,"51-60",315]
[null,null,"61-70",558]
[null,null,"71-80",677]
[null,null,"81+",476]
[]
[null,null,"Distribution of diagnoses in England: "]
[null,null,"Age bracket","Population size",null,null,null,"Population COPD","Population no COPD"]
[null,null,"0-30",20526860,null,null,null,{"$f":"D1229*$D$1246/100000","v":0},{"$f":"D1239-H1239","v":20526860}]
[null,null,"31-40",7400043,null,null,null,{"$f":"D1230*$D$1246/100000","v":12792.4689},{"$f":"D1240-H1240","v":7387250.5311000003}]
[null,null,"41-50",7292866,null,null,null,63962.344499999999,7228903.6555000003]
[null,null,"51-60",7386230,null,null,null,175201.20449999999,7211028.7955]
[null,null,"61-70",5873566,null,null,null,310356.41940000001,5563209.5806]
[null,null,"71-80",4417955,null,null,null,376543.54109999997,4041411.4589]
[null,null,"81+",2721910,null,null,null,264748.48680000001,2457161.5131999999]
[null,null,"All ages (0+)",{"$f":"SUM(D1239:D1245)","v":55619430},null,null,null,{"$f":"SUM(H1239:H1245)","v":1203604.4652},54415825.5348]
[]
[null,null,"Relative Risk Matrix (65+ vs. 0+)"]
[null,null,null,"COPD",null,null,null,"No COPD"]
[null,null,"Population (0+)",{"$f":"H1246","v":1203604.4652},null,null,null,{"$f":"I1246","v":54415825.5348}]
[null,null,"Population (65+)",{"$f":"H1243*0.5+H1244+H1245","v":796470.23760000011},null,null,null,{"$f":"I1243*0.5+I1244+I1245","v":9280177.7623999994}]
[null,null,null,null,null,null,"RR",{"$f":"(D1251/(D1251+H1251))/(D1250/(D1250+H1250))","v":3.6525503168049518}]
[]
[null,null,"Relative Risk Matrix (80+ vs. 0+)"]
[null,null,null,"COPD",null,null,null,"No COPD"]
[null,null,"Population (0+)",{"$f":"H1246","v":1203604.4652},null,null,null,{"$f":"I1246","v":54415825.5348}]
[null,null,"Population (80+)",{"$f":"H1244*0.1+H1245","v":302402.84091000003},null,null,null,{"$f":"I1244*0.1+I1245","v":2861302.6590900002}]
[null,null,null,null,null,null,"RR",{"$f":"(D1257/(D1257+H1257))/(D1256/(D1256+H1256))","v":4.4170524964483011}]
[]
[]
[]
[]
[]
[null,null,"Intervention:",null,"Befriending"]
[]
[null,null,"Summary: ",null,"In-built model population estimated by establishing the % of people who reported feeling isolated in a national GP survey. Overall rates (any age) by nation/LA/CCG/STP multiplied by the national % feeling isolated for sppecific age groups (65+/80+) "]
[]
[null,null,"Data availability:",null,"Prevalence data: ",null,null,null,"Derived by dividing total number reporting to fell isolated by total number answering question (Q_31). Data available nationally, regionally and for CCGs and STPs by age (65+ and 80+). Not available for local authorities so LA level analysis assumes regional prevalence rates."]
[null,null,null,null,"Prevalence by age",null,null,null,"Only national data available."]
[]
[null,null,"Eligible population: "]
[null,null,null,null,null,null,null,"65+","80+","Selection(age)"]
[null,null,null,null,"National",null,null,{"$f":"I1279*M1278","v":3.9690179559869115E-2},{"$f":"I1279*M1279","v":5.8763832927105415E-2},{"$f":"IF($J$266=1,H1273,I1273)","v":3.9690179559869115E-2}]
[null,null,null,null,"LA",null,null,{"$f":"C1282*M1278","v":4.6064416798758466E-2},{"$f":"C1282*M1279","v":6.8201296206373649E-2},{"$f":"IF($J$266=1,H1274,I1274)","v":4.6064416798758466E-2}]
[null,null,null,null,"CCG",null,null,{"$f":"M1282*M1278","v":4.1238480902619896E-2},{"$f":"M1282*M1279","v":6.105619145093065E-2},4.1238480902619896E-2]
[null,null,null,null,"STP",null,null,{"$f":"S1282*M1278","v":4.2703783338892576E-2},{"$f":"S1282*M1279","v":6.3225664819599181E-2},4.2703783338892576E-2]
[null,null,null,null,null,null,null,null,null,null,null,"RR"]
[null,null,null,"Total Pop ",null,null,null,"Total Isolated","% Isolated",null,null,"65+",{"$f":"H1607","v":0.61064415281611251}]
[null,null,"England",{"$f":"SUM(D1284:G1600)","v":43524498.857529826},null,null,null,{"$f":"SUM(H1284:H1600)","v":2828971.9420745675},{"$f":"H1279/D1279","v":6.4997231819595089E-2},null,null,"80+",{"$f":"H1613","v":0.90409747126168449}]
[]
[null,null,"Vlookup",null,null,null,null,null,null,null,null,null,"Vlookup",null,null,null,null,null,"Vlookup"]
[null,null,{"$f":"VLOOKUP(G273,$B$1284:$I$1600,8,FALSE)","v":7.5435778081756499E-2},null,null,null,null,null,null,null,null,null,{"$f":"VLOOKUP(M273,L1284:P1478,5,FALSE)","v":6.7532753261355355E-2},null,null,null,null,null,{"$f":"VLOOKUP(R273,R1284:W1327,6,FALSE)","v":6.9932354452188233E-2}]
[null,null,"LA","Total Pop ",null,null,null,"Total Isolated","% Isolated",null,null,null,"CCG","Total Pop","Total Isolated","% Isolated",null,null,"STP",null,"Total Pop","Total Isolated","% Isolated"]
[null,1,"Adur",117032.60591674724,null,null,null,6965.7596910107022,{"$f":"H1284/D1284","v":5.9519820450429785E-2},null,null,1,"NHS Airedale, Wharfedale and Craven ",2038.1034377927188,145.3373685959582,{"$f":"O1284/N1284","v":7.1310104237574737E-2},null,1,"Bath, NE Somerset, Swindon and Wiltshire",null,11907.999388577398,618.83829979087943,{"$f":"V1284/U1284","v":5.1968284478120852E-2}]
[null,2,"Allerdale",93752.542262674062,null,null,null,7182.5312680061188,{"$f":"H1285/D1285","v":7.6611589346369316E-2},null,null,2,"NHS Ashford ",1576.8574613165922,81.967237805455525,{"$f":"O1285/N1285","v":5.1981386914336083E-2},null,2,"Bedfordshire, Luton and Milton Keynes",null,12221.348936483153,760.90309116955791,6.2260155988027734E-2]
[null,3,"Amber Valley",210644.42735295714,null,null,null,13515.867036460095,6.4164370291234063E-2,null,null,3,"NHS Barking and Dagenham ",2569.2302715681662,139.47469929792331,5.428657012233977E-2,null,3,"Birmingham and Solihull",null,16085.064004096183,1211.2373466670936,7.5301991111669991E-2]
[null,4,"Arun",117032.60591674724,null,null,null,6965.7596910107022,5.9519820450429785E-2,null,null,4,"NHS Barnet ",5277.0832492588379,304.01484329476648,5.7610393646426769E-2,null,4,"Bristol, North Somerset and South Gloucestershire",null,12539.998853596589,976.52926690584604,7.7873154400310673E-2]
[null,5,"Ashfield",210644.42735295714,null,null,null,13515.867036460095,6.4164370291234063E-2,null,null,5,"NHS Barnsley ",3371.3485245045235,269.32650666076148,7.9886877521908997E-2,null,5,"Buckinghamshire, Oxfordshire and Berkshire West",null,23495.231579524087,1411.8953400969949,6.0092846300244633E-2]
[null,6,"Ashford",117032.60591674724,null,null,null,6965.7596910107022,5.9519820450429785E-2,null,null,6,"NHS Basildon and Brentwood ",3531.7020677196606,233.3325370838466,6.6068012705982324E-2,null,6,"Cambridgeshire and Peterborough",null,11506.306415848225,777.05255213102828,6.7532753261355355E-2]
[null,7,"Aylesbury Vale",117032.60591674724,null,null,null,6965.7596910107022,5.9519820450429785E-2,null,null,7,"NHS Bassetlaw ",1533.3950202673002,92.908975668061331,6.0590372630703805E-2,null,7,"Cheshire and Merseyside",null,33891.514717038328,2581.7849739591284,7.6177916375663901E-2]
[null,8,"Babergh",210644.42735295714,null,null,null,13515.867036460095,6.4164370291234063E-2,null,null,8,"NHS Bath and North East Somerset ",2593.9360751344766,153.73496938750674,5.9267061691000503E-2,null,8,"Cornwall and the Isles of Scilly",null,7370.8367198564165,470.72906220338785,6.3863721324240327E-2]
[null,9,"Barking and Dagenham",122601.24426847551,null,null,null,8159.5045929643848,6.655319561925882E-2,null,null,9,"NHS Bedfordshire ",5795.3109781223793,361.12924493161756,6.2314040833166766E-2,null,9,"Coventry and Warwickshire",null,12712.872786184833,865.01623829112782,6.8042546546296517E-2]
[null,10,"Barnet",122601.24426847551,null,null,null,8159.5045929643848,6.655319561925882E-2,null,null,10,"NHS Berkshire West ",6855.5467672529303,416.45890359030079,6.0747729937400609E-2,null,10,"Derbyshire (Joined Up Care)",null,27243.967466597092,1738.6009517309944,6.3815997206083663E-2]
[null,11,"Barnsley",72095.65050623464,null,null,null,5438.5914922481916,7.5435778081756499E-2,null,null,11,"NHS Bexley ",2974.8725597821476,171.52873182308898,5.7659186528531553E-2,null,11,"Devon",null,31761.972426118988,2260.5752429080981,7.117238226203948E-2]
[null,12,"Barrow-in-Furness",93752.542262674062,null,null,null,7182.5312680061188,7.6611589346369316E-2,null,null,12,"NHS Birmingham and Solihull ",16085.064004096183,1211.2373466670936,7.5301991111669991E-2,null,12,"Dorset",null,10520.436773796082,645.52754835835572,6.135938670970506E-2]
[null,13,"Basildon",210644.42735295714,null,null,null,13515.867036460095,6.4164370291234063E-2,null,null,13,"NHS Blackburn with Darwen ",2088.1547903338619,176.00408612194869,8.4286896228515942E-2,null,13,"Durham, Darlington, Teesside, Hambleton, Richmondshire and Whitby",null,14630.235003172358,1069.2091084143551,7.3082155425563039E-2]
[null,14,"Basingstoke and Deane",117032.60591674724,null,null,null,6965.7596910107022,5.9519820450429785E-2,null,null,14,"NHS Blackpool ",2247.4811046134546,263.02553088636716,0.11703125349817126,null,14,"East London",null,26637.621627684046,1781.3071395646525,6.6871853818712149E-2]
[null,15,"Bassetlaw",210644.42735295714,null,null,null,13515.867036460095,6.4164370291234063E-2,null,null,15,"NHS Bolton ",3828.7647837891682,258.71735518830241,6.7572015988994941E-2,null,15,"Frimley Health",null,9675.8510460221078,521.80755243234285,5.3928853384619432E-2]
[null,16,"Bath and North East Somerset",58008.376879350857,null,null,null,3575.9473523568668,6.1645361320733498E-2,null,null,16,"NHS Bradford City ",1736.407818572811,131.9045382876798,7.5964031534996673E-2,null,16,"Gloucestershire",null,8330.5305010508637,437.8890148784597,5.2564361276058194E-2]
[null,17,"Bedford",210644.42735295714,null,null,null,13515.867036460095,6.4164370291234063E-2,null,null,17,"NHS Bradford Districts ",3915.8654010968662,350.25454954597893,8.9444992018333863E-2,null,17,"Greater Manchester",null,37533.967281357822,2873.4127219530783,7.6554996182890328E-2]
[null,18,"Bexley",122601.24426847551,null,null,null,8159.5045929643848,6.655319561925882E-2,null,null,18,"NHS Brent ",4590.6193386701334,310.47686547565672,6.7632892769017836E-2,null,18,"Hampshire and the Isle of Wight",null,23638.712727581114,1448.4257095066719,6.1273459608343288E-2]
[null,19,"Birmingham",210644.42735295714,null,null,null,13515.867036460095,6.4164370291234063E-2,null,null,19,"NHS Brighton and Hove ",3995.0913836055693,415.04780545903634,0.10388943971650925,null,19,"Herefordshire and Worcestershire",null,10299.739828835443,548.90856727237497,5.3293440066868002E-2]
[null,20,"Blaby",210644.42735295714,null,null,null,13515.867036460095,6.4164370291234063E-2,null,null,20,"NHS Bristol, North Somerset and South Gloucestershire ",12539.998853596589,976.52926690584604,7.7873154400310673E-2,null,20,"Hertfordshire and West Essex",null,19311.655810137087,1029.2963562182993,5.3299228524878763E-2]
[null,21,"Blackburn with Darwen",93752.542262674062,null,null,null,7182.5312680061188,7.6611589346369316E-2,null,null,21,"NHS Bromley ",4431.4746577822052,213.32742856729755,4.8139151194889221E-2,null,21,"Humber, Coast and Vale",null,18493.340026548132,1380.0404115078168,7.4623643404960832E-2]
[null,22,"Blackpool",93752.542262674062,null,null,null,7182.5312680061188,7.6611589346369316E-2,null,null,22,"NHS Buckinghamshire ",6994.9445664524674,345.22961460680705,4.9354160183415513E-2,null,22,"Kent and Medway",null,23595.482463892691,1481.7174500480849,6.2796658314382983E-2]
[null,23,"Bolsover",210644.42735295714,null,null,null,13515.867036460095,6.4164370291234063E-2,null,null,23,"NHS Bury ",2189.7871401996686,142.24956685398595,6.4960454028885839E-2,null,23,"Lancashire and South Cumbria",null,22327.060264277923,1727.3335720939126,7.7365024846443933E-2]
[null,24,"Bolton",93752.542262674062,null,null,null,7182.5312680061188,7.6611589346369316E-2,null,null,24,"NHS Calderdale ",2778.5123562446888,209.72535288818386,7.5481166177586892E-2,null,24,"Leicester, Leicestershire and Rutland",null,14349.570272560981,960.61714356497464,6.6943965938955768E-2]
[null,25,"Boston",210644.42735295714,null,null,null,13515.867036460095,6.4164370291234063E-2,null,null,25,"NHS Cambridgeshire and Peterborough ",11506.306415848225,777.05255213102828,6.7532753261355355E-2,null,25,"Lincolnshire",null,10071.889256804468,587.87095710626386,5.8367496118874033E-2]
[null,26,"Bournemouth, Christchurch and Poole",58008.376879350857,null,null,null,3575.9473523568668,6.1645361320733498E-2,null,null,26,"NHS Camden ",3647.752660057603,354.82223286594973,9.7271461618328753E-2,null,26,"Mid and South Essex",null,15242.51470590079,846.32106888545422,5.5523716736702269E-2]
[null,27,"Bracknell Forest",117032.60591674724,null,null,null,6965.7596910107022,5.9519820450429785E-2,null,null,27,"NHS Cannock Chase ",1727.1063746634925,95.239487516642839,5.5143961549675359E-2,null,27,"Norfolk and Waveney",null,13761.135754459299,926.0109492757108,6.7291753079002703E-2]
[null,28,"Bradford",72095.65050623464,null,null,null,5438.5914922481916,7.5435778081756499E-2,null,null,28,"NHS Canterbury and Coastal ",2876.0722539070052,212.46393894505826,7.3872949004127511E-2,null,28,"North Cumbria",null,4190.983208197953,245.64948518906033,5.8613808022076323E-2]
[null,29,"Braintree",210644.42735295714,null,null,null,13515.867036460095,6.4164370291234063E-2,null,null,29,"NHS Castle Point and Rochford ",2329.3030905647242,96.369775355184998,4.1372793324127168E-2,null,29,"North London",null,20263.246166831013,1526.2393673809001,7.5320575726864888E-2]
[null,30,"Breckland",210644.42735295714,null,null,null,13515.867036460095,6.4164370291234063E-2,null,null,30,"NHS Central London (Westminster) ",2977.2190893264892,232.59422804391602,7.8124659645566696E-2,null,30,"North West London",null,30496.180495791235,1980.4077996237795,6.4939535621422975E-2]
[null,31,"Brent",122601.24426847551,null,null,null,8159.5045929643848,6.655319561925882E-2,null,null,31,"NHS Chorley and South Ribble ",2380.6878990185578,146.16519455412438,6.1396201750923002E-2,null,31,"Northamptonshire",null,9706.389668793001,630.39664927713102,6.4946563118511338E-2]
[null,32,"Brentwood",210644.42735295714,null,null,null,13515.867036460095,6.4164370291234063E-2,null,null,32,"NHS City and Hackney ",3936.6510285366166,279.21774024080452,7.0927734822509525E-2,null,32,"Northumberland, Tyne and Wear and North Durham",null,23075.026738820998,1774.318127726172,7.689343755953669E-2]
[null,33,"Brighton and Hove",117032.60591674724,null,null,null,6965.7596910107022,5.9519820450429785E-2,null,null,33,"NHS Coastal West Sussex ",6782.1945127924937,324.00837405494315,4.7773382707293699E-2,null,33,"Nottingham and Nottinghamshire",null,13784.675934732888,1090.1434292911536,7.9083718358902266E-2]
[null,34,"Bristol, City of",58008.376879350857,null,null,null,3575.9473523568668,6.1645361320733498E-2,null,null,34,"NHS Corby ",972.38159101510496,79.213533392001466,8.1463423540657054E-2,null,34,"Shropshire and Telford and Wrekin",null,6332.7121272382301,335.90834131402846,5.3043361922172516E-2]
[null,35,"Broadland",210644.42735295714,null,null,null,13515.867036460095,6.4164370291234063E-2,null,null,35,"NHS Coventry and Rugby ",6430.5346598272454,509.37946583575905,7.9212614935107645E-2,null,35,"Somerset",null,7338.5746424735089,426.43416021993818,5.8108581161232978E-2]
[null,36,"Bromley",122601.24426847551,null,null,null,8159.5045929643848,6.655319561925882E-2,null,null,36,"NHS Crawley ",1690.4574058998362,96.019891312090095,5.6801130260350087E-2,null,36,"South East London",null,24334.824680345591,1607.0637833713388,6.6039669670162421E-2]
[null,37,"Bromsgrove",210644.42735295714,null,null,null,13515.867036460095,6.4164370291234063E-2,null,null,37,"NHS Croydon ",5056.1685032187124,353.98610559422337,7.0010741408020508E-2,null,37,"South West London",null,20869.3712978236,1264.4865030237131,6.0590541275940706E-2]
[null,38,"Broxbourne",210644.42735295714,null,null,null,13515.867036460095,6.4164370291234063E-2,null,null,38,"NHS Darlington ",1407.8021471326642,90.803957942995694,6.450051104691118E-2,null,38,"South Yorkshire and Bassetlaw",null,19729.990628274711,1462.9858974827828,7.4150359472862734E-2]
[null,39,"Broxtowe",210644.42735295714,null,null,null,13515.867036460095,6.4164370291234063E-2,null,null,39,"NHS Dartford, Gravesham and Swanley ",3374.4894731190702,191.03204671210233,5.6610651250759342E-2,null,39,"Staffordshire and Stoke on Trent ",null,14784.299910482447,912.98369264800078,6.1753596597473787E-2]
[null,40,"Burnley",93752.542262674062,null,null,null,7182.5312680061188,7.6611589346369316E-2,null,null,40,"NHS Doncaster ",3956.5228700168541,316.96688823039091,8.0112487313649894E-2,null,40,"Suffolk and North East Essex",null,12678.509719143805,788.70250059122975,6.2207823952710725E-2]
[null,41,"Bury",93752.542262674062,null,null,null,7182.5312680061188,7.6611589346369316E-2,null,null,41,"NHS Dorset ",10520.436773796082,645.52754835835572,6.135938670970506E-2,null,41,"Surrey Heartlands",null,11528.001771129111,519.82090585145829,4.5092021685259019E-2]
[null,42,"Calderdale",72095.65050623464,null,null,null,5438.5914922481916,7.5435778081756499E-2,null,null,42,"NHS Dudley ",4072.64859443257,264.59013114446731,6.4967581908777938E-2,null,42,"Sussex and East Surrey",null,25099.326328598119,1582.0927330751488,6.3033274772499204E-2]
[null,43,"Cambridge",210644.42735295714,null,null,null,13515.867036460095,6.4164370291234063E-2,null,null,43,"NHS Durham Dales, Easington and Sedgefield ",3735.0257949160259,291.41462048509891,7.8022117245284184E-2,null,43,"The Black Country & West Birmingham",null,17795.742221256278,1244.4981527566656,6.9932354452188233E-2]
[null,44,"Camden",122601.24426847551,null,null,null,8159.5045929643848,6.655319561925882E-2,null,null,44,"NHS Ealing ",5427.6859799565855,330.74426956331223,6.0936515263537362E-2,null,44,"West Yorkshire & Harrogate",null,33872.319851411805,2595.5651832575918,7.6627913135078884E-2]
[null,45,"Cannock Chase",210644.42735295714,null,null,null,13515.867036460095,6.4164370291234063E-2,null,null,45,"NHS East and North Hertfordshire ",7485.378258552485,400.71898395459971,5.3533565053543515E-2]
[null,46,"Canterbury",117032.60591674724,null,null,null,6965.7596910107022,5.9519820450429785E-2,null,null,46,"NHS East Berkshire ",5635.8379376232706,313.53934898902611,5.5633137868625622E-2]
[null,47,"Carlisle",93752.542262674062,null,null,null,7182.5312680061188,7.6611589346369316E-2,null,null,47,"NHS East Lancashire ",4769.76591430796,352.75934976965823,7.3957371516174222E-2]
[null,48,"Castle Point",210644.42735295714,null,null,null,13515.867036460095,6.4164370291234063E-2,null,null,48,"NHS East Leicestershire and Rutland ",4292.1441896885426,223.12444549615853,5.1984377885578317E-2]
[null,49,"Central Bedfordshire",210644.42735295714,null,null,null,13515.867036460095,6.4164370291234063E-2,null,null,49,"NHS East Riding of Yorkshire ",4032.6096311287906,226.95355569988729,5.6279574880735338E-2]
[null,50,"Charnwood",210644.42735295714,null,null,null,13515.867036460095,6.4164370291234063E-2,null,null,50,"NHS East Staffordshire ",1824.0537507596639,107.85088348613193,5.9127031449163855E-2]
[null,51,"Chelmsford",210644.42735295714,null,null,null,13515.867036460095,6.4164370291234063E-2,null,null,51,"NHS East Surrey ",2309.0056168809206,100.15197783016949,4.3374505933622638E-2]
[null,52,"Cheltenham",58008.376879350857,null,null,null,3575.9473523568668,6.1645361320733498E-2,null,null,52,"NHS Eastbourne, Hailsham and Seaford ",2578.6770220551798,171.46016722516276,6.6491524824039708E-2]
[null,53,"Cherwell",117032.60591674724,null,null,null,6965.7596910107022,5.9519820450429785E-2,null,null,53,"NHS Eastern Cheshire ",2747.1956383617894,127.86711387954395,4.6544597004308658E-2]
[null,54,"Cheshire East",93752.542262674062,null,null,null,7182.5312680061188,7.6611589346369316E-2,null,null,54,"NHS Enfield ",4059.3831276383412,235.82606181168626,5.8094063653677502E-2]
[null,55,"Cheshire West and Chester",93752.542262674062,null,null,null,7182.5312680061188,7.6611589346369316E-2,null,null,55,"NHS Erewash ",43524498.857529826,2828971.9420745675,6.4997231819595089E-2]
[null,56,"Chesterfield",210644.42735295714,null,null,null,13515.867036460095,6.4164370291234063E-2,null,null,56,"NHS Fareham and Gosport ",2670.9863457727633,176.96901223384592,6.6256052755165121E-2]
[null,57,"Chichester",117032.60591674724,null,null,null,6965.7596910107022,5.9519820450429785E-2,null,null,57,"NHS Fylde and Wyre ",2385.2133409346407,142.25194279622391,5.9639085676287056E-2]
[null,58,"Chiltern",117032.60591674724,null,null,null,6965.7596910107022,5.9519820450429785E-2,null,null,58,"NHS Gloucestershire ",8330.5305010508637,437.8890148784597,5.2564361276058194E-2]
[null,59,"Chorley",93752.542262674062,null,null,null,7182.5312680061188,7.6611589346369316E-2,null,null,59,"NHS Great Yarmouth and Waveney ",3019.0327743437324,249.09486421121682,8.2508168287561648E-2]
[null,60,"City of London",122601.24426847551,null,null,null,8159.5045929643848,6.655319561925882E-2,null,null,60,"NHS Greater Huddersfield ",3133.7706421193061,206.41678613771811,6.5868504658057103E-2]
[null,61,"Colchester",210644.42735295714,null,null,null,13515.867036460095,6.4164370291234063E-2,null,null,61,"NHS Greater Preston ",2416.1669326296505,203.94427325502377,8.4408188234353379E-2]
[null,62,"Copeland",93752.542262674062,null,null,null,7182.5312680061188,7.6611589346369316E-2,null,null,62,"NHS Greenwich ",3634.2084111048275,269.65948944515765,7.4200337168659813E-2]
[null,63,"Corby",210644.42735295714,null,null,null,13515.867036460095,6.4164370291234063E-2,null,null,63,"NHS Guildford and Waverley ",2889.983572415641,142.39259321195033,4.9271073569781262E-2]
[null,64,"Cornwall",58008.376879350857,null,null,null,3575.9473523568668,6.1645361320733498E-2,null,null,64,"NHS Halton ",1710.1590015258507,123.90770705771901,7.2453910394977991E-2]
[null,65,"Cotswold",58008.376879350857,null,null,null,3575.9473523568668,6.1645361320733498E-2,null,null,65,"NHS Hambleton, Richmondshire and Whitby ",1905.05490034635,73.358876260839025,3.8507486712063763E-2]
[null,66,"County Durham",41896.244950191322,null,null,null,3089.1767213295875,{"$f":"H1349/D1349","v":7.3733976040148211E-2},null,null,66,"NHS Hammersmith and Fulham ",3231.8586860444861,233.93607919676191,{"$f":"O1349/N1349","v":7.2384377512210885E-2}]
[null,67,"Coventry",210644.42735295714,null,null,null,13515.867036460095,6.4164370291234063E-2,null,null,67,"NHS Hardwick ",43524498.857529826,2828971.9420745675,6.4997231819595089E-2]
[null,68,"Craven",72095.65050623464,null,null,null,5438.5914922481916,7.5435778081756499E-2,null,null,68,"NHS Haringey ",4035.1404147877038,328.15140810192628,8.1323417370889911E-2]
[null,69,"Crawley",117032.60591674724,null,null,null,6965.7596910107022,5.9519820450429785E-2,null,null,69,"NHS Harrogate and Rural District ",2136.1708468392394,98.960494225363448,4.632611402397388E-2]
[null,70,"Croydon",122601.24426847551,null,null,null,8159.5045929643848,6.655319561925882E-2,null,null,70,"NHS Harrow ",3365.3342225261404,171.31885112055338,5.0906935178627016E-2]
[null,71,"Dacorum",210644.42735295714,null,null,null,13515.867036460095,6.4164370291234063E-2,null,null,71,"NHS Hartlepool and Stockton-on-Tees ",3803.0691046249385,296.15950915610665,7.7873817437591406E-2]
[null,72,"Darlington",41896.244950191322,null,null,null,3089.1767213295875,7.3733976040148211E-2,null,null,72,"NHS Hastings and Rother ",2474.2179716657079,169.19624769453739,6.8383727558421245E-2]
[null,73,"Dartford",117032.60591674724,null,null,null,6965.7596910107022,5.9519820450429785E-2,null,null,73,"NHS Havering ",3494.5523582448186,209.00916329905124,5.9809996209079161E-2]
[null,74,"Daventry",210644.42735295714,null,null,null,13515.867036460095,6.4164370291234063E-2,null,null,74,"NHS Herefordshire ",2381.579359427607,147.17951953059799,6.1799124580073354E-2]
[null,75,"Derby",210644.42735295714,null,null,null,13515.867036460095,6.4164370291234063E-2,null,null,75,"NHS Herts Valleys ",7876.972773498881,409.83474673547738,5.2029473570648445E-2]
[null,76,"Derbyshire Dales",210644.42735295714,null,null,null,13515.867036460095,6.4164370291234063E-2,null,null,76,"NHS Heywood, Middleton and Rochdale ",2910.5852940420227,254.5520313423616,8.7457334393680336E-2]
[null,77,"Doncaster",72095.65050623464,null,null,null,5438.5914922481916,7.5435778081756499E-2,null,null,77,"NHS High Weald Lewes Havens ",2186.7862950001445,131.93846529205766,6.0334412006203347E-2]
[null,78,"Dorset",58008.376879350857,null,null,null,3575.9473523568668,6.1645361320733498E-2,null,null,78,"NHS Hillingdon ",3750.0530226913233,194.35495515166892,5.1827255234963322E-2]
[null,79,"Dover",117032.60591674724,null,null,null,6965.7596910107022,5.9519820450429785E-2,null,null,79,"NHS Horsham and Mid Sussex ",3082.896120698269,174.26980420715191,5.6527952089310163E-2]
[null,80,"Dudley",210644.42735295714,null,null,null,13515.867036460095,6.4164370291234063E-2,null,null,80,"NHS Hounslow ",3958.6944215299295,250.90020695076342,6.3379533814534039E-2]
[null,81,"Ealing",122601.24426847551,null,null,null,8159.5045929643848,6.655319561925882E-2,null,null,81,"NHS Hull ",3684.8503667525888,331.98494581287525,9.0094552768895553E-2]
[null,82,"East Cambridgeshire",210644.42735295714,null,null,null,13515.867036460095,6.4164370291234063E-2,null,null,82,"NHS Ipswich and East Suffolk ",5259.5243691149462,290.04787721140087,5.5147168613691407E-2]
[null,83,"East Devon",58008.376879350857,null,null,null,3575.9473523568668,6.1645361320733498E-2,null,null,83,"NHS Isle of Wight ",1927.1745182005704,131.31000230344318,6.8136020408805092E-2]
[null,84,"East Hampshire",117032.60591674724,null,null,null,6965.7596910107022,5.9519820450429785E-2,null,null,84,"NHS Islington ",3243.8867150885276,303.4248213065714,9.3537428386518351E-2]
[null,85,"East Hertfordshire",210644.42735295714,null,null,null,13515.867036460095,6.4164370291234063E-2,null,null,85,"NHS Kernow ",7370.8367198564165,470.72906220338785,6.3863721324240327E-2]
[null,86,"East Lindsey",210644.42735295714,null,null,null,13515.867036460095,6.4164370291234063E-2,null,null,86,"NHS Kingston ",2637.4932316865661,160.60266796197891,6.0892163070795924E-2]
[null,87,"East Northamptonshire",210644.42735295714,null,null,null,13515.867036460095,6.4164370291234063E-2,null,null,87,"NHS Knowsley ",2107.2496140186176,219.31031403534925,0.10407419822330152]
[null,88,"East Riding of Yorkshire",72095.65050623464,null,null,null,5438.5914922481916,7.5435778081756499E-2,null,null,88,"NHS Lambeth ",5223.6606745364234,331.32941960275605,6.3428587775211889E-2]
[null,89,"East Staffordshire",210644.42735295714,null,null,null,13515.867036460095,6.4164370291234063E-2,null,null,89,"NHS Leeds ",11103.517583889021,897.08568547969799,8.0792926989312938E-2]
[null,90,"East Suffolk",210644.42735295714,null,null,null,13515.867036460095,6.4164370291234063E-2,null,null,90,"NHS Leicester City ",4982.6315341533082,455.25985075903731,9.1369359270993933E-2]
[null,91,"Eastbourne",117032.60591674724,null,null,null,6965.7596910107022,5.9519820450429785E-2,null,null,91,"NHS Lewisham ",3977.4587656031758,313.85639551748409,7.8908774173021057E-2]
[null,92,"Eastleigh",117032.60591674724,null,null,null,6965.7596910107022,5.9519820450429785E-2,null,null,92,"NHS Lincolnshire East ",3170.7012715073656,195.53482244222891,6.1669266732677967E-2]
[null,93,"Eden",93752.542262674062,null,null,null,7182.5312680061188,7.6611589346369316E-2,null,null,93,"NHS Lincolnshire West ",3031.5274145517574,191.01632737461981,6.3009929073283191E-2]
[null,94,"Elmbridge",117032.60591674724,null,null,null,6965.7596910107022,5.9519820450429785E-2,null,null,94,"NHS Liverpool ",6733.0707827314136,687.07488421566029,0.10204480338716025]
[null,95,"Enfield",122601.24426847551,null,null,null,8159.5045929643848,6.655319561925882E-2,null,null,95,"NHS Luton ",2798.8068794055957,160.57535077093556,5.7372786937353169E-2]
[null,96,"Epping Forest",210644.42735295714,null,null,null,13515.867036460095,6.4164370291234063E-2,null,null,96,"NHS Manchester ",7837.955346594621,710.28802488757754,9.0621596255479872E-2]
[null,97,"Epsom and Ewell",117032.60591674724,null,null,null,6965.7596910107022,5.9519820450429785E-2,null,null,97,"NHS Mansfield and Ashfield ",2460.7452400754341,190.7628351865531,7.7522383089403138E-2]
[null,98,"Erewash",210644.42735295714,null,null,null,13515.867036460095,6.4164370291234063E-2,null,null,98,"NHS Medway ",3628.6440529432011,230.74058522415362,6.358865236092788E-2]
[null,99,"Exeter",58008.376879350857,null,null,null,3575.9473523568668,6.1645361320733498E-2,null,null,99,"NHS Merton ",2770.4564431174972,130.7840987399411,4.7206697316913723E-2]
[null,100,"Fareham",117032.60591674724,null,null,null,6965.7596910107022,5.9519820450429785E-2,null,null,100,"NHS Mid Essex ",4940.2716359850692,255.02072936158078,5.1620790950846311E-2]
[null,101,"Fenland",210644.42735295714,null,null,null,13515.867036460095,6.4164370291234063E-2,null,null,101,"NHS Milton Keynes ",3627.231078955178,239.19849546700488,6.5945204554187342E-2]
[null,102,"Folkestone and Hythe",117032.60591674724,null,null,null,6965.7596910107022,5.9519820450429785E-2,null,null,102,"NHS Morecambe Bay ",4608.1514510853503,331.58008984368496,7.1955119826972794E-2]
[null,103,"Forest of Dean",58008.376879350857,null,null,null,3575.9473523568668,6.1645361320733498E-2,null,null,103,"NHS Nene ",8734.0080777778967,551.1831158851295,6.3107694769313896E-2]
[null,104,"Fylde",93752.542262674062,null,null,null,7182.5312680061188,7.6611589346369316E-2,null,null,104,"NHS Newark and Sherwood ",1744.7198185996622,120.10117757535524,6.8836942353156863E-2]
[null,105,"Gateshead",41896.244950191322,null,null,null,3089.1767213295875,7.3733976040148211E-2,null,null,105,"NHS Newcastle Gateshead ",6833.7739122899775,656.15163064247849,9.6015999221520043E-2]
[null,106,"Gedling",210644.42735295714,null,null,null,13515.867036460095,6.4164370291234063E-2,null,null,106,"NHS Newham ",4838.9620985472802,327.67450604843361,6.7715865380885254E-2]
[null,107,"Gloucester",58008.376879350857,null,null,null,3575.9473523568668,6.1645361320733498E-2,null,null,107,"NHS North Cumbria ",4190.983208197953,245.64948518906033,5.8613808022076323E-2]
[null,108,"Gosport",117032.60591674724,null,null,null,6965.7596910107022,5.9519820450429785E-2,null,null,108,"NHS North Derbyshire ",13621.983733298546,869.30047586549722,6.3815997206083663E-2]
[null,109,"Gravesham",117032.60591674724,null,null,null,6965.7596910107022,5.9519820450429785E-2,null,null,109,"NHS North Durham ",3349.723427075543,209.90080809466278,6.2662130968202195E-2]
[null,110,"Great Yarmouth",210644.42735295714,null,null,null,13515.867036460095,6.4164370291234063E-2,null,null,110,"NHS North East Essex ",4137.2585927529599,308.86054975241001,7.4653431210083512E-2]
[null,111,"Greenwich",122601.24426847551,null,null,null,8159.5045929643848,6.655319561925882E-2,null,null,111,"NHS North East Hampshire and Farnham ",2871.9634791248081,155.10029852796421,5.4004968954281037E-2]
[null,112,"Guildford",117032.60591674724,null,null,null,6965.7596910107022,5.9519820450429785E-2,null,null,112,"NHS North East Lincolnshire ",2184.1928222417409,156.83487464797881,7.1804500523452747E-2]
[null,113,"Hackney",122601.24426847551,null,null,null,8159.5045929643848,6.655319561925882E-2,null,null,113,"NHS North Hampshire ",2390.7314146928006,126.7144159897781,5.300236371640283E-2]
[null,114,"Halton",93752.542262674062,null,null,null,7182.5312680061188,7.6611589346369316E-2,null,null,114,"NHS North Kirklees ",2404.6412240686013,189.55309380276384,7.8828014718155787E-2]
[null,115,"Hambleton",72095.65050623464,null,null,null,5438.5914922481916,7.5435778081756499E-2,null,null,115,"NHS North Lincolnshire ",2324.6454233730151,143.82124468369605,6.1868035115228127E-2]
[null,116,"Hammersmith and Fulham",122601.24426847551,null,null,null,8159.5045929643848,6.655319561925882E-2,null,null,116,"NHS North Norfolk ",2337.6306552025435,111.56269119599894,4.7724686937908337E-2]
[null,117,"Harborough",210644.42735295714,null,null,null,13515.867036460095,6.4164370291234063E-2,null,null,117,"NHS North Staffordshire ",2865.4378135243892,168.1644226854647,5.8687165323133741E-2]
[null,118,"Haringey",122601.24426847551,null,null,null,8159.5045929643848,6.655319561925882E-2,null,null,118,"NHS North Tyneside ",2863.8450217886698,207.47461305952413,7.2446173407086756E-2]
[null,119,"Harlow",210644.42735295714,null,null,null,13515.867036460095,6.4164370291234063E-2,null,null,119,"NHS North West Surrey ",4723.0012243430774,216.98036083494063,4.594120359668559E-2]
[null,120,"Harrogate",72095.65050623464,null,null,null,5438.5914922481916,7.5435778081756499E-2,null,null,120,"NHS Northern, Eastern and Western Devon ",15880.986213059494,1130.287621454049,7.117238226203948E-2]
[null,121,"Harrow",122601.24426847551,null,null,null,8159.5045929643848,6.655319561925882E-2,null,null,121,"NHS Northumberland ",4275.8488774675352,279.14647481298647,6.5284457615891481E-2]
[null,122,"Hart",117032.60591674724,null,null,null,6965.7596910107022,5.9519820450429785E-2,null,null,122,"NHS Norwich ",3069.634962542933,265.39992086683952,8.6459766097718063E-2]
[null,123,"Hartlepool",41896.244950191322,null,null,null,3089.1767213295875,7.3733976040148211E-2,null,null,123,"NHS Nottingham City ",4786.8970399160344,529.69851329186963,0.11065592363381205]
[null,124,"Hastings",117032.60591674724,null,null,null,6965.7596910107022,5.9519820450429785E-2,null,null,124,"NHS Nottingham North and East ",1814.4106027150815,111.81865695623847,6.1628088365948255E-2]
[null,125,"Havant",117032.60591674724,null,null,null,6965.7596910107022,5.9519820450429785E-2,null,null,125,"NHS Nottingham West ",1355.2593057741578,67.741201097632626,4.9983940939580682E-2]
[null,126,"Havering",122601.24426847551,null,null,null,8159.5045929643848,6.655319561925882E-2,null,null,126,"NHS Oldham ",3066.301757973401,220.10011367433503,7.1780317479191919E-2]
[null,127,"Herefordshire, County of",210644.42735295714,null,null,null,13515.867036460095,6.4164370291234063E-2,null,null,127,"NHS Oxfordshire ",9644.7402458186898,650.20682189988702,6.7415690348091334E-2]
[null,128,"Hertsmere",210644.42735295714,null,null,null,13515.867036460095,6.4164370291234063E-2,null,null,128,"NHS Portsmouth ",2853.7082685469891,211.23948212760126,7.4022801999714283E-2]
[null,129,"High Peak",210644.42735295714,null,null,null,13515.867036460095,6.4164370291234063E-2,null,null,129,"NHS Redbridge ",3883.7048913323497,206.66439354126942,5.3213207317194179E-2]
[null,130,"Hillingdon",122601.24426847551,null,null,null,8159.5045929643848,{"$f":"H1413/D1413","v":6.655319561925882E-2},null,null,130,"NHS Redditch and Bromsgrove ",2278.6260151778333,96.103518033543651,{"$f":"O1413/N1413","v":4.2176082162409326E-2}]
[null,131,"Hinckley and Bosworth",210644.42735295714,null,null,null,13515.867036460095,6.4164370291234063E-2,null,null,131,"NHS Richmond ",2734.5814613873895,150.34362082114012,5.4978658688362242E-2]
[null,132,"Horsham",117032.60591674724,null,null,null,6965.7596910107022,5.9519820450429785E-2,null,null,132,"NHS Rotherham ",3352.0576053100012,210.44737361004914,6.2781550435374089E-2]
[null,133,"Hounslow",122601.24426847551,null,null,null,8159.5045929643848,6.655319561925882E-2,null,null,133,"NHS Rushcliffe ",1622.6439276525207,70.021045183504597,4.3152440279861065E-2]
[null,134,"Huntingdonshire",210644.42735295714,null,null,null,13515.867036460095,6.4164370291234063E-2,null,null,134,"NHS Salford ",3412.8092289001502,310.75973163432928,9.105687156573887E-2]
[null,135,"Hyndburn",93752.542262674062,null,null,null,7182.5312680061188,7.6611589346369316E-2,null,null,135,"NHS Sandwell and West Birmingham ",6938.9301159846127,504.80189683442597,7.2749240646127492E-2]
[null,136,"Ipswich",210644.42735295714,null,null,null,13515.867036460095,6.4164370291234063E-2,null,null,136,"NHS Scarborough and Ryedale ",1532.4599615618149,137.89154903955114,8.9980523144642693E-2]
[null,137,"Isle of Wight",117032.60591674724,null,null,null,6965.7596910107022,5.9519820450429785E-2,null,null,137,"NHS Sheffield ",7516.6666081760322,573.33615331351996,7.6275320324821969E-2]
[null,138,"Isles of Scilly",58008.376879350857,null,null,null,3575.9473523568668,6.1645361320733498E-2,null,null,138,"NHS Shropshire ",3991.2686750833445,197.64010381534715,4.9518115643071833E-2]
[null,139,"Islington",122601.24426847551,null,null,null,8159.5045929643848,6.655319561925882E-2,null,null,139,"NHS Somerset ",7338.5746424735089,426.43416021993818,5.8108581161232978E-2]
[null,140,"Kensington and Chelsea",122601.24426847551,null,null,null,8159.5045929643848,6.655319561925882E-2,null,null,140,"NHS South Cheshire ",2423.2702158199636,171.07929624926609,7.0598522249974455E-2]
[null,141,"Kettering",210644.42735295714,null,null,null,13515.867036460095,6.4164370291234063E-2,null,null,141,"NHS South Devon and Torbay ",15880.986213059494,1130.287621454049,7.117238226203948E-2]
[null,142,"King's Lynn and West Norfolk",210644.42735295714,null,null,null,13515.867036460095,6.4164370291234063E-2,null,null,142,"NHS South East Staffordshire and Seisdon Peninsula ",2840.879169850522,168.95596052889348,5.9473124489762587E-2]
[null,143,"Kingston upon Hull, City of",72095.65050623464,null,null,null,5438.5914922481916,7.5435778081756499E-2,null,null,143,"NHS South Eastern Hampshire ",2826.2388990888758,121.91516903875583,4.3136894435236495E-2]
[null,144,"Kingston upon Thames",122601.24426847551,null,null,null,8159.5045929643848,6.655319561925882E-2,null,null,144,"NHS South Kent Coast ",2686.2578170023139,202.65766152581648,7.5442372002836655E-2]
[null,145,"Kirklees",72095.65050623464,null,null,null,5438.5914922481916,7.5435778081756499E-2,null,null,145,"NHS South Lincolnshire ",2186.946902845074,111.27063680338075,5.0879441406933554E-2]
[null,146,"Knowsley",93752.542262674062,null,null,null,7182.5312680061188,7.6611589346369316E-2,null,null,146,"NHS South Norfolk ",3007.2353809830392,159.19369174252284,5.2936891055891944E-2]
[null,147,"Lambeth",122601.24426847551,null,null,null,8159.5045929643848,6.655319561925882E-2,null,null,147,"NHS South Sefton ",2018.6895687467695,179.42707995879957,8.8882947995907263E-2]
[null,148,"Lancaster",93752.542262674062,null,null,null,7182.5312680061188,7.6611589346369316E-2,null,null,148,"NHS South Tees ",3779.2830561523788,317.47214456931488,8.4003272539349735E-2]
[null,149,"Leeds",72095.65050623464,null,null,null,5438.5914922481916,7.5435778081756499E-2,null,null,149,"NHS South Tyneside ",2046.6661148419487,139.39179862214326,6.8106760360816171E-2]
[null,150,"Leicester",210644.42735295714,null,null,null,13515.867036460095,6.4164370291234063E-2,null,null,150,"NHS South Warwickshire ",3776.2040746384296,208.58423304594675,5.5236483231091961E-2]
[null,151,"Lewes",117032.60591674724,null,null,null,6965.7596910107022,5.9519820450429785E-2,null,null,151,"NHS South West Lincolnshire ",1682.7136679002722,90.049170486034384,5.3514256289603782E-2]
[null,152,"Lewisham",122601.24426847551,null,null,null,8159.5045929643848,6.655319561925882E-2,null,null,152,"NHS South Worcestershire ",4094.1538923561297,238.74249457436915,5.8313024095187613E-2]
[null,153,"Lichfield",210644.42735295714,null,null,null,13515.867036460095,6.4164370291234063E-2,null,null,153,"NHS Southampton ",3647.546397660617,303.43415016351872,8.3188564882444985E-2]
[null,154,"Lincoln",210644.42735295714,null,null,null,13515.867036460095,6.4164370291234063E-2,null,null,154,"NHS Southend ",2390.9184136213403,136.75589552743622,5.7198060271869577E-2]
[null,155,"Liverpool",93752.542262674062,null,null,null,7182.5312680061188,7.6611589346369316E-2,null,null,155,"NHS Southern Derbyshire ",13621.983733298546,869.30047586549722,6.3815997206083663E-2]
[null,156,"Luton",210644.42735295714,null,null,null,13515.867036460095,6.4164370291234063E-2,null,null,156,"NHS Southport and Formby ",1665.8783036838363,84.660244257552961,5.0820185406304723E-2]
[null,157,"Maidstone",117032.60591674724,null,null,null,6965.7596910107022,5.9519820450429785E-2,null,null,157,"NHS Southwark ",4093.1496115368086,307.36231841555451,7.5091884633103512E-2]
[null,158,"Maldon",210644.42735295714,null,null,null,13515.867036460095,6.4164370291234063E-2,null,null,158,"NHS St Helens ",2560.2659386489049,173.34078753210196,6.7704211861513416E-2]
[null,159,"Malvern Hills",210644.42735295714,null,null,null,13515.867036460095,6.4164370291234063E-2,null,null,159,"NHS Stafford and Surrounds ",1948.8712438414889,120.42554771257075,6.1792459657414665E-2]
[null,160,"Manchester",93752.542262674062,null,null,null,7182.5312680061188,7.6611589346369316E-2,null,null,160,"NHS Stockport ",3999.5711223383628,258.47425742620743,6.462549346418163E-2]
[null,161,"Mansfield",210644.42735295714,null,null,null,13515.867036460095,6.4164370291234063E-2,null,null,161,"NHS Stoke on Trent ",3577.9515578428914,252.34739071829708,7.0528453680472586E-2]
[null,162,"Medway",117032.60591674724,null,null,null,6965.7596910107022,5.9519820450429785E-2,null,null,162,"NHS Sunderland ",3705.1693853573279,282.25280249437679,7.6178110401599428E-2]
[null,163,"Melton",210644.42735295714,null,null,null,13515.867036460095,6.4164370291234063E-2,null,null,163,"NHS Surrey Downs ",3915.0169743703932,160.44795180456731,4.0982696334380592E-2]
[null,164,"Mendip",58008.376879350857,null,null,null,3575.9473523568668,6.1645361320733498E-2,null,null,164,"NHS Surrey Heath ",1168.0496292740272,53.167904915352516,4.5518532417494734E-2]
[null,165,"Merton",122601.24426847551,null,null,null,8159.5045929643848,6.655319561925882E-2,null,null,165,"NHS Sutton ",2439.853806945388,131.88309732847165,5.4053688361592737E-2]
[null,166,"Mid Devon",58008.376879350857,null,null,null,3575.9473523568668,6.1645361320733498E-2,null,null,166,"NHS Swale ",1417.8560349381517,96.066559079514704,6.775480493949107E-2]
[null,167,"Mid Suffolk",210644.42735295714,null,null,null,13515.867036460095,6.4164370291234063E-2,null,null,167,"NHS Swindon ",2952.0375301583535,192.58305557882554,6.5237333066187328E-2]
[null,168,"Mid Sussex",117032.60591674724,null,null,null,6965.7596910107022,5.9519820450429785E-2,null,null,168,"NHS Tameside and Glossop ",3000.3995802084564,254.7088756537506,8.4891651543310243E-2]
[null,169,"Middlesbrough",41896.244950191322,null,null,null,3089.1767213295875,7.3733976040148211E-2,null,null,169,"NHS Telford and Wrekin ",2341.4434521548851,138.26823749868132,5.9052563226085951E-2]
[null,170,"Milton Keynes",117032.60591674724,null,null,null,6965.7596910107022,5.9519820450429785E-2,null,null,170,"NHS Thanet ",1872.702318496833,157.53802238158318,8.4123365911158071E-2]
[null,171,"Mole Valley",117032.60591674724,null,null,null,6965.7596910107022,5.9519820450429785E-2,null,null,171,"NHS Thurrock ",2050.3194980099961,124.84213155740555,6.088911102809836E-2]
[null,172,"New Forest",117032.60591674724,null,null,null,6965.7596910107022,5.9519820450429785E-2,null,null,172,"NHS Tower Hamlets ",4068.776892336844,360.24171249606815,8.8538084546869428E-2]
[null,173,"Newark and Sherwood",210644.42735295714,null,null,null,13515.867036460095,6.4164370291234063E-2,null,null,173,"NHS Trafford ",3052.9332467910785,161.45993297579435,5.2886820616043273E-2]
[null,174,"Newcastle upon Tyne",41896.244950191322,null,null,null,3089.1767213295875,7.3733976040148211E-2,null,null,174,"NHS Vale of York ",4734.5818214901819,382.55424162382837,8.0800006430857635E-2]
[null,175,"Newcastle-under-Lyme",210644.42735295714,null,null,null,13515.867036460095,6.4164370291234063E-2,null,null,175,"NHS Vale Royal ",1357.1402749964675,88.573711287564095,6.5264964071451381E-2]
[null,176,"Newham",122601.24426847551,null,null,null,8159.5045929643848,6.655319561925882E-2,null,null,176,"NHS Wakefield ",4625.3305407885518,366.32731429424751,7.9200245488140614E-2]
[null,177,"North Devon",58008.376879350857,null,null,null,3575.9473523568668,6.1645361320733498E-2,null,null,177,"NHS Walsall ",3386.6345038911577,232.29659372203847,6.8592165306039232E-2]
[null,178,"North East Derbyshire",210644.42735295714,null,null,null,13515.867036460095,6.4164370291234063E-2,null,null,178,"NHS Waltham Forest ",3845.7440871179765,259.02492464110213,6.7353656086673444E-2]
[null,179,"North East Lincolnshire",72095.65050623464,null,null,null,5438.5914922481916,7.5435778081756499E-2,null,null,179,"NHS Wandsworth ",5230.8178514680467,336.88691257795796,6.4404252287892136E-2]
[null,180,"North Hertfordshire",210644.42735295714,null,null,null,13515.867036460095,6.4164370291234063E-2,null,null,180,"NHS Warrington ",2768.2570534416868,163.51533086848374,5.9067972269840431E-2]
[null,181,"North Kesteven",210644.42735295714,null,null,null,13515.867036460095,6.4164370291234063E-2,null,null,181,"NHS Warwickshire North ",2506.1340517191584,147.05253940942208,5.8677044553361757E-2]
[null,182,"North Lincolnshire",72095.65050623464,null,null,null,5438.5914922481916,7.5435778081756499E-2,null,null,182,"NHS West Cheshire ",3455.3185569037814,230.97354004771438,6.6845801984371483E-2]
[null,183,"North Norfolk",210644.42735295714,null,null,null,13515.867036460095,6.4164370291234063E-2,null,null,183,"NHS West Essex ",3949.3047780857196,218.74262552822211,5.5387628410448878E-2]
[null,184,"North Somerset",58008.376879350857,null,null,null,3575.9473523568668,6.1645361320733498E-2,null,null,184,"NHS West Hampshire ",7322.326883618498,376.84347764972887,5.1464989700583115E-2]
[null,185,"North Tyneside",41896.244950191322,null,null,null,3089.1767213295875,7.3733976040148211E-2,null,null,185,"NHS West Kent ",6162.6030521695247,309.25139837440094,5.0181943532048516E-2]
[null,186,"North Warwickshire",210644.42735295714,null,null,null,13515.867036460095,6.4164370291234063E-2,null,null,186,"NHS West Lancashire ",1431.4388313544471,111.60310486688141,7.7965682097139291E-2]
[null,187,"North West Leicestershire",210644.42735295714,null,null,null,13515.867036460095,6.4164370291234063E-2,null,null,187,"NHS West Leicestershire ",5074.79454871913,282.23284730977872,5.5614635154247541E-2]
[null,188,"Northampton",210644.42735295714,null,null,null,13515.867036460095,6.4164370291234063E-2,null,null,188,"NHS West London ",3194.7157350461466,256.08234412114683,8.0158100237812807E-2]
[null,189,"Northumberland",41896.244950191322,null,null,null,3089.1767213295875,7.3733976040148211E-2,null,null,189,"NHS West Norfolk ",2327.601981387053,140.75978125913269,6.0474162844307178E-2]
[null,190,"Norwich",210644.42735295714,null,null,null,13515.867036460095,6.4164370291234063E-2,null,null,190,"NHS West Suffolk ",3281.7267572758997,189.79407362741892,5.7833600316244321E-2]
[null,191,"Nottingham",210644.42735295714,null,null,null,13515.867036460095,6.4164370291234063E-2,null,null,191,"NHS Wigan Borough ",4234.8597805208929,302.10283231643422,7.133715116283619E-2]
[null,192,"Nuneaton and Bedworth",210644.42735295714,null,null,null,13515.867036460095,6.4164370291234063E-2,null,null,192,"NHS Wiltshire ",6362.0257832845673,272.52027482454719,4.2835455892140578E-2]
[null,193,"Oadby and Wigston",210644.42735295714,null,null,null,13515.867036460095,6.4164370291234063E-2,null,null,193,"NHS Wirral ",4345.0197681592381,332.05496456937311,7.6421968664609263E-2]
[null,194,"Oldham",93752.542262674062,null,null,null,7182.5312680061188,{"$f":"H1477/D1477","v":7.6611589346369316E-2},null,null,194,"NHS Wolverhampton ",3397.5290069479379,242.80953105573394,{"$f":"O1477/N1477","v":7.1466507146573016E-2}]
[null,195,"Oxford",117032.60591674724,null,null,null,6965.7596910107022,5.9519820450429785E-2,null,null,195,"NHS Wyre Forest ",1545.3805618738729,66.883035133864183,4.3279329884131724E-2]
[null,196,"Pendle",93752.542262674062,null,null,null,7182.5312680061188,7.6611589346369316E-2]
[null,197,"Peterborough",210644.42735295714,null,null,null,13515.867036460095,6.4164370291234063E-2]
[null,198,"Plymouth",58008.376879350857,null,null,null,3575.9473523568668,6.1645361320733498E-2]
[null,199,"Portsmouth",117032.60591674724,null,null,null,6965.7596910107022,5.9519820450429785E-2]
[null,200,"Preston",93752.542262674062,null,null,null,7182.5312680061188,7.6611589346369316E-2]
[null,201,"Reading",117032.60591674724,null,null,null,6965.7596910107022,5.9519820450429785E-2]
[null,202,"Redbridge",122601.24426847551,null,null,null,8159.5045929643848,6.655319561925882E-2]
[null,203,"Redcar and Cleveland",41896.244950191322,null,null,null,3089.1767213295875,7.3733976040148211E-2]
[null,204,"Redditch",210644.42735295714,null,null,null,13515.867036460095,6.4164370291234063E-2]
[null,205,"Reigate and Banstead",117032.60591674724,null,null,null,6965.7596910107022,5.9519820450429785E-2]
[null,206,"Ribble Valley",93752.542262674062,null,null,null,7182.5312680061188,7.6611589346369316E-2]
[null,207,"Richmond upon Thames",122601.24426847551,null,null,null,8159.5045929643848,6.655319561925882E-2]
[null,208,"Richmondshire",72095.65050623464,null,null,null,5438.5914922481916,7.5435778081756499E-2]
[null,209,"Rochdale",93752.542262674062,null,null,null,7182.5312680061188,7.6611589346369316E-2]
[null,210,"Rochford",210644.42735295714,null,null,null,13515.867036460095,6.4164370291234063E-2]
[null,211,"Rossendale",93752.542262674062,null,null,null,7182.5312680061188,7.6611589346369316E-2]
[null,212,"Rother",117032.60591674724,null,null,null,6965.7596910107022,5.9519820450429785E-2]
[null,213,"Rotherham",72095.65050623464,null,null,null,5438.5914922481916,7.5435778081756499E-2]
[null,214,"Rugby",210644.42735295714,null,null,null,13515.867036460095,6.4164370291234063E-2]
[null,215,"Runnymede",117032.60591674724,null,null,null,6965.7596910107022,5.9519820450429785E-2]
[null,216,"Rushcliffe",210644.42735295714,null,null,null,13515.867036460095,6.4164370291234063E-2]
[null,217,"Rushmoor",117032.60591674724,null,null,null,6965.7596910107022,5.9519820450429785E-2]
[null,218,"Rutland",210644.42735295714,null,null,null,13515.867036460095,6.4164370291234063E-2]
[null,219,"Ryedale",72095.65050623464,null,null,null,5438.5914922481916,7.5435778081756499E-2]
[null,220,"Salford",93752.542262674062,null,null,null,7182.5312680061188,7.6611589346369316E-2]
[null,221,"Sandwell",210644.42735295714,null,null,null,13515.867036460095,6.4164370291234063E-2]
[null,222,"Scarborough",72095.65050623464,null,null,null,5438.5914922481916,7.5435778081756499E-2]
[null,223,"Sedgemoor",58008.376879350857,null,null,null,3575.9473523568668,6.1645361320733498E-2]
[null,224,"Sefton",93752.542262674062,null,null,null,7182.5312680061188,7.6611589346369316E-2]
[null,225,"Selby",72095.65050623464,null,null,null,5438.5914922481916,7.5435778081756499E-2]
[null,226,"Sevenoaks",117032.60591674724,null,null,null,6965.7596910107022,5.9519820450429785E-2]
[null,227,"Sheffield",72095.65050623464,null,null,null,5438.5914922481916,7.5435778081756499E-2]
[null,228,"Shropshire",210644.42735295714,null,null,null,13515.867036460095,6.4164370291234063E-2]
[null,229,"Slough",117032.60591674724,null,null,null,6965.7596910107022,5.9519820450429785E-2]
[null,230,"Solihull",210644.42735295714,null,null,null,13515.867036460095,6.4164370291234063E-2]
[null,231,"Somerset West and Taunton",58008.376879350857,null,null,null,3575.9473523568668,6.1645361320733498E-2]
[null,232,"South Bucks",117032.60591674724,null,null,null,6965.7596910107022,5.9519820450429785E-2]
[null,233,"South Cambridgeshire",210644.42735295714,null,null,null,13515.867036460095,6.4164370291234063E-2]
[null,234,"South Derbyshire",210644.42735295714,null,null,null,13515.867036460095,6.4164370291234063E-2]
[null,235,"South Gloucestershire",58008.376879350857,null,null,null,3575.9473523568668,6.1645361320733498E-2]
[null,236,"South Hams",58008.376879350857,null,null,null,3575.9473523568668,6.1645361320733498E-2]
[null,237,"South Holland",210644.42735295714,null,null,null,13515.867036460095,6.4164370291234063E-2]
[null,238,"South Kesteven",210644.42735295714,null,null,null,13515.867036460095,6.4164370291234063E-2]
[null,239,"South Lakeland",93752.542262674062,null,null,null,7182.5312680061188,7.6611589346369316E-2]
[null,240,"South Norfolk",210644.42735295714,null,null,null,13515.867036460095,6.4164370291234063E-2]
[null,241,"South Northamptonshire",210644.42735295714,null,null,null,13515.867036460095,6.4164370291234063E-2]
[null,242,"South Oxfordshire",117032.60591674724,null,null,null,6965.7596910107022,5.9519820450429785E-2]
[null,243,"South Ribble",93752.542262674062,null,null,null,7182.5312680061188,7.6611589346369316E-2]
[null,244,"South Somerset",58008.376879350857,null,null,null,3575.9473523568668,6.1645361320733498E-2]
[null,245,"South Staffordshire",210644.42735295714,null,null,null,13515.867036460095,6.4164370291234063E-2]
[null,246,"South Tyneside",41896.244950191322,null,null,null,3089.1767213295875,7.3733976040148211E-2]
[null,247,"Southampton",117032.60591674724,null,null,null,6965.7596910107022,5.9519820450429785E-2]
[null,248,"Southend-on-Sea",210644.42735295714,null,null,null,13515.867036460095,6.4164370291234063E-2]
[null,249,"Southwark",122601.24426847551,null,null,null,8159.5045929643848,6.655319561925882E-2]
[null,250,"Spelthorne",117032.60591674724,null,null,null,6965.7596910107022,5.9519820450429785E-2]
[null,251,"St Albans",210644.42735295714,null,null,null,13515.867036460095,6.4164370291234063E-2]
[null,252,"St. Helens",93752.542262674062,null,null,null,7182.5312680061188,7.6611589346369316E-2]
[null,253,"Stafford",210644.42735295714,null,null,null,13515.867036460095,6.4164370291234063E-2]
[null,254,"Staffordshire Moorlands",210644.42735295714,null,null,null,13515.867036460095,6.4164370291234063E-2]
[null,255,"Stevenage",210644.42735295714,null,null,null,13515.867036460095,6.4164370291234063E-2]
[null,256,"Stockport",93752.542262674062,null,null,null,7182.5312680061188,7.6611589346369316E-2]
[null,257,"Stockton-on-Tees",41896.244950191322,null,null,null,3089.1767213295875,7.3733976040148211E-2]
[null,258,"Stoke-on-Trent",210644.42735295714,null,null,null,13515.867036460095,{"$f":"H1541/D1541","v":6.4164370291234063E-2}]
[null,259,"Stratford-on-Avon",210644.42735295714,null,null,null,13515.867036460095,6.4164370291234063E-2]
[null,260,"Stroud",58008.376879350857,null,null,null,3575.9473523568668,6.1645361320733498E-2]
[null,261,"Sunderland",41896.244950191322,null,null,null,3089.1767213295875,7.3733976040148211E-2]
[null,262,"Surrey Heath",117032.60591674724,null,null,null,6965.7596910107022,5.9519820450429785E-2]
[null,263,"Sutton",122601.24426847551,null,null,null,8159.5045929643848,6.655319561925882E-2]
[null,264,"Swale",117032.60591674724,null,null,null,6965.7596910107022,5.9519820450429785E-2]
[null,265,"Swindon",58008.376879350857,null,null,null,3575.9473523568668,6.1645361320733498E-2]
[null,266,"Tameside",93752.542262674062,null,null,null,7182.5312680061188,7.6611589346369316E-2]
[null,267,"Tamworth",210644.42735295714,null,null,null,13515.867036460095,6.4164370291234063E-2]
[null,268,"Tandridge",117032.60591674724,null,null,null,6965.7596910107022,5.9519820450429785E-2]
[null,269,"Teignbridge",58008.376879350857,null,null,null,3575.9473523568668,6.1645361320733498E-2]
[null,270,"Telford and Wrekin",210644.42735295714,null,null,null,13515.867036460095,6.4164370291234063E-2]
[null,271,"Tendring",210644.42735295714,null,null,null,13515.867036460095,6.4164370291234063E-2]
[null,272,"Test Valley",117032.60591674724,null,null,null,6965.7596910107022,5.9519820450429785E-2]
[null,273,"Tewkesbury",58008.376879350857,null,null,null,3575.9473523568668,6.1645361320733498E-2]
[null,274,"Thanet",117032.60591674724,null,null,null,6965.7596910107022,5.9519820450429785E-2]
[null,275,"Three Rivers",210644.42735295714,null,null,null,13515.867036460095,6.4164370291234063E-2]
[null,276,"Thurrock",210644.42735295714,null,null,null,13515.867036460095,6.4164370291234063E-2]
[null,277,"Tonbridge and Malling",117032.60591674724,null,null,null,6965.7596910107022,5.9519820450429785E-2]
[null,278,"Torbay",58008.376879350857,null,null,null,3575.9473523568668,6.1645361320733498E-2]
[null,279,"Torridge",58008.376879350857,null,null,null,3575.9473523568668,6.1645361320733498E-2]
[null,280,"Tower Hamlets",122601.24426847551,null,null,null,8159.5045929643848,6.655319561925882E-2]
[null,281,"Trafford",93752.542262674062,null,null,null,7182.5312680061188,7.6611589346369316E-2]
[null,282,"Tunbridge Wells",117032.60591674724,null,null,null,6965.7596910107022,5.9519820450429785E-2]
[null,283,"Uttlesford",210644.42735295714,null,null,null,13515.867036460095,6.4164370291234063E-2]
[null,284,"Vale of White Horse",117032.60591674724,null,null,null,6965.7596910107022,5.9519820450429785E-2]
[null,285,"Wakefield",72095.65050623464,null,null,null,5438.5914922481916,7.5435778081756499E-2]
[null,286,"Walsall",210644.42735295714,null,null,null,13515.867036460095,6.4164370291234063E-2]
[null,287,"Waltham Forest",122601.24426847551,null,null,null,8159.5045929643848,6.655319561925882E-2]
[null,288,"Wandsworth",122601.24426847551,null,null,null,8159.5045929643848,6.655319561925882E-2]
[null,289,"Warrington",93752.542262674062,null,null,null,7182.5312680061188,7.6611589346369316E-2]
[null,290,"Warwick",210644.42735295714,null,null,null,13515.867036460095,6.4164370291234063E-2]
[null,291,"Watford",210644.42735295714,null,null,null,13515.867036460095,6.4164370291234063E-2]
[null,292,"Waverley",117032.60591674724,null,null,null,6965.7596910107022,5.9519820450429785E-2]
[null,293,"Wealden",117032.60591674724,null,null,null,6965.7596910107022,5.9519820450429785E-2]
[null,294,"Wellingborough",210644.42735295714,null,null,null,13515.867036460095,6.4164370291234063E-2]
[null,295,"Welwyn Hatfield",210644.42735295714,null,null,null,13515.867036460095,6.4164370291234063E-2]
[null,296,"West Berkshire",117032.60591674724,null,null,null,6965.7596910107022,5.9519820450429785E-2]
[null,297,"West Devon",58008.376879350857,null,null,null,3575.9473523568668,6.1645361320733498E-2]
[null,298,"West Lancashire",93752.542262674062,null,null,null,7182.5312680061188,7.6611589346369316E-2]
[null,299,"West Lindsey",210644.42735295714,null,null,null,13515.867036460095,6.4164370291234063E-2]
[null,300,"West Oxfordshire",117032.60591674724,null,null,null,6965.7596910107022,5.9519820450429785E-2]
[null,301,"West Suffolk",210644.42735295714,null,null,null,13515.867036460095,6.4164370291234063E-2]
[null,302,"Westminster",122601.24426847551,null,null,null,8159.5045929643848,6.655319561925882E-2]
[null,303,"Wigan",93752.542262674062,null,null,null,7182.5312680061188,7.6611589346369316E-2]
[null,304,"Wiltshire",58008.376879350857,null,null,null,3575.9473523568668,6.1645361320733498E-2]
[null,305,"Winchester",117032.60591674724,null,null,null,6965.7596910107022,5.9519820450429785E-2]
[null,306,"Windsor and Maidenhead",117032.60591674724,null,null,null,6965.7596910107022,5.9519820450429785E-2]
[null,307,"Wirral",93752.542262674062,null,null,null,7182.5312680061188,7.6611589346369316E-2]
[null,308,"Woking",117032.60591674724,null,null,null,6965.7596910107022,5.9519820450429785E-2]
[null,309,"Wokingham",117032.60591674724,null,null,null,6965.7596910107022,5.9519820450429785E-2]
[null,310,"Wolverhampton",210644.42735295714,null,null,null,13515.867036460095,6.4164370291234063E-2]
[null,311,"Worcester",210644.42735295714,null,null,null,13515.867036460095,6.4164370291234063E-2]
[null,312,"Worthing",117032.60591674724,null,null,null,6965.7596910107022,5.9519820450429785E-2]
[null,313,"Wychavon",210644.42735295714,null,null,null,13515.867036460095,6.4164370291234063E-2]
[null,314,"Wycombe",117032.60591674724,null,null,null,6965.7596910107022,5.9519820450429785E-2]
[null,315,"Wyre",93752.542262674062,null,null,null,7182.5312680061188,7.6611589346369316E-2]
[null,316,"Wyre Forest",210644.42735295714,null,null,null,13515.867036460095,6.4164370291234063E-2]
[null,317,"York",72095.65050623464,null,null,null,5438.5914922481916,7.5435778081756499E-2]
[]
[]
[null,null,"Relative Risk Matrix (65+ vs. 0+)"]
[null,null,null,"Isolated",null,null,null,"Not Isolated"]
[null,null,"Population (0+)",49927,null,null,null,695607]
[null,null,"Population (65+)",6840,null,null,null,160423]
[null,null,null,null,null,null,"RR",{"$f":"(D1606/(D1606+H1606))/(D1605/(D1605+H1605))","v":0.61064415281611251}]
[]
[null,null,"Relative Risk Matrix (80+ vs. 0+)"]
[null,null,null,"Isolated",null,null,null,"Not Isolated"]
[null,null,"Population (0+)",49927,null,null,null,695607]
[null,null,"Population (80+)",2857,null,null,null,44330.5]
[null,null,null,null,null,null,"RR",{"$f":"(D1612/(D1612+H1612))/(D1611/(D1611+H1611))","v":0.90409747126168449}]
[]
["Eligbile population: Help at home; Reablement"]
[]
[null,null,"Intervention:",null,"Reablement"]
[]
[null,null,"Summary: ",null,"In-built model population estimated by establishing the % of people who are unable to cope and need help with day to day activities. Measured as requiring help with at least one item on either ADL or IADL measures"]
[]
[null,null,"Data availability:",null,"Prevalence data: ",null,null,null,"Only national"]
[null,null,null,null,"Prevalence by age",null,null,null,"Estimated using relative risk for national data (health survey for england) "]
[]
[null,null,"Eligible population: "]
[null,null,null,null,null,null,null,"65+","80+","Selection(age)"]
[null,null,null,null,"National",null,null,{"$f":"I1633","v":0.37527311679943509},{"$f":"I1634","v":0.58737963701703255},{"$f":"IF($J$266=1,H1626,I1626)","v":0.37527311679943509}]
[null,null,null,null,"LA",null,null,{"$f":"I1633","v":0.37527311679943509},{"$f":"I1634","v":0.58737963701703255},{"$f":"IF($J$266=1,H1627,I1627)","v":0.37527311679943509}]
[null,null,null,null,"CCG",null,null,{"$f":"I1633","v":0.37527311679943509},{"$f":"I1634","v":0.58737963701703255},0.37527311679943509]
[null,null,null,null,"STP",null,null,{"$f":"I1633","v":0.37527311679943509},{"$f":"I1634","v":0.58737963701703255},0.37527311679943509]
[]
[]
[null,null,null,"1+ ADL or IADL",null,null,null,"Population","% (1+ ADL/IADL)"]
[null,null,"England (65+)",3820000,null,null,null,10179253,{"$f":"D1633/H1633","v":0.37527311679943509}]
[null,null,"England (85+)",null,null,null,null,null,{"$f":"I1633*H1641","v":0.58737963701703255}]
[]
[]
[null,null,"Relative Risk Matrix (65+ vs. 80+)"]
[null,null,null,">=1 ADL",null,null,null,"No ADLO"]
[null,null,"65+",0.27347886030000002,null,null,null,{"$f":"1-D1639","v":0.72652113969999998}]
[null,null,"80+",0.42805068229999998,null,null,null,{"$f":"1-D1640","v":0.57194931770000002}]
[null,null,null,null,null,null,"RR",{"$f":"(D1640/(D1640+H1640))/(D1639/(D1639+H1639))","v":1.5652057414252722}]

{"sheet":"2c) Intervention costs","index":7,"n_rows":477,"n_cols":11,"rows_kept":477,"cut":false,"hidden":false,"merged":[[385,7,385,10],[370,6,370,7],[427,7,427,8],[371,6,371,7],[372,6,372,7],[373,6,373,7],[408,7,408,9],[386,9,386,10],[387,9,387,10],[388,9,388,10],[389,9,389,10],[390,9,390,10],[391,9,391,10],[408,6,409,6],[385,6,386,6]]}
[]
[]
[]
[]
[]
[]
[]
[]
[]
[]
[]
[null,null,null,null,null,null,"Selected intervention:"]
[]
[]
[null,null,null,null,null,null,"Cost for implementation of the intervention:"]
[]
[null,null,null,null,null,null,"Resource","Cost per person","Population cost"]
[null,null,null,null,null,null,"Facilitator training costs",{"$f":"K311","v":0.65409050620668097},{"$f":"H18*TotalPop","v":459.26834075200873}]
[null,null,null,null,null,null,"Capital expenditure",{"$f":"K317","v":0.35829161486480615},{"$f":"H19*TotalPop","v":251.57374079409396}]
[null,null,null,null,null,null,"Indirect costs",{"$f":"K323","v":2.7377764590998472},{"$f":"H20*TotalPop","v":1922.3242652040399}]
[null,null,null,null,null,null,"Session costs",{"$f":"K330","v":15.887039046718533},{"$f":"H21*TotalPop","v":11155.052692575326}]
[null,null,null,null,null,null,"Total",{"$f":"SUM(H18:H21)","v":19.637197626889868},{"$f":"SUM(I18:I21)","v":13788.219039325468}]
[]
[]
[]
[]
[]
[]
[]
[]
[]
[]
[null,null,null,null,null,null,"Cost for implementation of the intervention:"]
[]
[null,null,null,null,null,null,"Resource","Cost per person","Population Cost"]
[null,null,null,null,null,null,"Practical home help",{"$f":"J343","v":722.39049999999997},{"$f":"H36*TotalPop","v":507225.0447940001}]
[null,null,null,null,null,null,"Befriending service",{"$f":"J344","v":89.472899999999981},{"$f":"H37*TotalPop","v":62823.217789199996}]
[null,null,null,null,null,null,"Welfare benefits advice ",{"$f":"J345","v":77.19},{"$f":"H38*TotalPop","v":54198.804120000008}]
[null,null,null,null,null,null,"Total",{"$f":"SUM(H36:H38)","v":889.05340000000001},{"$f":"H39*TotalPop","v":624247.06670320011}]
[]
[]
[]
[]
[]
[]
[]
[]
[]
[]
[]
[null,null,null,null,null,null,"Cost for implementation of the intervention:"]
[]
[null,null,null,null,null,null,"Resource","Cost per person","Population Cost"]
[null,null,null,null,null,null,"Befriending service",{"$f":"J359","v":99.84},{"$f":"H54*TotalPop","v":70102.456320000012}]
[null,null,null,null,null,null,"Total",{"$f":"SUM(H54:H54)","v":99.84},{"$f":"H55*TotalPop","v":70102.456320000012}]
[]
[]
[]
[]
[]
[]
[]
[]
[]
[]
[]
[]
[]
[null,null,null,null,null,null,"Cost for implementation of the intervention:"]
[]
[null,null,null,null,null,null,"Resource: Training & Supervision","Cost per person","Population Cost"]
[null,null,null,null,null,null,"WHELD Champion",{"$f":"J372","v":1488.79},{"$f":"H72*TotalPop","v":1045350.9209200002}]
[null,null,null,null,null,null,"WHELD Therapist",{"$f":"J373","v":1331.54},{"$f":"H73*TotalPop","v":934938.14792000013}]
[null,null,null,null,null,null,"Total",{"$f":"SUM(H72:H73)","v":2820.33},{"$f":"H74*TotalPop","v":1980289.0688400003}]
[]
[]
[]
[]
[]
[]
[]
[]
[]
[]
[]
[]
[null,null,null,null,null,null,"Cost for implementation of the intervention:"]
[]
[null,null,null,null,null,null,"Resource","Cost per person","Population Cost"]
[null,null,null,null,null,null,"Physiotherapist (staff cost)",{"$f":"J388","v":847.43468878829196},{"$f":"H90*TotalPop","v":595024.5718633217}]
[null,null,null,null,null,null,"Dietician (staff cost)",{"$f":"J389","v":41.338277501867907},29025.588871381551]
[null,null,null,null,null,null,"Respiratory nurse (staff cost)",{"$f":"J390","v":103.34569375466975},72563.972178453871]
[null,null,null,null,null,null,"Diet nutrition (material cost)",{"$f":"J391","v":238.93524396079658},167767.90367658544]
[null,null,null,null,null,null,"Total (undiscounted) ",{"$f":"SUM(H90:H93)","v":1231.053904005626},864382.03658974241]
[null,null,null,null,null,null,"Total (discounted)",{"$f":"H94/2+(H94/2)/(1+H97)","v":1210.2389829234053},849766.88138170331]
[]
[null,null,null,null,null,null,"Discount factor",3.5000000000000003E-2]
[]
[]
[]
[]
[]
[]
[]
[null,null,null,null,null,null,"Cost for implementation of the intervention:"]
[]
[null,null,null,null,null,null,"Resource","Cost per person","Population cost"]
[null,null,null,null,null,null,"Grants to providers",{"$f":"K411","v":328.52922815612118},{"$f":"H108*TotalPop","v":230676.14049136423}]
[null,null,null,null,null,null,"Additional support grants",{"$f":"K412","v":65.660804649098068},{"$f":"H109*TotalPop","v":46103.602662754922}]
[null,null,null,null,null,null,"VAR salaries and overheads",{"$f":"K413","v":314.42707176954616},{"$f":"H110*TotalPop","v":220774.33958884334}]
[null,null,null,null,null,null,"Total",{"$f":"SUM(H108:H110)","v":708.61710457476534},{"$f":"H111*TotalPop","v":497554.0827429624}]
[]
[]
[]
[]
[]
[]
[]
[]
[]
[]
[null,null,null,null,null,null,"Cost for implementation of the intervention:"]
[]
[null,null,null,null,null,null,"Resource","Cost per person","Population cost"]
[null,null,null,null,null,null,"Training, supervision & paperwork",{"$f":"I430*H426","v":24.453313500155907},{"$f":"H125*TotalPop","v":17169.845167507472}]
[null,null,null,null,null,null,"Delivery of health coaching",{"$f":"SUM(I432:I438)*H426","v":57.232214359197691},{"$f":"H126*TotalPop","v":40185.484847881948}]
[null,null,null,null,null,null,"Total",{"$f":"SUM(H125:H126)","v":81.685527859353599},{"$f":"H127*TotalPop","v":57355.330015389423}]
[]
[]
[]
[]
[]
[]
[]
[]
[]
[]
[]
[]
[]
[null,null,null,null,null,null,"Cost for implementation of the intervention:"]
[]
[null,null,null,null,null,null,"Resource","Cost per person","Population cost"]
[null,null,null,null,null,null,"BELLA delivery costs",{"$f":"J452","v":411.10139075136755},{"$f":"H144*TotalPop","v":288654.0193132913}]
[]
[]
[]
[]
[]
[]
[]
[]
[]
[]
[]
[]
[]
[]
[null,null,null,null,null,null,"Cost for implementation of the intervention:"]
[]
[null,null,null,null,null,null,"Resource","Cost per person","Population cost"]
[null,null,null,null,null,null,"Reablement service",{"$f":"J465","v":1647.8777253517574},{"$f":"H162*TotalPop","v":1157054.0491002859}]
[]
[]
[]
[]
[]
[]
[]
[]
[]
[]
[]
[]
[]
[]
[null,null,null,null,null,null,"Cost for implementation of the intervention:"]
[]
[null,null,null,null,null,null,"Resource Items","Cost per person","Population cost"]
[null,null,null,null,null,null,"Resource item #1 (or Total Costs)",null,{"$f":"IF(H180=\"\",\"\",H180*TotalPop)","v":""}]
[null,null,null,null,null,null,{"$f":"IF(G180=\"Resource item #1 (or Total Costs)\",\"Resource item #2\",\"\")","v":"Resource item #2"},null,""]
[null,null,null,null,null,null,{"$f":"IF(G181=\"Resource item #2\",\"Resource item #3\",\"\")","v":"Resource item #3"},null,""]
[null,null,null,null,null,null,{"$f":"IF(G182=\"Resource item #3\",\"Resource item #4\",\"\")","v":"Resource item #4"},null,""]
[null,null,null,null,null,null,{"$f":"IF(G183=\"Resource item #4\",\"Resource item #5\",\"\")","v":"Resource item #5"},null,""]
[null,null,null,null,null,null,{"$f":"IF(G184=\"Resource item #5\",\"Resource item #6\",\"\")","v":"Resource item #6"},null,{"$f":"IF(H185=\"\",\"\",H185*TotalPop)","v":""}]
[null,null,null,null,null,null,{"$f":"IF(G185=\"Resource item #6\",\"Resource item #7\",\"\")","v":"Resource item #7"},null,""]
[null,null,null,null,null,null,{"$f":"IF(G186=\"Resource item #7\",\"Resource item #8\",\"\")","v":"Resource item #8"},null,""]
[null,null,null,null,null,null,{"$f":"IF(G187=\"Resource item #8\",\"Resource item #9\",\"\")","v":"Resource item #9"},null,""]
[null,null,null,null,null,null,{"$f":"IF(G188=\"Resource item #9\",\"Resource item #10\",\"\")","v":"Resource item #10"},null,""]
[null,null,null,null,null,null,"Total",{"$f":"IF(H180=\"\",\"\",SUM(H180:H189))","v":""},{"$f":"IF(H190=\"\",\"\",H190*TotalPop)","v":""}]
[]
[]
[]
[]
[]
[]
[]
[]
[]
[]
[]
[]
[]
[]
[]
[]
[]
[]
[]
[]
[]
[]
[]
[]
[]
[]
[]
[]
[]
[]
[]
[]
[]
[]
[]
[]
[]
[]
[]
[]
[]
[]
[]
[]
[]
[]
[]
[]
[]
[]
[]
[]
[]
[]
[]
[]
[]
[]
[]
[]
[]
[]
[]
[]
[]
[]
[]
[]
[]
[]
[]
[]
[]
[]
[]
[]
[]
[]
[]
[]
[]
[]
[]
[]
[]
[]
[]
[]
[]
[]
[]
[]
[]
[]
[]
[]
[]
[]
[]
[]
[]
[]
[]
[]
[]
[]
[]
[]
[]
[null,null,null,null,null,null,"COST BREAKDOWN"]
[]
[null,null,null,null,null,null,"Selected intervention:"]
[]
[null,null,null,null,null,null,"Community Singing:"]
[null,null,null,null,null,null,"Facilitator training","Unit cost","No. sessions per unit","Cost per session","Cost per participant"]
[null,null,null,null,null,null,"Facilitator wage",233.90133661440001,80,{"$f":"H306/I306","v":2.92376670768},{"$f":"(J306/131)*14","v":0.31246361761465646}]
[null,null,null,null,null,null,"Facilitator expenses",109.15395708672,80,{"$f":"H307/I307","v":1.3644244635839999},{"$f":"(J307/131)*14","v":0.14581635488683969}]
[null,null,null,null,null,null,"Trainer",311.86844881920001,{"$f":"80*5","v":400},{"$f":"H308/I308","v":0.77967112204800004},{"$f":"(J308/131)*14","v":8.3323631363908413E-2}]
[null,null,null,null,null,null,"Trainer expenses",109.15395708672,{"$f":"80*5","v":400},{"$f":"H309/I309","v":0.2728848927168},{"$f":"(J309/131)*14","v":2.9163270977367942E-2}]
[null,null,null,null,null,null,"Venue hire",311.86844881920001,{"$f":"80*5","v":400},{"$f":"H310/I310","v":0.77967112204800004},{"$f":"(J310/131)*14","v":8.3323631363908413E-2}]
[null,null,null,null,null,null,null,null,null,"TOTAL",{"$f":"SUM(K306:K310)","v":0.65409050620668097}]
[]
[null,null,null,null,null,null,"Capital expenditure","Unit cost","No. sessions per unit","Cost per session","Cost per participant"]
[null,null,null,null,null,null,"Hand chimes",519.78074803200002,{"$f":"80*5","v":400},{"$f":"H314/I314","v":1.29945187008},{"$f":"(J314/131)*14","v":0.13887271893984734}]
[null,null,null,null,null,null,"Keyboard",727.69304724480003,{"$f":"80*5","v":400},{"$f":"H315/I315","v":1.819232618112},{"$f":"(J315/131)*14","v":0.19442180651578628}]
[null,null,null,null,null,null,"Song sheets",37.424213858304007,{"$f":"80*2","v":160},{"$f":"H316/I316","v":0.23390133661440005},{"$f":"(J316/131)*14","v":2.4997089409172522E-2}]
[null,null,null,null,null,null,null,null,null,"TOTAL",{"$f":"SUM(K314:K316)","v":0.35829161486480615}]
[]
[null,null,null,null,null,null,"Indirect costs","Unit cost","No. sessions per unit","Cost per session","Cost per participant"]
[null,null,null,null,null,null,"Advertising",31.186844881919999,14,{"$f":"H320/I320","v":2.2276317772800001},{"$f":"(J320/131)*14","v":0.23806751818259544}]
[null,null,null,null,null,null,"Management",140.34080196863997,14,{"$f":"H321/I321","v":10.024342997759998},{"$f":"(J321/131)*14","v":1.0713038318216792}]
[null,null,null,null,null,null,"Administration",187.12106929151997,14,{"$f":"H322/I322","v":13.365790663679999},{"$f":"(J322/131)*14","v":1.4284051090955723}]
[null,null,null,null,null,null,null,null,null,"TOTAL",{"$f":"SUM(K320:K322)","v":2.7377764590998472}]
[]
[null,null,null,null,null,null,"Session costs","Unit cost","No. sessions per unit","Cost per session","Cost per participant"]
[null,null,null,null,null,null,"Facilitator",77.967112204800003,1,{"$f":"H326/I326","v":77.967112204800003},{"$f":"(J326/131)*14","v":8.3323631363908408}]
[null,null,null,null,null,null,"Facilitator expenses",36.38465236223999,1,{"$f":"H327/I327","v":36.38465236223999},{"$f":"(J327/131)*14","v":3.888436130315724}]
[null,null,null,null,null,null,"Venue hire",31.186844881919999,1,{"$f":"H328/I328","v":31.186844881919999},{"$f":"(J328/131)*14","v":3.3329452545563356}]
[null,null,null,null,null,null,"Refreshments",3.1186844881919997,1,{"$f":"H329/I329","v":3.1186844881919997},{"$f":"(J329/131)*14","v":0.33329452545563359}]
[null,null,null,null,null,null,null,null,null,"TOTAL",{"$f":"SUM(K326:K329)","v":15.887039046718533}]
[]
[]
[]
[]
[]
[]
[]
[]
[]
[]
[null,null,null,null,null,null,"Help at home scheme:"]
[null,null,null,null,null,null,null,"Unit cost\n (per hour)","No of units ","Cost per participant"]
[null,null,null,null,null,null,"Practical home help ",10.79,66.95,{"$f":"H343*I343","v":722.39049999999997}]
[null,null,null,null,null,null,"Befriending ",10.45,8.5619999999999994,{"$f":"H344*I344","v":89.472899999999981}]
[null,null,null,null,null,null,"Welfare benefit advice","Not Stated","Unknown",77.19]
[null,null,null,null,null,null,null,null,"TOTAL",{"$f":"SUM(J343:J345)","v":889.05340000000001}]
[]
[]
[]
[]
[]
[]
[]
[]
[]
[]
[null,null,null,null,null,null,"Befriending:"]
[null,null,null,null,null,null,"Resource Item","Unit Costs","No of units","Cost per participant"]
[null,null,null,null,null,null,"Befriending service",8.32,12,{"$f":"H359*I359","v":99.84}]
[]
[]
[]
[]
[]
[]
[]
[]
[]
[]
[null,null,null,null,null,null,"Dementia (nursing homes):"]
[null,null,null,null,null,null,"Resource Item",null,"Cost \n(per nursing home)","Cost \n(per person)"]
[null,null,null,null,null,null,"WHELD Champion (training & supervision)",null,4734.16,1488.79]
[null,null,null,null,null,null,"WHELD Therapist (training and supervision) ",null,4234.13,1331.54]
[null,null,null,null,null,null,"TOTAL COSTS",null,{"$f":"SUM(I372:I373)","v":8968.2900000000009},{"$f":"SUM(J372:J373)","v":2820.33}]
[]
[]
[]
[]
[]
[]
[]
[]
[]
[]
[null,null,null,null,null,null,"Hospital discharge support: "]
[null,null,null,null,null,null,"Resource Item","Mean cost per participant "]
[null,null,null,null,null,null,null,"Intercom","Usual Care","Difference "]
[null,null,null,null,null,null,"Physiotherapist ",1066.5275595481919,219.09287075989991,{"$f":"H388-I388","v":847.43468878829196}]
[null,null,null,null,null,null,"Dietician ",57.873588502615071,16.535311000747168,{"$f":"H389-I389","v":41.338277501867907}]
[null,null,null,null,null,null,"Respiratory nurse",121.53453585549164,18.18884210082188,{"$f":"H390-I390","v":103.34569375466975}]
[null,null,null,null,null,null,"Diet nutrition ",264.56497601195468,25.629732051158108,{"$f":"H391-I391","v":238.93524396079658}]
[null,null,null,null,null,null,"TOTAL COSTS  ",{"$f":"SUM(H388:H391)","v":1510.5006599182534},{"$f":"SUM(I388:I391)","v":279.44675591262705},{"$f":"SUM(J388:K391)","v":1231.053904005626}]
[]
[]
[]
[]
[]
[]
[]
[]
[]
[null,null,null,null,null,null,"Social prescribing: "]
[null,null,null,null,null,null,"Population receiving intervention:"]
[null,null,null,null,null,null,null,"non VCS","VCS","Combined"]
[null,null,null,null,null,null,"Year 1",208,217,{"$f":"SUM(H405:I405)","v":425}]
[null,null,null,null,null,null,"Year 2",281,901,{"$f":"SUM(H406:I406)","v":1182}]
[]
[null,null,null,null,null,null,"Intervention Costs:"]
[null,null,null,null,null,null,"Resource Item","Total costs for all participants",null,null,"Cost per \nparticipant"]
[null,null,null,null,null,null,null,"Year 1","Year 2","Year 1 & 2","Year 1  & 2"]
[null,null,null,null,null,null,"Grants to providers",322505.01225081843,212631.90840493058,{"$f":"H411+I411/(1+$H$415)","v":527946.46964688669},{"$f":"J411/(SUM($J$405:$J$406))","v":328.52922815612118}]
[null,null,null,null,null,null,"Additional Support grants",12040.748633716805,96747.830192692214,{"$f":"H412+I412/(1+$H$415)","v":105516.9130711006},{"$f":"J412/(SUM($J$405:$J$406))","v":65.660804649098068}]
[null,null,null,null,null,null,"Salaries & Overheads",231069.07422407158,283812.76316342468,{"$f":"H413+I413/(1+$H$415)","v":505284.30433366064},{"$f":"J413/(SUM($J$405:$J$406))","v":314.42707176954616}]
[null,null,null,null,null,null,"Aggregated costs",{"$f":"SUM(H411:H413)","v":565614.83510860684},{"$f":"SUM(I411:I413)","v":593192.5017610474},{"$f":"SUM(J411:J413)","v":1138747.6870516478},{"$f":"SUM(K411:K413)","v":708.61710457476534}]
[null,null,null,null,null,null,"Discount factor ",3.5000000000000003E-2]
[]
[]
[]
[]
[]
[]
[]
[]
[null,null,null,null,null,null,"Interprofessional working (health coaching):"]
[null,null,null,null,null,null,null,"% of full course"]
[null,null,null,null,null,null,"Uptake of intervention",0.53480000000000005]
[]
[null,null,null,null,null,null,null,"Mean per participant "]
[null,null,null,null,null,null,"Resource Item: ","Duration (hours)","Cost"]
[null,null,null,null,null,null,"Training, supervision & paperwork","N/A",45.724221204480003]
[null,null,null,null,null,null,"Intervention delivery: (full course)"]
[null,null,null,null,null,null,"     Call 1",{"$f":"40/60","v":0.66666666666666663},22.748778823679999]
[null,null,null,null,null,null,"     Call 2",0.5,17.2058245632]
[null,null,null,null,null,null,"     Call 3",{"$f":"28/60","v":0.46666666666666667},15.97978077696]
[null,null,null,null,null,null,"     Call 4",{"$f":"28/60","v":0.46666666666666667},15.97978077696]
[null,null,null,null,null,null,"     Call 5 ",{"$f":"28/60","v":0.46666666666666667},15.97978077696]
[null,null,null,null,null,null,"     Call 6",{"$f":"25/60","v":0.41666666666666669},14.14586654208]
[null,null,null,null,null,null,"     Unanswered/rescheduled call",{"$f":"10/60","v":0.16666666666666666},4.9762953676799997]
[null,null,null,null,null,null,"Intervention costs (assuming full course)",null,{"$f":"SUM(I430:I438)","v":152.74032883199999}]
[null,null,null,null,null,null,"Intervention costs (assuming mean uptake)",null,{"$f":"I439*H426","v":81.685527859353599}]
[]
[]
[]
[]
[]
[]
[]
[]
[]
[null,null,null,null,null,null,"Self-management of COPD:"]
[null,null,null,null,null,null,"Resource","Total Costs","Number of participant","Cost per person"]
[null,null,null,null,null,null,"BELLA delivery costs",32065.908478606671,78,{"$f":"H452/I452","v":411.10139075136755}]
[]
[]
[]
[]
[]
[]
[]
[]
[]
[]
[null,null,null,null,null,null,"Reablement:"]
[null,null,null,null,null,null,"Resource","Unit Cost","Mean hours","Total Costs"]
[null,null,null,null,null,null,"Reablement service",43.870652025920919,37.562189054726403,{"$f":"H465*I465","v":1647.8777253517574}]
[]
[]
[]
[]
[]
[]
[]
[]
[]
[]
[null,null,null,null,null,null,"User defined Intervention "]
[null,null,null,null,null,null,"No additional breakdown on costs is available for a user defined intervention. "]

{"sheet":"2d) Outcomes","index":8,"n_rows":488,"n_cols":17,"rows_kept":488,"cut":false,"hidden":false,"merged":[[366,10,366,11],[366,4,366,6],[430,4,430,6],[430,7,430,8],[407,11,407,12],[140,6,141,6],[140,7,141,7],[140,8,140,9],[339,4,339,6],[340,4,340,6],[334,4,334,6],[335,4,335,6],[306,10,306,11],[307,10,307,11],[308,10,308,11],[309,10,309,11],[158,8,158,9],[176,6,177,6],[176,7,177,7],[176,8,176,9],[374,4,374,6],[371,4,371,6],[371,10,371,11],[320,4,320,6],[328,4,328,6],[324,4,324,6],[304,14,304,16],[14,8,14,9],[306,4,307,5],[68,8,68,9],[32,8,32,9],[50,8,50,9],[308,4,309,5],[304,4,305,6],[14,7,15,7],[14,6,15,6],[68,6,69,6],[68,7,69,7],[32,6,33,6],[32,7,33,7],[50,6,51,6],[50,7,51,7],[304,7,304,9],[86,6,87,6],[86,7,87,7],[86,8,86,9],[304,10,304,13],[305,10,305,11],[104,6,105,6],[104,7,105,7],[392,10,392,11],[393,10,393,11],[361,10,361,11],[360,12,360,14],[360,9,360,11],[360,7,360,8],[359,4,359,6],[360,4,360,6],[362,4,362,6],[363,4,363,6],[364,4,364,6],[374,10,374,11],[389,10,389,11],[390,10,390,11],[391,10,391,11],[362,10,362,11],[363,10,363,11],[364,10,364,11],[365,10,365,11],[104,8,104,9],[122,6,123,6],[122,7,123,7],[122,8,122,9],[158,6,159,6],[158,7,159,7],[321,4,321,6],[365,4,365,6],[367,4,367,6],[336,4,336,6],[411,14,411,16],[421,4,421,6],[398,9,398,12],[399,10,399,11],[400,10,400,11],[401,10,401,11],[402,10,402,11],[369,4,369,6],[372,4,372,6],[370,10,370,11],[373,4,373,6],[372,10,372,11],[373,10,373,11],[394,10,394,11],[395,10,395,11],[386,4,386,6],[388,10,388,11],[387,9,387,12],[397,4,397,6],[413,10,413,11],[414,10,414,11],[415,10,415,11],[416,10,416,11],[407,4,407,6],[408,4,408,6],[406,4,406,6],[411,10,411,13],[411,7,411,9],[412,4,412,6],[400,4,400,6],[401,4,401,6],[402,4,402,6],[395,4,395,6],[390,4,390,6],[391,4,391,6],[389,4,389,6],[392,4,392,6],[393,4,393,6],[394,4,394,6],[426,7,426,8],[419,4,419,6],[420,4,420,6],[426,4,426,6],[408,11,408,12],[427,7,427,8],[428,7,428,8],[422,4,422,6],[423,4,423,6],[424,4,424,6],[425,4,425,6],[419,7,419,8],[420,7,420,8],[421,7,421,8],[422,7,422,8],[423,7,423,8],[424,7,424,8],[425,7,425,8],[428,4,428,6],[427,4,427,6]]}
[]
[]
[]
[]
[]
[]
[]
[]
[]
[]
[]
[null,null,null,null,null,null,"Selected intervention:"]
[]
[]
[null,null,null,null,null,null,"Parameter","Mean change per person","95% CI"]
[null,null,null,null,null,null,null,null,"Lower","Upper"]
[null,null,null,null,null,null,"Social care costs",{"$f":"(H310-H308)-(H309-H307)","v":-3.4097617070899191},{"$f":"(J310-J308)-(J309-J307)","v":-7.3956085874636157},{"$f":"(I310-I308)-(I309-I307)","v":0.3062946245753464}]
[null,null,null,null,null,null,"NHS costs: primary care",{"$f":"(K310-K308)-(K309-K307)","v":-1.1643100000000075},{"$f":"(M310-M308)-(M309-M307)","v":-5.0560112922568834},{"$f":"(N310-N308)-(N309-N307)","v":2.7273935410735106}]
[null,null,null,null,null,null,"NHS costs: secondary care",{"$f":"(O310-O308)-(O309-O307)","v":40.688436955945065},{"$f":"(P310-P308)-(P309-P307)","v":-155.1192081966858},{"$f":"(Q310-Q308)-(Q309-Q307)","v":236.49608210857605}]
[null,null,null,null,null,null,"QALYs (derived from EQ-5D)",{"$f":"H313","v":1.4999999999999999E-2},{"$f":"I313","v":1.4E-2},{"$f":"J313","v":1.6E-2}]
[null,null,null,null,null,null,"York SF12 ",2.35,0.06,4.76]
[]
[]
[]
[]
[]
[]
[]
[]
[]
[]
[]
[null,null,null,null,null,null,"Parameter","Mean change per person","95% CI"]
[null,null,null,null,null,null,null,null,"Lower","Upper"]
[null,null,null,null,null,null,"NHS costs",{"$f":"H322","v":-2352.63},"Not reported","Not reported"]
[null,null,null,null,null,null,"Social care costs",{"$f":"H326","v":-270.89999999999998},"Not reported","Not reported"]
[null,null,null,null,null,null,"QALYs (derived from EQ-5D)",{"$f":"H336","v":4.2000000000000003E-2},"Not reported","Not reported"]
[null,null,null,null,null,null,"QALYs (derived from ASCOT)",{"$f":"H341","v":7.0000000000000007E-2},{"$f":"I341","v":1.6E-2},{"$f":"J341","v":0.14199999999999999}]
[]
[]
[]
[]
[]
[]
[]
[]
[]
[]
[]
[]
[null,null,null,null,null,null,"Parameter","Mean change per person","95% CI"]
[null,null,null,null,null,null,null,null,"Lower","Upper"]
[null,null,null,null,null,null,"NHS costs",-47,"Not reported","Not reported"]
[null,null,null,null,null,null,"Social care costs","Not Reported","Not reported","Not reported"]
[null,null,null,null,null,null,"QALYs",8.9999999999999993E-3,"Not reported","Not reported"]
[]
[]
[]
[]
[]
[]
[]
[]
[]
[]
[]
[]
[]
[null,null,null,null,null,null,"Parameter","Mean change per person","95% CI"]
[null,null,null,null,null,null,null,null,"Lower","Upper"]
[null,null,null,null,null,null,"NHS costs (excludes care home accommodation charges) ",{"$f":"M368-M367","v":-354.48986984396743},"Not reported","Not reported"]
[null,null,null,null,null,null,"NHS & social care costs (includes care home accommodation charges)",{"$f":"M368","v":-4927.5208910295069},{"$f":"N368","v":-1345.8193404732976},{"$f":"O368","v":-364.20091039229357}]
[null,null,null,null,null,null,"QALYs",{"$f":"H372","v":0.01},{"$f":"J372","v":1E-3},1.7999999999999999E-2]
[null,null,null,null,null,null,"DEMQOL-Proxy",{"$f":"H373","v":2.54},0.81,4.28]
[null,null,null,null,null,null,"CMAI",{"$f":"H374","v":-4.2699999999999996},-7.39,-1.1499999999999999]
[null,null,null,null,null,null,"Neuropsychiatric Inventory",{"$f":"H375","v":-4.55},-7.07,-2.2000000000000002]
[]
[]
[]
[]
[]
[]
[]
[]
[]
[]
[null,null,null,null,null,null,"Parameter","Mean change per person","95% CI"]
[null,null,null,null,null,null,null,null,"Lower","Upper"]
[null,null,null,null,null,null,"NHS costs (discounted)",{"$f":"J396/2+(J396/2)/(1+H95)","v":532.37510665871605},"Not reported","Not reported"]
[null,null,null,null,null,null,"Social care costs","Not reported","Not reported","Not reported"]
[null,null,null,null,null,null,"QALYs (discounted)",{"$f":"J401/2+(J401/2)/(1+H96)","v":7.9408866995073962E-2},{"$f":"K401/2+(K401/2)/(1+H96)","v":-9.9261083743842383E-3},{"$f":"M401/2+(M401/2)/(1+H96)","v":0.17866995073891626}]
[null,null,null,null,null,null,"Total COPD exacerbations",{"$f":"J402","v":0.83999999999999986},-7.0000000000000007E-2,{"$f":"M402","v":1.78}]
[null,null,null,null,null,null,"Improved SGRQ score",0.30000000000000004,0.03,{"$f":"M403","v":0.56000000000000005}]
[]
[null,null,null,null,null,null,"Discount factor: Costs",3.5000000000000003E-2]
[null,null,null,null,null,null,"Discount factor: QALYs",1.4999999999999999E-2]
[]
[]
[]
[]
[]
[]
[]
[]
[null,null,null,null,null,null,"Parameter","Mean change per person","95% CI"]
[null,null,null,null,null,null,null,null,"Lower","Upper"]
[null,null,null,null,null,null,"NHS costs (discounted)",{"$f":"Q417","v":-347.96396689991633},"Not reported","Not reported"]
[null,null,null,null,null,null,"Social care costs ","Not reported","Not reported","Not reported"]
[null,null,null,null,null,null,"QALYs (discoutned)",{"$f":"H431","v":2.4252791461412154E-2},"Not reported","Not reported"]
[]
[null,null,null,null,null,null,"Discount Factor: Costs",{"$f":"N408","v":3.5000000000000003E-2}]
[null,null,null,null,null,null,"Discount Factor: QALYs",{"$f":"N409","v":1.4999999999999999E-2}]
[]
[]
[]
[]
[]
[]
[]
[]
[]
[]
[null,null,null,null,null,null,"Parameter","Mean change per person","95% CI"]
[null,null,null,null,null,null,null,null,"Lower","Upper"]
[null,null,null,null,null,null,"NHS costs",73.452386262527995,-566.55689419929604,713.46063643545608]
[null,null,null,null,null,null,"Social care costs","Not reported","Not reported","Not reported"]
[null,null,null,null,null,null,"QALYs",1.9E-2,-6.0000000000000001E-3,4.2999999999999997E-2]
[null,null,null,null,null,null,"Patient Activation Measure",1.44,-0.46,3.33]
[null,null,null,null,null,null,"WHOQOL-BREF",1.62,-0.32,3.56]
[]
[]
[]
[]
[]
[]
[]
[]
[]
[]
[]
[null,null,null,null,null,null,"Parameter","Mean change per person","95% CI"]
[null,null,null,null,null,null,null,null,"Lower","Upper"]
[null,null,null,null,null,null,"NHS costs",104.09087213824625,"Not reported","Not reported"]
[null,null,null,null,null,null,"Social care costs","Not reported","Not reported","Not reported"]
[null,null,null,null,null,null,"QALYs",0.1130000000000001,"Not reported","Not reported"]
[null,null,null,null,null,null,"Respiratory Questionnaire ",-0.4,-5.0999999999999996,4.4000000000000004]
[null,null,null,null,null,null,"Strengthening exercise",12.4,-3.8,28.6]
[null,null,null,null,null,null,"Aerobic exercise",10.1,-16.3,35.5]
[]
[]
[]
[]
[]
[]
[]
[]
[]
[]
[null,null,null,null,null,null,"Parameter","Mean change per person","95% CI"]
[null,null,null,null,null,null,null,null,"Lower","Upper"]
[null,null,null,null,null,null,"NHS costs",557.65928321506465,"Not reported","Not reported"]
[null,null,null,null,null,null,"Social care costs",-1897.7876585342426,"Not reported","Not reported"]
[null,null,null,null,null,null,"QALYS (derived from EQ-5D)",0.107,"Not reported","Not reported"]
[null,null,null,null,null,null,"QALYs (derived from ASCOT)",2.5999999999999999E-2,"Not reported","Not reported"]
[]
[]
[]
[]
[]
[]
[]
[]
[]
[]
[]
[]
[null,null,null,null,null,null,"Parameter","Mean change (per person)","95% CI"]
[null,null,null,null,null,null,null,null,"Lower","Upper"]
[null,null,null,null,null,null,"NHS costs"]
[null,null,null,null,null,null,"Social care costs"]
[null,null,null,null,null,null,"QALYs"]
[null,null,null,null,null,null,"Primary Clinical Outcome"]
[]
[]
[]
[]
[]
[]
[]
[]
[]
[]
[]
[]
[]
[]
[]
[]
[]
[]
[]
[]
[]
[]
[]
[]
[]
[]
[]
[]
[]
[]
[]
[]
[]
[]
[]
[]
[]
[]
[]
[]
[]
[]
[]
[]
[]
[]
[]
[]
[]
[]
[]
[]
[]
[]
[]
[]
[]
[]
[]
[]
[]
[]
[]
[]
[]
[]
[]
[]
[]
[]
[]
[]
[]
[]
[]
[]
[]
[]
[]
[]
[]
[]
[]
[]
[]
[]
[]
[]
[]
[]
[]
[]
[]
[]
[]
[]
[]
[]
[]
[]
[]
[]
[]
[]
[]
[]
[]
[]
[]
[]
[]
[]
[]
[]
[]
[]
[]
[null,null,null,null,"OUTCOMES DATA"]
[]
[null,null,null,null,"Selected intervention:"]
[null,null,null,null,"Community singing:"]
[]
[null,null,null,null,"Change in cost of care use (£)",null,null,"Social care",null,null,"Primary care",null,null,null,"Secondary care"]
[null,null,null,null,null,null,null,"Mean","Lower CI","Upper CI","Mean",null,"Lower CI","Upper CI","Mean","Lower CI","Upper CI"]
[null,null,null,null,"Baseline",null,"Control",2.6820686598451204,-0.41076332711317975,5.9871139442631005,69.00609,null,53.052149740933309,84.960034476523305,284.44481655303167,152.61594411416368,416.27368899189969]
[null,null,null,null,null,null,"Intervention",4.2206196740198401,-0.15612168435531429,8.9313090896377467,62.84149,null,51.61464410417603,74.068340769961566,238.66252826637313,135.99086084450983,341.33419568823643]
[null,null,null,null,"6 \nmonths ",null,"Control",5.2393899401625594,-0.76783057881252992,11.661166668128653,88.581040000000002,null,70.935934070021503,106.22613608920534,554.58526692022269,296.00099796787754,813.16953587256785]
[null,null,null,null,null,null,"Intervention",3.36817924724736,-0.20689431147931805,7.209753226039683,81.252129999999994,null,64.44241714100734,98.061835923717112,549.49141558950919,124.25670650153788,974.72612467748058]
[]
[null,null,null,null,null,null,null,"Mean Difference","Lower CI","Upper CI"]
[null,null,null,null,null,null,"QALYs (derived from EQ-5D)",1.4999999999999999E-2,1.4E-2,1.6E-2]
[null,null,null,null,null,null,"York SF12 ",2.35,0.06,4.76]
[]
[]
[]
[]
[]
[null,null,null,null,"Healthcare Costs"]
[null,null,null,null,null,null,null,"Mean Difference"]
[null,null,null,null,"Aggregated Healthcare Costs",null,null,-2352.63]
[]
[null,null,null,null,"Social Care Costs"]
[null,null,null,null,null,null,null,"Mean Difference"]
[null,null,null,null,"Public Sector Costs (Participant)",null,null,-270.89999999999998]
[]
[null,null,null,null,"Additional Costs"]
[null,null,null,null,null,null,null,"Mean Difference"]
[null,null,null,null,"Personal Costs (Participant)",null,null,-988.04]
[null,null,null,null,"Public Sector Costs (Spouse)",null,null,-29.23]
[null,null,null,null,"Personal Costs (Spouse)",null,null,560.9]
[]
[null,null,null,null,"QALYS"]
[null,null,null,null,null,null,null,"Mean Difference","P-value"]
[null,null,null,null,"Physical QALYs",null,null,4.2000000000000003E-2,0.05]
[null,null,null,null,"Mental QALYs",null,null,9.4999999999999998E-3,"Not significant"]
[]
[null,null,null,null,"Social Care Related Quality of Life "]
[null,null,null,null,null,null,null,"Mean Difference","95% CI Low","95% CI High"]
[null,null,null,null,"ASCOT ",null,null,7.0000000000000007E-2,1.6E-2,0.14199999999999999]
[]
[]
[]
[]
[]
[]
[]
[]
[]
[null,null,null,null,"No additional breakdown on outcomes is available for this intervention. "]
[]
[]
[]
[]
[]
[]
[]
[]
[null,null,null,null,"NHS & Social Care Costs:"]
[null,null,null,null,null,null,null,"Intervention ",null,"Control ",null,null,"Difference (Intervention - Control)"]
[null,null,null,null,null,null,null,"Mean","SD","Mean ","SD",null,"Mean","95% CI Low","95% CI High"]
[null,null,null,null,"Hospital Admissions",null,null,279.64,1212.1300000000001,272.36511196876796,1317.1244155130878,null,{"$f":"H363-J363","v":7.2748880312320239},-190.239753779712,195.43756126003197]
[null,null,null,null,"Primary Care",null,null,727.69,274.44,1060.3527259852797,312.90801031526394,null,{"$f":"H364-J364","v":-332.66272598527962},-378.40038456729593,-287.95853440972803]
[null,null,null,null,"Community healthcare",null,null,81.09,270.29000000000002,72.76930472447998,214.14966818918398,null,{"$f":"H365-J365","v":8.3206952755200234},-23.909914409471998,45.740705826815997]
[null,null,null,null,"Emergency",null,null,50.94,138.26,88.362727165439992,253.65300503961598,null,{"$f":"H366-J366","v":-37.422727165439994},-70.690181732351988,-10.39561496064]
[null,null,null,null,"Care Home Accomodation Costs ",null,null,29737.696156406782,11292.756531743231,34310.727177592322,12919.670273083391,null,{"$f":"H367-J367","v":-4573.0310211855394},-5951.4895649663995,-3012.649215593472]
[null,null,null,null,"Total NHS and Social Care Costs ",null,null,{"$f":"SUM(H363:H367)","v":30877.056156406783},null,{"$f":"SUM(J363:J367)","v":35804.577047436287},null,null,{"$f":"SUM(M363:M367)","v":-4927.5208910295069},-1345.8193404732976,-364.20091039229357]
[]
[null,null,null,null,"Health/Clinical Outcomes:"]
[null,null,null,null,null,null,null,"Mean Difference","SEM","95% CI Lower","95% CI Upper",null,"N","P-value"]
[null,null,null,null,"QALYs",null,null,0.01,"Not reported",1E-3,1.7999999999999999E-2,null,553,"Not reported"]
[null,null,null,null,"DEMQOL-Proxy",null,null,2.54,0.88,0.81,4.28,null,533,4.1999999999999997E-3]
[null,null,null,null,"Cohen-Mansfield Agitiation Invention ",null,null,-4.2699999999999996,1.59,-7.39,-1.1499999999999999,null,533,7.6E-3]
[null,null,null,null,"Neuropsychiatric Inventory",null,null,-4.55,1.28,-7.07,-2.2000000000000002,null,547,"<0.001"]
[]
[]
[]
[]
[]
[]
[]
[]
[]
[]
[]
[null,null,null,null,"Healtcare Costs:"]
[null,null,null,null,null,null,null,null,null,"Incremental difference (intervention - control)"]
[null,null,null,null,null,null,null,"Intervention","Control","Mean","95% CI Low",null,"95% CI High"]
[null,null,null,null,"GP Vists",null,null,134.76278465608942,144.68397125653766,{"$f":"H390-I390","v":-9.9211866004482374},-48.779167452204142,null,29.763559801344908]
[null,null,null,null,"Specialist",null,null,471.25636352129408,504.3269855227885,{"$f":"H391-I391","v":-33.070622001494428},-147.16426790664977,null,83.503320553773207]
[null,null,null,null,"Hospital admissions",null,null,2433.9977793099824,2772.1448892752624,-338.14710996527992,-1722.9794062778549,null,1128.5349758009941]
[null,null,null,null,"Prescribed medication",null,null,2920.1359227319485,2743.2080950239556,176.92782770799295,-197.59696645892859,null,551.45262187491801]
[null,null,null,null,"Oxygen use",null,null,162.04604780732225,47.125636352129412,114.92041145519283,-10.747952150485659,null,251.3367272113569]
[null,null,null,null,"Other direct medical costs",null,null,2406.71451615875,1775.8924014802453,630.8221146785047,-997.90601889509117,null,2405.0609850586757]
[null,null,null,null,"Total healthcare costs",null,null,null,null,{"$f":"SUM(J390:J395)","v":541.53143527446787},"Not reported",null,"Not reported"]
[]
[null,null,null,null,"Health/Clinical Outcomes: "]
[null,null,null,null,null,null,null,null,null,"Incremental difference (intervention - control)"]
[null,null,null,null,null,null,null,"Intervention","Control","Mean","95% CI Low",null,"95% CI High"]
[null,null,null,null,"QALYs",null,null,1.62,1.54,{"$f":"H401-I401","v":8.0000000000000071E-2},-0.01,null,0.18]
[null,null,null,null,"Total COPD exacerbations",null,null,3.02,2.1800000000000002,{"$f":"H402-I402","v":0.83999999999999986},-7.0000000000000007E-2,null,1.78]
[null,null,null,null,"Improved SGRQ score",null,null,0.13,-0.17,{"$f":"H403-I403","v":0.30000000000000004},0.03,null,0.56000000000000005]
[]
[]
[null,null,null,null,"Population receiving intervention:",null,null,null,null,null,null,"Discounting "]
[null,null,null,null,null,null,null,"non VCS","VCS"]
[null,null,null,null,"Year 1",null,null,208,217,null,null,"Costs Discount Factor",null,3.5000000000000003E-2]
[null,null,null,null,"Year 2",null,null,281,901,null,null,"QALY Discount Factor",null,1.4999999999999999E-2]
[]
[null,null,null,null,"Healthcare Costs:",null,null,"12-month costs (per person)"]
[null,null,null,null,null,null,null,"12 month per person costs (non VCS)",null,null,"12-month per person costs (VCS)",null,null,null,"12-month per person costs (VCS & non VCS)"]
[null,null,null,null,null,null,null,"Before","After","Difference","Before",null,"After","Difference","Before","After","Difference"]
[null,null,null,null,"Hospital admission (inpatient stay)",null,null,2737.1654191365119,2530.2926814197763,{"$f":"H414-I414","v":206.87273771673563},2372.2793340180501,null,2080.1625536240599,{"$f":"L414-M414","v":-2080.1625536240599},{"$f":"(H414*SUM($H$408:$H$409)+(K414/(1+$N$408))*SUM($I$408:$I$409))/SUM($H$408:$I$409)","v":2427.5009223165894},{"$f":"(I414*SUM($H$408:$H$409)+(M414/(1+$N$408))*SUM($I$408:$I$409))/SUM($H$408:$I$409)","v":2168.1957952126531},{"$f":"P414-O414","v":-259.30512710393623}]
[null,null,null,null,"A & E attendance",null,null,208.95186070886396,180.883700315136,{"$f":"H415-I415","v":28.068160393727965},229.743090630144,null,190.239753779712,{"$f":"L415-M415","v":-190.239753779712},{"$f":"(H415*SUM($H$408:$H$409)+(K415/(1+$N$408))*SUM($I$408:$I$409))/SUM($H$408:$I$409)","v":218.01144528146344},{"$f":"(I415*SUM($H$408:$H$409)+(M415/(1+$N$408))*SUM($I$408:$I$409))/SUM($H$408:$I$409)","v":182.91712809039745},{"$f":"P415-O415","v":-35.094317191065983}]
[null,null,null,null,"Outpatient appointment",null,null,191.27931527577599,150.73641692928001,{"$f":"H416-I416","v":40.542898346495974},214.14966818918398,null,152.815539921408,{"$f":"L416-M416","v":-152.815539921408},{"$f":"(H416*SUM($H$408:$H$409)+(K416/(1+$N$408))*SUM($I$408:$I$409))/SUM($H$408:$I$409)","v":202.15221430775804},{"$f":"(I416*SUM($H$408:$H$409)+(M416/(1+$N$408))*SUM($I$408:$I$409))/SUM($H$408:$I$409)","v":148.58769170284395},{"$f":"P416-O416","v":-53.564522604914089}]
[null,null,null,null,"Aggregated NHS costs (Year 1)",null,null,{"$f":"SUM(H414:H416)","v":3137.3965951211517},{"$f":"SUM(I414:I416)","v":2861.9127986641925},{"$f":"H417-I417","v":275.48379645695923},{"$f":"SUM(K414:L416)","v":2816.1720928373779},2816.1720928373757,{"$f":"SUM(M414:M416)","v":2423.2178473251797},{"$f":"K417-M417","v":392.95424551219821},{"$f":"SUM(O414:O416)","v":2847.6645819058108},{"$f":"SUM(P414:P416)","v":2499.7006150058946},{"$f":"SUM(Q414:Q416)","v":-347.96396689991633}]
[]
[null,null,null,null,"QALYs:"]
[null,null,null,null,"Well-being category",null,null,"Difference (after - before)"]
[null,null,null,null,"Feeling positive",null,null,4.6333333333333331E-3]
[null,null,null,null,"Lifestyle",null,null,2.2000000000000001E-3]
[null,null,null,null,"Looking after yourself",null,null,2.1666666666666666E-3]
[null,null,null,null,"Managing symptoms",null,null,1.4E-3]
[null,null,null,null,"Work, volunteering and social group",null,null,6.1333333333333335E-3]
[null,null,null,null,"Money",null,null,2.6666666666666666E-3]
[null,null,null,null,"Where you live",null,null,2.2666666666666668E-3]
[null,null,null,null,"Family and friends",null,null,2.9666666666666665E-3]
[null,null,null,null,"Aggregated QALYs",null,null,{"$f":"SUM(H421:H428)","v":2.4433333333333335E-2}]
[]
[null,null,null,null,"Discounted QALYs",null,null,{"$f":"H429/2+((H429/2)/(1+N409))","v":2.4252791461412154E-2}]
[]
[]
[]
[]
[]
[]
[]
[]
[]
[]
[]
[]
[]
[]
[]
[]
[]
[]
[]
[null,null,null,null,"No additional breakdown on outcomes is available for this intervention. "]
[]
[]
[]
[]
[]
[]
[]
[]
[]
[]
[null,null,null,null,"No additional breakdown on outcomes is available for this intervention. "]
[]
[]
[]
[]
[]
[]
[]
[]
[]
[]
[]
[]
[]
[null,null,null,null,"No additional breakdown on outcomes is available for this intervention. "]
[]
[]
[]
[]
[]
[]
[]
[]
[]
[]
[]
[null,null,null,null,"No additional breakdown on outcomes is available for this intervention. "]

{"sheet":"3a) Results summary","index":9,"n_rows":108,"n_cols":11,"rows_kept":108,"cut":false,"hidden":false,"merged":[[95,3,95,6],[23,5,24,5],[36,7,36,8],[37,7,37,8],[40,7,40,8],[39,7,39,8],[38,7,38,8],[103,3,103,6],[104,3,104,6],[105,3,105,6],[106,3,106,6],[107,3,107,6]]}
[]
[]
[]
[]
[]
[]
[]
[]
[]
[]
[]
[null,null,null,null,null,null,"Select intervention:"]
[]
[null,null,null,null,null,null,"Target population receiving intervention",{"$f":"TotalPop","v":702.14800000000014}]
[]
[null,null,null,null,null,null,"Time horizon for analysis (months)",{"$f":"CHOOSE(IntChoice,'2a) Interventions'!M100,'2a) Interventions'!M101,'2a) Interventions'!M102,'2a) Interventions'!M103,'2a) Interventions'!M104,'2a) Interventions'!M105, '2a) Interventions'!M106,'2a) Interventions'!M107,'2a) Interventions'!M108,IF('2a) Interventions'!L85=TRUE,'2a) Interventions'!M109,\"\"))","v":24}]
[]
[null,null,null,null,null,null,"Value of a QALY","£"]
[null,null,null,null,null,null,"PHE value",60000]
[null,null,null,null,null,null,"Value used in model",60000]
[]
[null,null,null,null,null,null,"Results summary:"]
[]
[null,null,null,null,null,null,"Cost impact","Total population","Per patient","95% CI low","95% CI High"]
[null,null,null,null,null,null,"Intervention costs",{"$f":"CHOOSE(IntChoice,'2c) Intervention costs'!I22,'2c) Intervention costs'!I39,'2c) Intervention costs'!I55,'2c) Intervention costs'!I74,'2c) Intervention costs'!I95,'2c) Intervention costs'!I111,'2c) Intervention costs'!I127,'2c) Intervention costs'!I144,'2c) Intervention costs'!I162,IF('2a) Interventions'!L85=TRUE,'2c) Intervention costs'!I190,\"\"))","v":497554.0827429624},{"$f":"CHOOSE(IntChoice,'2c) Intervention costs'!H22,'2c) Intervention costs'!H39,'2c) Intervention costs'!H55,'2c) Intervention costs'!H74,'2c) Intervention costs'!H95,'2c) Intervention costs'!H111,'2c) Intervention costs'!H127,'2c) Intervention costs'!H144,'2c) Intervention costs'!H162,IF(Usertickbox=TRUE,'2c) Intervention costs'!H190,\"\"))","v":708.61710457476534},"N/A","N/A"]
[null,null,null,null,null,null,{"$f":"CHOOSE(IntChoice,\"NHS costs\",'2d) Outcomes'!G35,'2d) Outcomes'!G53,'2d) Outcomes'!G71,'2d) Outcomes'!G89,'2d) Outcomes'!G107,'2d) Outcomes'!G125,'2d) Outcomes'!G143,'2d) Outcomes'!G161,\"NHS costs\")","v":"NHS costs (discounted)"},{"$f":"IF(I26=\"Not reported\",\"Not reported\", IF(I26=\"\",\"\",I26*TotalPop))","v":-244322.20343084249},{"$f":"CHOOSE(IntChoice,SUM('2d) Outcomes'!H18:H19),'2d) Outcomes'!H35,'2d) Outcomes'!H53,'2d) Outcomes'!H71,'2d) Outcomes'!H89,'2d) Outcomes'!H107,'2d) Outcomes'!H125,'2d) Outcomes'!H143,'2d) Outcomes'!H161,IF('2a) Interventions'!L85=TRUE,H105,\"\"))","v":-347.96396689991633},{"$f":"CHOOSE(IntChoice,\"Not reported\",'2d) Outcomes'!I35,'2d) Outcomes'!I53,'2d) Outcomes'!I71,'2d) Outcomes'!I89,'2d) Outcomes'!I107,'2d) Outcomes'!I125,'2d) Outcomes'!I143,'2d) Outcomes'!I161,IF('2a) Interventions'!L85=TRUE,'2d) Outcomes'!I179,\"\"))","v":"Not reported"},{"$f":"CHOOSE(IntChoice,\"Not reported\",'2d) Outcomes'!J35,'2d) Outcomes'!J53,'2d) Outcomes'!J71,'2d) Outcomes'!J89,'2d) Outcomes'!J107,'2d) Outcomes'!J125,'2d) Outcomes'!J143,'2d) Outcomes'!J161,IF('2a) Interventions'!L85=TRUE,'2d) Outcomes'!IJ79,\"\"))","v":"Not reported"}]
[null,null,null,null,null,null,{"$f":"CHOOSE(IntChoice,\"Social care costs\",'2d) Outcomes'!G36,'2d) Outcomes'!G54,'2d) Outcomes'!G72,'2d) Outcomes'!G90,'2d) Outcomes'!G108,'2d) Outcomes'!G126,'2d) Outcomes'!G144,'2d) Outcomes'!G162,\"Socialcarecosts\")","v":"Social care costs "},{"$f":"IF(I27=\"Not reported\",\"Not reported\", IF(I27=\"\",\"\",I27*TotalPop))","v":"Not reported"},{"$f":"CHOOSE(IntChoice,'2d) Outcomes'!H17,'2d) Outcomes'!H36,'2d) Outcomes'!H54,'2d) Outcomes'!H72,'2d) Outcomes'!H90,'2d) Outcomes'!H108,'2d) Outcomes'!H126,'2d) Outcomes'!H144,'2d) Outcomes'!H162,IF('2a) Interventions'!L85=TRUE,H106,\"\"))","v":"Not reported"},{"$f":"CHOOSE(IntChoice,'2d) Outcomes'!I17,'2d) Outcomes'!I36,'2d) Outcomes'!I54,'2d) Outcomes'!I72,'2d) Outcomes'!I90,'2d) Outcomes'!I108,'2d) Outcomes'!I126,'2d) Outcomes'!I144,'2d) Outcomes'!I162,IF('2a) Interventions'!L85=TRUE,'2d) Outcomes'!I180,\"\"))","v":"Not reported"},{"$f":"CHOOSE(IntChoice,'2d) Outcomes'!J17,'2d) Outcomes'!J36,'2d) Outcomes'!J54,'2d) Outcomes'!J72,'2d) Outcomes'!J90,'2d) Outcomes'!J108,'2d) Outcomes'!J126,'2d) Outcomes'!J144,'2d) Outcomes'!J162,IF('2a) Interventions'!L85=TRUE,'2d) Outcomes'!J1180,\"\"))","v":"Not reported"}]
[null,null,null,null,null,null,"Net cost of intervention",{"$f":"CHOOSE(IntChoice,SUM(H25:H27),SUM(H25:H27),SUM(H25:H27),SUM(H25,H27),SUM(H25:H27),SUM(H25:H27),SUM(H25:H27),SUM(H25:H27),SUM(H25:H27),IF(H25=\"\",\"\",SUM(H25:H27)))","v":253231.87931211991},{"$f":"CHOOSE(IntChoice,SUM(I25:I27),SUM(I25:I27),SUM(I25:I27),SUM(I25,I27),SUM(I25:I27),SUM(I25:I27),SUM(I25:I27),SUM(I25:I27),SUM(I25:I27),IF(I25=\"\",\"\",SUM(I25:I27)))","v":360.65313767484901},"N/A","N/A"]
[]
[null,null,null,null,null,null,"Quality of life impact","Total population","Per patient","95% CI low","95% CI High"]
[null,null,null,null,null,null,"QALY gains",{"$f":"IF(I31=\"\",\"\",I31*TotalPop)","v":17.029049019047626},{"$f":"CHOOSE(IntChoice,'2d) Outcomes'!H20,'2d) Outcomes'!H37,'2d) Outcomes'!H55,'2d) Outcomes'!H73,'2d) Outcomes'!H91,'2d) Outcomes'!H109,'2d) Outcomes'!H127,'2d) Outcomes'!H145,'2d) Outcomes'!H163,IF('2a) Interventions'!L85=TRUE,H107,\"\"))","v":2.4252791461412154E-2},{"$f":"CHOOSE(IntChoice,'2d) Outcomes'!I20,'2d) Outcomes'!I37,'2d) Outcomes'!I55,'2d) Outcomes'!I73,'2d) Outcomes'!I91,'2d) Outcomes'!I109,'2d) Outcomes'!I127,'2d) Outcomes'!I145,'2d) Outcomes'!I163,IF('2a) Interventions'!L85=TRUE,I107,\"\"))","v":"Not reported"},{"$f":"CHOOSE(IntChoice,'2d) Outcomes'!J20,'2d) Outcomes'!J37,'2d) Outcomes'!J55,'2d) Outcomes'!J73,'2d) Outcomes'!J91,'2d) Outcomes'!J109,'2d) Outcomes'!J127,'2d) Outcomes'!J145,'2d) Outcomes'!J163,IF('2a) Interventions'!L85=TRUE,J107,\"\"))","v":"Not reported"}]
[null,null,null,null,null,null,"Value of QALY gains",{"$f":"IF(I31=\"\",\"\",H31*$H$20)","v":1021742.9411428575},{"$f":"IF(I31=\"\",\"\",I31*$H$20)","v":1455.1674876847292},{"$f":"IF(J31=\"Not reported\",\"Not reported\",IF(J31=\"\",\"\",J31*$H$20))","v":"Not reported"},{"$f":"IF(K31=\"Not reported\",\"Not reported\",IF(K31=\"\",\"\",K31*$H$20))","v":"Not reported"}]
[]
[null,null,null,null,null,null,"Clinical impacts","Total population","Per patient","95% CI low","95% CI High"]
[null,null,null,null,null,null,{"$f":"CHOOSE(IntChoice,\"None Reported\",'2d) Outcomes'!G38,\"None Reported\",'2d) Outcomes'!G75,'2d) Outcomes'!G93,\"None Reported\",'2d) Outcomes'!G128,'2d) Outcomes'!G146,'2d) Outcomes'!G164,IF('2a) Interventions'!L85=TRUE,'2d) Outcomes'!G182,\"\"))","v":"None Reported"},{"$f":"IF(I35=\"N/A\",\"N/A\",IF(I35=\"\",\"\",I35*TotalPop))","v":"N/A"},{"$f":"CHOOSE(IntChoice,\"N/A\",'2d) Outcomes'!H38,\"N/A\",'2d) Outcomes'!H75,'2d) Outcomes'!H93,\"N/A\",'2d) Outcomes'!H128,'2d) Outcomes'!H146,'2d) Outcomes'!H164,IF('2a) Interventions'!L85=TRUE,H108,\"\"))","v":"N/A"},{"$f":"CHOOSE(IntChoice,\"N/A\",'2d) Outcomes'!I38,\"N/A\",'2d) Outcomes'!I75,'2d) Outcomes'!I93,\"N/A\",'2d) Outcomes'!I128,'2d) Outcomes'!I146,'2d) Outcomes'!I164,IF('2a) Interventions'!L85=TRUE,I108,\"\"))","v":"N/A"},{"$f":"CHOOSE(IntChoice,\"N/A\",'2d) Outcomes'!J38,\"N/A\",'2d) Outcomes'!J76,'2d) Outcomes'!J93,\"N/A\",'2d) Outcomes'!J128,'2d) Outcomes'!J146,'2d) Outcomes'!J164,IF('2a) Interventions'!L85=TRUE,J108,\"\"))","v":"N/A"}]
[]
[null,null,null,null,null,null,"ROI","Cost-benefit ratio"]
[null,null,null,null,null,null,{"$f":"CHOOSE(IntChoice,\"Financial (NHS)\",\"Financial (NHS)\",\"Financial (NHS)\",\"Financial (NHS excluding accomodation charges)\",\"Financial (NHS)\",\"Financial (NHS)\",\"Financial (NHS)\",\"Financial (NHS)\",\"Financial (NHS)\",\"Financial (NHS)\")","v":"Financial (NHS)"},{"$f":"IF(I26=\"Not Reported\",\"Not Reported\",IF(I26=\"\",\"\",\"£1.00 : \"&\"£\"&ROUND(H96/$I$25,2)))","v":"£1.00 : £0.49"}]
[null,null,null,null,null,null,"Financial (Social Care)",{"$f":"CHOOSE(IntChoice,\"£1.00 : \"&\"£\"&ROUND(H97/$I$25,2),\"£1.00 : \"&\"£\"&ROUND(H97/$I$25,2),\"Not reported\",\"Not reported\",\"Not reported\",\"Not reported\",\"Not reported\",\"Not reported\",\"£1.00 : \"&\"£\"&ROUND(H97/$I$25,2),IF(I27=\"\",\"\",\"£1.00 : \"&\"£\"&ROUND(H97/$I$25,2)))","v":"Not reported"}]
[null,null,null,null,null,null,"Financial (NHS & Social Care)",{"$f":"IF(OR(I26=\"Not reported\",I27=\"Not reported\"),\"Not reported\",IF(OR(I26=\"\",I27=\"\"),\"\",\"£1.00 : \"&\"£\"&ROUND(H98/$I$25,2)))","v":"Not reported"}]
[null,null,null,null,null,null,"Societal",{"$f":"IF(AND(H38=\"\",H39=\"\",I31=\"\"),\"\",\"£1.00 : \"&\"£\"&ROUND(H99/$I$25,2))","v":"£1.00 : £2.54"}]
[]
[]
[]
[]
[]
[]
[]
[]
[]
[]
[]
[]
[]
[]
[]
[]
[]
[]
[]
[]
[]
[]
[]
[]
[]
[]
[]
[]
[]
[]
[]
[]
[]
[]
[]
[]
[]
[]
[]
[]
[]
[]
[]
[]
[]
[]
[]
[]
[]
[]
[]
[]
[]
[]
[null,null,null,"Health  savings",null,null,null,{"$f":"-SUM(I26)","v":347.96396689991633}]
[null,null,null,"Social Care savings",null,null,null,{"$f":"-I27","v":{"$error":"#VALUE!"}}]
[null,null,null,"Health + social care savings",null,null,null,{"$f":"CHOOSE(IntChoice,-SUM(I26:I27),-SUM(I26:I27),-SUM(I26:I27),-SUM(I27),-SUM(I26:I27),-SUM(I26:I27),-SUM(I26:I27),-SUM(I26:I27),-SUM(I26:I27),-SUM(I26:I27))","v":347.96396689991633}]
[null,null,null,"Savings + QALY gain",null,null,null,{"$f":"H98+I32","v":1803.1314545846456}]
[]
[null,null,null,{"$f":"'2a) Interventions'!G45","v":"Uncontrolled before and after study design. QALYs were not measured directly but derived based on scores on a well-being tool developed specifically for the Social Prescribing pilot study. "},null,null,"NHS and social care costs were grouped in this analysis as care home accommodation costs may be attributable to either budget. "]
[null,null,null,{"$f":"CHOOSE(IntChoice,\"Study limitations: \"&'2a) Interventions'!G45,\"Study limitations: \"&'2a) Interventions'!G45,\"Study limitations: \"&'2a) Interventions'!G45,\"Study limitations: \"&'2a) Interventions'!G45&\" \"&G101,\"Study limitations: \"&'2a) Interventions'!G45,\"Study limitations: \"&'2a) Interventions'!G45,\"Study limitations: \"&'2a) Interventions'!G45,\"Study limitations: \"&'2a) Interventions'!G45,\"Study limitations: \"&'2a) Interventions'!G45,\"Study limitations: \"&'2a) Interventions'!G45)","v":"Study limitations: Uncontrolled before and after study design. QALYs were not measured directly but derived based on scores on a well-being tool developed specifically for the Social Prescribing pilot study. "}]
[]
[null,null,null,"User defined intervention results",null,null,null,"Mean","95% Lower","95% Upper"]
[null,null,null,"Health costs",null,null,null,{"$f":"IF('2d) Outcomes'!H179=\"\",\"\",'2d) Outcomes'!H179)","v":""}]
[null,null,null,"Social Costs",null,null,null,{"$f":"IF('2d) Outcomes'!H180=\"\",\"\",'2d) Outcomes'!H180)","v":""},{"$f":"IF('2d) Outcomes'!I180=\"\",\"\",'2d) Outcomes'!I180)","v":""},{"$f":"IF('2d) Outcomes'!J180=\"\",\"\",'2d) Outcomes'!J180)","v":""}]
[null,null,null,"QALYS ",null,null,null,{"$f":"IF('2d) Outcomes'!H181=\"\",\"\",'2d) Outcomes'!H181)","v":""},{"$f":"IF('2d) Outcomes'!I181=\"\",\"\",'2d) Outcomes'!I181)","v":""},{"$f":"IF('2d) Outcomes'!J181=\"\",\"\",'2d) Outcomes'!J181)","v":""}]
[null,null,null,"Clinical Outcomes ",null,null,null,{"$f":"IF('2d) Outcomes'!H182=\"\",\"\",'2d) Outcomes'!H182)","v":""},{"$f":"IF('2d) Outcomes'!I182=\"\",\"\",'2d) Outcomes'!I182)","v":""},{"$f":"IF('2d) Outcomes'!J182=\"\",\"\",'2d) Outcomes'!J182)","v":""}]

{"sheet":"3b) Results charts","index":10,"n_rows":12,"n_cols":7,"rows_kept":12,"cut":false,"hidden":false,"merged":[[107,3,107,6],[23,5,24,5],[36,7,36,8],[37,7,37,8],[38,7,38,8],[39,7,39,8],[40,7,40,8],[95,3,95,6],[103,3,103,6],[104,3,104,6],[105,3,105,6],[106,3,106,6]]}
[]
[]
[]
[]
[]
[]
[]
[]
[]
[]
[]
[null,null,null,null,null,null,"Selected intervention:"]

{"sheet":"3c) Sensitivity analysis","index":11,"n_rows":217,"n_cols":21,"rows_kept":217,"cut":false,"hidden":false,"merged":[[71,6,71,7],[109,3,109,6],[23,5,24,5],[39,7,39,8],[40,7,40,8],[41,7,41,8],[42,7,42,8],[97,3,97,6],[105,3,105,6],[106,3,106,6],[107,3,107,6],[108,3,108,6],[68,6,68,7],[69,6,69,7],[70,6,70,7],[209,8,209,9],[210,8,210,9],[211,8,211,9],[208,8,208,9],[208,6,208,7],[209,6,209,7],[210,6,210,7],[211,6,211,7],[208,11,208,12],[209,11,209,12],[210,11,210,12],[211,11,211,12],[208,14,208,17],[209,14,209,17],[210,14,210,17],[211,14,211,17]]}
[]
[]
[]
[]
[]
[]
[]
[]
[]
[]
[]
[null,null,null,null,null,null,"Selected Intervention:"]
[]
[]
[]
[]
[]
[]
[]
[]
[]
[]
[]
[]
[]
[]
[]
[]
[]
[]
[]
[]
[]
[]
[]
[]
[]
[]
[]
[]
[]
[]
[]
[]
[]
[]
[]
[]
[]
[]
[]
[]
[]
[]
[]
[]
[]
[]
[]
[]
[]
[]
[]
[]
[]
[]
[]
[]
[]
[]
[]
[]
[]
[]
[]
[]
[]
[]
[]
[]
[]
[]
[]
[]
[]
[]
[]
[]
[]
[]
[]
[]
[]
[]
[]
[]
[]
[]
[]
[]
[]
[]
[]
[]
[]
[]
[]
[]
[]
[]
[]
[]
[]
[]
[]
[]
[]
[]
[]
[]
[]
[]
[]
[]
[]
[]
[]
[]
[]
[]
[]
[]
[]
[]
[]
[]
[]
[]
[]
[]
[]
[]
[]
[]
[]
[]
[]
[]
[]
[]
[]
[]
[]
[]
[]
[]
[]
[]
[]
[]
[]
[]
[]
[]
[]
[]
[]
[]
[]
[]
[]
[]
[]
[]
[]
[]
[]
[]
[]
[]
[]
[]
[]
[]
[]
[]
[]
[]
[]
[]
[]
[]
[]
[]
[]
[]
[]
[]
[]
[]
[]
[]
[]
[]
[]
[]
[null,null,null,null,null,null,"Threshold Analysis Text"]
[]
[null,null,null,null,null,null,"The current base-case inputted value for ",null,"intervention costs is ",null,"£",{"$f":"ROUND(int_costs,2)","v":708.62},null,". ","To result in a societal ROI of 1:1 intervention costs would have to increase to ",null,null,null,"£",{"$f":"ROUND(Calculations!C60,2)","v":1803.13},"."]
[null,null,null,null,null,null,"The current base-case inputted value for incremental ",null,"QALYs is ",null,null,{"$f":"ROUND(QALY_gain,4)","v":2.4299999999999999E-2},null,". ","To result in a societal ROI of 1:1 incremental QALYs would have to decrease to ",null,null,null,null,{"$f":"ROUND(Calculations!C64,4)","v":6.0000000000000001E-3},"."]
[null,null,null,null,null,null,"The current base-case inputted value for incremental ",null,{"$f":"Calculations!C29&\" is \"","v":"NHS costs is "},null,"£",{"$f":"CHOOSE(IntChoice,ROUND(NHS_Costs,2),ROUND(NHS_Costs,2),ROUND(NHS_Costs,2),ROUND(SocialC_costs,2),ROUND(NHS_Costs,2),ROUND(NHS_Costs,2),ROUND(NHS_Costs,2),ROUND(NHS_Costs,2),ROUND(NHS_Costs,2),ROUND(NHS_Costs,2))","v":-347.96},null,". ",{"$f":"\"To result in a societal ROI of 1:1 incremental \"&Calculations!C29&\" would have to increase to \"","v":"To result in a societal ROI of 1:1 incremental NHS costs would have to increase to "},null,null,null,"£",{"$f":"ROUND(Calculations!C90,2)","v":746.55},"."]
[null,null,null,null,null,null,"The current base-case inputted value for incremental ",null,"social care costs is ",null,"£",{"$f":"CHOOSE(IntChoice,ROUND(SocialC_costs,2),ROUND(SocialC_costs,2),ROUND(SocialC_costs,2),ROUND(asd,2),ROUND(SocialC_costs,2),ROUND(SocialC_costs,2),ROUND(SocialC_costs,2),ROUND(SocialC_costs,2),ROUND(SocialC_costs,2),ROUND(SocialC_costs,2))","v":{"$error":"#VALUE!"}},null,". ","To result in a societal ROI of 1:1 incremental social care costs would have to increase to ",null,null,null,"£",{"$f":"ROUND(Calculations!C114,2)","v":0},"."]
[]
[null,null,null,null,null,null,{"$f":"IFERROR(G209&I209&K209&L209&N209&O209&S209&T209&U209,\"\")","v":"The current base-case inputted value for intervention costs is £708.62. To result in a societal ROI of 1:1 intervention costs would have to increase to £1803.13."}]
[null,null,null,null,null,null,{"$f":"IFERROR(G210&I210&K210&L210&N210&O210&S210&T210&U210,\"\")","v":"The current base-case inputted value for incremental QALYs is 0.0243. To result in a societal ROI of 1:1 incremental QALYs would have to decrease to 0.006."}]
[null,null,null,null,null,null,{"$f":"IFERROR(G211&I211&K211&L211&N211&O211&S211&T211&U211,\"\")","v":"The current base-case inputted value for incremental NHS costs is £-347.96. To result in a societal ROI of 1:1 incremental NHS costs would have to increase to £746.55."}]
[null,null,null,null,null,null,{"$f":"IFERROR(G212&I212&K212&L212&N212&O212&S212&T212&U212,\"\")","v":""}]

{"sheet":"Calculations","index":12,"n_rows":134,"n_cols":12,"rows_kept":134,"cut":false,"hidden":false,"merged":[[3,2,3,3],[3,4,3,5],[21,13,21,16],[21,17,21,20],[49,13,49,16],[49,17,49,20],[21,2,21,5],[21,6,21,9],[4,8,4,11],[4,12,4,15]]}
[]
[]
[null,"3b) Results charts "]
[]
[null,"Graph 1: "]
[null,null,{"$f":"'2a) Interventions'!H85&\" vs comparator\"","v":"Bundle of VCS services for people with LTCs vs comparator"},null,null,"For Graph 1"]
[null,null,"Population","Per person",null,"Population ","Per Person "]
[null,"Intervention costs",{"$f":"'3a) Results summary'!H25","v":497554.0827429624},{"$f":"'3a) Results summary'!I25","v":708.61710457476534},"Intervention costs",{"$f":"'3a) Results summary'!H25","v":497554.0827429624},{"$f":"'3a) Results summary'!I25","v":708.61710457476534}]
[null,"Healthcare cost",{"$f":"'3a) Results summary'!H26","v":-244322.20343084249},{"$f":"'3a) Results summary'!I26","v":-347.96396689991633},{"$f":"CHOOSE(IntChoice,\"NHS costs\",\"NHS costs\",\"NHS costs\",\"\",\"NHS costs\",\"NHS costs\",\"NHS costs\",\"NHS costs\",\"NHS costs\",\"NHS costs\")","v":"NHS costs"},{"$f":"CHOOSE(IntChoice,'3a) Results summary'!H26,'3a) Results summary'!H26,'3a) Results summary'!H26,\"\",'3a) Results summary'!H26,'3a) Results summary'!H26,'3a) Results summary'!H26,'3a) Results summary'!H26,'3a) Results summary'!H26,'3a) Results summary'!H26)","v":-244322.20343084249},{"$f":"CHOOSE(IntChoice,'3a) Results summary'!I26,'3a) Results summary'!I26,'3a) Results summary'!I26,\"\",'3a) Results summary'!I26,'3a) Results summary'!I26,'3a) Results summary'!I26,'3a) Results summary'!I26,'3a) Results summary'!I26,'3a) Results summary'!I26)","v":-347.96396689991633}]
[null,"Social care costs",{"$f":"CHOOSE(IntChoice,'3a) Results summary'!H27,'3a) Results summary'!H27,'3a) Results summary'!H27,\"Not reported\",'3a) Results summary'!H27,'3a) Results summary'!H27,'3a) Results summary'!H27,'3a) Results summary'!H27,'3a) Results summary'!H27,'3a) Results summary'!H27)","v":"Not reported"},{"$f":"CHOOSE(IntChoice,'3a) Results summary'!I27,'3a) Results summary'!I27,'3a) Results summary'!I27,\"Not reported\",'3a) Results summary'!I27,'3a) Results summary'!I27,'3a) Results summary'!I27,'3a) Results summary'!I27,'3a) Results summary'!I27,'3a) Results summary'!I27)","v":"Not reported"},{"$f":"CHOOSE(IntChoice,\"Social care costs\",\"Social care costs\",\"Social care costs\",\"NHS & Social care costs\", \"Social care costs\",\"Social care costs\",\"Social care costs\",\"Social care costs\",\"Social care costs\",\"Social care costs\")","v":"Social care costs"},{"$f":"'3a) Results summary'!H27","v":"Not reported"},{"$f":"'3a) Results summary'!I27","v":"Not reported"}]
[null,"QALYs (monetised) ",{"$f":"-'3a) Results summary'!H32","v":-1021742.9411428575},{"$f":"-'3a) Results summary'!I32","v":-1455.1674876847292},"QALYs (monetised) ",{"$f":"-'3a) Results summary'!H32","v":-1021742.9411428575},{"$f":"-'3a) Results summary'!I32","v":-1455.1674876847292}]
[]
[]
[]
[]
[]
[]
[]
[]
[]
[]
[]
[]
[]
[]
[]
[]
[null,"3c) Sensitivity analysis","Intervention costs",{"$f":"'3a) Results summary'!I25","v":708.61710457476534},{"$f":"IF(D28=\"Not Reported\",0,D28)","v":708.61710457476534}]
[null,null,{"$f":"CHOOSE(IntChoice,\"NHS costs\",\"NHS costs\",\"NHS costs\",\"NHS and social care costs\",\"NHS costs\",\"NHS costs\",\"NHS costs\",\"NHS costs\",\"NHS costs\",\"NHS costs\")","v":"NHS costs"},{"$f":"CHOOSE(IntChoice,'3a) Results summary'!I26,'3a) Results summary'!I26,'3a) Results summary'!I26,'3a) Results summary'!I27,'3a) Results summary'!I26,'3a) Results summary'!I26,'3a) Results summary'!I26,'3a) Results summary'!I26,'3a) Results summary'!I26,'3a) Results summary'!I26)","v":-347.96396689991633},{"$f":"IF(D29=\"Not Reported\",0,D29)","v":-347.96396689991633}]
[null,null,"Social care costs",{"$f":"CHOOSE(IntChoice,'3a) Results summary'!I27,'3a) Results summary'!I27,'3a) Results summary'!I27,\"Not reported\",'3a) Results summary'!I27,'3a) Results summary'!I27,'3a) Results summary'!I27,'3a) Results summary'!I27,'3a) Results summary'!I27,'3a) Results summary'!I27)","v":"Not reported"},{"$f":"IF(D30=\"Not Reported\",0,D30)","v":0}]
[null,null,"£QALYs",{"$f":"'3a) Results summary'!I32","v":1455.1674876847292},1455.1674876847292]
[null,null,"QALYs",{"$f":"'3a) Results summary'!I31","v":2.4252791461412154E-2},2.4252791461412154E-2]
[]
[null,null,"Confidence Intervals","Lower ","Upper"]
[null,null,"NHS Costs",{"$f":"'3a) Results summary'!J26","v":"Not reported"},{"$f":"'3a) Results summary'!K26","v":"Not reported"}]
[null,null,"Social care costs",{"$f":"'3a) Results summary'!J27","v":"Not reported"},{"$f":"'3a) Results summary'!K27","v":"Not reported"}]
[null,null,"QALYs",{"$f":"'3a) Results summary'!J31","v":"Not reported"},{"$f":"'3a) Results summary'!K31","v":"Not reported"}]
[null,null,null,null,"Societal ROI (per £ spent on intervention)","NMB"]
[null,"Intervention costs","Intervention costs",null,{"$f":"(SensQALY-SensHC-SensSC)/(SensIC*I40)","v":2.5445779433544558},{"$f":"SensQALY-SensHC-SensSC-SensIC*I40","v":1094.5143500098802},"(£1 spent = £1 saved)","Intervention costs",{"$f":"'3a) Results summary'!I25","v":708.61710457476534},{"$f":"0.01*I39","v":7.0861710457476539}]
[null,null,{"$f":"D40*$I$39","v":531.46282843107406},0.75,3.3927705911392736,1271.6686261535715,{"$f":"1","v":1},"IC multiplier",1]
[null,null,595.04625973875261,{"$f":"D40+($D$60-$D$40)/20","v":0.83972889716772281},3.030237439650973,1208.0851948458931,{"$f":"1","v":1}]
[null,null,658.62969104643116,{"$f":"D41+($D$60-$D$40)/20","v":0.92945779433544562},2.7377014414880532,1144.5017635382144,{"$f":"1","v":1}]
[null,null,722.21312235410983,1.0191866915031684,2.496675010151018,1080.9183322305357,{"$f":"1","v":1}]
[null,null,785.79655366178838,1.1089155886708912,2.2946543175610876,1017.3349009228572,{"$f":"1","v":1}]
[null,null,849.37998496946705,1.198644485838614,2.122879613945063,953.75146961517851,{"$f":"1","v":1}]
[null,null,912.9634162771456,1.2883733830063369,1.9750314442361776,890.16803830749996,{"$f":"1","v":1}]
[null,null,976.54684758482415,1.3781022801740597,1.8464362043092082,826.5846069998214,{"$f":"1","v":1}]
[null,null,1040.1302788925027,1.4678311773417825,1.7335630845249135,763.00117569214285,{"$f":"1","v":1}]
[null,null,1103.7137102001814,1.5575600745095053,1.6336948956243464,699.41774438446419,{"$f":"1","v":1},null,null,{"$f":"SensQALY-SensHC-SensSC","v":1803.1314545846456},{"$f":"SensIC","v":708.61710457476534},{"$f":"J49/K49","v":2.5445779433544558}]
[null,null,1167.29714150786,1.6472889716772281,1.544706476583541,635.83431307678552,{"$f":"1","v":1}]
[null,null,1230.8805728155387,1.7370178688449509,1.4649117830011158,572.25088176910685,{"$f":"1","v":1}]
[null,null,1294.4640041232171,1.8267467660126737,1.3929560411422683,508.66745046142842,{"$f":"1","v":1}]
[null,null,1358.0474354308958,1.9164756631803965,1.3277381979021439,445.08401915374975,{"$f":"1","v":1}]
[null,null,1421.6308667385745,2.0062045603481193,1.2683541816458221,381.50058784607108,{"$f":"1","v":1}]
[null,null,1485.2142980462529,2.0959334575158421,1.2140547373915007,317.91715653839265,{"$f":"1","v":1},null,null,null,{"$f":"(D60-D40)/10","v":0.17945779433544556}]
[null,null,1548.7977293539316,2.185662354683565,1.1642136480512579,254.33372523071398,{"$f":"1","v":1}]
[null,null,1612.3811606616102,2.2753912518512878,1.118303474747103,190.75029392303531,{"$f":"1","v":1}]
[null,null,1675.9645919692889,2.3651201490190106,1.0758768193699924,127.16686261535665,{"$f":"1","v":1}]
[null,null,1739.5480232769673,2.4548490461867334,1.03655169645038,63.583431307678211,{"$f":"1","v":1}]
[null,null,1803.1314545846458,{"$f":"(SensQALY-SensHC-SensSC)/SensIC","v":2.5445779433544558},0.99999999999999989,0,{"$f":"1","v":1}]
[]
[null,null,null,null,"Societal ROI (per £ spent on intervention)","NMB","(£1 spent = £1 saved)"]
[null,"QALYs","Incremental QALYs",null,{"$f":"((SensQALY+I63*SensQALY)-SensHC-SensSC)/SensIC","v":2.5445779433544558},{"$f":"(SensQALY+I63*SensQALY)-SensHC-SensSC-SensIC","v":1094.5143500098802},{"$f":"1","v":1},"Multiplier",0]
[null,null,{"$f":"'3a) Results summary'!$I$31+D64*'3a) Results summary'!$I$31","v":6.0108856279141483E-3},{"$f":"((SensIC+SensHC+SensSC)/SensQALY)-1","v":-0.75215695737631361},1,0,{"$f":"1","v":1},"QALYs ",{"$f":"'3a) Results summary'!I32","v":1455.1674876847292}]
[null,null,{"$f":"'3a) Results summary'!$I$31+D65*'3a) Results summary'!$I$31","v":7.8350762112639506E-3},{"$f":"D64+($D$74-$D$64)/10","v":-0.67694126163868229},1.1544577943354453,109.45143500098789,{"$f":"1","v":1}]
[null,null,{"$f":"'3a) Results summary'!$I$31+D66*'3a) Results summary'!$I$31","v":9.6592667946137495E-3},{"$f":"D65+($D$74-$D$64)/10","v":-0.60172556590105097},1.3089155886708908,218.90287000197577,{"$f":"1","v":1}]
[null,null,{"$f":"'3a) Results summary'!$I$31+D67*'3a) Results summary'!$I$31","v":1.1483457377963548E-2},{"$f":"D66+($D$74-$D$64)/10","v":-0.52650987016341966},1.4633733830063365,328.35430500296388,{"$f":"1","v":1}]
[null,null,{"$f":"'3a) Results summary'!$I$31+D68*'3a) Results summary'!$I$31","v":1.3307647961313349E-2},-0.45129417442578829,1.6178311773417817,437.80574000395177,{"$f":"1","v":1}]
[null,null,{"$f":"'3a) Results summary'!$I$31+D69*'3a) Results summary'!$I$31","v":1.513183854466315E-2},-0.37607847868815691,1.7722889716772274,547.25717500493988,{"$f":"1","v":1}]
[null,null,{"$f":"'3a) Results summary'!$I$31+D70*'3a) Results summary'!$I$31","v":1.6956029128012952E-2},-0.30086278295052554,1.9267467660126731,656.70861000592799,{"$f":"1","v":1}]
[null,null,{"$f":"'3a) Results summary'!$I$31+D71*'3a) Results summary'!$I$31","v":1.8780219711362751E-2},-0.22564708721289417,2.0812045603481186,766.16004500691611,{"$f":"1","v":1}]
[null,null,{"$f":"'3a) Results summary'!$I$31+D72*'3a) Results summary'!$I$31","v":2.060441029471255E-2},-0.1504313914752628,2.2356623546835643,875.61148000790399,{"$f":"1","v":1}]
[null,null,{"$f":"'3a) Results summary'!$I$31+D73*'3a) Results summary'!$I$31","v":2.2428600878062352E-2},-7.5215695737631441E-2,2.39012014901901,985.06291500889211,{"$f":"1","v":1}]
[null,null,{"$f":"'3a) Results summary'!$I$31+D74*'3a) Results summary'!$I$31","v":2.4252791461412154E-2},0,2.5445779433544558,1094.5143500098802,{"$f":"1","v":1}]
[null,null,{"$f":"'3a) Results summary'!$I$31+D75*'3a) Results summary'!$I$31","v":2.6076982044761953E-2},{"$f":"D74+($D$74-$D$64)/10","v":7.5215695737631358E-2},2.6990357376899015,1203.9657850108683,{"$f":"1","v":1}]
[null,null,{"$f":"'3a) Results summary'!$I$31+D76*'3a) Results summary'!$I$31","v":2.7901172628111755E-2},{"$f":"D75+($D$74-$D$64)/10","v":0.15043139147526272},2.8534935320253467,1313.4172200118562,{"$f":"1","v":1}]
[null,null,{"$f":"'3a) Results summary'!$I$31+D77*'3a) Results summary'!$I$31","v":2.9725363211461554E-2},0.22564708721289406,3.0079513263607915,1422.8686550128439,{"$f":"1","v":1}]
[null,null,{"$f":"'3a) Results summary'!$I$31+D78*'3a) Results summary'!$I$31","v":3.1549553794811357E-2},0.30086278295052543,3.1624091206962373,1532.320090013832,{"$f":"1","v":1}]
[null,null,{"$f":"'3a) Results summary'!$I$31+D79*'3a) Results summary'!$I$31","v":3.3373744378161159E-2},0.3760784786881568,3.316866915031683,1641.7715250148201,{"$f":"1","v":1}]
[null,null,{"$f":"'3a) Results summary'!$I$31+D80*'3a) Results summary'!$I$31","v":3.5197934961510954E-2},0.45129417442578817,3.4713247093671287,1751.2229600158082,{"$f":"1","v":1}]
[null,null,{"$f":"'3a) Results summary'!$I$31+D81*'3a) Results summary'!$I$31","v":3.7022125544860757E-2},0.52650987016341955,3.6257825037025744,1860.6743950167963,{"$f":"1","v":1}]
[null,null,{"$f":"'3a) Results summary'!$I$31+D82*'3a) Results summary'!$I$31","v":3.8846316128210559E-2},0.60172556590105086,3.7802402980380196,1970.125830017784,{"$f":"1","v":1}]
[null,null,{"$f":"'3a) Results summary'!$I$31+D83*'3a) Results summary'!$I$31","v":4.0670506711560361E-2},0.67694126163868218,3.9346980923734654,2079.5772650187719,{"$f":"1","v":1}]
[null,null,{"$f":"'3a) Results summary'!$I$31+D84*'3a) Results summary'!$I$31","v":4.2494697294910157E-2},0.7521569573763135,4.0891558867089106,2189.0287000197604,1]
[]
[]
[]
[null,{"$f":"CHOOSE(IntChoice,\"Incremental NHS Costs (per person)\",\"Incremental NHS Costs (per person)\",\"Incremental NHS Costs (per person)\",\"Incremental NHS and Social Care Costs (per person)\",\"Incremental NHS Costs (per person)\",\"Incremental NHS Costs (per person)\",\"Incremental NHS Costs (per person)\",\"Incremental NHS Costs (per person)\",\"Incremental NHS Costs (per person)\",\"Incremental NHS Costs (per person)\")","v":"Incremental NHS Costs (per person)"},"Incremental healthcare costs",null,"ROI (per £ spent on intervention)","NMB"]
[null,null,null,null,{"$f":"(SensQALY-(SensHC+I89*SensHC)-SensSC)/SensIC","v":2.5445779433544558},{"$f":"SensQALY-(SensHC+I89*SensHC)-SensSC-SensIC","v":1094.5143500098802},"(£1 spent = £1 saved)","Multiplier",0]
[null,null,{"$f":"SensHC+SensHC*D90","v":746.55038310996383},{"$f":"(SensQALY-SensIC-SensSC)/SensHC-1","v":-3.1454818720488134},1,0,{"$f":"1","v":1},"HC Cost",{"$f":"'3a) Results summary'!I26","v":-347.96396689991633}]
[null,null,637.09894810897595,{"$f":"D90+($D$100-$D$90)/10","v":-2.8309336848439322},1.1544577943354453,109.45143500098789,{"$f":"1","v":1}]
[null,null,527.64751310798783,{"$f":"D91+($D$100-$D$90)/10","v":-2.5163854976390509},1.308915588670891,218.902870001976,{"$f":"1","v":1}]
[null,null,418.19607810699989,-2.2018373104341697,1.4633733830063365,328.35430500296388,{"$f":"1","v":1}]
[null,null,308.74464310601189,-1.8872891232292885,1.6178311773417822,437.805740003952,{"$f":"1","v":1}]
[null,null,199.29320810502401,-1.5727409360244073,1.7722889716772274,547.25717500493988,{"$f":"1","v":1}]
[null,null,89.841773104036008,-1.2581927488195261,1.9267467660126729,656.70861000592777,{"$f":"1","v":1}]
[null,null,-19.609661896951991,-0.94364456161464483,2.0812045603481186,766.16004500691588,{"$f":"1","v":1}]
[null,null,-129.06109689794002,-0.62909637440976351,2.2356623546835639,875.61148000790376,{"$f":"1","v":1}]
[null,null,-238.51253189892802,-0.3145481872048822,2.3901201490190096,985.06291500889188,{"$f":"1","v":1}]
[null,null,-347.96396689991633,0,2.5445779433544558,1094.5143500098802,{"$f":"1","v":1}]
[null,null,-457.41540190090433,0.31454818720488131,2.699035737689901,1203.9657850108681,{"$f":"1","v":1}]
[null,null,-566.86683690189238,0.62909637440976263,2.8534935320253467,1313.4172200118562,{"$f":"1","v":1}]
[null,null,-676.31827190288027,0.94364456161464394,3.0079513263607915,1422.8686550128439,{"$f":"1","v":1}]
[null,null,-785.76970690386838,1.2581927488195253,3.1624091206962381,1532.3200900138324,{"$f":"1","v":1}]
[null,null,-895.22114190485627,1.5727409360244065,3.316866915031683,1641.7715250148201,{"$f":"1","v":1}]
[null,null,-1004.6725769058444,1.8872891232292877,3.4713247093671287,1751.2229600158082,{"$f":"1","v":1}]
[null,null,-1114.1240119068323,2.2018373104341689,3.6257825037025744,1860.6743950167963,{"$f":"1","v":1}]
[null,null,-1223.5754469078202,2.5163854976390501,3.7802402980380196,1970.125830017784,{"$f":"1","v":1}]
[null,null,-1333.0268819088083,2.8309336848439313,3.9346980923734654,2079.5772650187719,{"$f":"1","v":1}]
[null,null,-1442.4783169097961,3.1454818720488125,4.0891558867089106,2189.0287000197604,{"$f":"1","v":1}]
[]
[null,"Social care costs","Incremental social care costs",null,"ROI (per £ spent on intervention)","NMB","(£1 spent = £1 saved)"]
[null,null,null,null,{"$f":"(SensQALY-SensHC-(SensSC+J113*SensSC))/SensIC","v":2.5445779433544558},{"$f":"SensQALY-SensHC-(SensSC+SensSC*J113)-SensIC","v":1094.5143500098802},{"$f":"1","v":1},null,"Multiplier",0]
[null,null,{"$f":"SensSC+SensSC*D114","v":0},{"$f":"IF(D30=\"Not reported\",0,(SensQALY-SensIC-SensHC)/SensSC-1)","v":0},2.5445779433544558,1094.5143500098802,{"$f":"1","v":1},null,"SC Cost",{"$f":"'3a) Results summary'!I27","v":"Not reported"}]
[null,null,0,{"$f":"D114+($D$124-$D$114)/10","v":0},2.5445779433544558,1094.5143500098802,{"$f":"1","v":1}]
[null,null,0,{"$f":"D115+($D$124-$D$114)/10","v":0},2.5445779433544558,1094.5143500098802,{"$f":"1","v":1}]
[null,null,0,0,2.5445779433544558,1094.5143500098802,{"$f":"1","v":1}]
[null,null,0,0,2.5445779433544558,1094.5143500098802,{"$f":"1","v":1}]
[null,null,0,0,2.5445779433544558,1094.5143500098802,{"$f":"1","v":1}]
[null,null,0,0,2.5445779433544558,1094.5143500098802,{"$f":"1","v":1}]
[null,null,0,0,2.5445779433544558,1094.5143500098802,{"$f":"1","v":1}]
[null,null,0,0,2.5445779433544558,1094.5143500098802,{"$f":"1","v":1}]
[null,null,0,0,2.5445779433544558,1094.5143500098802,{"$f":"1","v":1}]
[null,null,0,0,2.5445779433544558,1094.5143500098802,{"$f":"1","v":1}]
[null,null,0,{"$f":"D124+($D$124-$D$114)/10","v":0},2.5445779433544558,1094.5143500098802,{"$f":"1","v":1}]
[null,null,0,{"$f":"D125+($D$124-$D$114)/10","v":0},2.5445779433544558,1094.5143500098802,{"$f":"1","v":1}]
[null,null,0,0,2.5445779433544558,1094.5143500098802,{"$f":"1","v":1}]
[null,null,0,0,2.5445779433544558,1094.5143500098802,{"$f":"1","v":1}]
[null,null,0,0,2.5445779433544558,1094.5143500098802,{"$f":"1","v":1}]
[null,null,0,0,2.5445779433544558,1094.5143500098802,{"$f":"1","v":1}]
[null,null,0,0,2.5445779433544558,1094.5143500098802,{"$f":"1","v":1}]
[null,null,0,0,2.5445779433544558,1094.5143500098802,{"$f":"1","v":1}]
[null,null,0,0,2.5445779433544558,1094.5143500098802,{"$f":"1","v":1}]
[null,null,0,{"$f":"D133+($D$124-$D$114)/10","v":0},2.5445779433544558,1094.5143500098802,1]