{"text_format":"1","workbook":"xlsx","n_sheets":8,"sheets":["Title","Notes","Interactive Region Table","NUTS1 (Summary Data)","NUTS2","NUTS3","VlookupList","Lists"],"not_rendered":{"charts":2,"images":2,"macros":1,"external_links":0,"defined_names":96,"comments":0,"pivot_tables":0},"unopened":[],"bounds":{"document_bytes":16777216,"sheet_cells":100000,"rows_first":2000,"rows_last":500,"rows_between":2000,"halvings":0,"cell_chars":16384,"cell_head_chars":4096},"cells_cut":0,"cells_raw":0,"read":"whole","date_system":"1900"}

{"sheet":"Title","index":0,"n_rows":22,"n_cols":5,"rows_kept":22,"cut":false,"hidden":false,"merged":[[21,0,21,4],[1,0,2,3],[12,0,12,4],[13,0,13,4],[14,0,14,4],[15,0,15,4]]}
[]
[]
[]
[]
[]
[]
[]
[]
[]
[]
[]
[]
["Regional Trade in Goods Statistics dis-aggregated by smaller geographical areas\n\n"]
[2018]
["Interactive Data Tool"]
[]
[]
["Contents",null,null,null,"Page"]
[]
["Notes",null,null,null,1]
["Interactive Region Table",null,null,null,2]
["HM Revenue & Customs: Trade Statistics & Customs Analysis                            7 November 2019"]

{"sheet":"Notes","index":1,"n_rows":24,"n_cols":2,"rows_kept":24,"cut":false,"hidden":false,"merged":[]}
["Notes to Tables"]
[]
[]
["General"]
[]
["(a)","This release uses the same allocation methodology as the Regional Trade Statistics."]
["(b)","Data is compiled by merging trade data collected by HMRC with employment data from the Interdepartmental Business Register (IDBR). A business’ trade is allocated to a region based on the proportion of its employees employed in that region. Where a trader is not matched with the IDBR, its trade is matched with Office for National Statistics postcode data to obtain the region in which the Head Office of the VAT registered business (importer or exporter) is based."]
["(c)","Not all trade can be assigned to a NUTS1 region or smaller areas. Where appropriate, this is referred to in the tables as the ‘Unallocated Trade’. Un-allocated Trade is split into:\ni. ‘Unallocated – Known’: where we have virtually full details of the trade but it is not appropriate to allocate it to a region. This covers: \n• trade going into or out of the Channel Islands or the Isle of Man; \n• trade carried out by the UK Government;\n• trade carried out by overseas based traders who have a VAT presence in the UK; and\n• parcel post trade that is dealt with centrally (trade with non-EU countries only).\nii. ‘Unallocated – Unknown’: This includes:\n• Trade where business details submitted are invalid\n• Un-registered businesses (Non-EU only)\n• Private Individuals (non-EU only); and\n• Low Value Trade (non-EU only).\n"]
["(d)","Certain allocations made in the RTS have not been allocated to areas smaller than NUTS1. These are Below Threshold Trade Allocations and Fixed Link Energy Allocations."]
["(e)","Like the RTS, this release does not include estimates for late-response. It also excludes trade in non-monetary gold, which is included in OTS data from 2005 onwards."]
["(f)","More information can be found in the RTS methodology document which includes additional information concerning this release. "]
[]
["NUTS1 data"]
[]
["(g)","This is the annual NUTS1 data that replicates already published RTS data. If looking for NUTS1 data you are advised to consult RTS products rather than summing the data in this release. Likewise for UK data, please consult the OTS."]
[]
[]
["NUTS2 data"]
[]
["(h)","These are totals for all NUTS2 and NUTS3 in the UK. All values are rounded to nearest £million so there may be rounding errors when summing. See note (g) for accessing NUTS1 data if required."]
["(i)"," The number of businesses for a high level region will be less than the sums of the business counts of their constituent smaller level regions."]
["(j)","The business counts at NUTS2 and NUTS3 total level include businesses under the Intrastat threshold (Below Threshold Traders)"]
["(k)","In the RTS there are two methods used to allocate a business' trade to regions for multi-branch businesses. This release uses the 'Whole Number Method' where a business counts as 1 in each region they trade."]
["(l)","All Stores and Provisions data has been moved to residual 'Other' areas. "]

{"sheet":"Interactive Region Table","index":2,"n_rows":48,"n_cols":8,"rows_kept":48,"cut":false,"hidden":false,"merged":[[46,5,46,7],[47,5,47,7],[21,5,21,7],[22,5,22,7],[23,5,23,7],[24,5,24,7],[25,5,25,7],[32,5,33,17],[37,5,39,5],[43,5,43,7],[3,3,6,14],[44,5,44,7],[45,5,45,7],[10,1,11,2],[9,1,9,2],[15,5,17,5],[10,5,11,17]]}
[]
[]
[]
[null,null,null,"Regional trade in goods statistics disaggregated by smaller geographical areas - Interactive spreadsheet"]
[]
[]
[]
[]
[]
[null,"Using the drop-down lists below\n"]
[null,"1. Select either EU or Non-EU\n2. Select either imports or exports\n3. Select the NUTS1 area, then the NUTS2 area, and then the NUTS3 areas",null,null,null,{"$f":"IF($C$15=\"Please Select\",\" \",\"Total value (£ million) of \"&IF($C$13=\"Please Select\",\" \",$C$13)&\" \"&IF($C$14=\"Please Select\",\" \",$C$14)& \" in 2018 (\"&IF($C$15=\"Please Select\",\" \",$C$15)&\", \"&IF($C$16=\"Please Select NUTS 1\",\" \",$C$16)&\", \"&IF($C$17=\"Please Select NUTS 2\",\" \",$C$17)&\", \"&IF($C$18=\"Please Select NUTS 2\",\" \",$C$18)&\", and \"&IF($C$19=\"Please Select NUTS 2\",\" \",$C$19)&\")\")","v":" "}]
[]
[null,"Select EU/Non-EU","Please Select",null,null,null,null,"Total value (£ million)"]
[null,"Select Flow","Please Select",null,null,"NUTS 1 Area",{"$f":"IF($C15=\"Please Select\",\" \",$C15)","v":" "},{"$f":"IF(ISERROR(VLOOKUP((LEFT($C$14,3))&$C$13&$G14,'NUTS1 (Summary Data)'!$A:$E,5,FALSE)),\"S\",VLOOKUP((LEFT($C$14,3))&$C$13&$G14,'NUTS1 (Summary Data)'!$A:$E,5,FALSE))","v":"S"}]
[null,"Select NUTS1 area","Please Select",null,null,"NUTS 2 Area",{"$f":"IF($C16=\"Please Select\",\" \",$C16)","v":" "},{"$f":"IF(ISERROR(VLOOKUP((LEFT($C$14,3))&$C$13&$G14&$G15,NUTS2!$A:$F,6,FALSE)),\"S\",VLOOKUP((LEFT($C$14,3))&$C$13&$G14&$G15,NUTS2!$A:$F,6,FALSE))","v":"S"}]
[null,"Select NUTS2 area","Please Select",null,null,"NUTS 3 Areas",{"$f":"IF($C17=\"Please Select\",\" \",$C17)","v":" "},{"$f":"IF(ISERROR(VLOOKUP((LEFT($C$14,3))&$C$13&$G14&$G15&$G16,NUTS3!$A:$G,7,FALSE)),\"S\",VLOOKUP((LEFT($C$14,3))&$C$13&$G14&$G15&$G16,NUTS3!$A:$G,7,FALSE))","v":"S"}]
[null,"Select NUTS3 area","Please Select",null,null,null,{"$f":"IF($C18=\"Please Select\",\" \",$C18)","v":" "},{"$f":"IF(ISERROR(VLOOKUP((LEFT($C$14,3))&$C$13&$G$14&$G$15&$G17,NUTS3!$A:$G,7,FALSE)),\"S\",VLOOKUP((LEFT($C$14,3))&$C$13&$G$14&$G$15&$G17,NUTS3!$A:$G,7,FALSE))","v":"S"}]
[null,"Select NUTS3 area","Please Select",null,null,null,{"$f":"IF($C19=\"Please Select\",\" \",$C19)","v":" "},{"$f":"IF(ISERROR(VLOOKUP((LEFT($C$14,3))&$C$13&$G$14&$G$15&$G18,NUTS3!$A:$G,7,FALSE)),\"S\",VLOOKUP((LEFT($C$14,3))&$C$13&$G$14&$G$15&$G18,NUTS3!$A:$G,7,FALSE))","v":"S"}]
[null,"Select NUTS3 area","Please Select"]
[]
[]
[null,null,null,null,null,{"$f":"IF(ISERROR(\"The total value of \"&$C$13&\" \"&$C$14&\" for \"&$G$14&\" was £\"&ROUND($H$14,0)&\" million in 2018.\"),\" \",(\"The total value of \"&$C$13&\" \"&$C$14&\" for \"&$G$14&\" was £\"&ROUND($H$14,0)&\" million in 2018.\"))","v":" "}]
[null,null,null,null,null,{"$f":"IF(ISERROR(\"The total value of \"&$C$13&\" \"&$C$14&\" for \"&$G$15&\" was £\"&ROUND($H$15,0)&\" million in 2017.\"), \" \",(\"The total value of \"&$C$13&\" \"&$C$14&\" for \"&$G$15&\" was £\"&ROUND($H$15,0)&\" million in 2017.\"))","v":" "}]
[null,null,null,null,null,{"$f":"IF(ISERROR(\"The total value of \"&$C$13&\" \"&$C$14&\" for \"&$G$16&\" was £\"&ROUND($H$16,0)&\" million in 2018.\"),\" \",(\"The total value of \"&$C$13&\" \"&$C$14&\" for \"&$G$16&\" was £\"&ROUND($H$16,0)&\" million in 2018.\"))","v":" "}]
[null,null,null,null,null,{"$f":"IF(ISERROR(\"The total value of \"&$C$13&\" \"&$C$14&\" for \"&$G$17&\" was £\"&ROUND($H$17,0)&\" million in 2018.\"),\" \",(\"The total value of \"&$C$13&\" \"&$C$14&\" for \"&$G$17&\" was £\"&ROUND($H$17,0)&\" million in 2018.\"))","v":" "}]
[null,null,null,null,null,{"$f":"IF(ISERROR(\"The total value of \"&$C$13&\" \"&$C$14&\" for \"&$G$18&\" was £\"&ROUND($H$18,0)&\" million in 2018.\"),\" \",(\"The total value of \"&$C$13&\" \"&$C$14&\" for \"&$G$18&\" was £\"&ROUND($H$18,0)&\" million in 2018.\"))","v":" "}]
[]
[]
[]
[]
{"$rows_left_out":19}
{"sheet":"NUTS1 (Summary Data)","index":3,"n_rows":59,"n_cols":15,"rows_kept":59,"cut":false,"hidden":true,"merged":[[0,1,0,3]]}
[null,"Table 1 - NUTS1 by Flow - 2018"]
[]
[null,"Flow","EU / Non-EU","NUTS1","Statistical Value (£ million)","Business Count",null,"Flow","EU / Non-EU","Statistical Value (£ million)","Business Count",null,"Flow","Statistical Value (£ million)","Business Count"]
[{"$f":"$B4&$C4&$D4","v":"ExpEUEast"},"Exp","EU","East",14874,13883,null,"Exp","EU",170003,121430,null,"Exp",339506,156330]
[{"$f":"$B5&$C5&$D5","v":"ExpEUEast Midlands"},"Exp","EU","East Midlands",11391,10456,null,"Exp","Non-EU",169503,77312,null,"Imp",481828,243308]
["ExpEULondon","Exp","EU","London",16139,20813,null,"Imp","EU",262984,169066]
["ExpEUNorth East","Exp","EU","North East",7896,3369,null,"Imp","Non-EU",218844,120245]
["ExpEUNorthern Ireland","Exp","EU","Northern Ireland",5392,8412]
["ExpEUNorth West","Exp","EU","North West",14290,12911]
["ExpEUScotland","Exp","EU","Scotland",17255,6861]
["ExpEUSouth East","Exp","EU","South East",22690,21938]
["ExpEUSouth West","Exp","EU","South West",9681,11172]
["ExpEUWales","Exp","EU","Wales",10534,4206]
["ExpEUWest Midlands","Exp","EU","West Midlands",15015,12417]
["ExpEUYorkshire and the Humber","Exp","EU","Yorkshire and the Humber",10907,9903]
["ExpEUUnallocated-Known","Exp","EU","Unallocated-Known",13832,2349]
["ExpEUUnallocated-Unknown","Exp","EU","Unallocated-Unknown",107,"N/A"]
["ExpNon-EUEast","Exp","Non-EU","East",13405,9180]
["ExpNon-EUEast Midlands","Exp","Non-EU","East Midlands",10779,6770]
["ExpNon-EULondon","Exp","Non-EU","London",21327,16232]
["ExpNon-EUNorth East","Exp","Non-EU","North East",5273,2637]
["ExpNon-EUNorthern Ireland","Exp","Non-EU","Northern Ireland",3503,1579]
["ExpNon-EUNorth West","Exp","Non-EU","North West",13572,8748]
["ExpNon-EUScotland","Exp","Non-EU","Scotland",14978,5360]
["ExpNon-EUSouth East","Exp","Non-EU","South East",24305,14451]
["ExpNon-EUSouth West","Exp","Non-EU","South West",11776,7353]
["ExpNon-EUWales","Exp","Non-EU","Wales",6656,2992]
["ExpNon-EUWest Midlands","Exp","Non-EU","West Midlands",18424,8099]
["ExpNon-EUYorkshire and the Humber","Exp","Non-EU","Yorkshire and the Humber",7267,6798]
["ExpNon-EUUnallocated-Known","Exp","Non-EU","Unallocated-Known",8426,5862]
{"$rows_left_out":30}
{"sheet":"NUTS2","index":4,"n_rows":250,"n_cols":7,"rows_kept":250,"cut":false,"hidden":true,"merged":[[0,1,0,4]]}
[null,"Table 2 - NUTS2 by EU/Non-EU - 2018"]
[]
[null,"Flow","EU / Non-EU","NUTS1","NUTS2","Statistical Value (£ million) ","Business Count"]
[{"$f":"$B4&$C4&$D4&$E4","v":"ExpEUEastBedfordshire and Hertfordshire"},"Exp","EU","East","Bedfordshire and Hertfordshire",6538,5056]
[{"$f":"$B5&$C5&$D5&$E5","v":"ExpEUEastEA BTTA"},"Exp","EU","East","EA BTTA",414,"N/A"]
["ExpEUEastEA Energy","Exp","EU","East","EA Energy",957,"N/A"]
["ExpEUEastEA Other","Exp","EU","East","EA Other",132,187]
["ExpEUEastEast Anglia","Exp","EU","East","East Anglia",4433,5986]
["ExpEUEastEssex","Exp","EU","East","Essex",2399,3838]
["ExpEUEast MidlandsDerbyshire and Nottinghamshire","Exp","EU","East Midlands","Derbyshire and Nottinghamshire",6588,4459]
["ExpEUEast MidlandsEM BTTA","Exp","EU","East Midlands","EM BTTA",302,"N/A"]
["ExpEUEast MidlandsEM Energy","Exp","EU","East Midlands","EM Energy",72,"N/A"]
["ExpEUEast MidlandsEM Other","Exp","EU","East Midlands","EM Other",77,141]
["ExpEUEast MidlandsLeicestershire, Rutland and Northamptonshire","Exp","EU","East Midlands","Leicestershire, Rutland and Northamptonshire",3590,5072]
["ExpEUEast MidlandsLincolnshire","Exp","EU","East Midlands","Lincolnshire",761,1702]
["ExpEULondonInner London - East","Exp","EU","London","Inner London - East",2761,5510]
["ExpEULondonInner London - West","Exp","EU","London","Inner London - West",7505,7744]
["ExpEULondonLO BTTA","Exp","EU","London","LO BTTA",659,"N/A"]
["ExpEULondonLO Other","Exp","EU","London","LO Other",233,360]
["ExpEULondonOuter London - East and North East","Exp","EU","London","Outer London - East and North East",1055,2307]
["ExpEULondonOuter London - South","Exp","EU","London","Outer London - South",854,2268]
["ExpEULondonOuter London - West and North West","Exp","EU","London","Outer London - West and North West",3070,4776]
["ExpEUNorth EastNE BTTA","Exp","EU","North East","NE BTTA",71,"N/A"]
["ExpEUNorth EastNE Other","Exp","EU","North East","NE Other",46,100]
["ExpEUNorth EastNorthumberland and Tyne and Wear","Exp","EU","North East","Northumberland and Tyne and Wear",4826,2098]
["ExpEUNorth EastTees Valley and Durham","Exp","EU","North East","Tees Valley and Durham",2953,1599]
["ExpEUNorthern IrelandNorthern Ireland","Exp","EU","Northern Ireland","Northern Ireland",5392,8412]
["ExpEUNorth WestCheshire","Exp","EU","North West","Cheshire",3778,2698]
["ExpEUNorth WestCumbria","Exp","EU","North West","Cumbria",744,951]
["ExpEUNorth WestGreater Manchester","Exp","EU","North West","Greater Manchester",3973,5847]
{"$rows_left_out":221}
{"sheet":"NUTS3","index":5,"n_rows":789,"n_cols":8,"rows_kept":789,"cut":false,"hidden":true,"merged":[[0,1,0,4]]}
[null,"Table 5 - NUTS3 by EU/Non-EU - 2018"]
[]
[null,"Flow","EU / Non-EU","NUTS1","NUTS2","NUTS3","Statistical Value (£ million)","Business Count"]
[{"$f":"$B4&$C4&$D4&$E4&$F4","v":"ExpEUEastBedfordshire and HertfordshireBedford"},"Exp","EU","East","Bedfordshire and Hertfordshire","Bedford",160,561]
[{"$f":"$B5&$C5&$D5&$E5&$F5","v":"ExpEUEastBedfordshire and HertfordshireCentral Bedfordshire"},"Exp","EU","East","Bedfordshire and Hertfordshire","Central Bedfordshire",876,813]
["ExpEUEastBedfordshire and HertfordshireHertfordshire","Exp","EU","East","Bedfordshire and Hertfordshire","Hertfordshire",4541,3635]
["ExpEUEastBedfordshire and HertfordshireLuton","Exp","EU","East","Bedfordshire and Hertfordshire","Luton",962,509]
["ExpEUEastEA BTTAEA BTTA","Exp","EU","East","EA BTTA","EA BTTA",414,"N/A"]
["ExpEUEastEA EnergyEA Energy","Exp","EU","East","EA Energy","EA Energy",957,"N/A"]
["ExpEUEastEA OtherEA Other","Exp","EU","East","EA Other","EA Other",132,187]
["ExpEUEastEast AngliaBreckland and South Norfolk","Exp","EU","East","East Anglia","Breckland and South Norfolk",245,728]
["ExpEUEastEast AngliaCambridgeshire CC","Exp","EU","East","East Anglia","Cambridgeshire CC",1605,2288]
["ExpEUEastEast AngliaNorth and West Norfolk","Exp","EU","East","East Anglia","North and West Norfolk",364,647]
["ExpEUEastEast AngliaNorwich and East Norfolk","Exp","EU","East","East Anglia","Norwich and East Norfolk",284,910]
["ExpEUEastEast AngliaPeterborough","Exp","EU","East","East Anglia","Peterborough",586,637]
["ExpEUEastEast AngliaSuffolk","Exp","EU","East","East Anglia","Suffolk",1350,2049]
["ExpEUEastEssexEssex Haven Gateway","Exp","EU","East","Essex","Essex Haven Gateway",439,1131]
["ExpEUEastEssexEssex Thames Gateway","Exp","EU","East","Essex","Essex Thames Gateway",970,812]
["ExpEUEastEssexHeart of Essex","Exp","EU","East","Essex","Heart of Essex",350,892]
["ExpEUEastEssexSouthend-on-Sea","Exp","EU","East","Essex","Southend-on-Sea",75,377]
["ExpEUEastEssexThurrock","Exp","EU","East","Essex","Thurrock",178,488]
["ExpEUEastEssexWest Essex","Exp","EU","East","Essex","West Essex",387,1010]
["ExpEUEast MidlandsDerbyshire and NottinghamshireDerby","Exp","EU","East Midlands","Derbyshire and Nottinghamshire","Derby",2158,606]
["ExpEUEast MidlandsDerbyshire and NottinghamshireEast Derbyshire","Exp","EU","East Midlands","Derbyshire and Nottinghamshire","East Derbyshire",650,777]
["ExpEUEast MidlandsDerbyshire and NottinghamshireNorth Nottinghamshire","Exp","EU","East Midlands","Derbyshire and Nottinghamshire","North Nottinghamshire",685,1079]
["ExpEUEast MidlandsDerbyshire and NottinghamshireNottingham","Exp","EU","East Midlands","Derbyshire and Nottinghamshire","Nottingham",290,875]
["ExpEUEast MidlandsDerbyshire and NottinghamshireSouth Nottinghamshire","Exp","EU","East Midlands","Derbyshire and Nottinghamshire","South Nottinghamshire",342,744]
["ExpEUEast MidlandsDerbyshire and NottinghamshireSouth and West Derbyshire","Exp","EU","East Midlands","Derbyshire and Nottinghamshire","South and West Derbyshire",2464,1327]
["ExpEUEast MidlandsEM BTTAEM BTTA","Exp","EU","East Midlands","EM BTTA","EM BTTA",302,"N/A"]
["ExpEUEast MidlandsEM EnergyEM Energy","Exp","EU","East Midlands","EM Energy","EM Energy",72,"N/A"]
{"$rows_left_out":760}
{"sheet":"VlookupList","index":6,"n_rows":72,"n_cols":6,"rows_kept":72,"cut":false,"hidden":true,"merged":[]}
[null,"Vlookup values for NUTS 3 list",null,null,"Vlookup values for NUTS2 list"]
[null,"Please Select","PleaseSelectNUTS3",null,"Please Select","PleaseSelectNUTS2"]
[null,"Bedfordshire and Hertfordshire","BedfordshireandHertfordshire",null,"East","East"]
[null,"EA BTTA","EABTTA",null,"East Midlands","EastMidlands"]
[null,"EA Energy","EAEnergy",null,"London","London"]
[null,"EA Other","EAOther",null,"North East","NorthEast"]
[null,"East Anglia","EastAnglia",null,"North West","NorthWest"]
[null,"Essex","Essex",null,"Northern Ireland","NorthernIreland"]
[null,"Derbyshire and Nottinghamshire","DerbyshireandNottinghamshire",null,"Scotland","Scotland"]
[null,"EM BTTA","EMBTTA",null,"South East","SouthEast"]
[null,"EM Energy","EMEnergy",null,"South West","SouthWest"]
[null,"EM Other","EMOther",null,"Wales","Wales"]
[null,"Leicestershire, Rutland and Northamptonshire","LeicestershireRutlandandNorthamptonshire",null,"West Midlands","WestMidlands"]
[null,"Lincolnshire","Lincolnshire",null,"Yorkshire and the Humber","YorkshireandtheHumber"]
[null,"Inner London - East","InnerLondonEast"]
[null,"Inner London - West","InnerLondonWest"]
[null,"LO BTTA","LOBTTA"]
[null,"LO Other","LOOther"]
[null,"Outer London - East and North East","OuterLondonEastandNorthEast"]
[null,"Outer London - South","OuterLondonSouth"]
[null,"Outer London - West and North West","OuterLondonWestandNorthWest"]
[null,"NE BTTA","NEBTTA"]
[null,"NE Energy","NEEnergy"]
[null,"NE Other","NEOther"]
[null,"Northumberland and Tyne and Wear","NorthumberlandandTyneandWear"]
[null,"Tees Valley and Durham","TeesValleyandDurham"]
[null,"Cheshire","Cheshire"]
[null,"Cumbria","Cumbria"]
[null,"Greater Manchester","GreaterManchester"]
[null,"Lancashire","Lancashire"]
{"$rows_left_out":43}
{"sheet":"Lists","index":7,"n_rows":278,"n_cols":15,"rows_kept":278,"cut":false,"hidden":true,"merged":[[0,2,0,3],[0,7,0,9]]}
["NUTS 1",null,"NUTS 2",null,null,null,null,"NUTS 3",null,null,null,null,"EUNEU",null,"Flow"]
["Please Select",null,null,"Please Select",null,null,null,null,null,"Please Select",null,null,"Please Select",null,"Please Select"]
["East",null,"East","Please Select",null,null,null,"East","Bedfordshire and Hertfordshire","Please Select",null,null,"EU",null,"Exports"]
["East Midlands",null,"East","Bedfordshire and Hertfordshire",null,null,null,"East","Bedfordshire and Hertfordshire","Bedford",null,null,"Non-EU",null,"Imports"]
["London",null,"East","EA BTTA",null,null,null,"East","Bedfordshire and Hertfordshire","Central Bedfordshire"]
["North East",null,"East","EA Energy",null,null,null,"East","Bedfordshire and Hertfordshire","Hertfordshire"]
["North West",null,"East","EA Other",null,null,null,"East","Bedfordshire and Hertfordshire","Luton"]
["Northern Ireland",null,"East","East Anglia",null,null,null,"East","EA BTTA","Please Select"]
["Scotland",null,"East","Essex",null,null,null,"East","EA BTTA","EA BTTA"]
["South East",null,"East Midlands","Please Select",null,null,null,"East","EA Energy","Please Select"]
["South West",null,"East Midlands","Derbyshire and Nottinghamshire",null,null,null,"East","EA Energy","EA Energy"]
["Wales",null,"East Midlands","EM BTTA",null,null,null,"East","EA Other","Please Select"]
["West Midlands",null,"East Midlands","EM Energy",null,null,null,"East","EA Other","EA Other"]
["Yorkshire and The Humber",null,"East Midlands","EM Other",null,null,null,"East","East Anglia","Please Select"]
["Unallocated - Known",null,"East Midlands","Leicestershire, Rutland and Northamptonshire",null,null,null,"East","East Anglia","Breckland and South Norfolk"]
["Unallocated - Unknown",null,"East Midlands","Lincolnshire",null,null,null,"East","East Anglia","Cambridgeshire CC"]
[null,null,"London","Please Select",null,null,null,"East","East Anglia","North and West Norfolk"]
[null,null,"London","Inner London - East",null,null,null,"East","East Anglia","Norwich and East Norfolk"]
[null,null,"London","Inner London - West",null,null,null,"East","East Anglia","Peterborough"]
[null,null,"London","LO BTTA",null,null,null,"East","East Anglia","Suffolk"]
[null,null,"London","LO Other",null,null,null,"East","Essex","Please Select"]
[null,null,"London","LO Energy",null,null,null,"East","Essex","Essex Haven Gateway"]
[null,null,"London","Outer London - East and North East",null,null,null,"East","Essex","Essex Thames Gateway"]
[null,null,"London","Outer London - South",null,null,null,"East","Essex","Heart of Essex"]
[null,null,"London","Outer London - West and North West",null,null,null,"East","Essex","Southend-on-Sea"]
[null,null,"North East","Please Select",null,null,null,"East","Essex","Thurrock"]
[null,null,"North East","NE Energy",null,null,null,"East","Essex","West Essex"]
[null,null,"North East","NE BTTA",null,null,null,"East Midlands","Derbyshire and Nottinghamshire","Please Select"]
[null,null,"North East","NE Other",null,null,null,"East Midlands","Derbyshire and Nottinghamshire","Derby"]
[null,null,"North East","Northumberland and Tyne and Wear",null,null,null,"East Midlands","Derbyshire and Nottinghamshire","East Derbyshire"]
{"$rows_left_out":248}