{"text_format":"1","workbook":"xlsx","n_sheets":9,"sheets":["Guide to Ready Reckoners","Guidance","new drop down lookup","Key stage 2 Data Input","Single Measure Ready Reckoner","All Measures Ready Reckoner","Model values","Chart Data","KS2 Fine grades lookup"],"not_rendered":{"charts":2,"images":4,"macros":0,"external_links":3,"defined_names":17,"comments":0,"pivot_tables":0},"unopened":[],"bounds":{"document_bytes":16777216,"sheet_cells":100000,"rows_first":2000,"rows_last":500,"rows_between":2000,"halvings":0,"cell_chars":16384,"cell_head_chars":4096},"cells_cut":0,"cells_raw":0,"read":"whole","date_system":"1900"}

{"sheet":"Guide to Ready Reckoners","index":0,"n_rows":21,"n_cols":10,"rows_kept":21,"cut":false,"hidden":false,"merged":[[20,2,22,3]]}
[]
[null,"GUIDE TO 2018 KEY STAGE 2 TO 4 READY RECKONERS "]
[]
[null,"There are four key stage 2 to 4 ready reckoners."]
[]
[null,"This ready reckoner is the EBacc subject pupil ready reckoner. The aim is to help the user to understand how we arrive at a value added score for their pupil. "]
[null,"The ready reckoner allows the user to input, for an individual pupil, their key stage 2 prior attainment and key stage 4 attainment in any of the three subject areas in the English Baccalaureate. "]
[]
[null,"The aim of the EBacc subject school ready reckoner is to help the user understand how we arrive at a value added score for their school. "]
[null,"The ready reckoner allows the user to input the value added scores in any of the three subject areas in the English Baccalaureate, for all pupils in their school. "]
[null,"These value added scores can be copied and pasted directly from the pupil level file on the ",null,null,null,null,null,null,null,"Checking site."]
[]
[null,"The aim of the Progress 8 element breakdown pupil ready reckoner is to help the user to understand how we arrive at a value added score for their pupil. "]
[null,"The ready reckoner allows the user to input, for an individual pupil, their key stage 2 prior attainment and key stage 4 outcome in Attainment 8 or any of its elements. "]
[]
{"$rows_left_out":7}
{"sheet":"Guidance","index":1,"n_rows":49,"n_cols":18,"rows_kept":49,"cut":false,"hidden":false,"merged":[[39,17,41,18]]}
[]
[null,"2018 KEY STAGE 2 TO 4 INDIVIDUAL PUPIL READY RECKONER GUIDANCE"]
[]
[null,"This ready reckoner allows the user to calculate a value added score for an individual pupil for the following measures:"]
[]
[null,"1) English Baccalaureate - science subject area"]
[null,"2) English Baccalaureate - humanities subject area"]
[null,"3) English Baccalaureate - language subject area"]
[]
[null,"Please note that all attainment estimates and calculations relate to 2018 only."]
[null,"Calculations are completed based on attainment estimates to 2 decimal places."]
[]
[null,"HOW TO USE THE READY RECKONER"]
[]
[null,"The following steps explain how to use the ready reckoner…"]
{"$rows_left_out":35}
{"sheet":"new drop down lookup","index":2,"n_rows":95,"n_cols":21,"rows_kept":95,"cut":false,"hidden":true,"merged":[[52,0,56,5]]}
["Reading fine grade lookup",null,null,null,null,null,null,"Maths fine grade lookup"]
["Mark","Level","Bottom","Top","Drop down list?","Fine grade","Level","Mark","Level","Bottom","Top","Drop down list?","Fine grade","Level"]
["A - Absent","-",null,null,"A - Absent","-","-","A - Absent","-",null,null,"A - Absent","-","-"]
["M - Missing","-",null,null,"M - Missing","-","-","M - Missing","-",null,null,"M - Missing","-","-"]
["Q - Disregard","-",null,null,"Q - Disregard","-","-","Q - Disregard","-",null,null,"Q - Disregard","-","-"]
["T - No access to test","-",null,null,"T - No access to test","-","-","T - No access to test","-",null,null,"T - No access to test","-","-"]
["X - Lost","-",null,null,"X - Lost","-","-","X - Lost","-",null,null,"X - Lost","-","-"]
["B - Working below level of test","-",null,null,"B - Working below level of test","-","-","B - Working below level of test","-",null,null,"B - Working below level of test","-","-"]
["N - Not awarded test level","-",null,null,"N - Not awarded test level","-","-","N - Not awarded test level","-",null,null,"N - Not awarded test level","-","-",null,"checking"]
[11,3,11,18,{"$f":"CONCATENATE(A10,\" - Fine grade = \",ROUND(F10,4))","v":"11 - Fine grade = 3"},{"$f":"B10+((A10-C10)/(D10-C10+1))","v":3},{"$f":"B10","v":3},15,2,15,17,{"$f":"CONCATENATE(H10,\" - Fine grade = \",ROUND(M10,4))","v":"15 - Fine grade = 2.8889"},{"$f":"3-((J13-H10)/(K13-J13+1))","v":2.8888888888888888},{"$f":"I10","v":2},null,{"$f":"VLOOKUP(A10,'KS2 Fine grades lookup'!$A$10:$C$49,1,FALSE)","v":11},{"$f":"IF(VLOOKUP(A10,'KS2 Fine grades lookup'!$A$10:$C$49,3,FALSE)=F10,\"OK\",\"not OK\")","v":"OK"},{"$f":"IF(VLOOKUP(A10,'KS2 Fine grades lookup'!$A$10:$C$49,2,FALSE)=G10,\"OK\",\"not OK\")","v":"OK"},{"$f":"VLOOKUP(H10,'KS2 Fine grades lookup'!$E$10:$G$95,1,FALSE)","v":15},{"$f":"IF(VLOOKUP(H10,'KS2 Fine grades lookup'!$E$10:$G$95,3,FALSE)=M10,\"OK\",\"not OK\")","v":"OK"},{"$f":"IF(VLOOKUP(H10,'KS2 Fine grades lookup'!$E$10:$G$95,2,FALSE)=N10,\"OK\",\"not OK\")","v":"OK"}]
[12,3,11,18,{"$f":"CONCATENATE(A11,\" - Fine grade = \",ROUND(F11,4))","v":"12 - Fine grade = 3.125"},{"$f":"B11+((A11-C11)/(D11-C11+1))","v":3.125},{"$f":"B11","v":3},{"$f":"H10+1","v":16},2,15,17,{"$f":"CONCATENATE(H11,\" - Fine grade = \",ROUND(M11,4))","v":"16 - Fine grade = 2.9259"},{"$f":"3-((J14-H11)/(K14-J14+1))","v":2.925925925925926},{"$f":"I11","v":2},null,{"$f":"VLOOKUP(A11,'KS2 Fine grades lookup'!$A$10:$C$49,1,FALSE)","v":12},{"$f":"IF(VLOOKUP(A11,'KS2 Fine grades lookup'!$A$10:$C$49,3,FALSE)=F11,\"OK\",\"not OK\")","v":"OK"},{"$f":"IF(VLOOKUP(A11,'KS2 Fine grades lookup'!$A$10:$C$49,2,FALSE)=G11,\"OK\",\"not OK\")","v":"OK"},{"$f":"VLOOKUP(H11,'KS2 Fine grades lookup'!$E$10:$G$95,1,FALSE)","v":16},{"$f":"IF(VLOOKUP(H11,'KS2 Fine grades lookup'!$E$10:$G$95,3,FALSE)=M11,\"OK\",\"not OK\")","v":"OK"},{"$f":"IF(VLOOKUP(H11,'KS2 Fine grades lookup'!$E$10:$G$95,2,FALSE)=N11,\"OK\",\"not OK\")","v":"OK"}]
[13,3,11,18,"13 - Fine grade = 3.25",3.25,3,{"$f":"H11+1","v":17},2,15,17,"17 - Fine grade = 2.963",2.9629629629629628,2,null,{"$f":"VLOOKUP(A12,'KS2 Fine grades lookup'!$A$10:$C$49,1,FALSE)","v":13},{"$f":"IF(VLOOKUP(A12,'KS2 Fine grades lookup'!$A$10:$C$49,3,FALSE)=F12,\"OK\",\"not OK\")","v":"OK"},{"$f":"IF(VLOOKUP(A12,'KS2 Fine grades lookup'!$A$10:$C$49,2,FALSE)=G12,\"OK\",\"not OK\")","v":"OK"},{"$f":"VLOOKUP(H12,'KS2 Fine grades lookup'!$E$10:$G$95,1,FALSE)","v":17},{"$f":"IF(VLOOKUP(H12,'KS2 Fine grades lookup'!$E$10:$G$95,3,FALSE)=M12,\"OK\",\"not OK\")","v":"OK"},{"$f":"IF(VLOOKUP(H12,'KS2 Fine grades lookup'!$E$10:$G$95,2,FALSE)=N12,\"OK\",\"not OK\")","v":"OK"}]
[14,3,11,18,"14 - Fine grade = 3.375",3.375,3,18,3,18,44,"18 - Fine grade = 3",{"$f":"I13+((H13-J13)/(K13-J13+1))","v":3},3,null,{"$f":"VLOOKUP(A13,'KS2 Fine grades lookup'!$A$10:$C$49,1,FALSE)","v":14},{"$f":"IF(VLOOKUP(A13,'KS2 Fine grades lookup'!$A$10:$C$49,3,FALSE)=F13,\"OK\",\"not OK\")","v":"OK"},{"$f":"IF(VLOOKUP(A13,'KS2 Fine grades lookup'!$A$10:$C$49,2,FALSE)=G13,\"OK\",\"not OK\")","v":"OK"},{"$f":"VLOOKUP(H13,'KS2 Fine grades lookup'!$E$10:$G$95,1,FALSE)","v":18},{"$f":"IF(VLOOKUP(H13,'KS2 Fine grades lookup'!$E$10:$G$95,3,FALSE)=M13,\"OK\",\"not OK\")","v":"OK"},{"$f":"IF(VLOOKUP(H13,'KS2 Fine grades lookup'!$E$10:$G$95,2,FALSE)=N13,\"OK\",\"not OK\")","v":"OK"}]
[15,3,11,18,"15 - Fine grade = 3.5",3.5,3,19,3,18,44,"19 - Fine grade = 3.037",3.0370370370370372,3,null,{"$f":"VLOOKUP(A14,'KS2 Fine grades lookup'!$A$10:$C$49,1,FALSE)","v":15},{"$f":"IF(VLOOKUP(A14,'KS2 Fine grades lookup'!$A$10:$C$49,3,FALSE)=F14,\"OK\",\"not OK\")","v":"OK"},{"$f":"IF(VLOOKUP(A14,'KS2 Fine grades lookup'!$A$10:$C$49,2,FALSE)=G14,\"OK\",\"not OK\")","v":"OK"},{"$f":"VLOOKUP(H14,'KS2 Fine grades lookup'!$E$10:$G$95,1,FALSE)","v":19},{"$f":"IF(VLOOKUP(H14,'KS2 Fine grades lookup'!$E$10:$G$95,3,FALSE)=M14,\"OK\",\"not OK\")","v":"OK"},{"$f":"IF(VLOOKUP(H14,'KS2 Fine grades lookup'!$E$10:$G$95,2,FALSE)=N14,\"OK\",\"not OK\")","v":"OK"}]
[16,3,11,18,"16 - Fine grade = 3.625",3.625,3,20,3,18,44,"20 - Fine grade = 3.0741",3.074074074074074,3,null,{"$f":"VLOOKUP(A15,'KS2 Fine grades lookup'!$A$10:$C$49,1,FALSE)","v":16},{"$f":"IF(VLOOKUP(A15,'KS2 Fine grades lookup'!$A$10:$C$49,3,FALSE)=F15,\"OK\",\"not OK\")","v":"OK"},{"$f":"IF(VLOOKUP(A15,'KS2 Fine grades lookup'!$A$10:$C$49,2,FALSE)=G15,\"OK\",\"not OK\")","v":"OK"},{"$f":"VLOOKUP(H15,'KS2 Fine grades lookup'!$E$10:$G$95,1,FALSE)","v":20},{"$f":"IF(VLOOKUP(H15,'KS2 Fine grades lookup'!$E$10:$G$95,3,FALSE)=M15,\"OK\",\"not OK\")","v":"OK"},{"$f":"IF(VLOOKUP(H15,'KS2 Fine grades lookup'!$E$10:$G$95,2,FALSE)=N15,\"OK\",\"not OK\")","v":"OK"}]
{"$rows_left_out":81}
{"sheet":"Key stage 2 Data Input","index":3,"n_rows":96,"n_cols":17,"rows_kept":96,"cut":false,"hidden":false,"merged":[[34,1,34,2],[19,1,19,2],[25,1,25,2],[29,7,31,7],[31,1,31,2],[33,7,35,7],[6,1,6,2],[6,4,6,6],[10,1,10,2],[12,1,12,2],[17,1,17,2]]}
[]
[null,"INDIVIDUAL PUPIL KS2 DATA INPUT SHEET",null,null,null,null,"CELL COLOUR GUIDE:"]
[null,null,null,null,null,null,"DATA INPUT CELL",null,null,"--Select--","--Select--"]
[null,"This sheet is the data input sheet. Its purpose is to calculate a pupil's key stage 2 fine level",null,null,null,null,"CALCULATION CELL",null,null,"A - Absent","A - Absent"]
[null,"using their key stage 2 test and teacher assessment outcomes in reading and mathematics.",null,null,null,null,"NOT APPLICABLE",null,null,"M - Missing","M - Missing"]
[null,null,null,null,null,null,null,null,null,"Q - Disregard","Q - Disregard"]
[null,"INPUT SHEET GUIDANCE",null,null,"KS2 SUBJECTS",null,null,null,null,"T - No access to test","T - No access to test"]
[null,null,null,null,null,null,null,null,null,"X - Lost","X - Lost"]
[null,null,null,null,"KS2 READING TEST OUTCOME",null,"KS2 MATHEMATICS TEST OUTCOME",null,null,"B - Working below level of test","B - Working below level of test"]
[null,null,null,null,null,null,null,null,null,"N - Not awarded test level","N - Not awarded test level"]
[null,"Please enter the pupil's key stage 2 test mark for each subject. This is the number on the left in the options in the drop down menu - if you don't know the test mark, but do know the fine grade, then select from the drop down menu based on the fine grade.",null,null,"--Select--",null,"--Select--",null,null,{"$f":"'new drop down lookup'!E10","v":"11 - Fine grade = 3"},{"$f":"'new drop down lookup'!L10","v":"15 - Fine grade = 2.8889"},null,null,"--Select--","A,M,Q,S,T,X","B,N",2]
[null,null,null,null,null,null,null,null,null,{"$f":"'new drop down lookup'!E11","v":"12 - Fine grade = 3.125"},{"$f":"'new drop down lookup'!L11","v":"16 - Fine grade = 2.9259"},null,null,"OTHER (e.g. A, D, F etc)","-","-","-"]
[null,"These cells convert the key stage 2 test mark entered above to ",null,null,{"$f":"IF(E11=J3,\"-\",IF(ISNUMBER((VLOOKUP($E$11,'new drop down lookup'!$E$3:$F$49,2,FALSE))),(VLOOKUP($E$11,'new drop down lookup'!$E$3:$F$49,2,FALSE)),VLOOKUP($E$11,'new drop down lookup'!$E$3:$F$49,2,FALSE)))","v":"-"},null,{"$f":"IF(G11=K3,\"-\",IF(ISNUMBER((VLOOKUP($G$11,'new drop down lookup'!$L$3:$M$95,2,FALSE))),(VLOOKUP($G$11,'new drop down lookup'!$L$3:$M$95,2,FALSE)),VLOOKUP($G$11,'new drop down lookup'!$L$3:$M$95,2,FALSE)))","v":"-"},null,null,{"$f":"'new drop down lookup'!E12","v":"13 - Fine grade = 3.25"},{"$f":"'new drop down lookup'!L12","v":"17 - Fine grade = 2.963"},null,null,"W - Working towards Level 1",0.5,0.5,0.5]
[null,"fine grades for each subject.",null,null,{"$f":"IF(E11=J3,\"-\",IF(VLOOKUP($E$11,'new drop down lookup'!$E$3:$G$49,3,FALSE)=\"-\",\"-\",\" TEST LEVEL \"&VLOOKUP($E$11,'new drop down lookup'!$E$3:$G$49,3,FALSE)))","v":"-"},null,{"$f":"IF(G11=K3,\"-\",IF(VLOOKUP($G$11,'new drop down lookup'!$L$3:$N$95,3,FALSE)=\"-\",\"-\",\" TEST LEVEL \"&VLOOKUP($G$11,'new drop down lookup'!$L$3:$N$95,3,FALSE)))","v":"-"},null,null,{"$f":"'new drop down lookup'!E13","v":"14 - Fine grade = 3.375"},{"$f":"'new drop down lookup'!L13","v":"18 - Fine grade = 3"},null,null,"LEVEL 1",1.5,1.5,1.5]
[null,null,null,null,null,null,null,null,null,{"$f":"'new drop down lookup'!E14","v":"15 - Fine grade = 3.5"},{"$f":"'new drop down lookup'!L14","v":"19 - Fine grade = 3.037"},null,null,"LEVEL 2",2.5,2.5,2.5]
{"$rows_left_out":82}
{"sheet":"Single Measure Ready Reckoner","index":4,"n_rows":35,"n_cols":24,"rows_kept":35,"cut":false,"hidden":false,"merged":[[5,13,5,14],[8,13,9,14],[34,6,35,7],[34,2,35,2],[1,13,1,14],[21,6,22,8],[24,6,25,8],[8,1,8,3],[31,6,31,8],[8,6,8,8],[21,3,22,3],[24,3,25,3],[24,1,25,2],[2,13,2,14],[3,13,3,14],[4,13,4,14],[12,6,13,8]]}
[]
[null,"INDIVIDUAL PUPIL KEY STAGE 2 TO 4 EBACC PROGRESS MEASURE READY RECKONER",null,null,null,null,null,null,null,null,null,null,null,"CELL COLOUR GUIDE:",null,null,null,null,null,null,null,null,null,"--Select--"]
[null,null,null,null,null,null,null,null,null,null,null,null,null,"DATA INPUT CELL",null,null,null,null,null,null,null,null,null,"English Baccalaureate - science subject area"]
[null,"This sheet is the ready reckoner for the key stage 2 to 4 EBacc progress measures. To calculate a pupil's value added score, you need to first choose the ",null,null,null,null,null,null,null,null,null,null,null,"FROM 'KS2 DATA INPUT' SHEET",null,null,null,null,null,null,null,null,null,"English Baccalaureate - humanities subject area"]
[null,"measure you would like to use and then enter the pupil's actual key stage 4 attainment for the measure you have chosen.",null,null,null,null,null,null,null,null,null,null,null,"CALCULATION CELL",null,null,null,null,null,null,null,null,null,"English Baccalaureate - languages subject area"]
[null,null,null,null,null,null,null,null,null,null,null,null,null,"VALUE ADDED SCORE"]
[null,"1) WHICH PROGRESS MEASURE?"]
[null,null,null,null,null,null,null,null,null,null,null,null,null,null,null,null,null,null,null,null,null,null,null,{"$f":"IF($G$9=$X$2,\"Maths\",IF($G$9=$X$3,\"Science\",IF($G$9=$X$4,\"Humanities\",\"Language\")))","v":"Maths"}]
[null,"Using the drop down box, please select the key stage 2 to 4 English Baccalaureate progress measure you wish to view",null,null,null,null,"--Select--",null,null,{"$f":"VLOOKUP($G$9,$X$1:$AA$6,4,FALSE)","v":0},null,null,null,"Qualifications which count towards the EBacc"]
[]
[null,"2) ACTUAL KEY STAGE 4 ATTAINMENT"]
[]
[null,"Please enter the pupil's score",null,null,null,null,null,null,null,{"$f":"IF(ISNUMBER(G13),ROUND(G13,2),\"\")","v":""}]
[null,"in your chosen EBacc progress measure"]
[null,{"$f":"IF($G$9=$X$6,\"Their English and Maths bonus\",\"\")","v":""}]
{"$rows_left_out":21}
{"sheet":"All Measures Ready Reckoner","index":5,"n_rows":19,"n_cols":13,"rows_kept":19,"cut":false,"hidden":false,"merged":[[7,3,7,7],[1,12,1,13],[18,11,19,13],[2,12,2,13],[3,12,3,13],[4,12,4,13]]}
[]
[null,"INDIVIDUAL PUPIL KEY STAGE 2 - 4 EBACC SUBJECTS READY RECKONER - ALL MEASURES",null,null,null,null,null,null,null,null,null,null,"CELL COLOUR GUIDE:"]
[null,null,null,null,null,null,null,null,null,null,null,null,"DATA INPUT CELL"]
[null,"The purpose of this sheet is to allow the user to calculate the value added scores for all three key stage 2  to 4 EBacc progress measures at the same time.",null,null,null,null,null,null,null,null,null,null,"CALCULATION CELL"]
[null,"To complete this sheet, you need to enter the pupil's actual key stage 4 attainment for the various measures",null,null,null,null,null,null,null,null,null,null,"VALUE ADDED SCORE"]
[null,"The input for this sheet is still the 'Key stage 2 Data Input' sheet."]
[]
[null,null,null,"Key stage 2 to 4 progress measures"]
[]
[null,null,null,"English Baccalaureate - science subject area",null,"English Baccalaureate - humanities subject area",null,"English Baccalaureate - languages subject area"]
[]
[null,"Please enter the pupil's actual key stage 4 attainment",null,9.5,null,9.5,null,9.5]
[]
[null,"Pupil's estimated key stage 4 attainment (calculated)",null,{"$f":"IF(ISERROR(VLOOKUP('Single Measure Ready Reckoner'!$D25,'Model values'!$B$9:$E$42,2,FALSE)),\"-\",VLOOKUP('Single Measure Ready Reckoner'!$D25,'Model values'!$B$9:$E$42,2,FALSE))","v":"-"},null,{"$f":"IF(ISERROR(VLOOKUP('Single Measure Ready Reckoner'!$D25,'Model values'!$B$9:$E$42,3,FALSE)),\"-\",VLOOKUP('Single Measure Ready Reckoner'!$D25,'Model values'!$B$9:$E$42,3,FALSE))","v":"-"},null,{"$f":"IF(ISERROR(VLOOKUP('Single Measure Ready Reckoner'!$D25,'Model values'!$B$9:$E$42,4,FALSE)),\"-\",VLOOKUP('Single Measure Ready Reckoner'!$D25,'Model values'!$B$9:$E$42,4,FALSE))","v":"-"}]
[null,null,null,{"$f":"IF(ISERROR(ROUND(U2+($R3*U3)+($R4*U4)+($R5*U5)+($R6*U6)+($R7*U7),6)),\"-\",ROUND(U2+($R3*U3)+($R4*U4)+($R5*U5)+($R6*U6)+($R7*U7),6))","v":0},null,{"$f":"IF(ISERROR(ROUND(V2+($R3*V3)+($R4*V4)+($R5*V5)+($R6*V6)+($R7*V7),6)),\"-\",ROUND(V2+($R3*V3)+($R4*V4)+($R5*V5)+($R6*V6)+($R7*V7),6))","v":0},null,{"$f":"IF(ISERROR(ROUND(W2+($R3*W3)+($R4*W4)+($R5*W5)+($R6*W6)+($R7*W7),6)),\"-\",ROUND(W2+($R3*W3)+($R4*W4)+($R5*W5)+($R6*W6)+($R7*W7),6))","v":0}]
{"$rows_left_out":5}
{"sheet":"Model values","index":6,"n_rows":51,"n_cols":8,"rows_kept":51,"cut":false,"hidden":false,"merged":[[26,7,27,9],[6,1,7,1],[5,6,5,7],[20,7,21,9],[23,7,24,9],[6,2,6,4],[12,6,14,7]]}
[]
[null,"Model Values - 2018 Predicted Scores by Prior Attainment"]
[null,"This sheet shows the 2018 predicted point score in each subject area for pupils with the same prior attainment"]
[null,"Where few pupils achieved a certain prior attainment score, banding had been applied to produce more accurate predicted values"]
[null,"The groupings used for this banding can be seen in table 1"]
[null,null,null,null,null,null,"Table 1 "]
[null,"Prior Attainment Band","Predicted Values 2018",null,null,null,"Prior attainment shown in table","Band includes pupils with prior attainment scores"]
[null,null,"Science","Humanities","Languages",null,1.5,"Less than or equal to 1.5"]
[null,1.5,1.84,1.75,4.82,null,2,"Between 1.6 and 2.0"]
[null,2,1.89,1.67,5.19,null,2.5,"Between 2.1 and 2.5"]
[null,2.5,1.95,1.69,4.29,null,2.8,"Between 2.6 and 2.8"]
[null,2.8,1.94,1.48,3.44,null,5.8,"Greater than or equal to 5.8"]
[null,2.9,2.08,1.64,3.38,null,"All other prior attainment scores in the table have not been banded"]
[null,3,2.21,1.65,3.6]
[null,3.1,2.2999999999999998,1.83,3.26]
{"$rows_left_out":37}
{"sheet":"Chart Data","index":7,"n_rows":10,"n_cols":4,"rows_kept":10,"cut":false,"hidden":true,"merged":[]}
[]
[]
[]
[]
[]
[]
[null,null,0,0]
[null,null,600,600]
[null,null,0,0]
[null,null,15,15]

{"sheet":"KS2 Fine grades lookup","index":8,"n_rows":113,"n_cols":8,"rows_kept":113,"cut":false,"hidden":true,"merged":[[100,1,100,2],[101,5,101,6],[112,0,116,5]]}
["Reading",null,null,null,"Maths"]
["tot_2r","K2LEV_r","Fine Grade",null,"tot_2M","K2LEV_M","Fine Grade"]
["A - Absent","-","-",null,"A - Absent","-","-"]
["M - Missing","-","-",null,"M - Missing","-","-"]
["Q - Disregard","-","-",null,"Q - Disregard","-","-"]
["T - No access to test","-","-",null,"T - No access to test","-","-"]
["X - Lost","-","-",null,"X - Lost","-","-"]
["B - Working below level of test","-","-",null,"B - Working below level of test","-","-"]
["N - Not awarded test level","-","-","check","N - Not awarded test level","-","-","check"]
[11,3,{"$f":"B10+((A10-VLOOKUP(B10,$A$103:$E$107,2,FALSE))/(VLOOKUP(B10,$A$103:$E$107,3,FALSE)-VLOOKUP(B10,$A$103:$E$107,2,FALSE)+1))","v":3},{"$f":"IF(VLOOKUP(A10,[3]Sheet1!$A$6:$F$45,6,FALSE)=C10,\"OK\",\"not OK\")","v":"OK"},15,2,{"$f":"3-((VLOOKUP(3,$A$103:$E$107,4,FALSE)-E10)/(VLOOKUP(3,$A$103:$E$107,5,FALSE)-VLOOKUP(3,$A$103:$E$107,4,FALSE)+1))","v":2.8888888888888888},{"$f":"IF(VLOOKUP(E10,[3]Sheet1!$H$6:$M$91,6,FALSE)=G10,\"OK\",\"not OK\")","v":"OK"}]
[12,3,{"$f":"B11+((A11-VLOOKUP(B11,$A$103:$E$107,2,FALSE))/(VLOOKUP(B11,$A$103:$E$107,3,FALSE)-VLOOKUP(B11,$A$103:$E$107,2,FALSE)+1))","v":3.125},{"$f":"IF(VLOOKUP(A11,[3]Sheet1!$A$6:$F$45,6,FALSE)=C11,\"OK\",\"not OK\")","v":"OK"},16,2,{"$f":"3-((VLOOKUP(3,$A$103:$E$107,4,FALSE)-E11)/(VLOOKUP(3,$A$103:$E$107,5,FALSE)-VLOOKUP(3,$A$103:$E$107,4,FALSE)+1))","v":2.925925925925926},{"$f":"IF(VLOOKUP(E11,[3]Sheet1!$H$6:$M$91,6,FALSE)=G11,\"OK\",\"not OK\")","v":"OK"}]
[13,3,3.25,{"$f":"IF(VLOOKUP(A12,[3]Sheet1!$A$6:$F$45,6,FALSE)=C12,\"OK\",\"not OK\")","v":"OK"},17,2,2.9629629629629628,{"$f":"IF(VLOOKUP(E12,[3]Sheet1!$H$6:$M$91,6,FALSE)=G12,\"OK\",\"not OK\")","v":"OK"}]
[14,3,3.375,{"$f":"IF(VLOOKUP(A13,[3]Sheet1!$A$6:$F$45,6,FALSE)=C13,\"OK\",\"not OK\")","v":"OK"},18,3,{"$f":"F13+((E13-VLOOKUP(F13,$A$103:$E$107,4,FALSE))/(VLOOKUP(F13,$A$103:$E$107,5,FALSE)-VLOOKUP(F13,$A$103:$E$107,4,FALSE)+1))","v":3},{"$f":"IF(VLOOKUP(E13,[3]Sheet1!$H$6:$M$91,6,FALSE)=G13,\"OK\",\"not OK\")","v":"OK"}]
[15,3,3.5,{"$f":"IF(VLOOKUP(A14,[3]Sheet1!$A$6:$F$45,6,FALSE)=C14,\"OK\",\"not OK\")","v":"OK"},19,3,{"$f":"F14+((E14-VLOOKUP(F14,$A$103:$E$107,4,FALSE))/(VLOOKUP(F14,$A$103:$E$107,5,FALSE)-VLOOKUP(F14,$A$103:$E$107,4,FALSE)+1))","v":3.0370370370370372},{"$f":"IF(VLOOKUP(E14,[3]Sheet1!$H$6:$M$91,6,FALSE)=G14,\"OK\",\"not OK\")","v":"OK"}]
[16,3,3.625,{"$f":"IF(VLOOKUP(A15,[3]Sheet1!$A$6:$F$45,6,FALSE)=C15,\"OK\",\"not OK\")","v":"OK"},20,3,3.074074074074074,{"$f":"IF(VLOOKUP(E15,[3]Sheet1!$H$6:$M$91,6,FALSE)=G15,\"OK\",\"not OK\")","v":"OK"}]
{"$rows_left_out":98}