{"text_format":"1","workbook":"xlsx","n_sheets":6,"sheets":["Cover","Guidance","Control Panel","Damage Costs User Interface","Outputs","Damage Costs and Assumptions"],"not_rendered":{"charts":0,"images":1,"macros":1,"external_links":0,"defined_names":6,"comments":0,"pivot_tables":0},"unopened":[],"bounds":{"document_bytes":16777216,"sheet_cells":100000,"rows_first":2000,"rows_last":500,"rows_between":2000,"halvings":0,"cell_chars":16384,"cell_head_chars":4096},"cells_cut":0,"cells_raw":0,"read":"whole","date_system":"1900"}

{"sheet":"Cover","index":0,"n_rows":26,"n_cols":2,"rows_kept":26,"cut":false,"hidden":false,"merged":[]}
[]
[]
[]
[]
[]
[]
[]
["Damage Costs Appraisal Toolkit"]
[]
["Original Version: January 2019"]
{"$rows_left_out":17}
{"sheet":"Guidance","index":1,"n_rows":45,"n_cols":10,"rows_kept":45,"cut":false,"hidden":false,"merged":[]}
[]
[]
[]
[]
[]
[]
[]
["This toolkit allows appraisers to calculate the economic impact of policies which affect air quality, using the damage cost approach. "]
["This tool is designed to be used in conjunction with the Air Quality Damage Costs Guidance: ",null,null,null,null,null,null,null,null,"https://www.gov.uk/guidance/air-quality-economic-analysis"]
["It is only appropriate for small air quality impacts (below £50 million) provided the policy does not affect areas likely to breach legally binding air quality limits."]
{"$rows_left_out":36}
{"sheet":"Control Panel","index":2,"n_rows":23,"n_cols":6,"rows_kept":23,"cut":false,"hidden":false,"merged":[[5,0,5,2],[6,0,6,2],[7,0,7,2],[8,0,8,2],[10,0,10,2],[9,0,9,2],[21,0,21,2],[22,0,22,2],[11,0,11,2],[12,0,12,2],[13,0,13,2],[18,0,18,2],[19,0,19,2],[20,0,20,2]]}
["Control Panel"]
[]
[]
[]
[]
["Start Year",null,null,2019,null,"Please type the year at which the policy will start from, the start year is also the discount year"]
[]
["End Year",null,null,2028,null,"Please type the year at which the appraisal will end"]
[]
["Appraisal Period",null,null,{"$f":"IF(AND(COUNT(D8)=1, COUNT(D6)=1), (D8-D6)+1, \"\")","v":10},null,"Autofills the number of years for which the policy is reviewed for"]
{"$rows_left_out":14}
{"sheet":"Damage Costs User Interface","index":3,"n_rows":106,"n_cols":130,"rows_kept":106,"cut":false,"hidden":false,"merged":[[2,18,2,19],[3,7,3,9],[3,10,3,12],[4,0,4,2],[4,7,4,9],[4,4,4,5],[4,11,4,12],[2,0,2,2],[2,7,2,9],[2,14,2,16],[2,4,2,5],[2,11,2,12]]}
["Damage Cost User Interface"]
[null,null,null,null,null,null,null,null,null,null,{"$f":"IF(OR($D$3=\"PM2.5\", $K$3=\"PM2.5\", $R$3=\"PM2.5\", $D$5=\"PM2.5\", $K$5=\"PM2.5\"), 1, 0)","v":0}]
["Pollutant",null,null,null,null,null,null,{"$f":"IF(COUNTIF($A$3:G3, \"Pollutant\")+1<='Control Panel'!$D$14, \"Pollutant\", \"\")","v":""},null,null,null,null,null,null,{"$f":"IF(COUNTIF($A$3:N3, \"Pollutant\")+1<='Control Panel'!$D$14, \"Pollutant\", \"\")","v":""}]
[]
[{"$f":"IF(COUNTIF($A$3:$Q$3, \"Pollutant\")+1<='Control Panel'!$D$14, \"Pollutant\", \"\")","v":""},null,null,null,null,null,null,{"$f":"IF(SUM(COUNTIF($A$3:$Q$3, \"Pollutant\"), COUNTIF($A$5:$G$5, \"Pollutant\")+1)<='Control Panel'!$D$14, \"Pollutant\", \"\")","v":""}]
[]
[{"$f":"IF(OR(D3=\"PM2.5\", K3=\"PM2.5\", R3=\"PM2.5\", D5=\"PM2.5\", K5=\"PM2.5\"), \"Note: If you are assessing PM10 impacts, please convert these to PM2.5 using conversion factors found in the Assumptions sheet\", \"\")","v":""}]
[]
[{"$f":"IF($E$3=\"\", \"\", $D$3&\" \"&$E$3)","v":""}]
[null,null,null,"Year",{"$f":"IF('Control Panel'!$D$6=\"\", \"\", 'Control Panel'!$D$6)","v":2019},{"$f":"IF(COLUMN()-4<='Control Panel'!$D$10, 'Damage Costs User Interface'!E10+1, \"\")","v":2020},{"$f":"IF(COLUMN()-4<='Control Panel'!$D$10, 'Damage Costs User Interface'!F10+1, \"\")","v":2021},{"$f":"IF(COLUMN()-4<='Control Panel'!$D$10, 'Damage Costs User Interface'!G10+1, \"\")","v":2022},{"$f":"IF(COLUMN()-4<='Control Panel'!$D$10, 'Damage Costs User Interface'!H10+1, \"\")","v":2023},{"$f":"IF(COLUMN()-4<='Control Panel'!$D$10, 'Damage Costs User Interface'!I10+1, \"\")","v":2024},{"$f":"IF(COLUMN()-4<='Control Panel'!$D$10, 'Damage Costs User Interface'!J10+1, \"\")","v":2025},{"$f":"IF(COLUMN()-4<='Control Panel'!$D$10, 'Damage Costs User Interface'!K10+1, \"\")","v":2026},{"$f":"IF(COLUMN()-4<='Control Panel'!$D$10, 'Damage Costs User Interface'!L10+1, \"\")","v":2027},{"$f":"IF(COLUMN()-4<='Control Panel'!$D$10, 'Damage Costs User Interface'!M10+1, \"\")","v":2028},{"$f":"IF(COLUMN()-4<='Control Panel'!$D$10, 'Damage Costs User Interface'!N10+1, \"\")","v":""},{"$f":"IF(COLUMN()-4<='Control Panel'!$D$10, 'Damage Costs User Interface'!O10+1, \"\")","v":""},{"$f":"IF(COLUMN()-4<='Control Panel'!$D$10, 'Damage Costs User Interface'!P10+1, \"\")","v":""},{"$f":"IF(COLUMN()-4<='Control Panel'!$D$10, 'Damage Costs User Interface'!Q10+1, \"\")","v":""},{"$f":"IF(COLUMN()-4<='Control Panel'!$D$10, 'Damage Costs User Interface'!R10+1, \"\")","v":""},{"$f":"IF(COLUMN()-4<='Control Panel'!$D$10, 'Damage Costs User Interface'!S10+1, \"\")","v":""},{"$f":"IF(COLUMN()-4<='Control Panel'!$D$10, 'Damage Costs User Interface'!T10+1, \"\")","v":""},{"$f":"IF(COLUMN()-4<='Control Panel'!$D$10, 'Damage Costs User Interface'!U10+1, \"\")","v":""},{"$f":"IF(COLUMN()-4<='Control Panel'!$D$10, 'Damage Costs User Interface'!V10+1, \"\")","v":""},{"$f":"IF(COLUMN()-4<='Control Panel'!$D$10, 'Damage Costs User Interface'!W10+1, \"\")","v":""},{"$f":"IF(COLUMN()-4<='Control Panel'!$D$10, 'Damage Costs User Interface'!X10+1, \"\")","v":""},{"$f":"IF(COLUMN()-4<='Control Panel'!$D$10, 'Damage Costs User Interface'!Y10+1, \"\")","v":""},{"$f":"IF(COLUMN()-4<='Control Panel'!$D$10, 'Damage Costs User Interface'!Z10+1, \"\")","v":""},{"$f":"IF(COLUMN()-4<='Control Panel'!$D$10, 'Damage Costs User Interface'!AA10+1, \"\")","v":""},{"$f":"IF(COLUMN()-4<='Control Panel'!$D$10, 'Damage Costs User Interface'!AB10+1, \"\")","v":""},{"$f":"IF(COLUMN()-4<='Control Panel'!$D$10, 'Damage Costs User Interface'!AC10+1, \"\")","v":""},{"$f":"IF(COLUMN()-4<='Control Panel'!$D$10, 'Damage Costs User Interface'!AD10+1, \"\")","v":""},{"$f":"IF(COLUMN()-4<='Control Panel'!$D$10, 'Damage Costs User Interface'!AE10+1, \"\")","v":""},{"$f":"IF(COLUMN()-4<='Control Panel'!$D$10, 'Damage Costs User Interface'!AF10+1, \"\")","v":""},{"$f":"IF(COLUMN()-4<='Control Panel'!$D$10, 'Damage Costs User Interface'!AG10+1, \"\")","v":""},{"$f":"IF(COLUMN()-4<='Control Panel'!$D$10, 'Damage Costs User Interface'!AH10+1, \"\")","v":""},{"$f":"IF(COLUMN()-4<='Control Panel'!$D$10, 'Damage Costs User Interface'!AI10+1, \"\")","v":""},{"$f":"IF(COLUMN()-4<='Control Panel'!$D$10, 'Damage Costs User Interface'!AJ10+1, \"\")","v":""},{"$f":"IF(COLUMN()-4<='Control Panel'!$D$10, 'Damage Costs User Interface'!AK10+1, \"\")","v":""},{"$f":"IF(COLUMN()-4<='Control Panel'!$D$10, 'Damage Costs User Interface'!AL10+1, \"\")","v":""},{"$f":"IF(COLUMN()-4<='Control Panel'!$D$10, 'Damage Costs User Interface'!AM10+1, \"\")","v":""},{"$f":"IF(COLUMN()-4<='Control Panel'!$D$10, 'Damage Costs User Interface'!AN10+1, \"\")","v":""},{"$f":"IF(COLUMN()-4<='Control Panel'!$D$10, 'Damage Costs User Interface'!AO10+1, \"\")","v":""},{"$f":"IF(COLUMN()-4<='Control Panel'!$D$10, 'Damage Costs User Interface'!AP10+1, \"\")","v":""},{"$f":"IF(COLUMN()-4<='Control Panel'!$D$10, 'Damage Costs User Interface'!AQ10+1, \"\")","v":""},{"$f":"IF(COLUMN()-4<='Control Panel'!$D$10, 'Damage Costs User Interface'!AR10+1, \"\")","v":""},{"$f":"IF(COLUMN()-4<='Control Panel'!$D$10, 'Damage Costs User Interface'!AS10+1, \"\")","v":""},{"$f":"IF(COLUMN()-4<='Control Panel'!$D$10, 'Damage Costs User Interface'!AT10+1, \"\")","v":""},{"$f":"IF(COLUMN()-4<='Control Panel'!$D$10, 'Damage Costs User Interface'!AU10+1, \"\")","v":""},{"$f":"IF(COLUMN()-4<='Control Panel'!$D$10, 'Damage Costs User Interface'!AV10+1, \"\")","v":""},{"$f":"IF(COLUMN()-4<='Control Panel'!$D$10, 'Damage Costs User Interface'!AW10+1, \"\")","v":""},{"$f":"IF(COLUMN()-4<='Control Panel'!$D$10, 'Damage Costs User Interface'!AX10+1, \"\")","v":""},{"$f":"IF(COLUMN()-4<='Control Panel'!$D$10, 'Damage Costs User Interface'!AY10+1, \"\")","v":""},{"$f":"IF(COLUMN()-4<='Control Panel'!$D$10, 'Damage Costs User Interface'!AZ10+1, \"\")","v":""},{"$f":"IF(COLUMN()-4<='Control Panel'!$D$10, 'Damage Costs User Interface'!BA10+1, \"\")","v":""},{"$f":"IF(COLUMN()-4<='Control Panel'!$D$10, 'Damage Costs User Interface'!BB10+1, \"\")","v":""},{"$f":"IF(COLUMN()-4<='Control Panel'!$D$10, 'Damage Costs User Interface'!BC10+1, \"\")","v":""},{"$f":"IF(COLUMN()-4<='Control Panel'!$D$10, 'Damage Costs User Interface'!BD10+1, \"\")","v":""},{"$f":"IF(COLUMN()-4<='Control Panel'!$D$10, 'Damage Costs User Interface'!BE10+1, \"\")","v":""},{"$f":"IF(COLUMN()-4<='Control Panel'!$D$10, 'Damage Costs User Interface'!BF10+1, \"\")","v":""},{"$f":"IF(COLUMN()-4<='Control Panel'!$D$10, 'Damage Costs User Interface'!BG10+1, \"\")","v":""},{"$f":"IF(COLUMN()-4<='Control Panel'!$D$10, 'Damage Costs User Interface'!BH10+1, \"\")","v":""},{"$f":"IF(COLUMN()-4<='Control Panel'!$D$10, 'Damage Costs User Interface'!BI10+1, \"\")","v":""},{"$f":"IF(COLUMN()-4<='Control Panel'!$D$10, 'Damage Costs User Interface'!BJ10+1, \"\")","v":""},{"$f":"IF(COLUMN()-4<='Control Panel'!$D$10, 'Damage Costs User Interface'!BK10+1, \"\")","v":""},{"$f":"IF(COLUMN()-4<='Control Panel'!$D$10, 'Damage Costs User Interface'!BL10+1, \"\")","v":""},{"$f":"IF(COLUMN()-4<='Control Panel'!$D$10, 'Damage Costs User Interface'!BM10+1, \"\")","v":""},{"$f":"IF(COLUMN()-4<='Control Panel'!$D$10, 'Damage Costs User Interface'!BN10+1, \"\")","v":""},{"$f":"IF(COLUMN()-4<='Control Panel'!$D$10, 'Damage Costs User Interface'!BO10+1, \"\")","v":""},{"$f":"IF(COLUMN()-4<='Control Panel'!$D$10, 'Damage Costs User Interface'!BP10+1, \"\")","v":""},{"$f":"IF(COLUMN()-4<='Control Panel'!$D$10, 'Damage Costs User Interface'!BQ10+1, \"\")","v":""},{"$f":"IF(COLUMN()-4<='Control Panel'!$D$10, 'Damage Costs User Interface'!BR10+1, \"\")","v":""},{"$f":"IF(COLUMN()-4<='Control Panel'!$D$10, 'Damage Costs User Interface'!BS10+1, \"\")","v":""},{"$f":"IF(COLUMN()-4<='Control Panel'!$D$10, 'Damage Costs User Interface'!BT10+1, \"\")","v":""},{"$f":"IF(COLUMN()-4<='Control Panel'!$D$10, 'Damage Costs User Interface'!BU10+1, \"\")","v":""},{"$f":"IF(COLUMN()-4<='Control Panel'!$D$10, 'Damage Costs User Interface'!BV10+1, \"\")","v":""},{"$f":"IF(COLUMN()-4<='Control Panel'!$D$10, 'Damage Costs User Interface'!BW10+1, \"\")","v":""},{"$f":"IF(COLUMN()-4<='Control Panel'!$D$10, 'Damage Costs User Interface'!BX10+1, \"\")","v":""},{"$f":"IF(COLUMN()-4<='Control Panel'!$D$10, 'Damage Costs User Interface'!BY10+1, \"\")","v":""},{"$f":"IF(COLUMN()-4<='Control Panel'!$D$10, 'Damage Costs User Interface'!BZ10+1, \"\")","v":""},{"$f":"IF(COLUMN()-4<='Control Panel'!$D$10, 'Damage Costs User Interface'!CA10+1, \"\")","v":""},{"$f":"IF(COLUMN()-4<='Control Panel'!$D$10, 'Damage Costs User Interface'!CB10+1, \"\")","v":""},{"$f":"IF(COLUMN()-4<='Control Panel'!$D$10, 'Damage Costs User Interface'!CC10+1, \"\")","v":""},{"$f":"IF(COLUMN()-4<='Control Panel'!$D$10, 'Damage Costs User Interface'!CD10+1, \"\")","v":""},{"$f":"IF(COLUMN()-4<='Control Panel'!$D$10, 'Damage Costs User Interface'!CE10+1, \"\")","v":""},{"$f":"IF(COLUMN()-4<='Control Panel'!$D$10, 'Damage Costs User Interface'!CF10+1, \"\")","v":""},{"$f":"IF(COLUMN()-4<='Control Panel'!$D$10, 'Damage Costs User Interface'!CG10+1, \"\")","v":""},{"$f":"IF(COLUMN()-4<='Control Panel'!$D$10, 'Damage Costs User Interface'!CH10+1, \"\")","v":""},{"$f":"IF(COLUMN()-4<='Control Panel'!$D$10, 'Damage Costs User Interface'!CI10+1, \"\")","v":""},{"$f":"IF(COLUMN()-4<='Control Panel'!$D$10, 'Damage Costs User Interface'!CJ10+1, \"\")","v":""},{"$f":"IF(COLUMN()-4<='Control Panel'!$D$10, 'Damage Costs User Interface'!CK10+1, \"\")","v":""},{"$f":"IF(COLUMN()-4<='Control Panel'!$D$10, 'Damage Costs User Interface'!CL10+1, \"\")","v":""},{"$f":"IF(COLUMN()-4<='Control Panel'!$D$10, 'Damage Costs User Interface'!CM10+1, \"\")","v":""},{"$f":"IF(COLUMN()-4<='Control Panel'!$D$10, 'Damage Costs User Interface'!CN10+1, \"\")","v":""},{"$f":"IF(COLUMN()-4<='Control Panel'!$D$10, 'Damage Costs User Interface'!CO10+1, \"\")","v":""},{"$f":"IF(COLUMN()-4<='Control Panel'!$D$10, 'Damage Costs User Interface'!CP10+1, \"\")","v":""},{"$f":"IF(COLUMN()-4<='Control Panel'!$D$10, 'Damage Costs User Interface'!CQ10+1, \"\")","v":""},{"$f":"IF(COLUMN()-4<='Control Panel'!$D$10, 'Damage Costs User Interface'!CR10+1, \"\")","v":""},{"$f":"IF(COLUMN()-4<='Control Panel'!$D$10, 'Damage Costs User Interface'!CS10+1, \"\")","v":""},{"$f":"IF(COLUMN()-4<='Control Panel'!$D$10, 'Damage Costs User Interface'!CT10+1, \"\")","v":""},{"$f":"IF(COLUMN()-4<='Control Panel'!$D$10, 'Damage Costs User Interface'!CU10+1, \"\")","v":""},{"$f":"IF(COLUMN()-4<='Control Panel'!$D$10, 'Damage Costs User Interface'!CV10+1, \"\")","v":""},{"$f":"IF(COLUMN()-4<='Control Panel'!$D$10, 'Damage Costs User Interface'!CW10+1, \"\")","v":""},{"$f":"IF(COLUMN()-4<='Control Panel'!$D$10, 'Damage Costs User Interface'!CX10+1, \"\")","v":""},{"$f":"IF(COLUMN()-4<='Control Panel'!$D$10, 'Damage Costs User Interface'!CY10+1, \"\")","v":""},{"$f":"IF(COLUMN()-4<='Control Panel'!$D$10, 'Damage Costs User Interface'!CZ10+1, \"\")","v":""},{"$f":"IF(COLUMN()-4<='Control Panel'!$D$10, 'Damage Costs User Interface'!DA10+1, \"\")","v":""},{"$f":"IF(COLUMN()-4<='Control Panel'!$D$10, 'Damage Costs User Interface'!DB10+1, \"\")","v":""},{"$f":"IF(COLUMN()-4<='Control Panel'!$D$10, 'Damage Costs User Interface'!DC10+1, \"\")","v":""},{"$f":"IF(COLUMN()-4<='Control Panel'!$D$10, 'Damage Costs User Interface'!DD10+1, \"\")","v":""},{"$f":"IF(COLUMN()-4<='Control Panel'!$D$10, 'Damage Costs User Interface'!DE10+1, \"\")","v":""},{"$f":"IF(COLUMN()-4<='Control Panel'!$D$10, 'Damage Costs User Interface'!DF10+1, \"\")","v":""},{"$f":"IF(COLUMN()-4<='Control Panel'!$D$10, 'Damage Costs User Interface'!DG10+1, \"\")","v":""},{"$f":"IF(COLUMN()-4<='Control Panel'!$D$10, 'Damage Costs User Interface'!DH10+1, \"\")","v":""},{"$f":"IF(COLUMN()-4<='Control Panel'!$D$10, 'Damage Costs User Interface'!DI10+1, \"\")","v":""},{"$f":"IF(COLUMN()-4<='Control Panel'!$D$10, 'Damage Costs User Interface'!DJ10+1, \"\")","v":""},{"$f":"IF(COLUMN()-4<='Control Panel'!$D$10, 'Damage Costs User Interface'!DK10+1, \"\")","v":""},{"$f":"IF(COLUMN()-4<='Control Panel'!$D$10, 'Damage Costs User Interface'!DL10+1, \"\")","v":""},{"$f":"IF(COLUMN()-4<='Control Panel'!$D$10, 'Damage Costs User Interface'!DM10+1, \"\")","v":""},{"$f":"IF(COLUMN()-4<='Control Panel'!$D$10, 'Damage Costs User Interface'!DN10+1, \"\")","v":""},{"$f":"IF(COLUMN()-4<='Control Panel'!$D$10, 'Damage Costs User Interface'!DO10+1, \"\")","v":""},{"$f":"IF(COLUMN()-4<='Control Panel'!$D$10, 'Damage Costs User Interface'!DP10+1, \"\")","v":""},{"$f":"IF(COLUMN()-4<='Control Panel'!$D$10, 'Damage Costs User Interface'!DQ10+1, \"\")","v":""},{"$f":"IF(COLUMN()-4<='Control Panel'!$D$10, 'Damage Costs User Interface'!DR10+1, \"\")","v":""},{"$f":"IF(COLUMN()-4<='Control Panel'!$D$10, 'Damage Costs User Interface'!DS10+1, \"\")","v":""},{"$f":"IF(COLUMN()-4<='Control Panel'!$D$10, 'Damage Costs User Interface'!DT10+1, \"\")","v":""},{"$f":"IF(COLUMN()-4<='Control Panel'!$D$10, 'Damage Costs User Interface'!DU10+1, \"\")","v":""},{"$f":"IF(COLUMN()-4<='Control Panel'!$D$10, 'Damage Costs User Interface'!DV10+1, \"\")","v":""},{"$f":"IF(COLUMN()-4<='Control Panel'!$D$10, 'Damage Costs User Interface'!DW10+1, \"\")","v":""},{"$f":"IF(COLUMN()-4<='Control Panel'!$D$10, 'Damage Costs User Interface'!DX10+1, \"\")","v":""},{"$f":"IF(COLUMN()-4<='Control Panel'!$D$10, 'Damage Costs User Interface'!DY10+1, \"\")","v":""}]
{"$rows_left_out":97}
{"sheet":"Outputs","index":4,"n_rows":8,"n_cols":5,"rows_kept":8,"cut":false,"hidden":false,"merged":[]}
["Outputs"]
[]
[null,"Pollutant","Low Sensitivity Present Value","Central Present Value","High Sensitivity Present Value"]
[null,{"$f":"IF('Damage Costs User Interface'!$E$3=\"\", \"\", 'Damage Costs User Interface'!$A$9)","v":""},{"$f":"IF('Damage Costs User Interface'!$D$3=\"\", \"\", 'Damage Costs User Interface'!$E$21)","v":""},{"$f":"IF('Damage Costs User Interface'!$D$3=\"\", \"\", 'Damage Costs User Interface'!$E$16)","v":""},{"$f":"IF('Damage Costs User Interface'!$D$3=\"\", \"\", 'Damage Costs User Interface'!$E$26)","v":""}]
[null,{"$f":"IF('Damage Costs User Interface'!$L$3=\"\", \"\", 'Damage Costs User Interface'!$A$29)","v":""},{"$f":"IF('Damage Costs User Interface'!$K$3=\"\", \"\", 'Damage Costs User Interface'!$E$41)","v":""},{"$f":"IF('Damage Costs User Interface'!$K$3=\"\", \"\", 'Damage Costs User Interface'!$E$36)","v":""},{"$f":"IF('Damage Costs User Interface'!$K$3=\"\", \"\", 'Damage Costs User Interface'!$E$46)","v":""}]
[null,{"$f":"IF('Damage Costs User Interface'!$S$3=\"\", \"\", 'Damage Costs User Interface'!$A$49)","v":""},{"$f":"IF('Damage Costs User Interface'!$R$3=\"\", \"\", 'Damage Costs User Interface'!$E$61)","v":""},{"$f":"IF('Damage Costs User Interface'!$R$3=\"\", \"\", 'Damage Costs User Interface'!$E$56)","v":""},{"$f":"IF('Damage Costs User Interface'!$R$3=\"\", \"\", 'Damage Costs User Interface'!$E$66)","v":""}]
[null,{"$f":"IF('Damage Costs User Interface'!$E$5=\"\", \"\", 'Damage Costs User Interface'!$A$69)","v":""},{"$f":"IF('Damage Costs User Interface'!$D$5=\"\", \"\", 'Damage Costs User Interface'!$E$81)","v":""},{"$f":"IF('Damage Costs User Interface'!$D$5=\"\", \"\", 'Damage Costs User Interface'!$E$76)","v":""},{"$f":"IF('Damage Costs User Interface'!$D$5=\"\", \"\", 'Damage Costs User Interface'!$E$86)","v":""}]
[null,{"$f":"IF('Damage Costs User Interface'!$L$5=\"\", \"\", 'Damage Costs User Interface'!$A$89)","v":""},{"$f":"IF('Damage Costs User Interface'!$K$5=\"\", \"\", 'Damage Costs User Interface'!$E$101)","v":""},{"$f":"IF('Damage Costs User Interface'!$K$5=\"\", \"\", 'Damage Costs User Interface'!$E$96)","v":""},{"$f":"IF('Damage Costs User Interface'!$K$5=\"\", \"\", 'Damage Costs User Interface'!$E$106)","v":""}]

{"sheet":"Damage Costs and Assumptions","index":5,"n_rows":103,"n_cols":130,"rows_kept":103,"cut":false,"hidden":false,"merged":[[3,1,3,5],[3,6,4,6],[3,13,3,22],[4,13,4,14],[4,15,4,16],[4,17,4,18],[4,19,4,20],[4,21,4,22]]}
["Damage Costs & Assumptions"]
[]
[]
[null,"Damage Cost Valuations (£/tonne, 2017 Prices)",null,null,null,null,"PM2.5/PM10 Conversion Factors",null,null,null,null,null,null,"Pollutants by Sector"]
[null,"Number","Pollutant Sector","Low Scenario","Central Scenario","High Scenario",null,null,null,null,null,null,null,"NOx ",null,"PM2.5",null,"SO2 ",null,"VOC ",null,"NH3"]
[]
[null,1,"NOx National",633.77627791658301,6198.7963910636663,23152.511331131558,"-",null,null,null,null,null,null,"National",null,"National",null,"National",null,"National",null,"National"]
[null,2,"NOx Industry (area)",593.18971072143029,5670.5150730188207,21069.805562464106,"-",null,null,null,null,null,null,"Industry (area)",null,"Industry (area)"]
[null,3,"NOx Commercial",1179.896837365915,13307.189854597049,51176.769556371772,"-",null,null,null,null,null,null,"Commercial",null,"Commercial"]
[null,4,"NOx Domestic",1229.2786714684792,13949.951788163342,53710.805762446216,"-",null,null,null,null,null,null,"Domestic",null,"Domestic"]
{"$rows_left_out":93}