{"text_format":"1","workbook":"xlsx","n_sheets":21,"sheets":["Welcome","1a) Model guide","1b) Model steps","1c) Example","1d) Disclaimer","2a) Interventions","2b) Population","2c) Intervention costs","2d) Other resources","2e) Intervention effectiveness","2f) Quality of life","Calculations","3a) Results summary","3b) Detailed results","3c) Results charts","3d) Sensitivity analysis","3d) Sensitivity analysis 2","3d) Sensitivity analysis 3","3d) Sensitivity analysis 4","3d) Sensitivity analysis 5","3d) Sensitivity analysis 6"],"not_rendered":{"charts":26,"images":4,"macros":1,"external_links":0,"defined_names":37,"comments":7,"pivot_tables":0},"unopened":[],"bounds":{"document_bytes":16777216,"sheet_cells":100000,"rows_first":2000,"rows_last":500,"rows_between":2000,"halvings":0,"cell_chars":16384,"cell_head_chars":4096},"cells_cut":0,"cells_raw":0,"read":"whole","date_system":"1900"}

{"sheet":"Welcome","index":0,"n_rows":10,"n_cols":16,"rows_kept":10,"cut":false,"hidden":false,"merged":[[8,4,8,17],[9,4,9,14]]}
[]
[]
[null,null,null,null,null,"Return on Investment of Falls Prevention Programmes in Older People in the Community"]
[]
[]
[]
[]
[]
[null,null,null,null,"This is a tool that has been designed for healthcare commissioners and providers in England who wish to assess the return on investment for community-based falls prevention programmes for older people. The tool has been commissioned by Public Health England and developed by York Health Economics Consortium. It is hoped that the tool will aid decision-making and increase the uptake of cost-effective programmes aimed at falls prevention in the community. In total four separate programmes are included that have previously been found to be cost-effective. These programmes are:\n\n- Otago strength and balance exercise\n- Falls Management Exercise (FaME)\n- Tai Chi or Tai Ji Quan\n- Home Assessment and Modification.\n\nUsing the tool it is possible to assess the return on investment for adopting each programme within a specific geographical area (e.g. an individual local authority or CCG) and the tool is pre-populated with relevant English data to allow this. However, it is also possible to insert alternative data to analyse new scenarios (e.g. a reduction in costs for a specific programme). The tool contains an in-built user guide that aims to give a step-by-step explanation of how to undertake an analysis, including updating the data. It is recommended that the 'Information' section is read before undertaking any form of analysis and this section can be accessed using the button on the left."]
[null,null,null,null,"For more information on the tool, or to provide feedback on its usability, please contact us at:  ",null,null,null,null,null,null,null,null,null,null,"healtheconomics@phe.gov.uk"]

{"sheet":"1a) Model guide","index":1,"n_rows":20,"n_cols":7,"rows_kept":20,"cut":false,"hidden":false,"merged":[]}
[]
[]
[]
[]
[]
[]
[]
[]
[]
[null,null,null,null,null,null,"Tool sections:"]
[null,null,null,null,null,null,"The tool is separated into three main sections: Information (currently selected), Inputs and Results. You can navigate between these using the buttons on the left-hand side. Within each section there are also a number of sub-sections and it is possible to navigate amongst them using the buttons at the top of each page (as seen above). It is also possible to navigate across each of the tool's sections and sub-sections using the tabs at the bottom of the page. These tabs are colour coded based on the section that is chosen (i.e. Information, Inputs and Results)."]
[]
[null,null,null,null,null,null,"Navigating around the tool:"]
[null,null,null,null,null,null,"When entering the 'Inputs' section each sub-section should be viewed in-turn (moving from left to right) in order to ensure the inputs for the tool are setup in the appropriate way to generate relevant results. More information on how to setup the tool is given in the remaining pages in this section and also using the in-built user guide. Each sub-section within 'Inputs' has it's own user guide which can be selected to explain the information that is presented in that sub-section and how the default data can be updated to model new scenarios (i.e. ones specific to your local area)."]
[]
[null,null,null,null,null,null,"Colour-coding system:"]
[null,null,null,null,null,null,"There are three different types of cells in the tool (input, calculation and results) and there is a colour-coding system in place to help distinguish between them. Input cells contain data for the tool input parameters (e.g. unit costs, efficacy data) and are shown by a yellow background. These calls can be updated if you want to used new values to estimate the tool's results. Calculation cells contain equations that are used to estimate specific inputs that drive the tool's results. For example, to estimate the cost of staff time for a specific intervention the total number of hours required for one staff type (e.g. physiotherapist) will be multiplied by the hourly rate for that staff member. These cells are shown by a light blue background and the values in these cells shouldn't be altered as this will effect the overall results. Result cells contain the main outputs from the tool (e.g. total costs) and these can all be found within the 'Results' section. These cells are shown by a light orange background and, as with the calculation cells, the values presented in these cells should not be altered."]
[]
[null,null,null,null,null,null,"Other features:"]
[null,null,null,null,null,null,"The tool also contains a number of other features that allow for simple operation, including comment boxes that contain information about specific input parameters (an example can be found above this paragraph, viewable by hovering over the red triangle) and dropdown boxes that can be used to select from a number of different options from a pre-defined list (e.g. selected intervention, geographical area)."]
{"$rows_left_out":1}
{"sheet":"1b) Model steps","index":2,"n_rows":54,"n_cols":7,"rows_kept":54,"cut":false,"hidden":false,"merged":[]}
[]
[]
[]
[]
[]
[]
[]
[]
[]
[null,null,null,null,null,null,"A number of steps must be followed in order to generate relevant results regarding the return on investment for commissioning each of the four interventions included in the tool. If you do not wish to update the data sources used for the tool input parameters then it will be possible to generate results using the default data once a small number of variables have been chosen (e.g. geographical location, intervention choice). However, if you wish to update the values using data specific to your local area this will require further steps to generate appropriate results. These steps are summarised below and more information on updating input parameters is given in the user guide that is in-built into tool."]
[]
[null,null,null,null,null,null,"INPUTS"]
[]
[null,null,null,null,null,null,"Intervention (2a)"]
[null,null,null,null,null,null,"The return on investment for each included intervention must be assessed individually. Therefore, only one intervention can be chosen for the analysis and this choice should be made using the dropdown menu on the 'Interventions' (2a) page. Within the tool each intervention is compared to current usual care, which is assumed to be no specific falls prevention programmes (i.e. the participants are not currently part of a falls prevention service)."]
[]
[]
[null,null,null,null,null,null,"Population (2b)"]
[null,null,null,null,null,null,"Each analysis will be undertaken for a specific population. Therefore, the size of this population must be selected. Once you have navigated to the 'Population' (2b) page a specific geographical area can be selected from a pre-defined list using the dropdown menu. It will also be possible to input a new value into the 'user defined' cell if you wish to test a population size that isn't included in the list."]
[]
{"$rows_left_out":35}
{"sheet":"1c) Example","index":3,"n_rows":0,"n_cols":0,"rows_kept":0,"cut":false,"hidden":false,"merged":[]}

{"sheet":"1d) Disclaimer","index":4,"n_rows":18,"n_cols":7,"rows_kept":18,"cut":false,"hidden":false,"merged":[]}
[]
[]
[]
[]
[]
[]
[]
[]
[]
[null,null,null,null,null,null,"Disclaimer:"]
[null,null,null,null,null,null,"Public Health England has provided this tool to aid decision-making and cannot be held liable for any investment or other decisions that are made using the information presented. The best available evidence has been used in this tool and assumptions are clearly stated. Local authorities using this tool are advised to seek the support of their local falls prevention team."]
[]
[null,null,null,null,null,null,"Acknowledgments:"]
[null,null,null,null,null,null,"We would like to thank all the individuals who contributed towards the development of this tool. This included those helping to inform the tool design and values for the tool input parameters and also providing key insights during the quality assurance process. A range of individuals were involved, including: health economists at Public Health England, commissioners and representatives from local authorities, members of falls prevention teams from across England and advisors from the National Osteoporosis Society."]
[]
[null,null,null,null,null,null,"Citation:"]
[null,null,null,null,null,null,"If you wish to cite this tool please use the following:"]
[null,null,null,null,null,null,"Public Health England. A return on investment tool for falls prevention programmes in older people based in the community. 2017."]

{"sheet":"2a) Interventions","index":5,"n_rows":99,"n_cols":14,"rows_kept":99,"cut":false,"hidden":false,"merged":[[3,15,4,22],[15,6,15,8]]}
[]
[]
[]
[]
[]
[]
[]
[]
[]
[]
[]
[]
[null,null,null,null,null,null,"Select intervention:"]
[]
[null,null,null,null,null,null,"Intervention description:"]
[null,null,null,null,null,null,{"$f":"CHOOSE(IntChoice,G96,G97,G98,G99)","v":"The Otago programme is a home based exercise programme in which participants are encouraged to perform exercises three times a week at home and also walk indoors and outdoors at a moderate pace. Otago is recommended for at least one year and participants receive support from trained staff through home visits and follow up telephone calls."}]
[]
[null,null,null,null,null,null,"Target population for each intervention:"]
[]
[null,null,null,null,null,null,"Characteristic","Value"]
{"$rows_left_out":80}
{"sheet":"2b) Population","index":6,"n_rows":454,"n_cols":33,"rows_kept":454,"cut":false,"hidden":false,"merged":[[22,6,22,7]]}
[]
[]
[]
[]
[]
[]
[]
[]
[]
[]
[]
[]
[null,null,null,null,null,null,"Local authority, CCG or STP:"]
[]
[null,null,null,null,null,null,"Select age bracket:"]
[]
[null,null,null,null,null,null,"Select local authority:"]
[]
[null,null,null,null,null,null,"Select CCG:"]
[]
{"$rows_left_out":435}
{"sheet":"2c) Intervention costs","index":7,"n_rows":231,"n_cols":44,"rows_kept":231,"cut":false,"hidden":false,"merged":[[26,6,29,8],[182,6,182,7],[181,6,181,7],[180,6,180,7],[179,6,179,7],[178,6,178,7],[85,7,90,7],[95,6,95,7],[207,7,212,7],[124,7,129,7],[124,11,129,11],[124,12,129,12],[167,7,172,7],[167,11,172,11],[167,12,172,12],[140,6,140,7],[139,6,139,7],[138,6,138,7],[137,6,137,7],[136,6,136,7],[135,6,135,7],[134,6,134,7],[183,6,183,7],[177,6,177,7],[108,13,110,13],[96,6,96,7],[101,6,101,7],[100,6,100,7],[99,6,99,7],[98,6,98,7],[97,6,97,7]]}
[]
[]
[]
[]
[]
[]
[]
[]
[]
[]
[]
[]
[null,null,null,null,null,null,"Selected intervention:",{"$f":"VLOOKUP('2a) Interventions'!$G$79,'2a) Interventions'!$F$82:$G$85,2)","v":"Otago strength and balance exercise"}]
[]
[null,null,null,null,null,null,"Include a cost for evaluation interventions?"]
[]
[null,null,null,null,null,null,"Cost for implementation of the intervention:"]
[]
[null,null,null,null,null,null,"Resource","Cost per person","Total cost"]
[null,null,null,null,null,null,"Staff time",{"$f":"IF(I20=\"N/A\",\"N/A\",I20/TotalPop)","v":345.4},{"$f":"VLOOKUP(IntChoice,$AK$68:$AO$71,3)","v":345308.81440000003}]
{"$rows_left_out":212}
{"sheet":"2d) Other resources","index":8,"n_rows":106,"n_cols":23,"rows_kept":106,"cut":false,"hidden":false,"merged":[[14,6,14,7],[16,6,16,7],[15,6,15,7],[31,6,32,6],[33,6,34,6],[18,6,18,7],[17,6,17,7],[21,6,21,7],[20,6,20,7],[19,6,19,7],[24,6,24,7],[23,6,23,7],[22,6,22,7],[31,10,32,10],[33,10,34,10],[35,10,36,10],[35,6,36,6],[30,6,30,7]]}
[]
[]
[]
[]
[]
[]
[]
[]
[]
[]
[]
[]
[null,null,null,null,null,null,"Primary & secondary care costs:"]
[]
[null,null,null,null,null,null,"Resource",null,"Unit Cost"]
[null,null,null,null,null,null,"GP visit",null,36]
[null,null,null,null,null,null,"A&E visit - admission",null,100.53]
[null,null,null,null,null,null,"A&E visit - no admission",null,90.29]
[null,null,null,null,null,null,"Ambulance call-out to hospital",null,236]
[null,null,null,null,null,null,"Non-hip fracture - hospital inpatient stay",null,7949]
{"$rows_left_out":87}
{"sheet":"2e) Intervention effectiveness","index":9,"n_rows":195,"n_cols":36,"rows_kept":195,"cut":false,"hidden":false,"merged":[[159,21,159,22],[159,24,159,25],[42,8,42,9],[27,7,28,7],[177,25,177,26],[177,13,177,14],[177,17,177,18],[177,21,177,22],[159,12,159,13],[159,15,159,16],[159,18,159,19],[27,6,28,6],[159,9,159,10],[42,7,43,7],[42,6,43,6],[27,8,27,9],[53,6,53,7],[30,6,30,9],[36,6,36,9],[34,6,34,9],[79,34,79,35],[79,8,79,9],[79,6,80,6],[79,13,80,13],[79,15,79,16],[79,32,80,32]]}
[]
[]
[]
[]
[]
[]
[]
[]
[]
[]
[]
[]
[null,null,null,null,null,null,"Selected intervention:",{"$f":"VLOOKUP('2a) Interventions'!$G$79,'2a) Interventions'!$F$82:$G$85,2)","v":"Otago strength and balance exercise"}]
[]
[null,null,null,null,null,null,"Rate of falls with each intervention:"]
[null,null,null,null,null,null,"Parameter","Mean","95% CI","Data source"]
[null,null,null,null,null,null,"Rate of falls in study control group",{"$f":"VLOOKUP('2a) Interventions'!$G$79,'2e) Intervention effectiveness'!$AF$82:$AJ$85,3)","v":1.06},"N/A",{"$f":"VLOOKUP(IntChoice,'2a) Interventions'!$F$90:$I$93,3)","v":"Roberson et al. 2002"}]
[null,null,null,null,null,null,"Incidence rate ratio",{"$f":"VLOOKUP('2a) Interventions'!$G$79,'2e) Intervention effectiveness'!$AF$82:$AJ$85,4)","v":0.65},{"$f":"VLOOKUP('2a) Interventions'!$G$79,'2e) Intervention effectiveness'!$AF$82:$AJ$85,5)","v":"0.57 to 0.75"},{"$f":"VLOOKUP(IntChoice,'2a) Interventions'!$F$90:$I$93,4)","v":"Roberson et al. 2002"}]
[null,null,null,null,null,null,"Reduction in efficacy - year 2",0.5,"N/A","Assumption "]
[]
{"$rows_left_out":176}
{"sheet":"2f) Quality of life","index":10,"n_rows":107,"n_cols":36,"rows_kept":107,"cut":false,"hidden":false,"merged":[[88,6,88,7],[88,17,88,18],[88,21,88,22],[88,13,88,14],[88,9,88,10],[22,6,22,7],[67,32,68,32],[67,34,67,35],[27,7,28,7],[27,8,27,9]]}
[]
[]
[]
[]
[]
[]
[]
[]
[]
[]
[]
[]
[null,null,null,null,null,null,"Parameter","Value"]
[null,null,null,null,null,null,"Utility of general population aged ≥75",0.73]
[null,null,null,null,null,null,"Utility with a hip fracture",0.58199999999999996]
[null,null,null,null,null,null,"Utility with a non-hip fracture",0.69899999999999995]
[null,null,null,null,null,null,"Utility decrement following care home admission",0.06]
[null,null,null,null,null,null,"Utility decrement following a fall due to fear of a future fall",4.4999999999999998E-2]
[]
[null,null,null,null,null,null,"Value of a QALY",60000]
{"$rows_left_out":88}
{"sheet":"Calculations","index":11,"n_rows":54,"n_cols":21,"rows_kept":54,"cut":false,"hidden":true,"merged":[[55,1,55,5],[3,2,3,3],[3,4,3,5],[21,13,21,16],[21,17,21,20],[42,13,42,16],[42,17,42,20],[21,2,21,5],[21,6,21,9],[42,2,42,5],[42,6,42,9],[4,8,4,11],[4,12,4,15]]}
[]
[null,"Select intervention for analysis:"]
[]
[null,"Total number of events:","Control",null,{"$f":"'2c) Intervention costs'!$H$13","v":"Otago strength and balance exercise"},null,null,"Care home patients only:"]
[null,null,"Year 1","Year 2","Year 1","Year 2",null,null,"Control",null,null,null,"Treatment"]
[null,"Total falls",{"$f":"TotalPop*BaselineFall","v":1059.7201600000001},{"$f":"TotalPop*BaselineFall","v":1059.7201600000001},{"$f":"(TotalPop*BaselineFall)*IncRateRatio","v":688.81810400000006},{"$f":"IF(IntChoice=2,(TotalPop*BaselineFall)*FameYear2,(TotalPop*BaselineFall)*(IncRateRatio+((1-IncRateRatio)*Year2Eff)))","v":874.26913200000001},null,null,"Year 1","Year 2","Year 3","Year 4","Year 1","Year 2","Year 3","Year 4"]
[null,"Serious falls",{"$f":"C6*SeriousFalls","v":211.94403200000002},{"$f":"D6*SeriousFalls","v":211.94403200000002},{"$f":"E6*SeriousFalls","v":137.76362080000001},{"$f":"F6*SeriousFalls","v":174.8538264},null,"NHS care home",{"$f":"C16","v":0.86642720281600005},{"$f":"C16+D16","v":1.7328544056320001},{"$f":"(C16/2)+D16","v":1.299640804224},{"$f":"D16/2","v":0.43321360140800003},{"$f":"E16","v":0.56317768183040007},{"$f":"E16+F16","v":1.2779801241536002},{"$f":"(E16/2)+F16","v":0.99639128323840009},{"$f":"F16/2","v":0.3574012211616}]
[null,"Serious falls - GP visit",{"$f":"C7*FallsGP","v":108.09145632000001},{"$f":"D7*FallsGP","v":108.09145632000001},{"$f":"E7*FallsGP","v":70.259446608000005},{"$f":"F7*FallsGP","v":89.175451464000005},null,"LA care home",{"$f":"C17","v":0.33232824217600004},{"$f":"C17+D17","v":0.66465648435200009},{"$f":"(C17/2)+D17","v":0.49849236326400004},{"$f":"D17/2","v":0.16616412108800002},{"$f":"E17","v":0.21601335741440003},{"$f":"E17+F17","v":0.49018415720960001},{"$f":"(E17/2)+F17","v":0.38217747850240003},{"$f":"F17/2","v":0.13708539989759999}]
[null,"Serious falls - ambulance call-out",{"$f":"C7*FallsAmb","v":129.28585952},{"$f":"D7*FallsAmb","v":129.28585952},{"$f":"E7*FallsAmb","v":84.035808688000003},{"$f":"F7*FallsAmb","v":106.660834104},null,"Non-NHS care home",{"$f":"C18","v":0.92577153177600002},{"$f":"C18+D18","v":1.851543063552},{"$f":"(C18/2)+D18","v":1.3886572976639999},{"$f":"D18/2","v":0.46288576588800001},{"$f":"E18","v":0.6017514956544},{"$f":"E18+F18","v":1.3655130093696},{"$f":"(E18/2)+F18","v":1.0646372615424},{"$f":"F18/2","v":0.38188075685759998}]
[null,"Serious falls - A&E visit",{"$f":"C7*FallsAE","v":169.55522560000003},{"$f":"D7*FallsAE","v":169.55522560000003},{"$f":"E7*FallsAE","v":110.21089664000002},{"$f":"F7*FallsAE","v":139.88306112000001},null,"Total",{"$f":"I7+I8+I9","v":2.1245269767680002},{"$f":"J7+J8+J9","v":4.2490539535360003},{"$f":"K7+K8+K9","v":3.1867904651519998},1.0622634883840001,1.3809425348992002,3.1336772907328001,2.4432060232832002,0.87636737791679997]
[null,"A&E attendences w. admission",{"$f":"C10*AdmAE","v":59.344328960000006},{"$f":"D10*AdmAE","v":59.344328960000006},{"$f":"E10*AdmAE","v":38.573813824000005},{"$f":"F10*AdmAE","v":48.959071391999998}]
[null,"Admission due to non-hip fracture",{"$f":"C11*(1-HipAdm)","v":40.947586982400004},{"$f":"D11*(1-HipAdm)","v":40.947586982400004},{"$f":"E11*(1-HipAdm)","v":26.615931538560002},{"$f":"F11*(1-HipAdm)","v":33.781759260479994}]
[null,"Admissions due to hip fractures",{"$f":"C11*HipAdm","v":18.396741977600001},{"$f":"D11*HipAdm","v":18.396741977600001},{"$f":"E11*HipAdm","v":11.957882285440002},{"$f":"F11*HipAdm","v":15.177312131519999}]
[null,"Return home after inpatient stay",{"$f":"C11*'2e) Intervention effectiveness'!$H$45","v":52.424780203264},{"$f":"D11*'2e) Intervention effectiveness'!$H$45","v":52.424780203264},{"$f":"E11*'2e) Intervention effectiveness'!$H$45","v":34.076107132121606},{"$f":"F11*'2e) Intervention effectiveness'!$H$45","v":43.250443667692799},null,{"$f":"IntChoice","v":1}]
[null,{"$f":"+'2e) Intervention effectiveness'!G47","v":"NHS care home"},{"$f":"C11*GenWard","v":3.3766923178240003},{"$f":"D11*GenWard","v":3.3766923178240003},{"$f":"E11*GenWard","v":2.1948500065856003},{"$f":"F11*GenWard","v":2.7857711622047998}]
[null,"Move to new NHS care home",{"$f":"C11*Move1","v":0.86642720281600005},{"$f":"D11*Move1","v":0.86642720281600005},{"$f":"E11*Move1","v":0.56317768183040007},{"$f":"F11*Move1","v":0.7148024423232}]
[null,"Move to new LA care home",{"$f":"C11*Move2","v":0.33232824217600004},{"$f":"D11*Move2","v":0.33232824217600004},{"$f":"E11*Move2","v":0.21601335741440003},{"$f":"F11*Move2","v":0.27417079979519998}]
[null,"Move to new non-NHS care home",{"$f":"C11*Move3","v":0.92577153177600002},{"$f":"D11*Move3","v":0.92577153177600002},{"$f":"E11*Move3","v":0.6017514956544},{"$f":"F11*Move3","v":0.76376151371519996}]
[null,"Death",{"$f":"C11*Death","v":1.4183294621440001},{"$f":"D11*Death","v":1.4183294621440001},{"$f":"E11*Death","v":0.92191415039360014},{"$f":"F11*Death","v":1.1701218062687999}]
[]
{"$rows_left_out":35}
{"sheet":"3a) Results summary","index":12,"n_rows":142,"n_cols":10,"rows_kept":142,"cut":false,"hidden":false,"merged":[[24,21,25,21],[18,5,20,5]]}
[]
[]
[]
[]
[]
[]
[]
[]
[]
[]
[]
[]
[null,null,null,null,null,null,"Select intervention for analysis:"]
[]
[]
[]
[]
[]
[null,null,null,null,null,null,"Impact on costs (by total population):"]
[null,null,null,null,null,null,null,{"$f":"'2a) Interventions'!$H$79","v":"Otago"},"Usual care","Difference"]
{"$rows_left_out":123}
{"sheet":"3b) Detailed results","index":13,"n_rows":43,"n_cols":10,"rows_kept":43,"cut":false,"hidden":false,"merged":[]}
[]
[]
[]
[]
[]
[]
[]
[]
[]
[null,null,null,null,null,null,"Cost breakdown by falls-related event, total population:"]
[]
[null,null,null,null,null,null,"Event",{"$f":"CHOOSE(IntChoice,'2a) Interventions'!G90,'2a) Interventions'!G91,'2a) Interventions'!G92,'2a) Interventions'!G93)","v":"Otago"},"Usual care","Difference"]
[null,null,null,null,null,null,"GP visit",{"$f":"SUM(Calculations!R25:U25)","v":5631.094911418435},{"$f":"SUM(Calculations!N25:Q25)","v":7650.9952560417405},{"$f":"H13-I13","v":-2019.9003446233055}]
[null,null,null,null,null,null,"Ambulance call-out",{"$f":"SUM(Calculations!R26:U26)","v":44153.182104999883},{"$f":"SUM(Calculations!N26:Q26)","v":59991.137094758655},{"$f":"H14-I14","v":-15837.954989758771}]
[null,null,null,null,null,null,"A&E visit - no admission",{"$f":"SUM(Calculations!R27:U27)","v":14400.022383824875},{"$f":"SUM(Calculations!N27:Q27)","v":19565.378435041646},-5165.3560512167714]
[null,null,null,null,null,null,"A&E visit - admission",{"$f":"SUM(Calculations!R28:U28)","v":8633.2413945844601},{"$f":"SUM(Calculations!N28:Q28)","v":11730.025864115758},-3096.7844695312979]
[null,null,null,null,null,null,"General NHS ward",{"$f":"SUM(Calculations!R32:U32)","v":71631.345425492415},{"$f":"SUM(Calculations!N32:Q32)","v":97325.847398348895},-25694.50197285648]
[null,null,null,null,null,null,"Hospital inpatient - non-hip",{"$f":"SUM(Calculations!R29:U29)","v":471020.47879668541},{"$f":"SUM(Calculations!N29:Q29)","v":639977.74952512432},-168957.27072843892]
[null,null,null,null,null,null,"Hospital inpatient - hip",{"$f":"SUM(Calculations!R30:U31)","v":309340.88433935714},{"$f":"SUM(Calculations!N30:Q31)","v":420302.92080159695},-110962.0364622398]
[null,null,null,null,null,null,"Total",{"$f":"SUM(H13:H19)","v":924810.24935636262},{"$f":"SUM(I13:I19)","v":1256544.054375028},-331733.80501866539]
{"$rows_left_out":24}
{"sheet":"3c) Results charts","index":14,"n_rows":0,"n_cols":0,"rows_kept":0,"cut":false,"hidden":false,"merged":[]}

{"sheet":"3d) Sensitivity analysis","index":15,"n_rows":89,"n_cols":7,"rows_kept":89,"cut":false,"hidden":false,"merged":[[68,6,68,9],[81,6,81,9],[82,6,82,9],[69,6,69,9],[70,6,70,9],[71,6,71,9],[72,6,72,9],[80,6,80,9]]}
[]
[]
[]
[]
[]
[]
[]
[null,null,null,null,null,null,"Select deterministic sensitivity analysis from drop down menu:"]
[]
[]
[]
[]
[]
[]
[]
[]
[]
[]
[]
[]
{"$rows_left_out":70}
{"sheet":"3d) Sensitivity analysis 2","index":16,"n_rows":0,"n_cols":0,"rows_kept":0,"cut":false,"hidden":false,"merged":[]}

{"sheet":"3d) Sensitivity analysis 3","index":17,"n_rows":0,"n_cols":0,"rows_kept":0,"cut":false,"hidden":false,"merged":[]}

{"sheet":"3d) Sensitivity analysis 4","index":18,"n_rows":0,"n_cols":0,"rows_kept":0,"cut":false,"hidden":false,"merged":[]}

{"sheet":"3d) Sensitivity analysis 5","index":19,"n_rows":0,"n_cols":0,"rows_kept":0,"cut":false,"hidden":false,"merged":[]}

{"sheet":"3d) Sensitivity analysis 6","index":20,"n_rows":131,"n_cols":7,"rows_kept":131,"cut":false,"hidden":false,"merged":[[130,6,130,9],[124,6,124,9],[125,6,125,9],[126,6,126,9],[127,6,127,9],[128,6,128,9],[129,6,129,9],[123,6,123,9],[68,6,68,9],[69,6,69,9],[70,6,70,9],[71,6,71,9],[72,6,72,9]]}
[]
[]
[]
[]
[]
[]
[]
[]
[]
[]
[]
[]
[]
[]
[]
[]
[]
[]
[]
[]
{"$rows_left_out":111}