{"text_format":"1","workbook":"xlsx","n_sheets":7,"sheets":["User Guide","Notes","LEALA Dashboard","PCON Dashboard","Apps Ach - LEALA (R)","Apps-Ach-PCON (R)","Lists"],"not_rendered":{"charts":0,"images":6,"macros":0,"external_links":0,"defined_names":2,"comments":0,"pivot_tables":0},"unopened":[],"bounds":{"document_bytes":16777216,"sheet_cells":100000,"rows_first":2000,"rows_last":500,"rows_between":2000,"halvings":0,"cell_chars":16384,"cell_head_chars":4096},"cells_cut":0,"cells_raw":0,"read":"whole","date_system":"1900"}

{"sheet":"User Guide","index":0,"n_rows":30,"n_cols":3,"rows_kept":30,"cut":false,"hidden":false,"merged":[[3,2,3,6],[10,0,10,16],[11,0,11,16],[12,0,12,16],[15,0,15,16],[22,0,22,13],[24,0,24,9],[29,0,29,9],[16,0,16,16],[17,0,17,9],[20,0,20,16],[21,0,21,13],[25,0,25,9],[26,0,26,9]]}
[]
[]
[]
[null,null,"User Guide"]
[]
[]
[]
["General information"]
["This tool is in development.  It will be updated on an adhoc basis and will evolve over time."]
["This datapack contains the following:\n\n\n\n"]
["A 'Notes' tab which details notes from any data tables throughout the pack."]
["Two dashboards; 'LEALA Dashboard' and 'PCON Dashboard'."]
["Hidden tabs with underlying data tables that each dashboard is linked to."]
[]
["Dashboards"]
["The LEALA Dashboard contains information regarding Local Education Authorities/ Local Authorities."]
["The PCON Dashboard contains information regarding Parliamentary Constituencies. "]
["At the top of each dashboard there is a drop down menu (examples below) which allows you to select a LEA/LA/PCON, as shown below. This will automatically update each of the tables on the dashboard."]
[]
[]
["Each dashboard contains one table:\n\n\n\n"]
["Apprenticeship achievements by Age Group and Level"]
[]
["Filters"]
["In order to filter age and level in the first dashboard, and sector subject area in the second dashboard, click on the grey square filter button to the right of the header: "]
[]
["You will then have the option to select different levels/ages."]
[]
["Hidden tabs"]
["If you would like to see the larger data tables that each of the tables in the dashboards are linked to, then right click on any of the tabs below, click 'unhide' and each table will appear in a list."]

{"sheet":"Notes","index":1,"n_rows":55,"n_cols":10,"rows_kept":55,"cut":false,"hidden":false,"merged":[[19,11,19,12],[20,1,20,9],[20,11,20,12],[9,1,9,9],[10,1,10,9],[11,1,11,9],[12,1,12,9],[13,1,13,9],[14,1,14,9],[15,1,15,9],[16,1,16,9],[17,1,17,9],[19,1,19,9],[18,1,18,9],[34,1,34,9],[27,1,27,9],[32,1,32,9],[33,1,33,9],[47,1,47,9],[35,1,35,9],[36,1,36,9],[37,1,37,9],[44,1,44,9],[45,1,45,9],[46,1,46,9],[21,1,21,9],[25,1,25,9],[26,1,26,9],[24,1,24,9],[22,1,22,9],[23,1,23,9]]}
[]
[]
[]
[]
[]
[]
[]
[]
[]
[null,"Table Notes"]
[null," "]
[null,"Notes"]
[null,"1) Volumes are rounded to the nearest ten except for the Grand Totals which are rounded to the nearest hundred."]
[null,"2) ‘-’ Indicates a base value of less than 5."]
[null,"3) For definitions of variables used in the tables please see the data dictionary:"]
[null,"http://webarchive.nationalarchives.gov.uk/20140107201041/http://www.thedataservice.org.uk/datadictionary/"]
[null,"4) The data source for all tables is the Individualised Learner Record, except where stated."]
[null,"5) Unlike learner figures in other tables, figures for 2008/09 onwards are comparable with earlier years as demand led funding rules are not applied to starts and achievements."]
[null,"6) Age is calculated based on age at start of the programme rather than based on 31 August."]
[null,"7) In this table full-year numbers are a count of the number of achievements at any point during the year.  Learners achieving more than one Apprenticeship will appear more than once."]
[null,"8) Programme-Led Apprenticeships recorded in ILR returns are included in the above figures."]
[null,"9) These tables include provisional 2014/15 Employer Ownership Pilot (EOP) volumes due to problems with the final 2014/15 EOP data collection. See the note in the commentary and on the contents page of the table pack for more information. "]
[null,"10) Region, Parliamentary Constituency, Local Education Authority and Local Authority is based upon the home postcode of the learner. Where the postcode is outside of England, learners are included in the 'Other' category. Where postcode is not known this is also included in the 'Other' category."]
[null,"11) These figures are based on the geographic boundaries of regions as of May 2010. Figures for 2003/04 to 2008/09 based on earlier geographic boundaries are available in the SFR Archive, but these cannot be directly compared with new figures due to boundary changes."]
[null,"12) Figures for 2010/11 onwards are based on postcode to geographic area assignments in the National Statistics Postcode Lookup. Figures for earlier years are based on the Office for National Statistics Postcode Directory. "]
[null,"14) Figures for 2011/12 onwards are not comparable to earlier years as a Single Individualised Learner Record (ILR) data collection system has been introduced. More information on the Single ILR is available at: "]
[null,"http://webarchive.nationalarchives.gov.uk/20140107201041/http://www.thedataservice.org.uk/NR/rdonlyres/C05DCDD5-67EE-4AD0-88B9-BEBC8F7F3300/0/SILR_Effects_SFR_Learners_June12.pdf"]
[]
[]
[null,"Publication Date",null,null,null,null,null,null,null,"July 2017"]
[]
[null,"Data Sources"]
[null,"Apprenticeships"]
[null,"2007/08 and earlier years (W13 Final)"]
[null,"2008/09 (E13 Final)"]
[null,"2009/10 (E13 Final)"]
[null,"2010/11 (ER13 Final)"]
[null,"2011/12 (R15 Final)"]
[null,"2012/13 (R14 Final)"]
[null,"2013/14 (R14 Final)"]
[null,"2014/15 (R14 Final)"]
[null,"2015/16 (R14 final)"]
[]
[]
[null,"Employer Ownership Pilot"]
[null,"2012/13 (R14 Final)"]
[null,"2013/14 (R14 Final)"]
[null,"2014/15 (R13)"]
[null,"2015/16 (R14 Final) "]
[]
[null,"Large Employer Outcome Pilot Data"]
[null,"2011/12 (R14 Final)"]
[null,"2012/13 (R14 Final)"]
[null,"2013/14 (R14 Final)"]
[null,"2014/15 (R14 final)"]

{"sheet":"LEALA Dashboard","index":2,"n_rows":73,"n_cols":10,"rows_kept":73,"cut":false,"hidden":false,"merged":[[7,1,7,9],[1,3,1,8]]}
[]
[null,null,null,"Local Education Authority/ Local Authority data on Apprenticeship Achievements"]
[]
[null,null,null,"Local Education Authority/ Local Authority",1]
[]
[]
[]
[null,"Apprenticeship - Achievements"]
[null,"Level","Age","Geography","LEA/LA/Region/England","2011/12","2012/13","2013/14","2014/15","2015/16"]
[null,"All","All","LEA/LA",{"$f":"INDEX('Apps Ach - LEALA (R)'!$B:$B,MATCH('LEALA Dashboard'!$E$4,'Apps Ach - LEALA (R)'!$A:$A,0))","v":"Adur"},{"$f":"INDEX('Apps Ach - LEALA (R)'!$C$7:$CD$360,MATCH('LEALA Dashboard'!$E$4,'Apps Ach - LEALA (R)'!$A$7:$A$360,0),MATCH(F$9&$B10&$C10,'Apps Ach - LEALA (R)'!$C$3:$CD$3,0))","v":0},{"$f":"INDEX('Apps Ach - LEALA (R)'!$C$7:$CD$360,MATCH('LEALA Dashboard'!$E$4,'Apps Ach - LEALA (R)'!$A$7:$A$360,0),MATCH(G$9&$B10&$C10,'Apps Ach - LEALA (R)'!$C$3:$CD$3,0))","v":230},{"$f":"INDEX('Apps Ach - LEALA (R)'!$C$7:$CD$360,MATCH('LEALA Dashboard'!$E$4,'Apps Ach - LEALA (R)'!$A$7:$A$360,0),MATCH(H$9&$B10&$C10,'Apps Ach - LEALA (R)'!$C$3:$CD$3,0))","v":260},{"$f":"INDEX('Apps Ach - LEALA (R)'!$C$7:$CD$360,MATCH('LEALA Dashboard'!$E$4,'Apps Ach - LEALA (R)'!$A$7:$A$360,0),MATCH(I$9&$B10&$C10,'Apps Ach - LEALA (R)'!$C$3:$CD$3,0))","v":250},{"$f":"INDEX('Apps Ach - LEALA (R)'!$C$7:$CD$360,MATCH('LEALA Dashboard'!$E$4,'Apps Ach - LEALA (R)'!$A$7:$A$360,0),MATCH(J$9&$B10&$C10,'Apps Ach - LEALA (R)'!$C$3:$CD$3,0))","v":240}]
[null,"All","All","Region",{"$f":"INDEX(Lists!$D:$D,MATCH('LEALA Dashboard'!E10,Lists!$E:$E,0))","v":"South East"},{"$f":"INDEX('Apps Ach - LEALA (R)'!$C$363:$CD$374,MATCH($E11,'Apps Ach - LEALA (R)'!$B$363:$B$374,0),MATCH(F$9&$B11&$C11,'Apps Ach - LEALA (R)'!$C$3:$CD$3,0))","v":33760},{"$f":"INDEX('Apps Ach - LEALA (R)'!$C$363:$CD$374,MATCH($E11,'Apps Ach - LEALA (R)'!$B$363:$B$374,0),MATCH(G$9&$B11&$C11,'Apps Ach - LEALA (R)'!$C$3:$CD$3,0))","v":33680},{"$f":"INDEX('Apps Ach - LEALA (R)'!$C$363:$CD$374,MATCH($E11,'Apps Ach - LEALA (R)'!$B$363:$B$374,0),MATCH(H$9&$B11&$C11,'Apps Ach - LEALA (R)'!$C$3:$CD$3,0))","v":34770},{"$f":"INDEX('Apps Ach - LEALA (R)'!$C$363:$CD$374,MATCH($E11,'Apps Ach - LEALA (R)'!$B$363:$B$374,0),MATCH(I$9&$B11&$C11,'Apps Ach - LEALA (R)'!$C$3:$CD$3,0))","v":35480},{"$f":"INDEX('Apps Ach - LEALA (R)'!$C$363:$CD$374,MATCH($E11,'Apps Ach - LEALA (R)'!$B$363:$B$374,0),MATCH(J$9&$B11&$C11,'Apps Ach - LEALA (R)'!$C$3:$CD$3,0))","v":36370}]
[null,"All","All","National","England",{"$f":"INDEX('Apps Ach - LEALA (R)'!$C$363:$CD$374,MATCH($E12,'Apps Ach - LEALA (R)'!$B$363:$B$374,0),MATCH(F$9&$B12&$C12,'Apps Ach - LEALA (R)'!$C$3:$CD$3,0))","v":255700},{"$f":"INDEX('Apps Ach - LEALA (R)'!$C$363:$CD$374,MATCH($E12,'Apps Ach - LEALA (R)'!$B$363:$B$374,0),MATCH(G$9&$B12&$C12,'Apps Ach - LEALA (R)'!$C$3:$CD$3,0))","v":250000},{"$f":"INDEX('Apps Ach - LEALA (R)'!$C$363:$CD$374,MATCH($E12,'Apps Ach - LEALA (R)'!$B$363:$B$374,0),MATCH(H$9&$B12&$C12,'Apps Ach - LEALA (R)'!$C$3:$CD$3,0))","v":253500},{"$f":"INDEX('Apps Ach - LEALA (R)'!$C$363:$CD$374,MATCH($E12,'Apps Ach - LEALA (R)'!$B$363:$B$374,0),MATCH(I$9&$B12&$C12,'Apps Ach - LEALA (R)'!$C$3:$CD$3,0))","v":258400},{"$f":"INDEX('Apps Ach - LEALA (R)'!$C$363:$CD$374,MATCH($E12,'Apps Ach - LEALA (R)'!$B$363:$B$374,0),MATCH(J$9&$B12&$C12,'Apps Ach - LEALA (R)'!$C$3:$CD$3,0))","v":269200}]
[null,"All","All","Total","Grand Total",{"$f":"INDEX('Apps Ach - LEALA (R)'!$C$363:$CD$374,MATCH($E13,'Apps Ach - LEALA (R)'!$B$363:$B$374,0),MATCH(F$9&$B13&$C13,'Apps Ach - LEALA (R)'!$C$3:$CD$3,0))","v":258400},{"$f":"INDEX('Apps Ach - LEALA (R)'!$C$363:$CD$374,MATCH($E13,'Apps Ach - LEALA (R)'!$B$363:$B$374,0),MATCH(G$9&$B13&$C13,'Apps Ach - LEALA (R)'!$C$3:$CD$3,0))","v":252900},{"$f":"INDEX('Apps Ach - LEALA (R)'!$C$363:$CD$374,MATCH($E13,'Apps Ach - LEALA (R)'!$B$363:$B$374,0),MATCH(H$9&$B13&$C13,'Apps Ach - LEALA (R)'!$C$3:$CD$3,0))","v":255800},{"$f":"INDEX('Apps Ach - LEALA (R)'!$C$363:$CD$374,MATCH($E13,'Apps Ach - LEALA (R)'!$B$363:$B$374,0),MATCH(I$9&$B13&$C13,'Apps Ach - LEALA (R)'!$C$3:$CD$3,0))","v":260900},{"$f":"INDEX('Apps Ach - LEALA (R)'!$C$363:$CD$374,MATCH($E13,'Apps Ach - LEALA (R)'!$B$363:$B$374,0),MATCH(J$9&$B13&$C13,'Apps Ach - LEALA (R)'!$C$3:$CD$3,0))","v":271700}]
[null,"All","Under 19","LEA/LA",{"$f":"INDEX('Apps Ach - LEALA (R)'!$B:$B,MATCH('LEALA Dashboard'!$E$4,'Apps Ach - LEALA (R)'!$A:$A,0))","v":"Adur"},{"$f":"INDEX('Apps Ach - LEALA (R)'!$C$7:$CD$360,MATCH('LEALA Dashboard'!$E$4,'Apps Ach - LEALA (R)'!$A$7:$A$360,0),MATCH(F$9&$B14&$C14,'Apps Ach - LEALA (R)'!$C$3:$CD$3,0))","v":0},{"$f":"INDEX('Apps Ach - LEALA (R)'!$C$7:$CD$360,MATCH('LEALA Dashboard'!$E$4,'Apps Ach - LEALA (R)'!$A$7:$A$360,0),MATCH(G$9&$B14&$C14,'Apps Ach - LEALA (R)'!$C$3:$CD$3,0))","v":70},{"$f":"INDEX('Apps Ach - LEALA (R)'!$C$7:$CD$360,MATCH('LEALA Dashboard'!$E$4,'Apps Ach - LEALA (R)'!$A$7:$A$360,0),MATCH(H$9&$B14&$C14,'Apps Ach - LEALA (R)'!$C$3:$CD$3,0))","v":60},{"$f":"INDEX('Apps Ach - LEALA (R)'!$C$7:$CD$360,MATCH('LEALA Dashboard'!$E$4,'Apps Ach - LEALA (R)'!$A$7:$A$360,0),MATCH(I$9&$B14&$C14,'Apps Ach - LEALA (R)'!$C$3:$CD$3,0))","v":80},{"$f":"INDEX('Apps Ach - LEALA (R)'!$C$7:$CD$360,MATCH('LEALA Dashboard'!$E$4,'Apps Ach - LEALA (R)'!$A$7:$A$360,0),MATCH(J$9&$B14&$C14,'Apps Ach - LEALA (R)'!$C$3:$CD$3,0))","v":60}]
[null,"All","Under 19","Region",{"$f":"INDEX(Lists!$D:$D,MATCH('LEALA Dashboard'!E14,Lists!$E:$E,0))","v":"South East"},{"$f":"INDEX('Apps Ach - LEALA (R)'!$C$363:$CD$374,MATCH($E15,'Apps Ach - LEALA (R)'!$B$363:$B$374,0),MATCH(F$9&$B15&$C15,'Apps Ach - LEALA (R)'!$C$3:$CD$3,0))","v":9180},{"$f":"INDEX('Apps Ach - LEALA (R)'!$C$363:$CD$374,MATCH($E15,'Apps Ach - LEALA (R)'!$B$363:$B$374,0),MATCH(G$9&$B15&$C15,'Apps Ach - LEALA (R)'!$C$3:$CD$3,0))","v":7970},{"$f":"INDEX('Apps Ach - LEALA (R)'!$C$363:$CD$374,MATCH($E15,'Apps Ach - LEALA (R)'!$B$363:$B$374,0),MATCH(H$9&$B15&$C15,'Apps Ach - LEALA (R)'!$C$3:$CD$3,0))","v":8720},{"$f":"INDEX('Apps Ach - LEALA (R)'!$C$363:$CD$374,MATCH($E15,'Apps Ach - LEALA (R)'!$B$363:$B$374,0),MATCH(I$9&$B15&$C15,'Apps Ach - LEALA (R)'!$C$3:$CD$3,0))","v":9220},{"$f":"INDEX('Apps Ach - LEALA (R)'!$C$363:$CD$374,MATCH($E15,'Apps Ach - LEALA (R)'!$B$363:$B$374,0),MATCH(J$9&$B15&$C15,'Apps Ach - LEALA (R)'!$C$3:$CD$3,0))","v":9580}]
[null,"All","Under 19","National","England",{"$f":"INDEX('Apps Ach - LEALA (R)'!$C$363:$CD$374,MATCH($E16,'Apps Ach - LEALA (R)'!$B$363:$B$374,0),MATCH(F$9&$B16&$C16,'Apps Ach - LEALA (R)'!$C$3:$CD$3,0))","v":77200},{"$f":"INDEX('Apps Ach - LEALA (R)'!$C$363:$CD$374,MATCH($E16,'Apps Ach - LEALA (R)'!$B$363:$B$374,0),MATCH(G$9&$B16&$C16,'Apps Ach - LEALA (R)'!$C$3:$CD$3,0))","v":60100},{"$f":"INDEX('Apps Ach - LEALA (R)'!$C$363:$CD$374,MATCH($E16,'Apps Ach - LEALA (R)'!$B$363:$B$374,0),MATCH(H$9&$B16&$C16,'Apps Ach - LEALA (R)'!$C$3:$CD$3,0))","v":64800},{"$f":"INDEX('Apps Ach - LEALA (R)'!$C$363:$CD$374,MATCH($E16,'Apps Ach - LEALA (R)'!$B$363:$B$374,0),MATCH(I$9&$B16&$C16,'Apps Ach - LEALA (R)'!$C$3:$CD$3,0))","v":70400},{"$f":"INDEX('Apps Ach - LEALA (R)'!$C$363:$CD$374,MATCH($E16,'Apps Ach - LEALA (R)'!$B$363:$B$374,0),MATCH(J$9&$B16&$C16,'Apps Ach - LEALA (R)'!$C$3:$CD$3,0))","v":72800}]
[null,"All","Under 19","Total","Grand Total",{"$f":"INDEX('Apps Ach - LEALA (R)'!$C$363:$CD$374,MATCH($E17,'Apps Ach - LEALA (R)'!$B$363:$B$374,0),MATCH(F$9&$B17&$C17,'Apps Ach - LEALA (R)'!$C$3:$CD$3,0))","v":77900},{"$f":"INDEX('Apps Ach - LEALA (R)'!$C$363:$CD$374,MATCH($E17,'Apps Ach - LEALA (R)'!$B$363:$B$374,0),MATCH(G$9&$B17&$C17,'Apps Ach - LEALA (R)'!$C$3:$CD$3,0))","v":60800},{"$f":"INDEX('Apps Ach - LEALA (R)'!$C$363:$CD$374,MATCH($E17,'Apps Ach - LEALA (R)'!$B$363:$B$374,0),MATCH(H$9&$B17&$C17,'Apps Ach - LEALA (R)'!$C$3:$CD$3,0))","v":65400},{"$f":"INDEX('Apps Ach - LEALA (R)'!$C$363:$CD$374,MATCH($E17,'Apps Ach - LEALA (R)'!$B$363:$B$374,0),MATCH(I$9&$B17&$C17,'Apps Ach - LEALA (R)'!$C$3:$CD$3,0))","v":71100},{"$f":"INDEX('Apps Ach - LEALA (R)'!$C$363:$CD$374,MATCH($E17,'Apps Ach - LEALA (R)'!$B$363:$B$374,0),MATCH(J$9&$B17&$C17,'Apps Ach - LEALA (R)'!$C$3:$CD$3,0))","v":73600}]
[null,"All","19-24","LEA/LA",{"$f":"INDEX('Apps Ach - LEALA (R)'!$B:$B,MATCH('LEALA Dashboard'!$E$4,'Apps Ach - LEALA (R)'!$A:$A,0))","v":"Adur"},{"$f":"INDEX('Apps Ach - LEALA (R)'!$C$7:$CD$360,MATCH('LEALA Dashboard'!$E$4,'Apps Ach - LEALA (R)'!$A$7:$A$360,0),MATCH(F$9&$B18&$C18,'Apps Ach - LEALA (R)'!$C$3:$CD$3,0))","v":0},{"$f":"INDEX('Apps Ach - LEALA (R)'!$C$7:$CD$360,MATCH('LEALA Dashboard'!$E$4,'Apps Ach - LEALA (R)'!$A$7:$A$360,0),MATCH(G$9&$B18&$C18,'Apps Ach - LEALA (R)'!$C$3:$CD$3,0))","v":70},{"$f":"INDEX('Apps Ach - LEALA (R)'!$C$7:$CD$360,MATCH('LEALA Dashboard'!$E$4,'Apps Ach - LEALA (R)'!$A$7:$A$360,0),MATCH(H$9&$B18&$C18,'Apps Ach - LEALA (R)'!$C$3:$CD$3,0))","v":100},{"$f":"INDEX('Apps Ach - LEALA (R)'!$C$7:$CD$360,MATCH('LEALA Dashboard'!$E$4,'Apps Ach - LEALA (R)'!$A$7:$A$360,0),MATCH(I$9&$B18&$C18,'Apps Ach - LEALA (R)'!$C$3:$CD$3,0))","v":90},{"$f":"INDEX('Apps Ach - LEALA (R)'!$C$7:$CD$360,MATCH('LEALA Dashboard'!$E$4,'Apps Ach - LEALA (R)'!$A$7:$A$360,0),MATCH(J$9&$B18&$C18,'Apps Ach - LEALA (R)'!$C$3:$CD$3,0))","v":100}]
[null,"All","19-24","Region",{"$f":"INDEX(Lists!$D:$D,MATCH('LEALA Dashboard'!E18,Lists!$E:$E,0))","v":"South East"},{"$f":"INDEX('Apps Ach - LEALA (R)'!$C$363:$CD$374,MATCH($E19,'Apps Ach - LEALA (R)'!$B$363:$B$374,0),MATCH(F$9&$B19&$C19,'Apps Ach - LEALA (R)'!$C$3:$CD$3,0))","v":12540},{"$f":"INDEX('Apps Ach - LEALA (R)'!$C$363:$CD$374,MATCH($E19,'Apps Ach - LEALA (R)'!$B$363:$B$374,0),MATCH(G$9&$B19&$C19,'Apps Ach - LEALA (R)'!$C$3:$CD$3,0))","v":11650},{"$f":"INDEX('Apps Ach - LEALA (R)'!$C$363:$CD$374,MATCH($E19,'Apps Ach - LEALA (R)'!$B$363:$B$374,0),MATCH(H$9&$B19&$C19,'Apps Ach - LEALA (R)'!$C$3:$CD$3,0))","v":13000},{"$f":"INDEX('Apps Ach - LEALA (R)'!$C$363:$CD$374,MATCH($E19,'Apps Ach - LEALA (R)'!$B$363:$B$374,0),MATCH(I$9&$B19&$C19,'Apps Ach - LEALA (R)'!$C$3:$CD$3,0))","v":13640},{"$f":"INDEX('Apps Ach - LEALA (R)'!$C$363:$CD$374,MATCH($E19,'Apps Ach - LEALA (R)'!$B$363:$B$374,0),MATCH(J$9&$B19&$C19,'Apps Ach - LEALA (R)'!$C$3:$CD$3,0))","v":12760}]
[null,"All","19-24","National","England",{"$f":"INDEX('Apps Ach - LEALA (R)'!$C$363:$CD$374,MATCH($E20,'Apps Ach - LEALA (R)'!$B$363:$B$374,0),MATCH(F$9&$B20&$C20,'Apps Ach - LEALA (R)'!$C$3:$CD$3,0))","v":84700},{"$f":"INDEX('Apps Ach - LEALA (R)'!$C$363:$CD$374,MATCH($E20,'Apps Ach - LEALA (R)'!$B$363:$B$374,0),MATCH(G$9&$B20&$C20,'Apps Ach - LEALA (R)'!$C$3:$CD$3,0))","v":78500},{"$f":"INDEX('Apps Ach - LEALA (R)'!$C$363:$CD$374,MATCH($E20,'Apps Ach - LEALA (R)'!$B$363:$B$374,0),MATCH(H$9&$B20&$C20,'Apps Ach - LEALA (R)'!$C$3:$CD$3,0))","v":86200},{"$f":"INDEX('Apps Ach - LEALA (R)'!$C$363:$CD$374,MATCH($E20,'Apps Ach - LEALA (R)'!$B$363:$B$374,0),MATCH(I$9&$B20&$C20,'Apps Ach - LEALA (R)'!$C$3:$CD$3,0))","v":90500},{"$f":"INDEX('Apps Ach - LEALA (R)'!$C$363:$CD$374,MATCH($E20,'Apps Ach - LEALA (R)'!$B$363:$B$374,0),MATCH(J$9&$B20&$C20,'Apps Ach - LEALA (R)'!$C$3:$CD$3,0))","v":89300}]
[null,"All","19-24","Total","Grand Total",{"$f":"INDEX('Apps Ach - LEALA (R)'!$C$363:$CD$374,MATCH($E21,'Apps Ach - LEALA (R)'!$B$363:$B$374,0),MATCH(F$9&$B21&$C21,'Apps Ach - LEALA (R)'!$C$3:$CD$3,0))","v":85600},{"$f":"INDEX('Apps Ach - LEALA (R)'!$C$363:$CD$374,MATCH($E21,'Apps Ach - LEALA (R)'!$B$363:$B$374,0),MATCH(G$9&$B21&$C21,'Apps Ach - LEALA (R)'!$C$3:$CD$3,0))","v":79300},{"$f":"INDEX('Apps Ach - LEALA (R)'!$C$363:$CD$374,MATCH($E21,'Apps Ach - LEALA (R)'!$B$363:$B$374,0),MATCH(H$9&$B21&$C21,'Apps Ach - LEALA (R)'!$C$3:$CD$3,0))","v":86900},{"$f":"INDEX('Apps Ach - LEALA (R)'!$C$363:$CD$374,MATCH($E21,'Apps Ach - LEALA (R)'!$B$363:$B$374,0),MATCH(I$9&$B21&$C21,'Apps Ach - LEALA (R)'!$C$3:$CD$3,0))","v":91300},{"$f":"INDEX('Apps Ach - LEALA (R)'!$C$363:$CD$374,MATCH($E21,'Apps Ach - LEALA (R)'!$B$363:$B$374,0),MATCH(J$9&$B21&$C21,'Apps Ach - LEALA (R)'!$C$3:$CD$3,0))","v":90100}]
[null,"All","25+","LEA/LA",{"$f":"INDEX('Apps Ach - LEALA (R)'!$B:$B,MATCH('LEALA Dashboard'!$E$4,'Apps Ach - LEALA (R)'!$A:$A,0))","v":"Adur"},{"$f":"INDEX('Apps Ach - LEALA (R)'!$C$7:$CD$360,MATCH('LEALA Dashboard'!$E$4,'Apps Ach - LEALA (R)'!$A$7:$A$360,0),MATCH(F$9&$B22&$C22,'Apps Ach - LEALA (R)'!$C$3:$CD$3,0))","v":0},{"$f":"INDEX('Apps Ach - LEALA (R)'!$C$7:$CD$360,MATCH('LEALA Dashboard'!$E$4,'Apps Ach - LEALA (R)'!$A$7:$A$360,0),MATCH(G$9&$B22&$C22,'Apps Ach - LEALA (R)'!$C$3:$CD$3,0))","v":100},{"$f":"INDEX('Apps Ach - LEALA (R)'!$C$7:$CD$360,MATCH('LEALA Dashboard'!$E$4,'Apps Ach - LEALA (R)'!$A$7:$A$360,0),MATCH(H$9&$B22&$C22,'Apps Ach - LEALA (R)'!$C$3:$CD$3,0))","v":100},{"$f":"INDEX('Apps Ach - LEALA (R)'!$C$7:$CD$360,MATCH('LEALA Dashboard'!$E$4,'Apps Ach - LEALA (R)'!$A$7:$A$360,0),MATCH(I$9&$B22&$C22,'Apps Ach - LEALA (R)'!$C$3:$CD$3,0))","v":80},{"$f":"INDEX('Apps Ach - LEALA (R)'!$C$7:$CD$360,MATCH('LEALA Dashboard'!$E$4,'Apps Ach - LEALA (R)'!$A$7:$A$360,0),MATCH(J$9&$B22&$C22,'Apps Ach - LEALA (R)'!$C$3:$CD$3,0))","v":80}]
[null,"All","25+","Region",{"$f":"INDEX(Lists!$D:$D,MATCH('LEALA Dashboard'!E22,Lists!$E:$E,0))","v":"South East"},{"$f":"INDEX('Apps Ach - LEALA (R)'!$C$363:$CD$374,MATCH($E23,'Apps Ach - LEALA (R)'!$B$363:$B$374,0),MATCH(F$9&$B23&$C23,'Apps Ach - LEALA (R)'!$C$3:$CD$3,0))","v":12040},{"$f":"INDEX('Apps Ach - LEALA (R)'!$C$363:$CD$374,MATCH($E23,'Apps Ach - LEALA (R)'!$B$363:$B$374,0),MATCH(G$9&$B23&$C23,'Apps Ach - LEALA (R)'!$C$3:$CD$3,0))","v":14060},{"$f":"INDEX('Apps Ach - LEALA (R)'!$C$363:$CD$374,MATCH($E23,'Apps Ach - LEALA (R)'!$B$363:$B$374,0),MATCH(H$9&$B23&$C23,'Apps Ach - LEALA (R)'!$C$3:$CD$3,0))","v":13050},{"$f":"INDEX('Apps Ach - LEALA (R)'!$C$363:$CD$374,MATCH($E23,'Apps Ach - LEALA (R)'!$B$363:$B$374,0),MATCH(I$9&$B23&$C23,'Apps Ach - LEALA (R)'!$C$3:$CD$3,0))","v":12620},{"$f":"INDEX('Apps Ach - LEALA (R)'!$C$363:$CD$374,MATCH($E23,'Apps Ach - LEALA (R)'!$B$363:$B$374,0),MATCH(J$9&$B23&$C23,'Apps Ach - LEALA (R)'!$C$3:$CD$3,0))","v":14020}]
[null,"All","25+","National","England",{"$f":"INDEX('Apps Ach - LEALA (R)'!$C$363:$CD$374,MATCH($E24,'Apps Ach - LEALA (R)'!$B$363:$B$374,0),MATCH(F$9&$B24&$C24,'Apps Ach - LEALA (R)'!$C$3:$CD$3,0))","v":93800},{"$f":"INDEX('Apps Ach - LEALA (R)'!$C$363:$CD$374,MATCH($E24,'Apps Ach - LEALA (R)'!$B$363:$B$374,0),MATCH(G$9&$B24&$C24,'Apps Ach - LEALA (R)'!$C$3:$CD$3,0))","v":111500},{"$f":"INDEX('Apps Ach - LEALA (R)'!$C$363:$CD$374,MATCH($E24,'Apps Ach - LEALA (R)'!$B$363:$B$374,0),MATCH(H$9&$B24&$C24,'Apps Ach - LEALA (R)'!$C$3:$CD$3,0))","v":102600},{"$f":"INDEX('Apps Ach - LEALA (R)'!$C$363:$CD$374,MATCH($E24,'Apps Ach - LEALA (R)'!$B$363:$B$374,0),MATCH(I$9&$B24&$C24,'Apps Ach - LEALA (R)'!$C$3:$CD$3,0))","v":97500},{"$f":"INDEX('Apps Ach - LEALA (R)'!$C$363:$CD$374,MATCH($E24,'Apps Ach - LEALA (R)'!$B$363:$B$374,0),MATCH(J$9&$B24&$C24,'Apps Ach - LEALA (R)'!$C$3:$CD$3,0))","v":107000}]
[null,"All","25+","Total","Grand Total",{"$f":"INDEX('Apps Ach - LEALA (R)'!$C$363:$CD$374,MATCH($E25,'Apps Ach - LEALA (R)'!$B$363:$B$374,0),MATCH(F$9&$B25&$C25,'Apps Ach - LEALA (R)'!$C$3:$CD$3,0))","v":94900},{"$f":"INDEX('Apps Ach - LEALA (R)'!$C$363:$CD$374,MATCH($E25,'Apps Ach - LEALA (R)'!$B$363:$B$374,0),MATCH(G$9&$B25&$C25,'Apps Ach - LEALA (R)'!$C$3:$CD$3,0))","v":112800},{"$f":"INDEX('Apps Ach - LEALA (R)'!$C$363:$CD$374,MATCH($E25,'Apps Ach - LEALA (R)'!$B$363:$B$374,0),MATCH(H$9&$B25&$C25,'Apps Ach - LEALA (R)'!$C$3:$CD$3,0))","v":103500},{"$f":"INDEX('Apps Ach - LEALA (R)'!$C$363:$CD$374,MATCH($E25,'Apps Ach - LEALA (R)'!$B$363:$B$374,0),MATCH(I$9&$B25&$C25,'Apps Ach - LEALA (R)'!$C$3:$CD$3,0))","v":98500},{"$f":"INDEX('Apps Ach - LEALA (R)'!$C$363:$CD$374,MATCH($E25,'Apps Ach - LEALA (R)'!$B$363:$B$374,0),MATCH(J$9&$B25&$C25,'Apps Ach - LEALA (R)'!$C$3:$CD$3,0))","v":108000}]
[null,"Intermediate","All","LEA/LA",{"$f":"INDEX('Apps Ach - LEALA (R)'!$B:$B,MATCH('LEALA Dashboard'!$E$4,'Apps Ach - LEALA (R)'!$A:$A,0))","v":"Adur"},{"$f":"INDEX('Apps Ach - LEALA (R)'!$C$7:$CD$360,MATCH('LEALA Dashboard'!$E$4,'Apps Ach - LEALA (R)'!$A$7:$A$360,0),MATCH(F$9&$B26&$C26,'Apps Ach - LEALA (R)'!$C$3:$CD$3,0))","v":0},{"$f":"INDEX('Apps Ach - LEALA (R)'!$C$7:$CD$360,MATCH('LEALA Dashboard'!$E$4,'Apps Ach - LEALA (R)'!$A$7:$A$360,0),MATCH(G$9&$B26&$C26,'Apps Ach - LEALA (R)'!$C$3:$CD$3,0))","v":120},{"$f":"INDEX('Apps Ach - LEALA (R)'!$C$7:$CD$360,MATCH('LEALA Dashboard'!$E$4,'Apps Ach - LEALA (R)'!$A$7:$A$360,0),MATCH(H$9&$B26&$C26,'Apps Ach - LEALA (R)'!$C$3:$CD$3,0))","v":150},{"$f":"INDEX('Apps Ach - LEALA (R)'!$C$7:$CD$360,MATCH('LEALA Dashboard'!$E$4,'Apps Ach - LEALA (R)'!$A$7:$A$360,0),MATCH(I$9&$B26&$C26,'Apps Ach - LEALA (R)'!$C$3:$CD$3,0))","v":160},{"$f":"INDEX('Apps Ach - LEALA (R)'!$C$7:$CD$360,MATCH('LEALA Dashboard'!$E$4,'Apps Ach - LEALA (R)'!$A$7:$A$360,0),MATCH(J$9&$B26&$C26,'Apps Ach - LEALA (R)'!$C$3:$CD$3,0))","v":150}]
[null,"Intermediate","All","Region",{"$f":"INDEX(Lists!$D:$D,MATCH('LEALA Dashboard'!E26,Lists!$E:$E,0))","v":"South East"},{"$f":"INDEX('Apps Ach - LEALA (R)'!$C$363:$CD$374,MATCH($E27,'Apps Ach - LEALA (R)'!$B$363:$B$374,0),MATCH(F$9&$B27&$C27,'Apps Ach - LEALA (R)'!$C$3:$CD$3,0))","v":22570},{"$f":"INDEX('Apps Ach - LEALA (R)'!$C$363:$CD$374,MATCH($E27,'Apps Ach - LEALA (R)'!$B$363:$B$374,0),MATCH(G$9&$B27&$C27,'Apps Ach - LEALA (R)'!$C$3:$CD$3,0))","v":20130},{"$f":"INDEX('Apps Ach - LEALA (R)'!$C$363:$CD$374,MATCH($E27,'Apps Ach - LEALA (R)'!$B$363:$B$374,0),MATCH(H$9&$B27&$C27,'Apps Ach - LEALA (R)'!$C$3:$CD$3,0))","v":19910},{"$f":"INDEX('Apps Ach - LEALA (R)'!$C$363:$CD$374,MATCH($E27,'Apps Ach - LEALA (R)'!$B$363:$B$374,0),MATCH(I$9&$B27&$C27,'Apps Ach - LEALA (R)'!$C$3:$CD$3,0))","v":21150},{"$f":"INDEX('Apps Ach - LEALA (R)'!$C$363:$CD$374,MATCH($E27,'Apps Ach - LEALA (R)'!$B$363:$B$374,0),MATCH(J$9&$B27&$C27,'Apps Ach - LEALA (R)'!$C$3:$CD$3,0))","v":21230}]
[null,"Intermediate","All","National","England",{"$f":"INDEX('Apps Ach - LEALA (R)'!$C$363:$CD$374,MATCH($E28,'Apps Ach - LEALA (R)'!$B$363:$B$374,0),MATCH(F$9&$B28&$C28,'Apps Ach - LEALA (R)'!$C$3:$CD$3,0))","v":170500},{"$f":"INDEX('Apps Ach - LEALA (R)'!$C$363:$CD$374,MATCH($E28,'Apps Ach - LEALA (R)'!$B$363:$B$374,0),MATCH(G$9&$B28&$C28,'Apps Ach - LEALA (R)'!$C$3:$CD$3,0))","v":154500},{"$f":"INDEX('Apps Ach - LEALA (R)'!$C$363:$CD$374,MATCH($E28,'Apps Ach - LEALA (R)'!$B$363:$B$374,0),MATCH(H$9&$B28&$C28,'Apps Ach - LEALA (R)'!$C$3:$CD$3,0))","v":149600},{"$f":"INDEX('Apps Ach - LEALA (R)'!$C$363:$CD$374,MATCH($E28,'Apps Ach - LEALA (R)'!$B$363:$B$374,0),MATCH(I$9&$B28&$C28,'Apps Ach - LEALA (R)'!$C$3:$CD$3,0))","v":158800},{"$f":"INDEX('Apps Ach - LEALA (R)'!$C$363:$CD$374,MATCH($E28,'Apps Ach - LEALA (R)'!$B$363:$B$374,0),MATCH(J$9&$B28&$C28,'Apps Ach - LEALA (R)'!$C$3:$CD$3,0))","v":162500}]
[null,"Intermediate","All","Total","Grand Total",{"$f":"INDEX('Apps Ach - LEALA (R)'!$C$363:$CD$374,MATCH($E29,'Apps Ach - LEALA (R)'!$B$363:$B$374,0),MATCH(F$9&$B29&$C29,'Apps Ach - LEALA (R)'!$C$3:$CD$3,0))","v":172400},{"$f":"INDEX('Apps Ach - LEALA (R)'!$C$363:$CD$374,MATCH($E29,'Apps Ach - LEALA (R)'!$B$363:$B$374,0),MATCH(G$9&$B29&$C29,'Apps Ach - LEALA (R)'!$C$3:$CD$3,0))","v":156300},{"$f":"INDEX('Apps Ach - LEALA (R)'!$C$363:$CD$374,MATCH($E29,'Apps Ach - LEALA (R)'!$B$363:$B$374,0),MATCH(H$9&$B29&$C29,'Apps Ach - LEALA (R)'!$C$3:$CD$3,0))","v":150900},{"$f":"INDEX('Apps Ach - LEALA (R)'!$C$363:$CD$374,MATCH($E29,'Apps Ach - LEALA (R)'!$B$363:$B$374,0),MATCH(I$9&$B29&$C29,'Apps Ach - LEALA (R)'!$C$3:$CD$3,0))","v":160300},{"$f":"INDEX('Apps Ach - LEALA (R)'!$C$363:$CD$374,MATCH($E29,'Apps Ach - LEALA (R)'!$B$363:$B$374,0),MATCH(J$9&$B29&$C29,'Apps Ach - LEALA (R)'!$C$3:$CD$3,0))","v":163800}]
[null,"Intermediate","Under 19","LEA/LA",{"$f":"INDEX('Apps Ach - LEALA (R)'!$B:$B,MATCH('LEALA Dashboard'!$E$4,'Apps Ach - LEALA (R)'!$A:$A,0))","v":"Adur"},{"$f":"INDEX('Apps Ach - LEALA (R)'!$C$7:$CD$360,MATCH('LEALA Dashboard'!$E$4,'Apps Ach - LEALA (R)'!$A$7:$A$360,0),MATCH(F$9&$B30&$C30,'Apps Ach - LEALA (R)'!$C$3:$CD$3,0))","v":0},{"$f":"INDEX('Apps Ach - LEALA (R)'!$C$7:$CD$360,MATCH('LEALA Dashboard'!$E$4,'Apps Ach - LEALA (R)'!$A$7:$A$360,0),MATCH(G$9&$B30&$C30,'Apps Ach - LEALA (R)'!$C$3:$CD$3,0))","v":50},{"$f":"INDEX('Apps Ach - LEALA (R)'!$C$7:$CD$360,MATCH('LEALA Dashboard'!$E$4,'Apps Ach - LEALA (R)'!$A$7:$A$360,0),MATCH(H$9&$B30&$C30,'Apps Ach - LEALA (R)'!$C$3:$CD$3,0))","v":50},{"$f":"INDEX('Apps Ach - LEALA (R)'!$C$7:$CD$360,MATCH('LEALA Dashboard'!$E$4,'Apps Ach - LEALA (R)'!$A$7:$A$360,0),MATCH(I$9&$B30&$C30,'Apps Ach - LEALA (R)'!$C$3:$CD$3,0))","v":60},{"$f":"INDEX('Apps Ach - LEALA (R)'!$C$7:$CD$360,MATCH('LEALA Dashboard'!$E$4,'Apps Ach - LEALA (R)'!$A$7:$A$360,0),MATCH(J$9&$B30&$C30,'Apps Ach - LEALA (R)'!$C$3:$CD$3,0))","v":40}]
[null,"Intermediate","Under 19","Region",{"$f":"INDEX(Lists!$D:$D,MATCH('LEALA Dashboard'!E30,Lists!$E:$E,0))","v":"South East"},{"$f":"INDEX('Apps Ach - LEALA (R)'!$C$363:$CD$374,MATCH($E31,'Apps Ach - LEALA (R)'!$B$363:$B$374,0),MATCH(F$9&$B31&$C31,'Apps Ach - LEALA (R)'!$C$3:$CD$3,0))","v":6660},{"$f":"INDEX('Apps Ach - LEALA (R)'!$C$363:$CD$374,MATCH($E31,'Apps Ach - LEALA (R)'!$B$363:$B$374,0),MATCH(G$9&$B31&$C31,'Apps Ach - LEALA (R)'!$C$3:$CD$3,0))","v":5450},{"$f":"INDEX('Apps Ach - LEALA (R)'!$C$363:$CD$374,MATCH($E31,'Apps Ach - LEALA (R)'!$B$363:$B$374,0),MATCH(H$9&$B31&$C31,'Apps Ach - LEALA (R)'!$C$3:$CD$3,0))","v":5850},{"$f":"INDEX('Apps Ach - LEALA (R)'!$C$363:$CD$374,MATCH($E31,'Apps Ach - LEALA (R)'!$B$363:$B$374,0),MATCH(I$9&$B31&$C31,'Apps Ach - LEALA (R)'!$C$3:$CD$3,0))","v":6170},{"$f":"INDEX('Apps Ach - LEALA (R)'!$C$363:$CD$374,MATCH($E31,'Apps Ach - LEALA (R)'!$B$363:$B$374,0),MATCH(J$9&$B31&$C31,'Apps Ach - LEALA (R)'!$C$3:$CD$3,0))","v":6240}]
[null,"Intermediate","Under 19","National","England",{"$f":"INDEX('Apps Ach - LEALA (R)'!$C$363:$CD$374,MATCH($E32,'Apps Ach - LEALA (R)'!$B$363:$B$374,0),MATCH(F$9&$B32&$C32,'Apps Ach - LEALA (R)'!$C$3:$CD$3,0))","v":56100},{"$f":"INDEX('Apps Ach - LEALA (R)'!$C$363:$CD$374,MATCH($E32,'Apps Ach - LEALA (R)'!$B$363:$B$374,0),MATCH(G$9&$B32&$C32,'Apps Ach - LEALA (R)'!$C$3:$CD$3,0))","v":41700},{"$f":"INDEX('Apps Ach - LEALA (R)'!$C$363:$CD$374,MATCH($E32,'Apps Ach - LEALA (R)'!$B$363:$B$374,0),MATCH(H$9&$B32&$C32,'Apps Ach - LEALA (R)'!$C$3:$CD$3,0))","v":44900},{"$f":"INDEX('Apps Ach - LEALA (R)'!$C$363:$CD$374,MATCH($E32,'Apps Ach - LEALA (R)'!$B$363:$B$374,0),MATCH(I$9&$B32&$C32,'Apps Ach - LEALA (R)'!$C$3:$CD$3,0))","v":47800},{"$f":"INDEX('Apps Ach - LEALA (R)'!$C$363:$CD$374,MATCH($E32,'Apps Ach - LEALA (R)'!$B$363:$B$374,0),MATCH(J$9&$B32&$C32,'Apps Ach - LEALA (R)'!$C$3:$CD$3,0))","v":48700}]
[null,"Intermediate","Under 19","Total","Grand Total",{"$f":"INDEX('Apps Ach - LEALA (R)'!$C$363:$CD$374,MATCH($E33,'Apps Ach - LEALA (R)'!$B$363:$B$374,0),MATCH(F$9&$B33&$C33,'Apps Ach - LEALA (R)'!$C$3:$CD$3,0))","v":56500},{"$f":"INDEX('Apps Ach - LEALA (R)'!$C$363:$CD$374,MATCH($E33,'Apps Ach - LEALA (R)'!$B$363:$B$374,0),MATCH(G$9&$B33&$C33,'Apps Ach - LEALA (R)'!$C$3:$CD$3,0))","v":42100},{"$f":"INDEX('Apps Ach - LEALA (R)'!$C$363:$CD$374,MATCH($E33,'Apps Ach - LEALA (R)'!$B$363:$B$374,0),MATCH(H$9&$B33&$C33,'Apps Ach - LEALA (R)'!$C$3:$CD$3,0))","v":45200},{"$f":"INDEX('Apps Ach - LEALA (R)'!$C$363:$CD$374,MATCH($E33,'Apps Ach - LEALA (R)'!$B$363:$B$374,0),MATCH(I$9&$B33&$C33,'Apps Ach - LEALA (R)'!$C$3:$CD$3,0))","v":48200},{"$f":"INDEX('Apps Ach - LEALA (R)'!$C$363:$CD$374,MATCH($E33,'Apps Ach - LEALA (R)'!$B$363:$B$374,0),MATCH(J$9&$B33&$C33,'Apps Ach - LEALA (R)'!$C$3:$CD$3,0))","v":49100}]
[null,"Intermediate","19-24","LEA/LA",{"$f":"INDEX('Apps Ach - LEALA (R)'!$B:$B,MATCH('LEALA Dashboard'!$E$4,'Apps Ach - LEALA (R)'!$A:$A,0))","v":"Adur"},{"$f":"INDEX('Apps Ach - LEALA (R)'!$C$7:$CD$360,MATCH('LEALA Dashboard'!$E$4,'Apps Ach - LEALA (R)'!$A$7:$A$360,0),MATCH(F$9&$B34&$C34,'Apps Ach - LEALA (R)'!$C$3:$CD$3,0))","v":0},{"$f":"INDEX('Apps Ach - LEALA (R)'!$C$7:$CD$360,MATCH('LEALA Dashboard'!$E$4,'Apps Ach - LEALA (R)'!$A$7:$A$360,0),MATCH(G$9&$B34&$C34,'Apps Ach - LEALA (R)'!$C$3:$CD$3,0))","v":40},{"$f":"INDEX('Apps Ach - LEALA (R)'!$C$7:$CD$360,MATCH('LEALA Dashboard'!$E$4,'Apps Ach - LEALA (R)'!$A$7:$A$360,0),MATCH(H$9&$B34&$C34,'Apps Ach - LEALA (R)'!$C$3:$CD$3,0))","v":50},{"$f":"INDEX('Apps Ach - LEALA (R)'!$C$7:$CD$360,MATCH('LEALA Dashboard'!$E$4,'Apps Ach - LEALA (R)'!$A$7:$A$360,0),MATCH(I$9&$B34&$C34,'Apps Ach - LEALA (R)'!$C$3:$CD$3,0))","v":60},{"$f":"INDEX('Apps Ach - LEALA (R)'!$C$7:$CD$360,MATCH('LEALA Dashboard'!$E$4,'Apps Ach - LEALA (R)'!$A$7:$A$360,0),MATCH(J$9&$B34&$C34,'Apps Ach - LEALA (R)'!$C$3:$CD$3,0))","v":60}]
[null,"Intermediate","19-24","Region",{"$f":"INDEX(Lists!$D:$D,MATCH('LEALA Dashboard'!E34,Lists!$E:$E,0))","v":"South East"},{"$f":"INDEX('Apps Ach - LEALA (R)'!$C$363:$CD$374,MATCH($E35,'Apps Ach - LEALA (R)'!$B$363:$B$374,0),MATCH(F$9&$B35&$C35,'Apps Ach - LEALA (R)'!$C$3:$CD$3,0))","v":8120},{"$f":"INDEX('Apps Ach - LEALA (R)'!$C$363:$CD$374,MATCH($E35,'Apps Ach - LEALA (R)'!$B$363:$B$374,0),MATCH(G$9&$B35&$C35,'Apps Ach - LEALA (R)'!$C$3:$CD$3,0))","v":6870},{"$f":"INDEX('Apps Ach - LEALA (R)'!$C$363:$CD$374,MATCH($E35,'Apps Ach - LEALA (R)'!$B$363:$B$374,0),MATCH(H$9&$B35&$C35,'Apps Ach - LEALA (R)'!$C$3:$CD$3,0))","v":7390},{"$f":"INDEX('Apps Ach - LEALA (R)'!$C$363:$CD$374,MATCH($E35,'Apps Ach - LEALA (R)'!$B$363:$B$374,0),MATCH(I$9&$B35&$C35,'Apps Ach - LEALA (R)'!$C$3:$CD$3,0))","v":7680},{"$f":"INDEX('Apps Ach - LEALA (R)'!$C$363:$CD$374,MATCH($E35,'Apps Ach - LEALA (R)'!$B$363:$B$374,0),MATCH(J$9&$B35&$C35,'Apps Ach - LEALA (R)'!$C$3:$CD$3,0))","v":7130}]
[null,"Intermediate","19-24","National","England",{"$f":"INDEX('Apps Ach - LEALA (R)'!$C$363:$CD$374,MATCH($E36,'Apps Ach - LEALA (R)'!$B$363:$B$374,0),MATCH(F$9&$B36&$C36,'Apps Ach - LEALA (R)'!$C$3:$CD$3,0))","v":53500},{"$f":"INDEX('Apps Ach - LEALA (R)'!$C$363:$CD$374,MATCH($E36,'Apps Ach - LEALA (R)'!$B$363:$B$374,0),MATCH(G$9&$B36&$C36,'Apps Ach - LEALA (R)'!$C$3:$CD$3,0))","v":47200},{"$f":"INDEX('Apps Ach - LEALA (R)'!$C$363:$CD$374,MATCH($E36,'Apps Ach - LEALA (R)'!$B$363:$B$374,0),MATCH(H$9&$B36&$C36,'Apps Ach - LEALA (R)'!$C$3:$CD$3,0))","v":50300},{"$f":"INDEX('Apps Ach - LEALA (R)'!$C$363:$CD$374,MATCH($E36,'Apps Ach - LEALA (R)'!$B$363:$B$374,0),MATCH(I$9&$B36&$C36,'Apps Ach - LEALA (R)'!$C$3:$CD$3,0))","v":52600},{"$f":"INDEX('Apps Ach - LEALA (R)'!$C$363:$CD$374,MATCH($E36,'Apps Ach - LEALA (R)'!$B$363:$B$374,0),MATCH(J$9&$B36&$C36,'Apps Ach - LEALA (R)'!$C$3:$CD$3,0))","v":51300}]
[null,"Intermediate","19-24","Total","Grand Total",{"$f":"INDEX('Apps Ach - LEALA (R)'!$C$363:$CD$374,MATCH($E37,'Apps Ach - LEALA (R)'!$B$363:$B$374,0),MATCH(F$9&$B37&$C37,'Apps Ach - LEALA (R)'!$C$3:$CD$3,0))","v":54100},{"$f":"INDEX('Apps Ach - LEALA (R)'!$C$363:$CD$374,MATCH($E37,'Apps Ach - LEALA (R)'!$B$363:$B$374,0),MATCH(G$9&$B37&$C37,'Apps Ach - LEALA (R)'!$C$3:$CD$3,0))","v":47700},{"$f":"INDEX('Apps Ach - LEALA (R)'!$C$363:$CD$374,MATCH($E37,'Apps Ach - LEALA (R)'!$B$363:$B$374,0),MATCH(H$9&$B37&$C37,'Apps Ach - LEALA (R)'!$C$3:$CD$3,0))","v":50800},{"$f":"INDEX('Apps Ach - LEALA (R)'!$C$363:$CD$374,MATCH($E37,'Apps Ach - LEALA (R)'!$B$363:$B$374,0),MATCH(I$9&$B37&$C37,'Apps Ach - LEALA (R)'!$C$3:$CD$3,0))","v":53100},{"$f":"INDEX('Apps Ach - LEALA (R)'!$C$363:$CD$374,MATCH($E37,'Apps Ach - LEALA (R)'!$B$363:$B$374,0),MATCH(J$9&$B37&$C37,'Apps Ach - LEALA (R)'!$C$3:$CD$3,0))","v":51700}]
[null,"Intermediate","25+","LEA/LA",{"$f":"INDEX('Apps Ach - LEALA (R)'!$B:$B,MATCH('LEALA Dashboard'!$E$4,'Apps Ach - LEALA (R)'!$A:$A,0))","v":"Adur"},{"$f":"INDEX('Apps Ach - LEALA (R)'!$C$7:$CD$360,MATCH('LEALA Dashboard'!$E$4,'Apps Ach - LEALA (R)'!$A$7:$A$360,0),MATCH(F$9&$B38&$C38,'Apps Ach - LEALA (R)'!$C$3:$CD$3,0))","v":0},{"$f":"INDEX('Apps Ach - LEALA (R)'!$C$7:$CD$360,MATCH('LEALA Dashboard'!$E$4,'Apps Ach - LEALA (R)'!$A$7:$A$360,0),MATCH(G$9&$B38&$C38,'Apps Ach - LEALA (R)'!$C$3:$CD$3,0))","v":40},{"$f":"INDEX('Apps Ach - LEALA (R)'!$C$7:$CD$360,MATCH('LEALA Dashboard'!$E$4,'Apps Ach - LEALA (R)'!$A$7:$A$360,0),MATCH(H$9&$B38&$C38,'Apps Ach - LEALA (R)'!$C$3:$CD$3,0))","v":50},{"$f":"INDEX('Apps Ach - LEALA (R)'!$C$7:$CD$360,MATCH('LEALA Dashboard'!$E$4,'Apps Ach - LEALA (R)'!$A$7:$A$360,0),MATCH(I$9&$B38&$C38,'Apps Ach - LEALA (R)'!$C$3:$CD$3,0))","v":50},{"$f":"INDEX('Apps Ach - LEALA (R)'!$C$7:$CD$360,MATCH('LEALA Dashboard'!$E$4,'Apps Ach - LEALA (R)'!$A$7:$A$360,0),MATCH(J$9&$B38&$C38,'Apps Ach - LEALA (R)'!$C$3:$CD$3,0))","v":50}]
[null,"Intermediate","25+","Region",{"$f":"INDEX(Lists!$D:$D,MATCH('LEALA Dashboard'!E38,Lists!$E:$E,0))","v":"South East"},{"$f":"INDEX('Apps Ach - LEALA (R)'!$C$363:$CD$374,MATCH($E39,'Apps Ach - LEALA (R)'!$B$363:$B$374,0),MATCH(F$9&$B39&$C39,'Apps Ach - LEALA (R)'!$C$3:$CD$3,0))","v":7790},{"$f":"INDEX('Apps Ach - LEALA (R)'!$C$363:$CD$374,MATCH($E39,'Apps Ach - LEALA (R)'!$B$363:$B$374,0),MATCH(G$9&$B39&$C39,'Apps Ach - LEALA (R)'!$C$3:$CD$3,0))","v":7810},{"$f":"INDEX('Apps Ach - LEALA (R)'!$C$363:$CD$374,MATCH($E39,'Apps Ach - LEALA (R)'!$B$363:$B$374,0),MATCH(H$9&$B39&$C39,'Apps Ach - LEALA (R)'!$C$3:$CD$3,0))","v":6670},{"$f":"INDEX('Apps Ach - LEALA (R)'!$C$363:$CD$374,MATCH($E39,'Apps Ach - LEALA (R)'!$B$363:$B$374,0),MATCH(I$9&$B39&$C39,'Apps Ach - LEALA (R)'!$C$3:$CD$3,0))","v":7310},{"$f":"INDEX('Apps Ach - LEALA (R)'!$C$363:$CD$374,MATCH($E39,'Apps Ach - LEALA (R)'!$B$363:$B$374,0),MATCH(J$9&$B39&$C39,'Apps Ach - LEALA (R)'!$C$3:$CD$3,0))","v":7860}]
[null,"Intermediate","25+","National","England",{"$f":"INDEX('Apps Ach - LEALA (R)'!$C$363:$CD$374,MATCH($E40,'Apps Ach - LEALA (R)'!$B$363:$B$374,0),MATCH(F$9&$B40&$C40,'Apps Ach - LEALA (R)'!$C$3:$CD$3,0))","v":61000},{"$f":"INDEX('Apps Ach - LEALA (R)'!$C$363:$CD$374,MATCH($E40,'Apps Ach - LEALA (R)'!$B$363:$B$374,0),MATCH(G$9&$B40&$C40,'Apps Ach - LEALA (R)'!$C$3:$CD$3,0))","v":65600},{"$f":"INDEX('Apps Ach - LEALA (R)'!$C$363:$CD$374,MATCH($E40,'Apps Ach - LEALA (R)'!$B$363:$B$374,0),MATCH(H$9&$B40&$C40,'Apps Ach - LEALA (R)'!$C$3:$CD$3,0))","v":54400},{"$f":"INDEX('Apps Ach - LEALA (R)'!$C$363:$CD$374,MATCH($E40,'Apps Ach - LEALA (R)'!$B$363:$B$374,0),MATCH(I$9&$B40&$C40,'Apps Ach - LEALA (R)'!$C$3:$CD$3,0))","v":58500},{"$f":"INDEX('Apps Ach - LEALA (R)'!$C$363:$CD$374,MATCH($E40,'Apps Ach - LEALA (R)'!$B$363:$B$374,0),MATCH(J$9&$B40&$C40,'Apps Ach - LEALA (R)'!$C$3:$CD$3,0))","v":62500}]
[null,"Intermediate","25+","Total","Grand Total",{"$f":"INDEX('Apps Ach - LEALA (R)'!$C$363:$CD$374,MATCH($E41,'Apps Ach - LEALA (R)'!$B$363:$B$374,0),MATCH(F$9&$B41&$C41,'Apps Ach - LEALA (R)'!$C$3:$CD$3,0))","v":61800},{"$f":"INDEX('Apps Ach - LEALA (R)'!$C$363:$CD$374,MATCH($E41,'Apps Ach - LEALA (R)'!$B$363:$B$374,0),MATCH(G$9&$B41&$C41,'Apps Ach - LEALA (R)'!$C$3:$CD$3,0))","v":66500},{"$f":"INDEX('Apps Ach - LEALA (R)'!$C$363:$CD$374,MATCH($E41,'Apps Ach - LEALA (R)'!$B$363:$B$374,0),MATCH(H$9&$B41&$C41,'Apps Ach - LEALA (R)'!$C$3:$CD$3,0))","v":54900},{"$f":"INDEX('Apps Ach - LEALA (R)'!$C$363:$CD$374,MATCH($E41,'Apps Ach - LEALA (R)'!$B$363:$B$374,0),MATCH(I$9&$B41&$C41,'Apps Ach - LEALA (R)'!$C$3:$CD$3,0))","v":59100},{"$f":"INDEX('Apps Ach - LEALA (R)'!$C$363:$CD$374,MATCH($E41,'Apps Ach - LEALA (R)'!$B$363:$B$374,0),MATCH(J$9&$B41&$C41,'Apps Ach - LEALA (R)'!$C$3:$CD$3,0))","v":63000}]
[null,"Advanced","All","LEA/LA",{"$f":"INDEX('Apps Ach - LEALA (R)'!$B:$B,MATCH('LEALA Dashboard'!$E$4,'Apps Ach - LEALA (R)'!$A:$A,0))","v":"Adur"},{"$f":"INDEX('Apps Ach - LEALA (R)'!$C$7:$CD$360,MATCH('LEALA Dashboard'!$E$4,'Apps Ach - LEALA (R)'!$A$7:$A$360,0),MATCH(F$9&$B42&$C42,'Apps Ach - LEALA (R)'!$C$3:$CD$3,0))","v":0},{"$f":"INDEX('Apps Ach - LEALA (R)'!$C$7:$CD$360,MATCH('LEALA Dashboard'!$E$4,'Apps Ach - LEALA (R)'!$A$7:$A$360,0),MATCH(G$9&$B42&$C42,'Apps Ach - LEALA (R)'!$C$3:$CD$3,0))","v":110},{"$f":"INDEX('Apps Ach - LEALA (R)'!$C$7:$CD$360,MATCH('LEALA Dashboard'!$E$4,'Apps Ach - LEALA (R)'!$A$7:$A$360,0),MATCH(H$9&$B42&$C42,'Apps Ach - LEALA (R)'!$C$3:$CD$3,0))","v":110},{"$f":"INDEX('Apps Ach - LEALA (R)'!$C$7:$CD$360,MATCH('LEALA Dashboard'!$E$4,'Apps Ach - LEALA (R)'!$A$7:$A$360,0),MATCH(I$9&$B42&$C42,'Apps Ach - LEALA (R)'!$C$3:$CD$3,0))","v":80},{"$f":"INDEX('Apps Ach - LEALA (R)'!$C$7:$CD$360,MATCH('LEALA Dashboard'!$E$4,'Apps Ach - LEALA (R)'!$A$7:$A$360,0),MATCH(J$9&$B42&$C42,'Apps Ach - LEALA (R)'!$C$3:$CD$3,0))","v":80}]
[null,"Advanced","All","Region",{"$f":"INDEX(Lists!$D:$D,MATCH('LEALA Dashboard'!E42,Lists!$E:$E,0))","v":"South East"},{"$f":"INDEX('Apps Ach - LEALA (R)'!$C$363:$CD$374,MATCH($E43,'Apps Ach - LEALA (R)'!$B$363:$B$374,0),MATCH(F$9&$B43&$C43,'Apps Ach - LEALA (R)'!$C$3:$CD$3,0))","v":11090},{"$f":"INDEX('Apps Ach - LEALA (R)'!$C$363:$CD$374,MATCH($E43,'Apps Ach - LEALA (R)'!$B$363:$B$374,0),MATCH(G$9&$B43&$C43,'Apps Ach - LEALA (R)'!$C$3:$CD$3,0))","v":13400},{"$f":"INDEX('Apps Ach - LEALA (R)'!$C$363:$CD$374,MATCH($E43,'Apps Ach - LEALA (R)'!$B$363:$B$374,0),MATCH(H$9&$B43&$C43,'Apps Ach - LEALA (R)'!$C$3:$CD$3,0))","v":14560},{"$f":"INDEX('Apps Ach - LEALA (R)'!$C$363:$CD$374,MATCH($E43,'Apps Ach - LEALA (R)'!$B$363:$B$374,0),MATCH(I$9&$B43&$C43,'Apps Ach - LEALA (R)'!$C$3:$CD$3,0))","v":13840},{"$f":"INDEX('Apps Ach - LEALA (R)'!$C$363:$CD$374,MATCH($E43,'Apps Ach - LEALA (R)'!$B$363:$B$374,0),MATCH(J$9&$B43&$C43,'Apps Ach - LEALA (R)'!$C$3:$CD$3,0))","v":14180}]
[null,"Advanced","All","National","England",{"$f":"INDEX('Apps Ach - LEALA (R)'!$C$363:$CD$374,MATCH($E44,'Apps Ach - LEALA (R)'!$B$363:$B$374,0),MATCH(F$9&$B44&$C44,'Apps Ach - LEALA (R)'!$C$3:$CD$3,0))","v":83900},{"$f":"INDEX('Apps Ach - LEALA (R)'!$C$363:$CD$374,MATCH($E44,'Apps Ach - LEALA (R)'!$B$363:$B$374,0),MATCH(G$9&$B44&$C44,'Apps Ach - LEALA (R)'!$C$3:$CD$3,0))","v":93900},{"$f":"INDEX('Apps Ach - LEALA (R)'!$C$363:$CD$374,MATCH($E44,'Apps Ach - LEALA (R)'!$B$363:$B$374,0),MATCH(H$9&$B44&$C44,'Apps Ach - LEALA (R)'!$C$3:$CD$3,0))","v":101200},{"$f":"INDEX('Apps Ach - LEALA (R)'!$C$363:$CD$374,MATCH($E44,'Apps Ach - LEALA (R)'!$B$363:$B$374,0),MATCH(I$9&$B44&$C44,'Apps Ach - LEALA (R)'!$C$3:$CD$3,0))","v":95300},{"$f":"INDEX('Apps Ach - LEALA (R)'!$C$363:$CD$374,MATCH($E44,'Apps Ach - LEALA (R)'!$B$363:$B$374,0),MATCH(J$9&$B44&$C44,'Apps Ach - LEALA (R)'!$C$3:$CD$3,0))","v":99800}]
[null,"Advanced","All","Total","Grand Total",{"$f":"INDEX('Apps Ach - LEALA (R)'!$C$363:$CD$374,MATCH($E45,'Apps Ach - LEALA (R)'!$B$363:$B$374,0),MATCH(F$9&$B45&$C45,'Apps Ach - LEALA (R)'!$C$3:$CD$3,0))","v":84700},{"$f":"INDEX('Apps Ach - LEALA (R)'!$C$363:$CD$374,MATCH($E45,'Apps Ach - LEALA (R)'!$B$363:$B$374,0),MATCH(G$9&$B45&$C45,'Apps Ach - LEALA (R)'!$C$3:$CD$3,0))","v":95000},{"$f":"INDEX('Apps Ach - LEALA (R)'!$C$363:$CD$374,MATCH($E45,'Apps Ach - LEALA (R)'!$B$363:$B$374,0),MATCH(H$9&$B45&$C45,'Apps Ach - LEALA (R)'!$C$3:$CD$3,0))","v":102200},{"$f":"INDEX('Apps Ach - LEALA (R)'!$C$363:$CD$374,MATCH($E45,'Apps Ach - LEALA (R)'!$B$363:$B$374,0),MATCH(I$9&$B45&$C45,'Apps Ach - LEALA (R)'!$C$3:$CD$3,0))","v":96200},{"$f":"INDEX('Apps Ach - LEALA (R)'!$C$363:$CD$374,MATCH($E45,'Apps Ach - LEALA (R)'!$B$363:$B$374,0),MATCH(J$9&$B45&$C45,'Apps Ach - LEALA (R)'!$C$3:$CD$3,0))","v":100900}]
[null,"Advanced","Under 19","LEA/LA",{"$f":"INDEX('Apps Ach - LEALA (R)'!$B:$B,MATCH('LEALA Dashboard'!$E$4,'Apps Ach - LEALA (R)'!$A:$A,0))","v":"Adur"},{"$f":"INDEX('Apps Ach - LEALA (R)'!$C$7:$CD$360,MATCH('LEALA Dashboard'!$E$4,'Apps Ach - LEALA (R)'!$A$7:$A$360,0),MATCH(F$9&$B46&$C46,'Apps Ach - LEALA (R)'!$C$3:$CD$3,0))","v":0},{"$f":"INDEX('Apps Ach - LEALA (R)'!$C$7:$CD$360,MATCH('LEALA Dashboard'!$E$4,'Apps Ach - LEALA (R)'!$A$7:$A$360,0),MATCH(G$9&$B46&$C46,'Apps Ach - LEALA (R)'!$C$3:$CD$3,0))","v":20},{"$f":"INDEX('Apps Ach - LEALA (R)'!$C$7:$CD$360,MATCH('LEALA Dashboard'!$E$4,'Apps Ach - LEALA (R)'!$A$7:$A$360,0),MATCH(H$9&$B46&$C46,'Apps Ach - LEALA (R)'!$C$3:$CD$3,0))","v":20},{"$f":"INDEX('Apps Ach - LEALA (R)'!$C$7:$CD$360,MATCH('LEALA Dashboard'!$E$4,'Apps Ach - LEALA (R)'!$A$7:$A$360,0),MATCH(I$9&$B46&$C46,'Apps Ach - LEALA (R)'!$C$3:$CD$3,0))","v":30},{"$f":"INDEX('Apps Ach - LEALA (R)'!$C$7:$CD$360,MATCH('LEALA Dashboard'!$E$4,'Apps Ach - LEALA (R)'!$A$7:$A$360,0),MATCH(J$9&$B46&$C46,'Apps Ach - LEALA (R)'!$C$3:$CD$3,0))","v":20}]
[null,"Advanced","Under 19","Region",{"$f":"INDEX(Lists!$D:$D,MATCH('LEALA Dashboard'!E46,Lists!$E:$E,0))","v":"South East"},{"$f":"INDEX('Apps Ach - LEALA (R)'!$C$363:$CD$374,MATCH($E47,'Apps Ach - LEALA (R)'!$B$363:$B$374,0),MATCH(F$9&$B47&$C47,'Apps Ach - LEALA (R)'!$C$3:$CD$3,0))","v":2520},{"$f":"INDEX('Apps Ach - LEALA (R)'!$C$363:$CD$374,MATCH($E47,'Apps Ach - LEALA (R)'!$B$363:$B$374,0),MATCH(G$9&$B47&$C47,'Apps Ach - LEALA (R)'!$C$3:$CD$3,0))","v":2510},{"$f":"INDEX('Apps Ach - LEALA (R)'!$C$363:$CD$374,MATCH($E47,'Apps Ach - LEALA (R)'!$B$363:$B$374,0),MATCH(H$9&$B47&$C47,'Apps Ach - LEALA (R)'!$C$3:$CD$3,0))","v":2850},{"$f":"INDEX('Apps Ach - LEALA (R)'!$C$363:$CD$374,MATCH($E47,'Apps Ach - LEALA (R)'!$B$363:$B$374,0),MATCH(I$9&$B47&$C47,'Apps Ach - LEALA (R)'!$C$3:$CD$3,0))","v":3030},{"$f":"INDEX('Apps Ach - LEALA (R)'!$C$363:$CD$374,MATCH($E47,'Apps Ach - LEALA (R)'!$B$363:$B$374,0),MATCH(J$9&$B47&$C47,'Apps Ach - LEALA (R)'!$C$3:$CD$3,0))","v":3290}]
[null,"Advanced","Under 19","National","England",{"$f":"INDEX('Apps Ach - LEALA (R)'!$C$363:$CD$374,MATCH($E48,'Apps Ach - LEALA (R)'!$B$363:$B$374,0),MATCH(F$9&$B48&$C48,'Apps Ach - LEALA (R)'!$C$3:$CD$3,0))","v":21000},{"$f":"INDEX('Apps Ach - LEALA (R)'!$C$363:$CD$374,MATCH($E48,'Apps Ach - LEALA (R)'!$B$363:$B$374,0),MATCH(G$9&$B48&$C48,'Apps Ach - LEALA (R)'!$C$3:$CD$3,0))","v":18300},{"$f":"INDEX('Apps Ach - LEALA (R)'!$C$363:$CD$374,MATCH($E48,'Apps Ach - LEALA (R)'!$B$363:$B$374,0),MATCH(H$9&$B48&$C48,'Apps Ach - LEALA (R)'!$C$3:$CD$3,0))","v":19700},{"$f":"INDEX('Apps Ach - LEALA (R)'!$C$363:$CD$374,MATCH($E48,'Apps Ach - LEALA (R)'!$B$363:$B$374,0),MATCH(I$9&$B48&$C48,'Apps Ach - LEALA (R)'!$C$3:$CD$3,0))","v":22300},{"$f":"INDEX('Apps Ach - LEALA (R)'!$C$363:$CD$374,MATCH($E48,'Apps Ach - LEALA (R)'!$B$363:$B$374,0),MATCH(J$9&$B48&$C48,'Apps Ach - LEALA (R)'!$C$3:$CD$3,0))","v":23700}]
[null,"Advanced","Under 19","Total","Grand Total",{"$f":"INDEX('Apps Ach - LEALA (R)'!$C$363:$CD$374,MATCH($E49,'Apps Ach - LEALA (R)'!$B$363:$B$374,0),MATCH(F$9&$B49&$C49,'Apps Ach - LEALA (R)'!$C$3:$CD$3,0))","v":21300},{"$f":"INDEX('Apps Ach - LEALA (R)'!$C$363:$CD$374,MATCH($E49,'Apps Ach - LEALA (R)'!$B$363:$B$374,0),MATCH(G$9&$B49&$C49,'Apps Ach - LEALA (R)'!$C$3:$CD$3,0))","v":18600},{"$f":"INDEX('Apps Ach - LEALA (R)'!$C$363:$CD$374,MATCH($E49,'Apps Ach - LEALA (R)'!$B$363:$B$374,0),MATCH(H$9&$B49&$C49,'Apps Ach - LEALA (R)'!$C$3:$CD$3,0))","v":20000},{"$f":"INDEX('Apps Ach - LEALA (R)'!$C$363:$CD$374,MATCH($E49,'Apps Ach - LEALA (R)'!$B$363:$B$374,0),MATCH(I$9&$B49&$C49,'Apps Ach - LEALA (R)'!$C$3:$CD$3,0))","v":22500},{"$f":"INDEX('Apps Ach - LEALA (R)'!$C$363:$CD$374,MATCH($E49,'Apps Ach - LEALA (R)'!$B$363:$B$374,0),MATCH(J$9&$B49&$C49,'Apps Ach - LEALA (R)'!$C$3:$CD$3,0))","v":24000}]
[null,"Advanced","19-24","LEA/LA",{"$f":"INDEX('Apps Ach - LEALA (R)'!$B:$B,MATCH('LEALA Dashboard'!$E$4,'Apps Ach - LEALA (R)'!$A:$A,0))","v":"Adur"},{"$f":"INDEX('Apps Ach - LEALA (R)'!$C$7:$CD$360,MATCH('LEALA Dashboard'!$E$4,'Apps Ach - LEALA (R)'!$A$7:$A$360,0),MATCH(F$9&$B50&$C50,'Apps Ach - LEALA (R)'!$C$3:$CD$3,0))","v":0},{"$f":"INDEX('Apps Ach - LEALA (R)'!$C$7:$CD$360,MATCH('LEALA Dashboard'!$E$4,'Apps Ach - LEALA (R)'!$A$7:$A$360,0),MATCH(G$9&$B50&$C50,'Apps Ach - LEALA (R)'!$C$3:$CD$3,0))","v":40},{"$f":"INDEX('Apps Ach - LEALA (R)'!$C$7:$CD$360,MATCH('LEALA Dashboard'!$E$4,'Apps Ach - LEALA (R)'!$A$7:$A$360,0),MATCH(H$9&$B50&$C50,'Apps Ach - LEALA (R)'!$C$3:$CD$3,0))","v":50},{"$f":"INDEX('Apps Ach - LEALA (R)'!$C$7:$CD$360,MATCH('LEALA Dashboard'!$E$4,'Apps Ach - LEALA (R)'!$A$7:$A$360,0),MATCH(I$9&$B50&$C50,'Apps Ach - LEALA (R)'!$C$3:$CD$3,0))","v":30},{"$f":"INDEX('Apps Ach - LEALA (R)'!$C$7:$CD$360,MATCH('LEALA Dashboard'!$E$4,'Apps Ach - LEALA (R)'!$A$7:$A$360,0),MATCH(J$9&$B50&$C50,'Apps Ach - LEALA (R)'!$C$3:$CD$3,0))","v":30}]
[null,"Advanced","19-24","Region",{"$f":"INDEX(Lists!$D:$D,MATCH('LEALA Dashboard'!E50,Lists!$E:$E,0))","v":"South East"},{"$f":"INDEX('Apps Ach - LEALA (R)'!$C$363:$CD$374,MATCH($E51,'Apps Ach - LEALA (R)'!$B$363:$B$374,0),MATCH(F$9&$B51&$C51,'Apps Ach - LEALA (R)'!$C$3:$CD$3,0))","v":4340},{"$f":"INDEX('Apps Ach - LEALA (R)'!$C$363:$CD$374,MATCH($E51,'Apps Ach - LEALA (R)'!$B$363:$B$374,0),MATCH(G$9&$B51&$C51,'Apps Ach - LEALA (R)'!$C$3:$CD$3,0))","v":4680},{"$f":"INDEX('Apps Ach - LEALA (R)'!$C$363:$CD$374,MATCH($E51,'Apps Ach - LEALA (R)'!$B$363:$B$374,0),MATCH(H$9&$B51&$C51,'Apps Ach - LEALA (R)'!$C$3:$CD$3,0))","v":5470},{"$f":"INDEX('Apps Ach - LEALA (R)'!$C$363:$CD$374,MATCH($E51,'Apps Ach - LEALA (R)'!$B$363:$B$374,0),MATCH(I$9&$B51&$C51,'Apps Ach - LEALA (R)'!$C$3:$CD$3,0))","v":5810},{"$f":"INDEX('Apps Ach - LEALA (R)'!$C$363:$CD$374,MATCH($E51,'Apps Ach - LEALA (R)'!$B$363:$B$374,0),MATCH(J$9&$B51&$C51,'Apps Ach - LEALA (R)'!$C$3:$CD$3,0))","v":5420}]
[null,"Advanced","19-24","National","England",{"$f":"INDEX('Apps Ach - LEALA (R)'!$C$363:$CD$374,MATCH($E52,'Apps Ach - LEALA (R)'!$B$363:$B$374,0),MATCH(F$9&$B52&$C52,'Apps Ach - LEALA (R)'!$C$3:$CD$3,0))","v":30400},{"$f":"INDEX('Apps Ach - LEALA (R)'!$C$363:$CD$374,MATCH($E52,'Apps Ach - LEALA (R)'!$B$363:$B$374,0),MATCH(G$9&$B52&$C52,'Apps Ach - LEALA (R)'!$C$3:$CD$3,0))","v":30400},{"$f":"INDEX('Apps Ach - LEALA (R)'!$C$363:$CD$374,MATCH($E52,'Apps Ach - LEALA (R)'!$B$363:$B$374,0),MATCH(H$9&$B52&$C52,'Apps Ach - LEALA (R)'!$C$3:$CD$3,0))","v":34700},{"$f":"INDEX('Apps Ach - LEALA (R)'!$C$363:$CD$374,MATCH($E52,'Apps Ach - LEALA (R)'!$B$363:$B$374,0),MATCH(I$9&$B52&$C52,'Apps Ach - LEALA (R)'!$C$3:$CD$3,0))","v":36800},{"$f":"INDEX('Apps Ach - LEALA (R)'!$C$363:$CD$374,MATCH($E52,'Apps Ach - LEALA (R)'!$B$363:$B$374,0),MATCH(J$9&$B52&$C52,'Apps Ach - LEALA (R)'!$C$3:$CD$3,0))","v":36500}]
[null,"Advanced","19-24","Total","Grand Total",{"$f":"INDEX('Apps Ach - LEALA (R)'!$C$363:$CD$374,MATCH($E53,'Apps Ach - LEALA (R)'!$B$363:$B$374,0),MATCH(F$9&$B53&$C53,'Apps Ach - LEALA (R)'!$C$3:$CD$3,0))","v":30600},{"$f":"INDEX('Apps Ach - LEALA (R)'!$C$363:$CD$374,MATCH($E53,'Apps Ach - LEALA (R)'!$B$363:$B$374,0),MATCH(G$9&$B53&$C53,'Apps Ach - LEALA (R)'!$C$3:$CD$3,0))","v":30800},{"$f":"INDEX('Apps Ach - LEALA (R)'!$C$363:$CD$374,MATCH($E53,'Apps Ach - LEALA (R)'!$B$363:$B$374,0),MATCH(H$9&$B53&$C53,'Apps Ach - LEALA (R)'!$C$3:$CD$3,0))","v":35000},{"$f":"INDEX('Apps Ach - LEALA (R)'!$C$363:$CD$374,MATCH($E53,'Apps Ach - LEALA (R)'!$B$363:$B$374,0),MATCH(I$9&$B53&$C53,'Apps Ach - LEALA (R)'!$C$3:$CD$3,0))","v":37100},{"$f":"INDEX('Apps Ach - LEALA (R)'!$C$363:$CD$374,MATCH($E53,'Apps Ach - LEALA (R)'!$B$363:$B$374,0),MATCH(J$9&$B53&$C53,'Apps Ach - LEALA (R)'!$C$3:$CD$3,0))","v":36900}]
[null,"Advanced","25+","LEA/LA",{"$f":"INDEX('Apps Ach - LEALA (R)'!$B:$B,MATCH('LEALA Dashboard'!$E$4,'Apps Ach - LEALA (R)'!$A:$A,0))","v":"Adur"},{"$f":"INDEX('Apps Ach - LEALA (R)'!$C$7:$CD$360,MATCH('LEALA Dashboard'!$E$4,'Apps Ach - LEALA (R)'!$A$7:$A$360,0),MATCH(F$9&$B54&$C54,'Apps Ach - LEALA (R)'!$C$3:$CD$3,0))","v":0},{"$f":"INDEX('Apps Ach - LEALA (R)'!$C$7:$CD$360,MATCH('LEALA Dashboard'!$E$4,'Apps Ach - LEALA (R)'!$A$7:$A$360,0),MATCH(G$9&$B54&$C54,'Apps Ach - LEALA (R)'!$C$3:$CD$3,0))","v":60},{"$f":"INDEX('Apps Ach - LEALA (R)'!$C$7:$CD$360,MATCH('LEALA Dashboard'!$E$4,'Apps Ach - LEALA (R)'!$A$7:$A$360,0),MATCH(H$9&$B54&$C54,'Apps Ach - LEALA (R)'!$C$3:$CD$3,0))","v":50},{"$f":"INDEX('Apps Ach - LEALA (R)'!$C$7:$CD$360,MATCH('LEALA Dashboard'!$E$4,'Apps Ach - LEALA (R)'!$A$7:$A$360,0),MATCH(I$9&$B54&$C54,'Apps Ach - LEALA (R)'!$C$3:$CD$3,0))","v":30},{"$f":"INDEX('Apps Ach - LEALA (R)'!$C$7:$CD$360,MATCH('LEALA Dashboard'!$E$4,'Apps Ach - LEALA (R)'!$A$7:$A$360,0),MATCH(J$9&$B54&$C54,'Apps Ach - LEALA (R)'!$C$3:$CD$3,0))","v":20}]
[null,"Advanced","25+","Region",{"$f":"INDEX(Lists!$D:$D,MATCH('LEALA Dashboard'!E54,Lists!$E:$E,0))","v":"South East"},{"$f":"INDEX('Apps Ach - LEALA (R)'!$C$363:$CD$374,MATCH($E55,'Apps Ach - LEALA (R)'!$B$363:$B$374,0),MATCH(F$9&$B55&$C55,'Apps Ach - LEALA (R)'!$C$3:$CD$3,0))","v":4230},{"$f":"INDEX('Apps Ach - LEALA (R)'!$C$363:$CD$374,MATCH($E55,'Apps Ach - LEALA (R)'!$B$363:$B$374,0),MATCH(G$9&$B55&$C55,'Apps Ach - LEALA (R)'!$C$3:$CD$3,0))","v":6210},{"$f":"INDEX('Apps Ach - LEALA (R)'!$C$363:$CD$374,MATCH($E55,'Apps Ach - LEALA (R)'!$B$363:$B$374,0),MATCH(H$9&$B55&$C55,'Apps Ach - LEALA (R)'!$C$3:$CD$3,0))","v":6240},{"$f":"INDEX('Apps Ach - LEALA (R)'!$C$363:$CD$374,MATCH($E55,'Apps Ach - LEALA (R)'!$B$363:$B$374,0),MATCH(I$9&$B55&$C55,'Apps Ach - LEALA (R)'!$C$3:$CD$3,0))","v":5010},{"$f":"INDEX('Apps Ach - LEALA (R)'!$C$363:$CD$374,MATCH($E55,'Apps Ach - LEALA (R)'!$B$363:$B$374,0),MATCH(J$9&$B55&$C55,'Apps Ach - LEALA (R)'!$C$3:$CD$3,0))","v":5470}]
[null,"Advanced","25+","National","England",{"$f":"INDEX('Apps Ach - LEALA (R)'!$C$363:$CD$374,MATCH($E56,'Apps Ach - LEALA (R)'!$B$363:$B$374,0),MATCH(F$9&$B56&$C56,'Apps Ach - LEALA (R)'!$C$3:$CD$3,0))","v":32500},{"$f":"INDEX('Apps Ach - LEALA (R)'!$C$363:$CD$374,MATCH($E56,'Apps Ach - LEALA (R)'!$B$363:$B$374,0),MATCH(G$9&$B56&$C56,'Apps Ach - LEALA (R)'!$C$3:$CD$3,0))","v":45200},{"$f":"INDEX('Apps Ach - LEALA (R)'!$C$363:$CD$374,MATCH($E56,'Apps Ach - LEALA (R)'!$B$363:$B$374,0),MATCH(H$9&$B56&$C56,'Apps Ach - LEALA (R)'!$C$3:$CD$3,0))","v":46800},{"$f":"INDEX('Apps Ach - LEALA (R)'!$C$363:$CD$374,MATCH($E56,'Apps Ach - LEALA (R)'!$B$363:$B$374,0),MATCH(I$9&$B56&$C56,'Apps Ach - LEALA (R)'!$C$3:$CD$3,0))","v":36200},{"$f":"INDEX('Apps Ach - LEALA (R)'!$C$363:$CD$374,MATCH($E56,'Apps Ach - LEALA (R)'!$B$363:$B$374,0),MATCH(J$9&$B56&$C56,'Apps Ach - LEALA (R)'!$C$3:$CD$3,0))","v":39700}]
[null,"Advanced","25+","Total","Grand Total",{"$f":"INDEX('Apps Ach - LEALA (R)'!$C$363:$CD$374,MATCH($E57,'Apps Ach - LEALA (R)'!$B$363:$B$374,0),MATCH(F$9&$B57&$C57,'Apps Ach - LEALA (R)'!$C$3:$CD$3,0))","v":32800},{"$f":"INDEX('Apps Ach - LEALA (R)'!$C$363:$CD$374,MATCH($E57,'Apps Ach - LEALA (R)'!$B$363:$B$374,0),MATCH(G$9&$B57&$C57,'Apps Ach - LEALA (R)'!$C$3:$CD$3,0))","v":45700},{"$f":"INDEX('Apps Ach - LEALA (R)'!$C$363:$CD$374,MATCH($E57,'Apps Ach - LEALA (R)'!$B$363:$B$374,0),MATCH(H$9&$B57&$C57,'Apps Ach - LEALA (R)'!$C$3:$CD$3,0))","v":47200},{"$f":"INDEX('Apps Ach - LEALA (R)'!$C$363:$CD$374,MATCH($E57,'Apps Ach - LEALA (R)'!$B$363:$B$374,0),MATCH(I$9&$B57&$C57,'Apps Ach - LEALA (R)'!$C$3:$CD$3,0))","v":36600},{"$f":"INDEX('Apps Ach - LEALA (R)'!$C$363:$CD$374,MATCH($E57,'Apps Ach - LEALA (R)'!$B$363:$B$374,0),MATCH(J$9&$B57&$C57,'Apps Ach - LEALA (R)'!$C$3:$CD$3,0))","v":40000}]
[null,"Higher","All","LEA/LA",{"$f":"INDEX('Apps Ach - LEALA (R)'!$B:$B,MATCH('LEALA Dashboard'!$E$4,'Apps Ach - LEALA (R)'!$A:$A,0))","v":"Adur"},{"$f":"INDEX('Apps Ach - LEALA (R)'!$C$7:$CD$360,MATCH('LEALA Dashboard'!$E$4,'Apps Ach - LEALA (R)'!$A$7:$A$360,0),MATCH(F$9&$B58&$C58,'Apps Ach - LEALA (R)'!$C$3:$CD$3,0))","v":0},{"$f":"INDEX('Apps Ach - LEALA (R)'!$C$7:$CD$360,MATCH('LEALA Dashboard'!$E$4,'Apps Ach - LEALA (R)'!$A$7:$A$360,0),MATCH(G$9&$B58&$C58,'Apps Ach - LEALA (R)'!$C$3:$CD$3,0))","v":"-"},{"$f":"INDEX('Apps Ach - LEALA (R)'!$C$7:$CD$360,MATCH('LEALA Dashboard'!$E$4,'Apps Ach - LEALA (R)'!$A$7:$A$360,0),MATCH(H$9&$B58&$C58,'Apps Ach - LEALA (R)'!$C$3:$CD$3,0))","v":"-"},{"$f":"INDEX('Apps Ach - LEALA (R)'!$C$7:$CD$360,MATCH('LEALA Dashboard'!$E$4,'Apps Ach - LEALA (R)'!$A$7:$A$360,0),MATCH(I$9&$B58&$C58,'Apps Ach - LEALA (R)'!$C$3:$CD$3,0))","v":"-"},{"$f":"INDEX('Apps Ach - LEALA (R)'!$C$7:$CD$360,MATCH('LEALA Dashboard'!$E$4,'Apps Ach - LEALA (R)'!$A$7:$A$360,0),MATCH(J$9&$B58&$C58,'Apps Ach - LEALA (R)'!$C$3:$CD$3,0))","v":10}]
[null,"Higher","All","Region",{"$f":"INDEX(Lists!$D:$D,MATCH('LEALA Dashboard'!E58,Lists!$E:$E,0))","v":"South East"},{"$f":"INDEX('Apps Ach - LEALA (R)'!$C$363:$CD$374,MATCH($E59,'Apps Ach - LEALA (R)'!$B$363:$B$374,0),MATCH(F$9&$B59&$C59,'Apps Ach - LEALA (R)'!$C$3:$CD$3,0))","v":100},{"$f":"INDEX('Apps Ach - LEALA (R)'!$C$363:$CD$374,MATCH($E59,'Apps Ach - LEALA (R)'!$B$363:$B$374,0),MATCH(G$9&$B59&$C59,'Apps Ach - LEALA (R)'!$C$3:$CD$3,0))","v":150},{"$f":"INDEX('Apps Ach - LEALA (R)'!$C$363:$CD$374,MATCH($E59,'Apps Ach - LEALA (R)'!$B$363:$B$374,0),MATCH(H$9&$B59&$C59,'Apps Ach - LEALA (R)'!$C$3:$CD$3,0))","v":300},{"$f":"INDEX('Apps Ach - LEALA (R)'!$C$363:$CD$374,MATCH($E59,'Apps Ach - LEALA (R)'!$B$363:$B$374,0),MATCH(I$9&$B59&$C59,'Apps Ach - LEALA (R)'!$C$3:$CD$3,0))","v":490},{"$f":"INDEX('Apps Ach - LEALA (R)'!$C$363:$CD$374,MATCH($E59,'Apps Ach - LEALA (R)'!$B$363:$B$374,0),MATCH(J$9&$B59&$C59,'Apps Ach - LEALA (R)'!$C$3:$CD$3,0))","v":960}]
[null,"Higher","All","National","England",{"$f":"INDEX('Apps Ach - LEALA (R)'!$C$363:$CD$374,MATCH($E60,'Apps Ach - LEALA (R)'!$B$363:$B$374,0),MATCH(F$9&$B60&$C60,'Apps Ach - LEALA (R)'!$C$3:$CD$3,0))","v":1200},{"$f":"INDEX('Apps Ach - LEALA (R)'!$C$363:$CD$374,MATCH($E60,'Apps Ach - LEALA (R)'!$B$363:$B$374,0),MATCH(G$9&$B60&$C60,'Apps Ach - LEALA (R)'!$C$3:$CD$3,0))","v":1500},{"$f":"INDEX('Apps Ach - LEALA (R)'!$C$363:$CD$374,MATCH($E60,'Apps Ach - LEALA (R)'!$B$363:$B$374,0),MATCH(H$9&$B60&$C60,'Apps Ach - LEALA (R)'!$C$3:$CD$3,0))","v":2700},{"$f":"INDEX('Apps Ach - LEALA (R)'!$C$363:$CD$374,MATCH($E60,'Apps Ach - LEALA (R)'!$B$363:$B$374,0),MATCH(I$9&$B60&$C60,'Apps Ach - LEALA (R)'!$C$3:$CD$3,0))","v":4300},{"$f":"INDEX('Apps Ach - LEALA (R)'!$C$363:$CD$374,MATCH($E60,'Apps Ach - LEALA (R)'!$B$363:$B$374,0),MATCH(J$9&$B60&$C60,'Apps Ach - LEALA (R)'!$C$3:$CD$3,0))","v":6900}]
[null,"Higher","All","Total","Grand Total",{"$f":"INDEX('Apps Ach - LEALA (R)'!$C$363:$CD$374,MATCH($E61,'Apps Ach - LEALA (R)'!$B$363:$B$374,0),MATCH(F$9&$B61&$C61,'Apps Ach - LEALA (R)'!$C$3:$CD$3,0))","v":1200},{"$f":"INDEX('Apps Ach - LEALA (R)'!$C$363:$CD$374,MATCH($E61,'Apps Ach - LEALA (R)'!$B$363:$B$374,0),MATCH(G$9&$B61&$C61,'Apps Ach - LEALA (R)'!$C$3:$CD$3,0))","v":1600},{"$f":"INDEX('Apps Ach - LEALA (R)'!$C$363:$CD$374,MATCH($E61,'Apps Ach - LEALA (R)'!$B$363:$B$374,0),MATCH(H$9&$B61&$C61,'Apps Ach - LEALA (R)'!$C$3:$CD$3,0))","v":2700},{"$f":"INDEX('Apps Ach - LEALA (R)'!$C$363:$CD$374,MATCH($E61,'Apps Ach - LEALA (R)'!$B$363:$B$374,0),MATCH(I$9&$B61&$C61,'Apps Ach - LEALA (R)'!$C$3:$CD$3,0))","v":4300},{"$f":"INDEX('Apps Ach - LEALA (R)'!$C$363:$CD$374,MATCH($E61,'Apps Ach - LEALA (R)'!$B$363:$B$374,0),MATCH(J$9&$B61&$C61,'Apps Ach - LEALA (R)'!$C$3:$CD$3,0))","v":7000}]
[null,"Higher","Under 19","LEA/LA",{"$f":"INDEX('Apps Ach - LEALA (R)'!$B:$B,MATCH('LEALA Dashboard'!$E$4,'Apps Ach - LEALA (R)'!$A:$A,0))","v":"Adur"},{"$f":"INDEX('Apps Ach - LEALA (R)'!$C$7:$CD$360,MATCH('LEALA Dashboard'!$E$4,'Apps Ach - LEALA (R)'!$A$7:$A$360,0),MATCH(F$9&$B62&$C62,'Apps Ach - LEALA (R)'!$C$3:$CD$3,0))","v":0},{"$f":"INDEX('Apps Ach - LEALA (R)'!$C$7:$CD$360,MATCH('LEALA Dashboard'!$E$4,'Apps Ach - LEALA (R)'!$A$7:$A$360,0),MATCH(G$9&$B62&$C62,'Apps Ach - LEALA (R)'!$C$3:$CD$3,0))","v":"-"},{"$f":"INDEX('Apps Ach - LEALA (R)'!$C$7:$CD$360,MATCH('LEALA Dashboard'!$E$4,'Apps Ach - LEALA (R)'!$A$7:$A$360,0),MATCH(H$9&$B62&$C62,'Apps Ach - LEALA (R)'!$C$3:$CD$3,0))","v":"-"},{"$f":"INDEX('Apps Ach - LEALA (R)'!$C$7:$CD$360,MATCH('LEALA Dashboard'!$E$4,'Apps Ach - LEALA (R)'!$A$7:$A$360,0),MATCH(I$9&$B62&$C62,'Apps Ach - LEALA (R)'!$C$3:$CD$3,0))","v":"-"},{"$f":"INDEX('Apps Ach - LEALA (R)'!$C$7:$CD$360,MATCH('LEALA Dashboard'!$E$4,'Apps Ach - LEALA (R)'!$A$7:$A$360,0),MATCH(J$9&$B62&$C62,'Apps Ach - LEALA (R)'!$C$3:$CD$3,0))","v":"-"}]
[null,"Higher","Under 19","Region",{"$f":"INDEX(Lists!$D:$D,MATCH('LEALA Dashboard'!E62,Lists!$E:$E,0))","v":"South East"},{"$f":"INDEX('Apps Ach - LEALA (R)'!$C$363:$CD$374,MATCH($E63,'Apps Ach - LEALA (R)'!$B$363:$B$374,0),MATCH(F$9&$B63&$C63,'Apps Ach - LEALA (R)'!$C$3:$CD$3,0))","v":"-"},{"$f":"INDEX('Apps Ach - LEALA (R)'!$C$363:$CD$374,MATCH($E63,'Apps Ach - LEALA (R)'!$B$363:$B$374,0),MATCH(G$9&$B63&$C63,'Apps Ach - LEALA (R)'!$C$3:$CD$3,0))","v":10},{"$f":"INDEX('Apps Ach - LEALA (R)'!$C$363:$CD$374,MATCH($E63,'Apps Ach - LEALA (R)'!$B$363:$B$374,0),MATCH(H$9&$B63&$C63,'Apps Ach - LEALA (R)'!$C$3:$CD$3,0))","v":20},{"$f":"INDEX('Apps Ach - LEALA (R)'!$C$363:$CD$374,MATCH($E63,'Apps Ach - LEALA (R)'!$B$363:$B$374,0),MATCH(I$9&$B63&$C63,'Apps Ach - LEALA (R)'!$C$3:$CD$3,0))","v":30},{"$f":"INDEX('Apps Ach - LEALA (R)'!$C$363:$CD$374,MATCH($E63,'Apps Ach - LEALA (R)'!$B$363:$B$374,0),MATCH(J$9&$B63&$C63,'Apps Ach - LEALA (R)'!$C$3:$CD$3,0))","v":50}]
[null,"Higher","Under 19","National","England",{"$f":"INDEX('Apps Ach - LEALA (R)'!$C$363:$CD$374,MATCH($E64,'Apps Ach - LEALA (R)'!$B$363:$B$374,0),MATCH(F$9&$B64&$C64,'Apps Ach - LEALA (R)'!$C$3:$CD$3,0))","v":100},{"$f":"INDEX('Apps Ach - LEALA (R)'!$C$363:$CD$374,MATCH($E64,'Apps Ach - LEALA (R)'!$B$363:$B$374,0),MATCH(G$9&$B64&$C64,'Apps Ach - LEALA (R)'!$C$3:$CD$3,0))","v":100},{"$f":"INDEX('Apps Ach - LEALA (R)'!$C$363:$CD$374,MATCH($E64,'Apps Ach - LEALA (R)'!$B$363:$B$374,0),MATCH(H$9&$B64&$C64,'Apps Ach - LEALA (R)'!$C$3:$CD$3,0))","v":200},{"$f":"INDEX('Apps Ach - LEALA (R)'!$C$363:$CD$374,MATCH($E64,'Apps Ach - LEALA (R)'!$B$363:$B$374,0),MATCH(I$9&$B64&$C64,'Apps Ach - LEALA (R)'!$C$3:$CD$3,0))","v":300},{"$f":"INDEX('Apps Ach - LEALA (R)'!$C$363:$CD$374,MATCH($E64,'Apps Ach - LEALA (R)'!$B$363:$B$374,0),MATCH(J$9&$B64&$C64,'Apps Ach - LEALA (R)'!$C$3:$CD$3,0))","v":400}]
[null,"Higher","Under 19","Total","Grand Total",{"$f":"INDEX('Apps Ach - LEALA (R)'!$C$363:$CD$374,MATCH($E65,'Apps Ach - LEALA (R)'!$B$363:$B$374,0),MATCH(F$9&$B65&$C65,'Apps Ach - LEALA (R)'!$C$3:$CD$3,0))","v":100},{"$f":"INDEX('Apps Ach - LEALA (R)'!$C$363:$CD$374,MATCH($E65,'Apps Ach - LEALA (R)'!$B$363:$B$374,0),MATCH(G$9&$B65&$C65,'Apps Ach - LEALA (R)'!$C$3:$CD$3,0))","v":100},{"$f":"INDEX('Apps Ach - LEALA (R)'!$C$363:$CD$374,MATCH($E65,'Apps Ach - LEALA (R)'!$B$363:$B$374,0),MATCH(H$9&$B65&$C65,'Apps Ach - LEALA (R)'!$C$3:$CD$3,0))","v":200},{"$f":"INDEX('Apps Ach - LEALA (R)'!$C$363:$CD$374,MATCH($E65,'Apps Ach - LEALA (R)'!$B$363:$B$374,0),MATCH(I$9&$B65&$C65,'Apps Ach - LEALA (R)'!$C$3:$CD$3,0))","v":300},{"$f":"INDEX('Apps Ach - LEALA (R)'!$C$363:$CD$374,MATCH($E65,'Apps Ach - LEALA (R)'!$B$363:$B$374,0),MATCH(J$9&$B65&$C65,'Apps Ach - LEALA (R)'!$C$3:$CD$3,0))","v":400}]
[null,"Higher","19-24","LEA/LA",{"$f":"INDEX('Apps Ach - LEALA (R)'!$B:$B,MATCH('LEALA Dashboard'!$E$4,'Apps Ach - LEALA (R)'!$A:$A,0))","v":"Adur"},{"$f":"INDEX('Apps Ach - LEALA (R)'!$C$7:$CD$360,MATCH('LEALA Dashboard'!$E$4,'Apps Ach - LEALA (R)'!$A$7:$A$360,0),MATCH(F$9&$B66&$C66,'Apps Ach - LEALA (R)'!$C$3:$CD$3,0))","v":0},{"$f":"INDEX('Apps Ach - LEALA (R)'!$C$7:$CD$360,MATCH('LEALA Dashboard'!$E$4,'Apps Ach - LEALA (R)'!$A$7:$A$360,0),MATCH(G$9&$B66&$C66,'Apps Ach - LEALA (R)'!$C$3:$CD$3,0))","v":"-"},{"$f":"INDEX('Apps Ach - LEALA (R)'!$C$7:$CD$360,MATCH('LEALA Dashboard'!$E$4,'Apps Ach - LEALA (R)'!$A$7:$A$360,0),MATCH(H$9&$B66&$C66,'Apps Ach - LEALA (R)'!$C$3:$CD$3,0))","v":"-"},{"$f":"INDEX('Apps Ach - LEALA (R)'!$C$7:$CD$360,MATCH('LEALA Dashboard'!$E$4,'Apps Ach - LEALA (R)'!$A$7:$A$360,0),MATCH(I$9&$B66&$C66,'Apps Ach - LEALA (R)'!$C$3:$CD$3,0))","v":"-"},{"$f":"INDEX('Apps Ach - LEALA (R)'!$C$7:$CD$360,MATCH('LEALA Dashboard'!$E$4,'Apps Ach - LEALA (R)'!$A$7:$A$360,0),MATCH(J$9&$B66&$C66,'Apps Ach - LEALA (R)'!$C$3:$CD$3,0))","v":"-"}]
[null,"Higher","19-24","Region",{"$f":"INDEX(Lists!$D:$D,MATCH('LEALA Dashboard'!E66,Lists!$E:$E,0))","v":"South East"},{"$f":"INDEX('Apps Ach - LEALA (R)'!$C$363:$CD$374,MATCH($E67,'Apps Ach - LEALA (R)'!$B$363:$B$374,0),MATCH(F$9&$B67&$C67,'Apps Ach - LEALA (R)'!$C$3:$CD$3,0))","v":80},{"$f":"INDEX('Apps Ach - LEALA (R)'!$C$363:$CD$374,MATCH($E67,'Apps Ach - LEALA (R)'!$B$363:$B$374,0),MATCH(G$9&$B67&$C67,'Apps Ach - LEALA (R)'!$C$3:$CD$3,0))","v":100},{"$f":"INDEX('Apps Ach - LEALA (R)'!$C$363:$CD$374,MATCH($E67,'Apps Ach - LEALA (R)'!$B$363:$B$374,0),MATCH(H$9&$B67&$C67,'Apps Ach - LEALA (R)'!$C$3:$CD$3,0))","v":140},{"$f":"INDEX('Apps Ach - LEALA (R)'!$C$363:$CD$374,MATCH($E67,'Apps Ach - LEALA (R)'!$B$363:$B$374,0),MATCH(I$9&$B67&$C67,'Apps Ach - LEALA (R)'!$C$3:$CD$3,0))","v":150},{"$f":"INDEX('Apps Ach - LEALA (R)'!$C$363:$CD$374,MATCH($E67,'Apps Ach - LEALA (R)'!$B$363:$B$374,0),MATCH(J$9&$B67&$C67,'Apps Ach - LEALA (R)'!$C$3:$CD$3,0))","v":210}]
[null,"Higher","19-24","National","England",{"$f":"INDEX('Apps Ach - LEALA (R)'!$C$363:$CD$374,MATCH($E68,'Apps Ach - LEALA (R)'!$B$363:$B$374,0),MATCH(F$9&$B68&$C68,'Apps Ach - LEALA (R)'!$C$3:$CD$3,0))","v":800},{"$f":"INDEX('Apps Ach - LEALA (R)'!$C$363:$CD$374,MATCH($E68,'Apps Ach - LEALA (R)'!$B$363:$B$374,0),MATCH(G$9&$B68&$C68,'Apps Ach - LEALA (R)'!$C$3:$CD$3,0))","v":800},{"$f":"INDEX('Apps Ach - LEALA (R)'!$C$363:$CD$374,MATCH($E68,'Apps Ach - LEALA (R)'!$B$363:$B$374,0),MATCH(H$9&$B68&$C68,'Apps Ach - LEALA (R)'!$C$3:$CD$3,0))","v":1100},{"$f":"INDEX('Apps Ach - LEALA (R)'!$C$363:$CD$374,MATCH($E68,'Apps Ach - LEALA (R)'!$B$363:$B$374,0),MATCH(I$9&$B68&$C68,'Apps Ach - LEALA (R)'!$C$3:$CD$3,0))","v":1100},{"$f":"INDEX('Apps Ach - LEALA (R)'!$C$363:$CD$374,MATCH($E68,'Apps Ach - LEALA (R)'!$B$363:$B$374,0),MATCH(J$9&$B68&$C68,'Apps Ach - LEALA (R)'!$C$3:$CD$3,0))","v":1500}]
[null,"Higher","19-24","Total","Grand Total",{"$f":"INDEX('Apps Ach - LEALA (R)'!$C$363:$CD$374,MATCH($E69,'Apps Ach - LEALA (R)'!$B$363:$B$374,0),MATCH(F$9&$B69&$C69,'Apps Ach - LEALA (R)'!$C$3:$CD$3,0))","v":800},{"$f":"INDEX('Apps Ach - LEALA (R)'!$C$363:$CD$374,MATCH($E69,'Apps Ach - LEALA (R)'!$B$363:$B$374,0),MATCH(G$9&$B69&$C69,'Apps Ach - LEALA (R)'!$C$3:$CD$3,0))","v":800},{"$f":"INDEX('Apps Ach - LEALA (R)'!$C$363:$CD$374,MATCH($E69,'Apps Ach - LEALA (R)'!$B$363:$B$374,0),MATCH(H$9&$B69&$C69,'Apps Ach - LEALA (R)'!$C$3:$CD$3,0))","v":1100},{"$f":"INDEX('Apps Ach - LEALA (R)'!$C$363:$CD$374,MATCH($E69,'Apps Ach - LEALA (R)'!$B$363:$B$374,0),MATCH(I$9&$B69&$C69,'Apps Ach - LEALA (R)'!$C$3:$CD$3,0))","v":1100},{"$f":"INDEX('Apps Ach - LEALA (R)'!$C$363:$CD$374,MATCH($E69,'Apps Ach - LEALA (R)'!$B$363:$B$374,0),MATCH(J$9&$B69&$C69,'Apps Ach - LEALA (R)'!$C$3:$CD$3,0))","v":1600}]
[null,"Higher","25+","LEA/LA",{"$f":"INDEX('Apps Ach - LEALA (R)'!$B:$B,MATCH('LEALA Dashboard'!$E$4,'Apps Ach - LEALA (R)'!$A:$A,0))","v":"Adur"},{"$f":"INDEX('Apps Ach - LEALA (R)'!$C$7:$CD$360,MATCH('LEALA Dashboard'!$E$4,'Apps Ach - LEALA (R)'!$A$7:$A$360,0),MATCH(F$9&$B70&$C70,'Apps Ach - LEALA (R)'!$C$3:$CD$3,0))","v":0},{"$f":"INDEX('Apps Ach - LEALA (R)'!$C$7:$CD$360,MATCH('LEALA Dashboard'!$E$4,'Apps Ach - LEALA (R)'!$A$7:$A$360,0),MATCH(G$9&$B70&$C70,'Apps Ach - LEALA (R)'!$C$3:$CD$3,0))","v":"-"},{"$f":"INDEX('Apps Ach - LEALA (R)'!$C$7:$CD$360,MATCH('LEALA Dashboard'!$E$4,'Apps Ach - LEALA (R)'!$A$7:$A$360,0),MATCH(H$9&$B70&$C70,'Apps Ach - LEALA (R)'!$C$3:$CD$3,0))","v":"-"},{"$f":"INDEX('Apps Ach - LEALA (R)'!$C$7:$CD$360,MATCH('LEALA Dashboard'!$E$4,'Apps Ach - LEALA (R)'!$A$7:$A$360,0),MATCH(I$9&$B70&$C70,'Apps Ach - LEALA (R)'!$C$3:$CD$3,0))","v":"-"},{"$f":"INDEX('Apps Ach - LEALA (R)'!$C$7:$CD$360,MATCH('LEALA Dashboard'!$E$4,'Apps Ach - LEALA (R)'!$A$7:$A$360,0),MATCH(J$9&$B70&$C70,'Apps Ach - LEALA (R)'!$C$3:$CD$3,0))","v":10}]
[null,"Higher","25+","Region",{"$f":"INDEX(Lists!$D:$D,MATCH('LEALA Dashboard'!E70,Lists!$E:$E,0))","v":"South East"},{"$f":"INDEX('Apps Ach - LEALA (R)'!$C$363:$CD$374,MATCH($E71,'Apps Ach - LEALA (R)'!$B$363:$B$374,0),MATCH(F$9&$B71&$C71,'Apps Ach - LEALA (R)'!$C$3:$CD$3,0))","v":20},{"$f":"INDEX('Apps Ach - LEALA (R)'!$C$363:$CD$374,MATCH($E71,'Apps Ach - LEALA (R)'!$B$363:$B$374,0),MATCH(G$9&$B71&$C71,'Apps Ach - LEALA (R)'!$C$3:$CD$3,0))","v":40},{"$f":"INDEX('Apps Ach - LEALA (R)'!$C$363:$CD$374,MATCH($E71,'Apps Ach - LEALA (R)'!$B$363:$B$374,0),MATCH(H$9&$B71&$C71,'Apps Ach - LEALA (R)'!$C$3:$CD$3,0))","v":140},{"$f":"INDEX('Apps Ach - LEALA (R)'!$C$363:$CD$374,MATCH($E71,'Apps Ach - LEALA (R)'!$B$363:$B$374,0),MATCH(I$9&$B71&$C71,'Apps Ach - LEALA (R)'!$C$3:$CD$3,0))","v":310},{"$f":"INDEX('Apps Ach - LEALA (R)'!$C$363:$CD$374,MATCH($E71,'Apps Ach - LEALA (R)'!$B$363:$B$374,0),MATCH(J$9&$B71&$C71,'Apps Ach - LEALA (R)'!$C$3:$CD$3,0))","v":700}]
[null,"Higher","25+","National","England",{"$f":"INDEX('Apps Ach - LEALA (R)'!$C$363:$CD$374,MATCH($E72,'Apps Ach - LEALA (R)'!$B$363:$B$374,0),MATCH(F$9&$B72&$C72,'Apps Ach - LEALA (R)'!$C$3:$CD$3,0))","v":300},{"$f":"INDEX('Apps Ach - LEALA (R)'!$C$363:$CD$374,MATCH($E72,'Apps Ach - LEALA (R)'!$B$363:$B$374,0),MATCH(G$9&$B72&$C72,'Apps Ach - LEALA (R)'!$C$3:$CD$3,0))","v":600},{"$f":"INDEX('Apps Ach - LEALA (R)'!$C$363:$CD$374,MATCH($E72,'Apps Ach - LEALA (R)'!$B$363:$B$374,0),MATCH(H$9&$B72&$C72,'Apps Ach - LEALA (R)'!$C$3:$CD$3,0))","v":1400},{"$f":"INDEX('Apps Ach - LEALA (R)'!$C$363:$CD$374,MATCH($E72,'Apps Ach - LEALA (R)'!$B$363:$B$374,0),MATCH(I$9&$B72&$C72,'Apps Ach - LEALA (R)'!$C$3:$CD$3,0))","v":2800},{"$f":"INDEX('Apps Ach - LEALA (R)'!$C$363:$CD$374,MATCH($E72,'Apps Ach - LEALA (R)'!$B$363:$B$374,0),MATCH(J$9&$B72&$C72,'Apps Ach - LEALA (R)'!$C$3:$CD$3,0))","v":4900}]
[null,"Higher","25+","Total","Grand Total",{"$f":"INDEX('Apps Ach - LEALA (R)'!$C$363:$CD$374,MATCH($E73,'Apps Ach - LEALA (R)'!$B$363:$B$374,0),MATCH(F$9&$B73&$C73,'Apps Ach - LEALA (R)'!$C$3:$CD$3,0))","v":300},{"$f":"INDEX('Apps Ach - LEALA (R)'!$C$363:$CD$374,MATCH($E73,'Apps Ach - LEALA (R)'!$B$363:$B$374,0),MATCH(G$9&$B73&$C73,'Apps Ach - LEALA (R)'!$C$3:$CD$3,0))","v":600},{"$f":"INDEX('Apps Ach - LEALA (R)'!$C$363:$CD$374,MATCH($E73,'Apps Ach - LEALA (R)'!$B$363:$B$374,0),MATCH(H$9&$B73&$C73,'Apps Ach - LEALA (R)'!$C$3:$CD$3,0))","v":1400},{"$f":"INDEX('Apps Ach - LEALA (R)'!$C$363:$CD$374,MATCH($E73,'Apps Ach - LEALA (R)'!$B$363:$B$374,0),MATCH(I$9&$B73&$C73,'Apps Ach - LEALA (R)'!$C$3:$CD$3,0))","v":2900},{"$f":"INDEX('Apps Ach - LEALA (R)'!$C$363:$CD$374,MATCH($E73,'Apps Ach - LEALA (R)'!$B$363:$B$374,0),MATCH(J$9&$B73&$C73,'Apps Ach - LEALA (R)'!$C$3:$CD$3,0))","v":5000}]

{"sheet":"PCON Dashboard","index":3,"n_rows":72,"n_cols":10,"rows_kept":72,"cut":false,"hidden":false,"merged":[[6,1,6,9],[1,3,1,8]]}
[]
[null,null,null,"Parliamentary Constituency data on Apprenticeship Achievements"]
[null,null,null,"Parliamentary Constituency",1]
[]
[]
[]
[null,"Apprenticeship - Achievements"]
[null,"Level","Age","Geography","PCON/Region/England","2011/12","2012/13","2013/14","2014/15","2015/16"]
[null,"All","All","PCON",{"$f":"INDEX('Apps-Ach-PCON (R)'!$B:$B,MATCH('PCON Dashboard'!$E$3,'Apps-Ach-PCON (R)'!$A:$A,0))","v":"Aldershot"},{"$f":"INDEX('Apps-Ach-PCON (R)'!$D$7:$CE$539,MATCH('PCON Dashboard'!$E$3,'Apps-Ach-PCON (R)'!$A$7:$A$539,0),MATCH(F$8&$B9&$C9,'Apps-Ach-PCON (R)'!$D$3:$CE$3,0))","v":510},{"$f":"INDEX('Apps-Ach-PCON (R)'!$D$7:$CE$539,MATCH('PCON Dashboard'!$E$3,'Apps-Ach-PCON (R)'!$A$7:$A$539,0),MATCH(G$8&$B9&$C9,'Apps-Ach-PCON (R)'!$D$3:$CE$3,0))","v":580},{"$f":"INDEX('Apps-Ach-PCON (R)'!$D$7:$CE$539,MATCH('PCON Dashboard'!$E$3,'Apps-Ach-PCON (R)'!$A$7:$A$539,0),MATCH(H$8&$B9&$C9,'Apps-Ach-PCON (R)'!$D$3:$CE$3,0))","v":580},{"$f":"INDEX('Apps-Ach-PCON (R)'!$D$7:$CE$539,MATCH('PCON Dashboard'!$E$3,'Apps-Ach-PCON (R)'!$A$7:$A$539,0),MATCH(I$8&$B9&$C9,'Apps-Ach-PCON (R)'!$D$3:$CE$3,0))","v":480},{"$f":"INDEX('Apps-Ach-PCON (R)'!$D$7:$CE$539,MATCH('PCON Dashboard'!$E$3,'Apps-Ach-PCON (R)'!$A$7:$A$539,0),MATCH(J$8&$B9&$C9,'Apps-Ach-PCON (R)'!$D$3:$CE$3,0))","v":500}]
[null,"All","All","Region",{"$f":"INDEX(Lists!$H:$H,MATCH('PCON Dashboard'!E9,Lists!$I:$I,0))","v":"South East"},{"$f":"INDEX('Apps-Ach-PCON (R)'!$D$545:$CE$556,MATCH($E10,'Apps-Ach-PCON (R)'!$B$545:$B$556,0),MATCH('PCON Dashboard'!F$8&'PCON Dashboard'!$B10&'PCON Dashboard'!$C10,'Apps-Ach-PCON (R)'!$D$3:$CE$3,0))","v":33760},{"$f":"INDEX('Apps-Ach-PCON (R)'!$D$545:$CE$556,MATCH($E10,'Apps-Ach-PCON (R)'!$B$545:$B$556,0),MATCH('PCON Dashboard'!G$8&'PCON Dashboard'!$B10&'PCON Dashboard'!$C10,'Apps-Ach-PCON (R)'!$D$3:$CE$3,0))","v":33680},{"$f":"INDEX('Apps-Ach-PCON (R)'!$D$545:$CE$556,MATCH($E10,'Apps-Ach-PCON (R)'!$B$545:$B$556,0),MATCH('PCON Dashboard'!H$8&'PCON Dashboard'!$B10&'PCON Dashboard'!$C10,'Apps-Ach-PCON (R)'!$D$3:$CE$3,0))","v":34770},{"$f":"INDEX('Apps-Ach-PCON (R)'!$D$545:$CE$556,MATCH($E10,'Apps-Ach-PCON (R)'!$B$545:$B$556,0),MATCH('PCON Dashboard'!I$8&'PCON Dashboard'!$B10&'PCON Dashboard'!$C10,'Apps-Ach-PCON (R)'!$D$3:$CE$3,0))","v":35480},{"$f":"INDEX('Apps-Ach-PCON (R)'!$D$545:$CE$556,MATCH($E10,'Apps-Ach-PCON (R)'!$B$545:$B$556,0),MATCH('PCON Dashboard'!J$8&'PCON Dashboard'!$B10&'PCON Dashboard'!$C10,'Apps-Ach-PCON (R)'!$D$3:$CE$3,0))","v":36370}]
[null,"All","All","National","England",{"$f":"INDEX('Apps-Ach-PCON (R)'!$D$545:$CE$556,MATCH($E11,'Apps-Ach-PCON (R)'!$B$545:$B$556,0),MATCH('PCON Dashboard'!F$8&'PCON Dashboard'!$B11&'PCON Dashboard'!$C11,'Apps-Ach-PCON (R)'!$D$3:$CE$3,0))","v":255700},{"$f":"INDEX('Apps-Ach-PCON (R)'!$D$545:$CE$556,MATCH($E11,'Apps-Ach-PCON (R)'!$B$545:$B$556,0),MATCH('PCON Dashboard'!G$8&'PCON Dashboard'!$B11&'PCON Dashboard'!$C11,'Apps-Ach-PCON (R)'!$D$3:$CE$3,0))","v":250000},{"$f":"INDEX('Apps-Ach-PCON (R)'!$D$545:$CE$556,MATCH($E11,'Apps-Ach-PCON (R)'!$B$545:$B$556,0),MATCH('PCON Dashboard'!H$8&'PCON Dashboard'!$B11&'PCON Dashboard'!$C11,'Apps-Ach-PCON (R)'!$D$3:$CE$3,0))","v":253500},{"$f":"INDEX('Apps-Ach-PCON (R)'!$D$545:$CE$556,MATCH($E11,'Apps-Ach-PCON (R)'!$B$545:$B$556,0),MATCH('PCON Dashboard'!I$8&'PCON Dashboard'!$B11&'PCON Dashboard'!$C11,'Apps-Ach-PCON (R)'!$D$3:$CE$3,0))","v":258400},{"$f":"INDEX('Apps-Ach-PCON (R)'!$D$545:$CE$556,MATCH($E11,'Apps-Ach-PCON (R)'!$B$545:$B$556,0),MATCH('PCON Dashboard'!J$8&'PCON Dashboard'!$B11&'PCON Dashboard'!$C11,'Apps-Ach-PCON (R)'!$D$3:$CE$3,0))","v":269200}]
[null,"All","All","Total","Grand Total",{"$f":"INDEX('Apps-Ach-PCON (R)'!$D$545:$CE$556,MATCH($E12,'Apps-Ach-PCON (R)'!$B$545:$B$556,0),MATCH('PCON Dashboard'!F$8&'PCON Dashboard'!$B12&'PCON Dashboard'!$C12,'Apps-Ach-PCON (R)'!$D$3:$CE$3,0))","v":258400},{"$f":"INDEX('Apps-Ach-PCON (R)'!$D$545:$CE$556,MATCH($E12,'Apps-Ach-PCON (R)'!$B$545:$B$556,0),MATCH('PCON Dashboard'!G$8&'PCON Dashboard'!$B12&'PCON Dashboard'!$C12,'Apps-Ach-PCON (R)'!$D$3:$CE$3,0))","v":252900},{"$f":"INDEX('Apps-Ach-PCON (R)'!$D$545:$CE$556,MATCH($E12,'Apps-Ach-PCON (R)'!$B$545:$B$556,0),MATCH('PCON Dashboard'!H$8&'PCON Dashboard'!$B12&'PCON Dashboard'!$C12,'Apps-Ach-PCON (R)'!$D$3:$CE$3,0))","v":255800},{"$f":"INDEX('Apps-Ach-PCON (R)'!$D$545:$CE$556,MATCH($E12,'Apps-Ach-PCON (R)'!$B$545:$B$556,0),MATCH('PCON Dashboard'!I$8&'PCON Dashboard'!$B12&'PCON Dashboard'!$C12,'Apps-Ach-PCON (R)'!$D$3:$CE$3,0))","v":260900},{"$f":"INDEX('Apps-Ach-PCON (R)'!$D$545:$CE$556,MATCH($E12,'Apps-Ach-PCON (R)'!$B$545:$B$556,0),MATCH('PCON Dashboard'!J$8&'PCON Dashboard'!$B12&'PCON Dashboard'!$C12,'Apps-Ach-PCON (R)'!$D$3:$CE$3,0))","v":271700}]
[null,"All","Under 19","PCON",{"$f":"INDEX('Apps-Ach-PCON (R)'!$B:$B,MATCH('PCON Dashboard'!$E$3,'Apps-Ach-PCON (R)'!$A:$A,0))","v":"Aldershot"},{"$f":"INDEX('Apps-Ach-PCON (R)'!$D$7:$CE$539,MATCH('PCON Dashboard'!$E$3,'Apps-Ach-PCON (R)'!$A$7:$A$539,0),MATCH(F$8&$B13&$C13,'Apps-Ach-PCON (R)'!$D$3:$CE$3,0))","v":140},{"$f":"INDEX('Apps-Ach-PCON (R)'!$D$7:$CE$539,MATCH('PCON Dashboard'!$E$3,'Apps-Ach-PCON (R)'!$A$7:$A$539,0),MATCH(G$8&$B13&$C13,'Apps-Ach-PCON (R)'!$D$3:$CE$3,0))","v":180},{"$f":"INDEX('Apps-Ach-PCON (R)'!$D$7:$CE$539,MATCH('PCON Dashboard'!$E$3,'Apps-Ach-PCON (R)'!$A$7:$A$539,0),MATCH(H$8&$B13&$C13,'Apps-Ach-PCON (R)'!$D$3:$CE$3,0))","v":190},{"$f":"INDEX('Apps-Ach-PCON (R)'!$D$7:$CE$539,MATCH('PCON Dashboard'!$E$3,'Apps-Ach-PCON (R)'!$A$7:$A$539,0),MATCH(I$8&$B13&$C13,'Apps-Ach-PCON (R)'!$D$3:$CE$3,0))","v":100},{"$f":"INDEX('Apps-Ach-PCON (R)'!$D$7:$CE$539,MATCH('PCON Dashboard'!$E$3,'Apps-Ach-PCON (R)'!$A$7:$A$539,0),MATCH(J$8&$B13&$C13,'Apps-Ach-PCON (R)'!$D$3:$CE$3,0))","v":160}]
[null,"All","Under 19","Region",{"$f":"INDEX(Lists!$H:$H,MATCH('PCON Dashboard'!E13,Lists!$I:$I,0))","v":"South East"},{"$f":"INDEX('Apps-Ach-PCON (R)'!$D$545:$CE$556,MATCH($E14,'Apps-Ach-PCON (R)'!$B$545:$B$556,0),MATCH('PCON Dashboard'!F$8&'PCON Dashboard'!$B14&'PCON Dashboard'!$C14,'Apps-Ach-PCON (R)'!$D$3:$CE$3,0))","v":9180},{"$f":"INDEX('Apps-Ach-PCON (R)'!$D$545:$CE$556,MATCH($E14,'Apps-Ach-PCON (R)'!$B$545:$B$556,0),MATCH('PCON Dashboard'!G$8&'PCON Dashboard'!$B14&'PCON Dashboard'!$C14,'Apps-Ach-PCON (R)'!$D$3:$CE$3,0))","v":7970},{"$f":"INDEX('Apps-Ach-PCON (R)'!$D$545:$CE$556,MATCH($E14,'Apps-Ach-PCON (R)'!$B$545:$B$556,0),MATCH('PCON Dashboard'!H$8&'PCON Dashboard'!$B14&'PCON Dashboard'!$C14,'Apps-Ach-PCON (R)'!$D$3:$CE$3,0))","v":8720},{"$f":"INDEX('Apps-Ach-PCON (R)'!$D$545:$CE$556,MATCH($E14,'Apps-Ach-PCON (R)'!$B$545:$B$556,0),MATCH('PCON Dashboard'!I$8&'PCON Dashboard'!$B14&'PCON Dashboard'!$C14,'Apps-Ach-PCON (R)'!$D$3:$CE$3,0))","v":9220},{"$f":"INDEX('Apps-Ach-PCON (R)'!$D$545:$CE$556,MATCH($E14,'Apps-Ach-PCON (R)'!$B$545:$B$556,0),MATCH('PCON Dashboard'!J$8&'PCON Dashboard'!$B14&'PCON Dashboard'!$C14,'Apps-Ach-PCON (R)'!$D$3:$CE$3,0))","v":9580}]
[null,"All","Under 19","National","England",{"$f":"INDEX('Apps-Ach-PCON (R)'!$D$545:$CE$556,MATCH($E15,'Apps-Ach-PCON (R)'!$B$545:$B$556,0),MATCH('PCON Dashboard'!F$8&'PCON Dashboard'!$B15&'PCON Dashboard'!$C15,'Apps-Ach-PCON (R)'!$D$3:$CE$3,0))","v":77200},{"$f":"INDEX('Apps-Ach-PCON (R)'!$D$545:$CE$556,MATCH($E15,'Apps-Ach-PCON (R)'!$B$545:$B$556,0),MATCH('PCON Dashboard'!G$8&'PCON Dashboard'!$B15&'PCON Dashboard'!$C15,'Apps-Ach-PCON (R)'!$D$3:$CE$3,0))","v":60100},{"$f":"INDEX('Apps-Ach-PCON (R)'!$D$545:$CE$556,MATCH($E15,'Apps-Ach-PCON (R)'!$B$545:$B$556,0),MATCH('PCON Dashboard'!H$8&'PCON Dashboard'!$B15&'PCON Dashboard'!$C15,'Apps-Ach-PCON (R)'!$D$3:$CE$3,0))","v":64800},{"$f":"INDEX('Apps-Ach-PCON (R)'!$D$545:$CE$556,MATCH($E15,'Apps-Ach-PCON (R)'!$B$545:$B$556,0),MATCH('PCON Dashboard'!I$8&'PCON Dashboard'!$B15&'PCON Dashboard'!$C15,'Apps-Ach-PCON (R)'!$D$3:$CE$3,0))","v":70400},{"$f":"INDEX('Apps-Ach-PCON (R)'!$D$545:$CE$556,MATCH($E15,'Apps-Ach-PCON (R)'!$B$545:$B$556,0),MATCH('PCON Dashboard'!J$8&'PCON Dashboard'!$B15&'PCON Dashboard'!$C15,'Apps-Ach-PCON (R)'!$D$3:$CE$3,0))","v":72800}]
[null,"All","Under 19","Total","Grand Total",{"$f":"INDEX('Apps-Ach-PCON (R)'!$D$545:$CE$556,MATCH($E16,'Apps-Ach-PCON (R)'!$B$545:$B$556,0),MATCH('PCON Dashboard'!F$8&'PCON Dashboard'!$B16&'PCON Dashboard'!$C16,'Apps-Ach-PCON (R)'!$D$3:$CE$3,0))","v":77900},{"$f":"INDEX('Apps-Ach-PCON (R)'!$D$545:$CE$556,MATCH($E16,'Apps-Ach-PCON (R)'!$B$545:$B$556,0),MATCH('PCON Dashboard'!G$8&'PCON Dashboard'!$B16&'PCON Dashboard'!$C16,'Apps-Ach-PCON (R)'!$D$3:$CE$3,0))","v":60800},{"$f":"INDEX('Apps-Ach-PCON (R)'!$D$545:$CE$556,MATCH($E16,'Apps-Ach-PCON (R)'!$B$545:$B$556,0),MATCH('PCON Dashboard'!H$8&'PCON Dashboard'!$B16&'PCON Dashboard'!$C16,'Apps-Ach-PCON (R)'!$D$3:$CE$3,0))","v":65400},{"$f":"INDEX('Apps-Ach-PCON (R)'!$D$545:$CE$556,MATCH($E16,'Apps-Ach-PCON (R)'!$B$545:$B$556,0),MATCH('PCON Dashboard'!I$8&'PCON Dashboard'!$B16&'PCON Dashboard'!$C16,'Apps-Ach-PCON (R)'!$D$3:$CE$3,0))","v":71100},{"$f":"INDEX('Apps-Ach-PCON (R)'!$D$545:$CE$556,MATCH($E16,'Apps-Ach-PCON (R)'!$B$545:$B$556,0),MATCH('PCON Dashboard'!J$8&'PCON Dashboard'!$B16&'PCON Dashboard'!$C16,'Apps-Ach-PCON (R)'!$D$3:$CE$3,0))","v":73600}]
[null,"All","19-24","PCON",{"$f":"INDEX('Apps-Ach-PCON (R)'!$B:$B,MATCH('PCON Dashboard'!$E$3,'Apps-Ach-PCON (R)'!$A:$A,0))","v":"Aldershot"},{"$f":"INDEX('Apps-Ach-PCON (R)'!$D$7:$CE$539,MATCH('PCON Dashboard'!$E$3,'Apps-Ach-PCON (R)'!$A$7:$A$539,0),MATCH(F$8&$B17&$C17,'Apps-Ach-PCON (R)'!$D$3:$CE$3,0))","v":200},{"$f":"INDEX('Apps-Ach-PCON (R)'!$D$7:$CE$539,MATCH('PCON Dashboard'!$E$3,'Apps-Ach-PCON (R)'!$A$7:$A$539,0),MATCH(G$8&$B17&$C17,'Apps-Ach-PCON (R)'!$D$3:$CE$3,0))","v":160},{"$f":"INDEX('Apps-Ach-PCON (R)'!$D$7:$CE$539,MATCH('PCON Dashboard'!$E$3,'Apps-Ach-PCON (R)'!$A$7:$A$539,0),MATCH(H$8&$B17&$C17,'Apps-Ach-PCON (R)'!$D$3:$CE$3,0))","v":180},{"$f":"INDEX('Apps-Ach-PCON (R)'!$D$7:$CE$539,MATCH('PCON Dashboard'!$E$3,'Apps-Ach-PCON (R)'!$A$7:$A$539,0),MATCH(I$8&$B17&$C17,'Apps-Ach-PCON (R)'!$D$3:$CE$3,0))","v":170},{"$f":"INDEX('Apps-Ach-PCON (R)'!$D$7:$CE$539,MATCH('PCON Dashboard'!$E$3,'Apps-Ach-PCON (R)'!$A$7:$A$539,0),MATCH(J$8&$B17&$C17,'Apps-Ach-PCON (R)'!$D$3:$CE$3,0))","v":150}]
[null,"All","19-24","Region",{"$f":"INDEX(Lists!$H:$H,MATCH('PCON Dashboard'!E17,Lists!$I:$I,0))","v":"South East"},{"$f":"INDEX('Apps-Ach-PCON (R)'!$D$545:$CE$556,MATCH($E18,'Apps-Ach-PCON (R)'!$B$545:$B$556,0),MATCH('PCON Dashboard'!F$8&'PCON Dashboard'!$B18&'PCON Dashboard'!$C18,'Apps-Ach-PCON (R)'!$D$3:$CE$3,0))","v":12540},{"$f":"INDEX('Apps-Ach-PCON (R)'!$D$545:$CE$556,MATCH($E18,'Apps-Ach-PCON (R)'!$B$545:$B$556,0),MATCH('PCON Dashboard'!G$8&'PCON Dashboard'!$B18&'PCON Dashboard'!$C18,'Apps-Ach-PCON (R)'!$D$3:$CE$3,0))","v":11650},{"$f":"INDEX('Apps-Ach-PCON (R)'!$D$545:$CE$556,MATCH($E18,'Apps-Ach-PCON (R)'!$B$545:$B$556,0),MATCH('PCON Dashboard'!H$8&'PCON Dashboard'!$B18&'PCON Dashboard'!$C18,'Apps-Ach-PCON (R)'!$D$3:$CE$3,0))","v":13000},{"$f":"INDEX('Apps-Ach-PCON (R)'!$D$545:$CE$556,MATCH($E18,'Apps-Ach-PCON (R)'!$B$545:$B$556,0),MATCH('PCON Dashboard'!I$8&'PCON Dashboard'!$B18&'PCON Dashboard'!$C18,'Apps-Ach-PCON (R)'!$D$3:$CE$3,0))","v":13640},{"$f":"INDEX('Apps-Ach-PCON (R)'!$D$545:$CE$556,MATCH($E18,'Apps-Ach-PCON (R)'!$B$545:$B$556,0),MATCH('PCON Dashboard'!J$8&'PCON Dashboard'!$B18&'PCON Dashboard'!$C18,'Apps-Ach-PCON (R)'!$D$3:$CE$3,0))","v":12760}]
[null,"All","19-24","National","England",{"$f":"INDEX('Apps-Ach-PCON (R)'!$D$545:$CE$556,MATCH($E19,'Apps-Ach-PCON (R)'!$B$545:$B$556,0),MATCH('PCON Dashboard'!F$8&'PCON Dashboard'!$B19&'PCON Dashboard'!$C19,'Apps-Ach-PCON (R)'!$D$3:$CE$3,0))","v":84700},{"$f":"INDEX('Apps-Ach-PCON (R)'!$D$545:$CE$556,MATCH($E19,'Apps-Ach-PCON (R)'!$B$545:$B$556,0),MATCH('PCON Dashboard'!G$8&'PCON Dashboard'!$B19&'PCON Dashboard'!$C19,'Apps-Ach-PCON (R)'!$D$3:$CE$3,0))","v":78500},{"$f":"INDEX('Apps-Ach-PCON (R)'!$D$545:$CE$556,MATCH($E19,'Apps-Ach-PCON (R)'!$B$545:$B$556,0),MATCH('PCON Dashboard'!H$8&'PCON Dashboard'!$B19&'PCON Dashboard'!$C19,'Apps-Ach-PCON (R)'!$D$3:$CE$3,0))","v":86200},{"$f":"INDEX('Apps-Ach-PCON (R)'!$D$545:$CE$556,MATCH($E19,'Apps-Ach-PCON (R)'!$B$545:$B$556,0),MATCH('PCON Dashboard'!I$8&'PCON Dashboard'!$B19&'PCON Dashboard'!$C19,'Apps-Ach-PCON (R)'!$D$3:$CE$3,0))","v":90500},{"$f":"INDEX('Apps-Ach-PCON (R)'!$D$545:$CE$556,MATCH($E19,'Apps-Ach-PCON (R)'!$B$545:$B$556,0),MATCH('PCON Dashboard'!J$8&'PCON Dashboard'!$B19&'PCON Dashboard'!$C19,'Apps-Ach-PCON (R)'!$D$3:$CE$3,0))","v":89300}]
[null,"All","19-24","Total","Grand Total",{"$f":"INDEX('Apps-Ach-PCON (R)'!$D$545:$CE$556,MATCH($E20,'Apps-Ach-PCON (R)'!$B$545:$B$556,0),MATCH('PCON Dashboard'!F$8&'PCON Dashboard'!$B20&'PCON Dashboard'!$C20,'Apps-Ach-PCON (R)'!$D$3:$CE$3,0))","v":85600},{"$f":"INDEX('Apps-Ach-PCON (R)'!$D$545:$CE$556,MATCH($E20,'Apps-Ach-PCON (R)'!$B$545:$B$556,0),MATCH('PCON Dashboard'!G$8&'PCON Dashboard'!$B20&'PCON Dashboard'!$C20,'Apps-Ach-PCON (R)'!$D$3:$CE$3,0))","v":79300},{"$f":"INDEX('Apps-Ach-PCON (R)'!$D$545:$CE$556,MATCH($E20,'Apps-Ach-PCON (R)'!$B$545:$B$556,0),MATCH('PCON Dashboard'!H$8&'PCON Dashboard'!$B20&'PCON Dashboard'!$C20,'Apps-Ach-PCON (R)'!$D$3:$CE$3,0))","v":86900},{"$f":"INDEX('Apps-Ach-PCON (R)'!$D$545:$CE$556,MATCH($E20,'Apps-Ach-PCON (R)'!$B$545:$B$556,0),MATCH('PCON Dashboard'!I$8&'PCON Dashboard'!$B20&'PCON Dashboard'!$C20,'Apps-Ach-PCON (R)'!$D$3:$CE$3,0))","v":91300},{"$f":"INDEX('Apps-Ach-PCON (R)'!$D$545:$CE$556,MATCH($E20,'Apps-Ach-PCON (R)'!$B$545:$B$556,0),MATCH('PCON Dashboard'!J$8&'PCON Dashboard'!$B20&'PCON Dashboard'!$C20,'Apps-Ach-PCON (R)'!$D$3:$CE$3,0))","v":90100}]
[null,"All","25+","PCON",{"$f":"INDEX('Apps-Ach-PCON (R)'!$B:$B,MATCH('PCON Dashboard'!$E$3,'Apps-Ach-PCON (R)'!$A:$A,0))","v":"Aldershot"},{"$f":"INDEX('Apps-Ach-PCON (R)'!$D$7:$CE$539,MATCH('PCON Dashboard'!$E$3,'Apps-Ach-PCON (R)'!$A$7:$A$539,0),MATCH(F$8&$B21&$C21,'Apps-Ach-PCON (R)'!$D$3:$CE$3,0))","v":170},{"$f":"INDEX('Apps-Ach-PCON (R)'!$D$7:$CE$539,MATCH('PCON Dashboard'!$E$3,'Apps-Ach-PCON (R)'!$A$7:$A$539,0),MATCH(G$8&$B21&$C21,'Apps-Ach-PCON (R)'!$D$3:$CE$3,0))","v":240},{"$f":"INDEX('Apps-Ach-PCON (R)'!$D$7:$CE$539,MATCH('PCON Dashboard'!$E$3,'Apps-Ach-PCON (R)'!$A$7:$A$539,0),MATCH(H$8&$B21&$C21,'Apps-Ach-PCON (R)'!$D$3:$CE$3,0))","v":210},{"$f":"INDEX('Apps-Ach-PCON (R)'!$D$7:$CE$539,MATCH('PCON Dashboard'!$E$3,'Apps-Ach-PCON (R)'!$A$7:$A$539,0),MATCH(I$8&$B21&$C21,'Apps-Ach-PCON (R)'!$D$3:$CE$3,0))","v":210},{"$f":"INDEX('Apps-Ach-PCON (R)'!$D$7:$CE$539,MATCH('PCON Dashboard'!$E$3,'Apps-Ach-PCON (R)'!$A$7:$A$539,0),MATCH(J$8&$B21&$C21,'Apps-Ach-PCON (R)'!$D$3:$CE$3,0))","v":190}]
[null,"All","25+","Region",{"$f":"INDEX(Lists!$H:$H,MATCH('PCON Dashboard'!E21,Lists!$I:$I,0))","v":"South East"},{"$f":"INDEX('Apps-Ach-PCON (R)'!$D$545:$CE$556,MATCH($E22,'Apps-Ach-PCON (R)'!$B$545:$B$556,0),MATCH('PCON Dashboard'!F$8&'PCON Dashboard'!$B22&'PCON Dashboard'!$C22,'Apps-Ach-PCON (R)'!$D$3:$CE$3,0))","v":12040},{"$f":"INDEX('Apps-Ach-PCON (R)'!$D$545:$CE$556,MATCH($E22,'Apps-Ach-PCON (R)'!$B$545:$B$556,0),MATCH('PCON Dashboard'!G$8&'PCON Dashboard'!$B22&'PCON Dashboard'!$C22,'Apps-Ach-PCON (R)'!$D$3:$CE$3,0))","v":14060},{"$f":"INDEX('Apps-Ach-PCON (R)'!$D$545:$CE$556,MATCH($E22,'Apps-Ach-PCON (R)'!$B$545:$B$556,0),MATCH('PCON Dashboard'!H$8&'PCON Dashboard'!$B22&'PCON Dashboard'!$C22,'Apps-Ach-PCON (R)'!$D$3:$CE$3,0))","v":13050},{"$f":"INDEX('Apps-Ach-PCON (R)'!$D$545:$CE$556,MATCH($E22,'Apps-Ach-PCON (R)'!$B$545:$B$556,0),MATCH('PCON Dashboard'!I$8&'PCON Dashboard'!$B22&'PCON Dashboard'!$C22,'Apps-Ach-PCON (R)'!$D$3:$CE$3,0))","v":12620},{"$f":"INDEX('Apps-Ach-PCON (R)'!$D$545:$CE$556,MATCH($E22,'Apps-Ach-PCON (R)'!$B$545:$B$556,0),MATCH('PCON Dashboard'!J$8&'PCON Dashboard'!$B22&'PCON Dashboard'!$C22,'Apps-Ach-PCON (R)'!$D$3:$CE$3,0))","v":14020}]
[null,"All","25+","National","England",{"$f":"INDEX('Apps-Ach-PCON (R)'!$D$545:$CE$556,MATCH($E23,'Apps-Ach-PCON (R)'!$B$545:$B$556,0),MATCH('PCON Dashboard'!F$8&'PCON Dashboard'!$B23&'PCON Dashboard'!$C23,'Apps-Ach-PCON (R)'!$D$3:$CE$3,0))","v":93800},{"$f":"INDEX('Apps-Ach-PCON (R)'!$D$545:$CE$556,MATCH($E23,'Apps-Ach-PCON (R)'!$B$545:$B$556,0),MATCH('PCON Dashboard'!G$8&'PCON Dashboard'!$B23&'PCON Dashboard'!$C23,'Apps-Ach-PCON (R)'!$D$3:$CE$3,0))","v":111500},{"$f":"INDEX('Apps-Ach-PCON (R)'!$D$545:$CE$556,MATCH($E23,'Apps-Ach-PCON (R)'!$B$545:$B$556,0),MATCH('PCON Dashboard'!H$8&'PCON Dashboard'!$B23&'PCON Dashboard'!$C23,'Apps-Ach-PCON (R)'!$D$3:$CE$3,0))","v":102600},{"$f":"INDEX('Apps-Ach-PCON (R)'!$D$545:$CE$556,MATCH($E23,'Apps-Ach-PCON (R)'!$B$545:$B$556,0),MATCH('PCON Dashboard'!I$8&'PCON Dashboard'!$B23&'PCON Dashboard'!$C23,'Apps-Ach-PCON (R)'!$D$3:$CE$3,0))","v":97500},{"$f":"INDEX('Apps-Ach-PCON (R)'!$D$545:$CE$556,MATCH($E23,'Apps-Ach-PCON (R)'!$B$545:$B$556,0),MATCH('PCON Dashboard'!J$8&'PCON Dashboard'!$B23&'PCON Dashboard'!$C23,'Apps-Ach-PCON (R)'!$D$3:$CE$3,0))","v":107000}]
[null,"All","25+","Total","Grand Total",{"$f":"INDEX('Apps-Ach-PCON (R)'!$D$545:$CE$556,MATCH($E24,'Apps-Ach-PCON (R)'!$B$545:$B$556,0),MATCH('PCON Dashboard'!F$8&'PCON Dashboard'!$B24&'PCON Dashboard'!$C24,'Apps-Ach-PCON (R)'!$D$3:$CE$3,0))","v":94900},{"$f":"INDEX('Apps-Ach-PCON (R)'!$D$545:$CE$556,MATCH($E24,'Apps-Ach-PCON (R)'!$B$545:$B$556,0),MATCH('PCON Dashboard'!G$8&'PCON Dashboard'!$B24&'PCON Dashboard'!$C24,'Apps-Ach-PCON (R)'!$D$3:$CE$3,0))","v":112800},{"$f":"INDEX('Apps-Ach-PCON (R)'!$D$545:$CE$556,MATCH($E24,'Apps-Ach-PCON (R)'!$B$545:$B$556,0),MATCH('PCON Dashboard'!H$8&'PCON Dashboard'!$B24&'PCON Dashboard'!$C24,'Apps-Ach-PCON (R)'!$D$3:$CE$3,0))","v":103500},{"$f":"INDEX('Apps-Ach-PCON (R)'!$D$545:$CE$556,MATCH($E24,'Apps-Ach-PCON (R)'!$B$545:$B$556,0),MATCH('PCON Dashboard'!I$8&'PCON Dashboard'!$B24&'PCON Dashboard'!$C24,'Apps-Ach-PCON (R)'!$D$3:$CE$3,0))","v":98500},{"$f":"INDEX('Apps-Ach-PCON (R)'!$D$545:$CE$556,MATCH($E24,'Apps-Ach-PCON (R)'!$B$545:$B$556,0),MATCH('PCON Dashboard'!J$8&'PCON Dashboard'!$B24&'PCON Dashboard'!$C24,'Apps-Ach-PCON (R)'!$D$3:$CE$3,0))","v":108000}]
[null,"Intermediate","All","PCON",{"$f":"INDEX('Apps-Ach-PCON (R)'!$B:$B,MATCH('PCON Dashboard'!$E$3,'Apps-Ach-PCON (R)'!$A:$A,0))","v":"Aldershot"},{"$f":"INDEX('Apps-Ach-PCON (R)'!$D$7:$CE$539,MATCH('PCON Dashboard'!$E$3,'Apps-Ach-PCON (R)'!$A$7:$A$539,0),MATCH(F$8&$B25&$C25,'Apps-Ach-PCON (R)'!$D$3:$CE$3,0))","v":350},{"$f":"INDEX('Apps-Ach-PCON (R)'!$D$7:$CE$539,MATCH('PCON Dashboard'!$E$3,'Apps-Ach-PCON (R)'!$A$7:$A$539,0),MATCH(G$8&$B25&$C25,'Apps-Ach-PCON (R)'!$D$3:$CE$3,0))","v":410},{"$f":"INDEX('Apps-Ach-PCON (R)'!$D$7:$CE$539,MATCH('PCON Dashboard'!$E$3,'Apps-Ach-PCON (R)'!$A$7:$A$539,0),MATCH(H$8&$B25&$C25,'Apps-Ach-PCON (R)'!$D$3:$CE$3,0))","v":320},{"$f":"INDEX('Apps-Ach-PCON (R)'!$D$7:$CE$539,MATCH('PCON Dashboard'!$E$3,'Apps-Ach-PCON (R)'!$A$7:$A$539,0),MATCH(I$8&$B25&$C25,'Apps-Ach-PCON (R)'!$D$3:$CE$3,0))","v":330},{"$f":"INDEX('Apps-Ach-PCON (R)'!$D$7:$CE$539,MATCH('PCON Dashboard'!$E$3,'Apps-Ach-PCON (R)'!$A$7:$A$539,0),MATCH(J$8&$B25&$C25,'Apps-Ach-PCON (R)'!$D$3:$CE$3,0))","v":280}]
[null,"Intermediate","All","Region",{"$f":"INDEX(Lists!$H:$H,MATCH('PCON Dashboard'!E25,Lists!$I:$I,0))","v":"South East"},{"$f":"INDEX('Apps-Ach-PCON (R)'!$D$545:$CE$556,MATCH($E26,'Apps-Ach-PCON (R)'!$B$545:$B$556,0),MATCH('PCON Dashboard'!F$8&'PCON Dashboard'!$B26&'PCON Dashboard'!$C26,'Apps-Ach-PCON (R)'!$D$3:$CE$3,0))","v":22570},{"$f":"INDEX('Apps-Ach-PCON (R)'!$D$545:$CE$556,MATCH($E26,'Apps-Ach-PCON (R)'!$B$545:$B$556,0),MATCH('PCON Dashboard'!G$8&'PCON Dashboard'!$B26&'PCON Dashboard'!$C26,'Apps-Ach-PCON (R)'!$D$3:$CE$3,0))","v":20130},{"$f":"INDEX('Apps-Ach-PCON (R)'!$D$545:$CE$556,MATCH($E26,'Apps-Ach-PCON (R)'!$B$545:$B$556,0),MATCH('PCON Dashboard'!H$8&'PCON Dashboard'!$B26&'PCON Dashboard'!$C26,'Apps-Ach-PCON (R)'!$D$3:$CE$3,0))","v":19910},{"$f":"INDEX('Apps-Ach-PCON (R)'!$D$545:$CE$556,MATCH($E26,'Apps-Ach-PCON (R)'!$B$545:$B$556,0),MATCH('PCON Dashboard'!I$8&'PCON Dashboard'!$B26&'PCON Dashboard'!$C26,'Apps-Ach-PCON (R)'!$D$3:$CE$3,0))","v":21150},{"$f":"INDEX('Apps-Ach-PCON (R)'!$D$545:$CE$556,MATCH($E26,'Apps-Ach-PCON (R)'!$B$545:$B$556,0),MATCH('PCON Dashboard'!J$8&'PCON Dashboard'!$B26&'PCON Dashboard'!$C26,'Apps-Ach-PCON (R)'!$D$3:$CE$3,0))","v":21230}]
[null,"Intermediate","All","National","England",{"$f":"INDEX('Apps-Ach-PCON (R)'!$D$545:$CE$556,MATCH($E27,'Apps-Ach-PCON (R)'!$B$545:$B$556,0),MATCH('PCON Dashboard'!F$8&'PCON Dashboard'!$B27&'PCON Dashboard'!$C27,'Apps-Ach-PCON (R)'!$D$3:$CE$3,0))","v":170500},{"$f":"INDEX('Apps-Ach-PCON (R)'!$D$545:$CE$556,MATCH($E27,'Apps-Ach-PCON (R)'!$B$545:$B$556,0),MATCH('PCON Dashboard'!G$8&'PCON Dashboard'!$B27&'PCON Dashboard'!$C27,'Apps-Ach-PCON (R)'!$D$3:$CE$3,0))","v":154500},{"$f":"INDEX('Apps-Ach-PCON (R)'!$D$545:$CE$556,MATCH($E27,'Apps-Ach-PCON (R)'!$B$545:$B$556,0),MATCH('PCON Dashboard'!H$8&'PCON Dashboard'!$B27&'PCON Dashboard'!$C27,'Apps-Ach-PCON (R)'!$D$3:$CE$3,0))","v":149600},{"$f":"INDEX('Apps-Ach-PCON (R)'!$D$545:$CE$556,MATCH($E27,'Apps-Ach-PCON (R)'!$B$545:$B$556,0),MATCH('PCON Dashboard'!I$8&'PCON Dashboard'!$B27&'PCON Dashboard'!$C27,'Apps-Ach-PCON (R)'!$D$3:$CE$3,0))","v":158800},{"$f":"INDEX('Apps-Ach-PCON (R)'!$D$545:$CE$556,MATCH($E27,'Apps-Ach-PCON (R)'!$B$545:$B$556,0),MATCH('PCON Dashboard'!J$8&'PCON Dashboard'!$B27&'PCON Dashboard'!$C27,'Apps-Ach-PCON (R)'!$D$3:$CE$3,0))","v":162500}]
[null,"Intermediate","All","Total","Grand Total",{"$f":"INDEX('Apps-Ach-PCON (R)'!$D$545:$CE$556,MATCH($E28,'Apps-Ach-PCON (R)'!$B$545:$B$556,0),MATCH('PCON Dashboard'!F$8&'PCON Dashboard'!$B28&'PCON Dashboard'!$C28,'Apps-Ach-PCON (R)'!$D$3:$CE$3,0))","v":172400},{"$f":"INDEX('Apps-Ach-PCON (R)'!$D$545:$CE$556,MATCH($E28,'Apps-Ach-PCON (R)'!$B$545:$B$556,0),MATCH('PCON Dashboard'!G$8&'PCON Dashboard'!$B28&'PCON Dashboard'!$C28,'Apps-Ach-PCON (R)'!$D$3:$CE$3,0))","v":156300},{"$f":"INDEX('Apps-Ach-PCON (R)'!$D$545:$CE$556,MATCH($E28,'Apps-Ach-PCON (R)'!$B$545:$B$556,0),MATCH('PCON Dashboard'!H$8&'PCON Dashboard'!$B28&'PCON Dashboard'!$C28,'Apps-Ach-PCON (R)'!$D$3:$CE$3,0))","v":150900},{"$f":"INDEX('Apps-Ach-PCON (R)'!$D$545:$CE$556,MATCH($E28,'Apps-Ach-PCON (R)'!$B$545:$B$556,0),MATCH('PCON Dashboard'!I$8&'PCON Dashboard'!$B28&'PCON Dashboard'!$C28,'Apps-Ach-PCON (R)'!$D$3:$CE$3,0))","v":160300},{"$f":"INDEX('Apps-Ach-PCON (R)'!$D$545:$CE$556,MATCH($E28,'Apps-Ach-PCON (R)'!$B$545:$B$556,0),MATCH('PCON Dashboard'!J$8&'PCON Dashboard'!$B28&'PCON Dashboard'!$C28,'Apps-Ach-PCON (R)'!$D$3:$CE$3,0))","v":163800}]
[null,"Intermediate","Under 19","PCON",{"$f":"INDEX('Apps-Ach-PCON (R)'!$B:$B,MATCH('PCON Dashboard'!$E$3,'Apps-Ach-PCON (R)'!$A:$A,0))","v":"Aldershot"},{"$f":"INDEX('Apps-Ach-PCON (R)'!$D$7:$CE$539,MATCH('PCON Dashboard'!$E$3,'Apps-Ach-PCON (R)'!$A$7:$A$539,0),MATCH(F$8&$B29&$C29,'Apps-Ach-PCON (R)'!$D$3:$CE$3,0))","v":100},{"$f":"INDEX('Apps-Ach-PCON (R)'!$D$7:$CE$539,MATCH('PCON Dashboard'!$E$3,'Apps-Ach-PCON (R)'!$A$7:$A$539,0),MATCH(G$8&$B29&$C29,'Apps-Ach-PCON (R)'!$D$3:$CE$3,0))","v":150},{"$f":"INDEX('Apps-Ach-PCON (R)'!$D$7:$CE$539,MATCH('PCON Dashboard'!$E$3,'Apps-Ach-PCON (R)'!$A$7:$A$539,0),MATCH(H$8&$B29&$C29,'Apps-Ach-PCON (R)'!$D$3:$CE$3,0))","v":90},{"$f":"INDEX('Apps-Ach-PCON (R)'!$D$7:$CE$539,MATCH('PCON Dashboard'!$E$3,'Apps-Ach-PCON (R)'!$A$7:$A$539,0),MATCH(I$8&$B29&$C29,'Apps-Ach-PCON (R)'!$D$3:$CE$3,0))","v":60},{"$f":"INDEX('Apps-Ach-PCON (R)'!$D$7:$CE$539,MATCH('PCON Dashboard'!$E$3,'Apps-Ach-PCON (R)'!$A$7:$A$539,0),MATCH(J$8&$B29&$C29,'Apps-Ach-PCON (R)'!$D$3:$CE$3,0))","v":80}]
[null,"Intermediate","Under 19","Region",{"$f":"INDEX(Lists!$H:$H,MATCH('PCON Dashboard'!E29,Lists!$I:$I,0))","v":"South East"},{"$f":"INDEX('Apps-Ach-PCON (R)'!$D$545:$CE$556,MATCH($E30,'Apps-Ach-PCON (R)'!$B$545:$B$556,0),MATCH('PCON Dashboard'!F$8&'PCON Dashboard'!$B30&'PCON Dashboard'!$C30,'Apps-Ach-PCON (R)'!$D$3:$CE$3,0))","v":6660},{"$f":"INDEX('Apps-Ach-PCON (R)'!$D$545:$CE$556,MATCH($E30,'Apps-Ach-PCON (R)'!$B$545:$B$556,0),MATCH('PCON Dashboard'!G$8&'PCON Dashboard'!$B30&'PCON Dashboard'!$C30,'Apps-Ach-PCON (R)'!$D$3:$CE$3,0))","v":5450},{"$f":"INDEX('Apps-Ach-PCON (R)'!$D$545:$CE$556,MATCH($E30,'Apps-Ach-PCON (R)'!$B$545:$B$556,0),MATCH('PCON Dashboard'!H$8&'PCON Dashboard'!$B30&'PCON Dashboard'!$C30,'Apps-Ach-PCON (R)'!$D$3:$CE$3,0))","v":5850},{"$f":"INDEX('Apps-Ach-PCON (R)'!$D$545:$CE$556,MATCH($E30,'Apps-Ach-PCON (R)'!$B$545:$B$556,0),MATCH('PCON Dashboard'!I$8&'PCON Dashboard'!$B30&'PCON Dashboard'!$C30,'Apps-Ach-PCON (R)'!$D$3:$CE$3,0))","v":6170},{"$f":"INDEX('Apps-Ach-PCON (R)'!$D$545:$CE$556,MATCH($E30,'Apps-Ach-PCON (R)'!$B$545:$B$556,0),MATCH('PCON Dashboard'!J$8&'PCON Dashboard'!$B30&'PCON Dashboard'!$C30,'Apps-Ach-PCON (R)'!$D$3:$CE$3,0))","v":6240}]
[null,"Intermediate","Under 19","National","England",{"$f":"INDEX('Apps-Ach-PCON (R)'!$D$545:$CE$556,MATCH($E31,'Apps-Ach-PCON (R)'!$B$545:$B$556,0),MATCH('PCON Dashboard'!F$8&'PCON Dashboard'!$B31&'PCON Dashboard'!$C31,'Apps-Ach-PCON (R)'!$D$3:$CE$3,0))","v":56100},{"$f":"INDEX('Apps-Ach-PCON (R)'!$D$545:$CE$556,MATCH($E31,'Apps-Ach-PCON (R)'!$B$545:$B$556,0),MATCH('PCON Dashboard'!G$8&'PCON Dashboard'!$B31&'PCON Dashboard'!$C31,'Apps-Ach-PCON (R)'!$D$3:$CE$3,0))","v":41700},{"$f":"INDEX('Apps-Ach-PCON (R)'!$D$545:$CE$556,MATCH($E31,'Apps-Ach-PCON (R)'!$B$545:$B$556,0),MATCH('PCON Dashboard'!H$8&'PCON Dashboard'!$B31&'PCON Dashboard'!$C31,'Apps-Ach-PCON (R)'!$D$3:$CE$3,0))","v":44900},{"$f":"INDEX('Apps-Ach-PCON (R)'!$D$545:$CE$556,MATCH($E31,'Apps-Ach-PCON (R)'!$B$545:$B$556,0),MATCH('PCON Dashboard'!I$8&'PCON Dashboard'!$B31&'PCON Dashboard'!$C31,'Apps-Ach-PCON (R)'!$D$3:$CE$3,0))","v":47800},{"$f":"INDEX('Apps-Ach-PCON (R)'!$D$545:$CE$556,MATCH($E31,'Apps-Ach-PCON (R)'!$B$545:$B$556,0),MATCH('PCON Dashboard'!J$8&'PCON Dashboard'!$B31&'PCON Dashboard'!$C31,'Apps-Ach-PCON (R)'!$D$3:$CE$3,0))","v":48700}]
[null,"Intermediate","Under 19","Total","Grand Total",{"$f":"INDEX('Apps-Ach-PCON (R)'!$D$545:$CE$556,MATCH($E32,'Apps-Ach-PCON (R)'!$B$545:$B$556,0),MATCH('PCON Dashboard'!F$8&'PCON Dashboard'!$B32&'PCON Dashboard'!$C32,'Apps-Ach-PCON (R)'!$D$3:$CE$3,0))","v":56500},{"$f":"INDEX('Apps-Ach-PCON (R)'!$D$545:$CE$556,MATCH($E32,'Apps-Ach-PCON (R)'!$B$545:$B$556,0),MATCH('PCON Dashboard'!G$8&'PCON Dashboard'!$B32&'PCON Dashboard'!$C32,'Apps-Ach-PCON (R)'!$D$3:$CE$3,0))","v":42100},{"$f":"INDEX('Apps-Ach-PCON (R)'!$D$545:$CE$556,MATCH($E32,'Apps-Ach-PCON (R)'!$B$545:$B$556,0),MATCH('PCON Dashboard'!H$8&'PCON Dashboard'!$B32&'PCON Dashboard'!$C32,'Apps-Ach-PCON (R)'!$D$3:$CE$3,0))","v":45200},{"$f":"INDEX('Apps-Ach-PCON (R)'!$D$545:$CE$556,MATCH($E32,'Apps-Ach-PCON (R)'!$B$545:$B$556,0),MATCH('PCON Dashboard'!I$8&'PCON Dashboard'!$B32&'PCON Dashboard'!$C32,'Apps-Ach-PCON (R)'!$D$3:$CE$3,0))","v":48200},{"$f":"INDEX('Apps-Ach-PCON (R)'!$D$545:$CE$556,MATCH($E32,'Apps-Ach-PCON (R)'!$B$545:$B$556,0),MATCH('PCON Dashboard'!J$8&'PCON Dashboard'!$B32&'PCON Dashboard'!$C32,'Apps-Ach-PCON (R)'!$D$3:$CE$3,0))","v":49100}]
[null,"Intermediate","19-24","PCON",{"$f":"INDEX('Apps-Ach-PCON (R)'!$B:$B,MATCH('PCON Dashboard'!$E$3,'Apps-Ach-PCON (R)'!$A:$A,0))","v":"Aldershot"},{"$f":"INDEX('Apps-Ach-PCON (R)'!$D$7:$CE$539,MATCH('PCON Dashboard'!$E$3,'Apps-Ach-PCON (R)'!$A$7:$A$539,0),MATCH(F$8&$B33&$C33,'Apps-Ach-PCON (R)'!$D$3:$CE$3,0))","v":140},{"$f":"INDEX('Apps-Ach-PCON (R)'!$D$7:$CE$539,MATCH('PCON Dashboard'!$E$3,'Apps-Ach-PCON (R)'!$A$7:$A$539,0),MATCH(G$8&$B33&$C33,'Apps-Ach-PCON (R)'!$D$3:$CE$3,0))","v":100},{"$f":"INDEX('Apps-Ach-PCON (R)'!$D$7:$CE$539,MATCH('PCON Dashboard'!$E$3,'Apps-Ach-PCON (R)'!$A$7:$A$539,0),MATCH(H$8&$B33&$C33,'Apps-Ach-PCON (R)'!$D$3:$CE$3,0))","v":110},{"$f":"INDEX('Apps-Ach-PCON (R)'!$D$7:$CE$539,MATCH('PCON Dashboard'!$E$3,'Apps-Ach-PCON (R)'!$A$7:$A$539,0),MATCH(I$8&$B33&$C33,'Apps-Ach-PCON (R)'!$D$3:$CE$3,0))","v":100},{"$f":"INDEX('Apps-Ach-PCON (R)'!$D$7:$CE$539,MATCH('PCON Dashboard'!$E$3,'Apps-Ach-PCON (R)'!$A$7:$A$539,0),MATCH(J$8&$B33&$C33,'Apps-Ach-PCON (R)'!$D$3:$CE$3,0))","v":90}]
[null,"Intermediate","19-24","Region",{"$f":"INDEX(Lists!$H:$H,MATCH('PCON Dashboard'!E33,Lists!$I:$I,0))","v":"South East"},{"$f":"INDEX('Apps-Ach-PCON (R)'!$D$545:$CE$556,MATCH($E34,'Apps-Ach-PCON (R)'!$B$545:$B$556,0),MATCH('PCON Dashboard'!F$8&'PCON Dashboard'!$B34&'PCON Dashboard'!$C34,'Apps-Ach-PCON (R)'!$D$3:$CE$3,0))","v":8120},{"$f":"INDEX('Apps-Ach-PCON (R)'!$D$545:$CE$556,MATCH($E34,'Apps-Ach-PCON (R)'!$B$545:$B$556,0),MATCH('PCON Dashboard'!G$8&'PCON Dashboard'!$B34&'PCON Dashboard'!$C34,'Apps-Ach-PCON (R)'!$D$3:$CE$3,0))","v":6870},{"$f":"INDEX('Apps-Ach-PCON (R)'!$D$545:$CE$556,MATCH($E34,'Apps-Ach-PCON (R)'!$B$545:$B$556,0),MATCH('PCON Dashboard'!H$8&'PCON Dashboard'!$B34&'PCON Dashboard'!$C34,'Apps-Ach-PCON (R)'!$D$3:$CE$3,0))","v":7390},{"$f":"INDEX('Apps-Ach-PCON (R)'!$D$545:$CE$556,MATCH($E34,'Apps-Ach-PCON (R)'!$B$545:$B$556,0),MATCH('PCON Dashboard'!I$8&'PCON Dashboard'!$B34&'PCON Dashboard'!$C34,'Apps-Ach-PCON (R)'!$D$3:$CE$3,0))","v":7680},{"$f":"INDEX('Apps-Ach-PCON (R)'!$D$545:$CE$556,MATCH($E34,'Apps-Ach-PCON (R)'!$B$545:$B$556,0),MATCH('PCON Dashboard'!J$8&'PCON Dashboard'!$B34&'PCON Dashboard'!$C34,'Apps-Ach-PCON (R)'!$D$3:$CE$3,0))","v":7130}]
[null,"Intermediate","19-24","National","England",{"$f":"INDEX('Apps-Ach-PCON (R)'!$D$545:$CE$556,MATCH($E35,'Apps-Ach-PCON (R)'!$B$545:$B$556,0),MATCH('PCON Dashboard'!F$8&'PCON Dashboard'!$B35&'PCON Dashboard'!$C35,'Apps-Ach-PCON (R)'!$D$3:$CE$3,0))","v":53500},{"$f":"INDEX('Apps-Ach-PCON (R)'!$D$545:$CE$556,MATCH($E35,'Apps-Ach-PCON (R)'!$B$545:$B$556,0),MATCH('PCON Dashboard'!G$8&'PCON Dashboard'!$B35&'PCON Dashboard'!$C35,'Apps-Ach-PCON (R)'!$D$3:$CE$3,0))","v":47200},{"$f":"INDEX('Apps-Ach-PCON (R)'!$D$545:$CE$556,MATCH($E35,'Apps-Ach-PCON (R)'!$B$545:$B$556,0),MATCH('PCON Dashboard'!H$8&'PCON Dashboard'!$B35&'PCON Dashboard'!$C35,'Apps-Ach-PCON (R)'!$D$3:$CE$3,0))","v":50300},{"$f":"INDEX('Apps-Ach-PCON (R)'!$D$545:$CE$556,MATCH($E35,'Apps-Ach-PCON (R)'!$B$545:$B$556,0),MATCH('PCON Dashboard'!I$8&'PCON Dashboard'!$B35&'PCON Dashboard'!$C35,'Apps-Ach-PCON (R)'!$D$3:$CE$3,0))","v":52600},{"$f":"INDEX('Apps-Ach-PCON (R)'!$D$545:$CE$556,MATCH($E35,'Apps-Ach-PCON (R)'!$B$545:$B$556,0),MATCH('PCON Dashboard'!J$8&'PCON Dashboard'!$B35&'PCON Dashboard'!$C35,'Apps-Ach-PCON (R)'!$D$3:$CE$3,0))","v":51300}]
[null,"Intermediate","19-24","Total","Grand Total",{"$f":"INDEX('Apps-Ach-PCON (R)'!$D$545:$CE$556,MATCH($E36,'Apps-Ach-PCON (R)'!$B$545:$B$556,0),MATCH('PCON Dashboard'!F$8&'PCON Dashboard'!$B36&'PCON Dashboard'!$C36,'Apps-Ach-PCON (R)'!$D$3:$CE$3,0))","v":54100},{"$f":"INDEX('Apps-Ach-PCON (R)'!$D$545:$CE$556,MATCH($E36,'Apps-Ach-PCON (R)'!$B$545:$B$556,0),MATCH('PCON Dashboard'!G$8&'PCON Dashboard'!$B36&'PCON Dashboard'!$C36,'Apps-Ach-PCON (R)'!$D$3:$CE$3,0))","v":47700},{"$f":"INDEX('Apps-Ach-PCON (R)'!$D$545:$CE$556,MATCH($E36,'Apps-Ach-PCON (R)'!$B$545:$B$556,0),MATCH('PCON Dashboard'!H$8&'PCON Dashboard'!$B36&'PCON Dashboard'!$C36,'Apps-Ach-PCON (R)'!$D$3:$CE$3,0))","v":50800},{"$f":"INDEX('Apps-Ach-PCON (R)'!$D$545:$CE$556,MATCH($E36,'Apps-Ach-PCON (R)'!$B$545:$B$556,0),MATCH('PCON Dashboard'!I$8&'PCON Dashboard'!$B36&'PCON Dashboard'!$C36,'Apps-Ach-PCON (R)'!$D$3:$CE$3,0))","v":53100},{"$f":"INDEX('Apps-Ach-PCON (R)'!$D$545:$CE$556,MATCH($E36,'Apps-Ach-PCON (R)'!$B$545:$B$556,0),MATCH('PCON Dashboard'!J$8&'PCON Dashboard'!$B36&'PCON Dashboard'!$C36,'Apps-Ach-PCON (R)'!$D$3:$CE$3,0))","v":51700}]
[null,"Intermediate","25+","PCON",{"$f":"INDEX('Apps-Ach-PCON (R)'!$B:$B,MATCH('PCON Dashboard'!$E$3,'Apps-Ach-PCON (R)'!$A:$A,0))","v":"Aldershot"},{"$f":"INDEX('Apps-Ach-PCON (R)'!$D$7:$CE$539,MATCH('PCON Dashboard'!$E$3,'Apps-Ach-PCON (R)'!$A$7:$A$539,0),MATCH(F$8&$B37&$C37,'Apps-Ach-PCON (R)'!$D$3:$CE$3,0))","v":120},{"$f":"INDEX('Apps-Ach-PCON (R)'!$D$7:$CE$539,MATCH('PCON Dashboard'!$E$3,'Apps-Ach-PCON (R)'!$A$7:$A$539,0),MATCH(G$8&$B37&$C37,'Apps-Ach-PCON (R)'!$D$3:$CE$3,0))","v":160},{"$f":"INDEX('Apps-Ach-PCON (R)'!$D$7:$CE$539,MATCH('PCON Dashboard'!$E$3,'Apps-Ach-PCON (R)'!$A$7:$A$539,0),MATCH(H$8&$B37&$C37,'Apps-Ach-PCON (R)'!$D$3:$CE$3,0))","v":130},{"$f":"INDEX('Apps-Ach-PCON (R)'!$D$7:$CE$539,MATCH('PCON Dashboard'!$E$3,'Apps-Ach-PCON (R)'!$A$7:$A$539,0),MATCH(I$8&$B37&$C37,'Apps-Ach-PCON (R)'!$D$3:$CE$3,0))","v":160},{"$f":"INDEX('Apps-Ach-PCON (R)'!$D$7:$CE$539,MATCH('PCON Dashboard'!$E$3,'Apps-Ach-PCON (R)'!$A$7:$A$539,0),MATCH(J$8&$B37&$C37,'Apps-Ach-PCON (R)'!$D$3:$CE$3,0))","v":110}]
[null,"Intermediate","25+","Region",{"$f":"INDEX(Lists!$H:$H,MATCH('PCON Dashboard'!E37,Lists!$I:$I,0))","v":"South East"},{"$f":"INDEX('Apps-Ach-PCON (R)'!$D$545:$CE$556,MATCH($E38,'Apps-Ach-PCON (R)'!$B$545:$B$556,0),MATCH('PCON Dashboard'!F$8&'PCON Dashboard'!$B38&'PCON Dashboard'!$C38,'Apps-Ach-PCON (R)'!$D$3:$CE$3,0))","v":7790},{"$f":"INDEX('Apps-Ach-PCON (R)'!$D$545:$CE$556,MATCH($E38,'Apps-Ach-PCON (R)'!$B$545:$B$556,0),MATCH('PCON Dashboard'!G$8&'PCON Dashboard'!$B38&'PCON Dashboard'!$C38,'Apps-Ach-PCON (R)'!$D$3:$CE$3,0))","v":7810},{"$f":"INDEX('Apps-Ach-PCON (R)'!$D$545:$CE$556,MATCH($E38,'Apps-Ach-PCON (R)'!$B$545:$B$556,0),MATCH('PCON Dashboard'!H$8&'PCON Dashboard'!$B38&'PCON Dashboard'!$C38,'Apps-Ach-PCON (R)'!$D$3:$CE$3,0))","v":6670},{"$f":"INDEX('Apps-Ach-PCON (R)'!$D$545:$CE$556,MATCH($E38,'Apps-Ach-PCON (R)'!$B$545:$B$556,0),MATCH('PCON Dashboard'!I$8&'PCON Dashboard'!$B38&'PCON Dashboard'!$C38,'Apps-Ach-PCON (R)'!$D$3:$CE$3,0))","v":7310},{"$f":"INDEX('Apps-Ach-PCON (R)'!$D$545:$CE$556,MATCH($E38,'Apps-Ach-PCON (R)'!$B$545:$B$556,0),MATCH('PCON Dashboard'!J$8&'PCON Dashboard'!$B38&'PCON Dashboard'!$C38,'Apps-Ach-PCON (R)'!$D$3:$CE$3,0))","v":7860}]
[null,"Intermediate","25+","National","England",{"$f":"INDEX('Apps-Ach-PCON (R)'!$D$545:$CE$556,MATCH($E39,'Apps-Ach-PCON (R)'!$B$545:$B$556,0),MATCH('PCON Dashboard'!F$8&'PCON Dashboard'!$B39&'PCON Dashboard'!$C39,'Apps-Ach-PCON (R)'!$D$3:$CE$3,0))","v":61000},{"$f":"INDEX('Apps-Ach-PCON (R)'!$D$545:$CE$556,MATCH($E39,'Apps-Ach-PCON (R)'!$B$545:$B$556,0),MATCH('PCON Dashboard'!G$8&'PCON Dashboard'!$B39&'PCON Dashboard'!$C39,'Apps-Ach-PCON (R)'!$D$3:$CE$3,0))","v":65600},{"$f":"INDEX('Apps-Ach-PCON (R)'!$D$545:$CE$556,MATCH($E39,'Apps-Ach-PCON (R)'!$B$545:$B$556,0),MATCH('PCON Dashboard'!H$8&'PCON Dashboard'!$B39&'PCON Dashboard'!$C39,'Apps-Ach-PCON (R)'!$D$3:$CE$3,0))","v":54400},{"$f":"INDEX('Apps-Ach-PCON (R)'!$D$545:$CE$556,MATCH($E39,'Apps-Ach-PCON (R)'!$B$545:$B$556,0),MATCH('PCON Dashboard'!I$8&'PCON Dashboard'!$B39&'PCON Dashboard'!$C39,'Apps-Ach-PCON (R)'!$D$3:$CE$3,0))","v":58500},{"$f":"INDEX('Apps-Ach-PCON (R)'!$D$545:$CE$556,MATCH($E39,'Apps-Ach-PCON (R)'!$B$545:$B$556,0),MATCH('PCON Dashboard'!J$8&'PCON Dashboard'!$B39&'PCON Dashboard'!$C39,'Apps-Ach-PCON (R)'!$D$3:$CE$3,0))","v":62500}]
[null,"Intermediate","25+","Total","Grand Total",{"$f":"INDEX('Apps-Ach-PCON (R)'!$D$545:$CE$556,MATCH($E40,'Apps-Ach-PCON (R)'!$B$545:$B$556,0),MATCH('PCON Dashboard'!F$8&'PCON Dashboard'!$B40&'PCON Dashboard'!$C40,'Apps-Ach-PCON (R)'!$D$3:$CE$3,0))","v":61800},{"$f":"INDEX('Apps-Ach-PCON (R)'!$D$545:$CE$556,MATCH($E40,'Apps-Ach-PCON (R)'!$B$545:$B$556,0),MATCH('PCON Dashboard'!G$8&'PCON Dashboard'!$B40&'PCON Dashboard'!$C40,'Apps-Ach-PCON (R)'!$D$3:$CE$3,0))","v":66500},{"$f":"INDEX('Apps-Ach-PCON (R)'!$D$545:$CE$556,MATCH($E40,'Apps-Ach-PCON (R)'!$B$545:$B$556,0),MATCH('PCON Dashboard'!H$8&'PCON Dashboard'!$B40&'PCON Dashboard'!$C40,'Apps-Ach-PCON (R)'!$D$3:$CE$3,0))","v":54900},{"$f":"INDEX('Apps-Ach-PCON (R)'!$D$545:$CE$556,MATCH($E40,'Apps-Ach-PCON (R)'!$B$545:$B$556,0),MATCH('PCON Dashboard'!I$8&'PCON Dashboard'!$B40&'PCON Dashboard'!$C40,'Apps-Ach-PCON (R)'!$D$3:$CE$3,0))","v":59100},{"$f":"INDEX('Apps-Ach-PCON (R)'!$D$545:$CE$556,MATCH($E40,'Apps-Ach-PCON (R)'!$B$545:$B$556,0),MATCH('PCON Dashboard'!J$8&'PCON Dashboard'!$B40&'PCON Dashboard'!$C40,'Apps-Ach-PCON (R)'!$D$3:$CE$3,0))","v":63000}]
[null,"Advanced","All","PCON",{"$f":"INDEX('Apps-Ach-PCON (R)'!$B:$B,MATCH('PCON Dashboard'!$E$3,'Apps-Ach-PCON (R)'!$A:$A,0))","v":"Aldershot"},{"$f":"INDEX('Apps-Ach-PCON (R)'!$D$7:$CE$539,MATCH('PCON Dashboard'!$E$3,'Apps-Ach-PCON (R)'!$A$7:$A$539,0),MATCH(F$8&$B41&$C41,'Apps-Ach-PCON (R)'!$D$3:$CE$3,0))","v":160},{"$f":"INDEX('Apps-Ach-PCON (R)'!$D$7:$CE$539,MATCH('PCON Dashboard'!$E$3,'Apps-Ach-PCON (R)'!$A$7:$A$539,0),MATCH(G$8&$B41&$C41,'Apps-Ach-PCON (R)'!$D$3:$CE$3,0))","v":170},{"$f":"INDEX('Apps-Ach-PCON (R)'!$D$7:$CE$539,MATCH('PCON Dashboard'!$E$3,'Apps-Ach-PCON (R)'!$A$7:$A$539,0),MATCH(H$8&$B41&$C41,'Apps-Ach-PCON (R)'!$D$3:$CE$3,0))","v":250},{"$f":"INDEX('Apps-Ach-PCON (R)'!$D$7:$CE$539,MATCH('PCON Dashboard'!$E$3,'Apps-Ach-PCON (R)'!$A$7:$A$539,0),MATCH(I$8&$B41&$C41,'Apps-Ach-PCON (R)'!$D$3:$CE$3,0))","v":150},{"$f":"INDEX('Apps-Ach-PCON (R)'!$D$7:$CE$539,MATCH('PCON Dashboard'!$E$3,'Apps-Ach-PCON (R)'!$A$7:$A$539,0),MATCH(J$8&$B41&$C41,'Apps-Ach-PCON (R)'!$D$3:$CE$3,0))","v":210}]
[null,"Advanced","All","Region",{"$f":"INDEX(Lists!$H:$H,MATCH('PCON Dashboard'!E41,Lists!$I:$I,0))","v":"South East"},{"$f":"INDEX('Apps-Ach-PCON (R)'!$D$545:$CE$556,MATCH($E42,'Apps-Ach-PCON (R)'!$B$545:$B$556,0),MATCH('PCON Dashboard'!F$8&'PCON Dashboard'!$B42&'PCON Dashboard'!$C42,'Apps-Ach-PCON (R)'!$D$3:$CE$3,0))","v":11090},{"$f":"INDEX('Apps-Ach-PCON (R)'!$D$545:$CE$556,MATCH($E42,'Apps-Ach-PCON (R)'!$B$545:$B$556,0),MATCH('PCON Dashboard'!G$8&'PCON Dashboard'!$B42&'PCON Dashboard'!$C42,'Apps-Ach-PCON (R)'!$D$3:$CE$3,0))","v":13400},{"$f":"INDEX('Apps-Ach-PCON (R)'!$D$545:$CE$556,MATCH($E42,'Apps-Ach-PCON (R)'!$B$545:$B$556,0),MATCH('PCON Dashboard'!H$8&'PCON Dashboard'!$B42&'PCON Dashboard'!$C42,'Apps-Ach-PCON (R)'!$D$3:$CE$3,0))","v":14560},{"$f":"INDEX('Apps-Ach-PCON (R)'!$D$545:$CE$556,MATCH($E42,'Apps-Ach-PCON (R)'!$B$545:$B$556,0),MATCH('PCON Dashboard'!I$8&'PCON Dashboard'!$B42&'PCON Dashboard'!$C42,'Apps-Ach-PCON (R)'!$D$3:$CE$3,0))","v":13840},{"$f":"INDEX('Apps-Ach-PCON (R)'!$D$545:$CE$556,MATCH($E42,'Apps-Ach-PCON (R)'!$B$545:$B$556,0),MATCH('PCON Dashboard'!J$8&'PCON Dashboard'!$B42&'PCON Dashboard'!$C42,'Apps-Ach-PCON (R)'!$D$3:$CE$3,0))","v":14180}]
[null,"Advanced","All","National","England",{"$f":"INDEX('Apps-Ach-PCON (R)'!$D$545:$CE$556,MATCH($E43,'Apps-Ach-PCON (R)'!$B$545:$B$556,0),MATCH('PCON Dashboard'!F$8&'PCON Dashboard'!$B43&'PCON Dashboard'!$C43,'Apps-Ach-PCON (R)'!$D$3:$CE$3,0))","v":83900},{"$f":"INDEX('Apps-Ach-PCON (R)'!$D$545:$CE$556,MATCH($E43,'Apps-Ach-PCON (R)'!$B$545:$B$556,0),MATCH('PCON Dashboard'!G$8&'PCON Dashboard'!$B43&'PCON Dashboard'!$C43,'Apps-Ach-PCON (R)'!$D$3:$CE$3,0))","v":93900},{"$f":"INDEX('Apps-Ach-PCON (R)'!$D$545:$CE$556,MATCH($E43,'Apps-Ach-PCON (R)'!$B$545:$B$556,0),MATCH('PCON Dashboard'!H$8&'PCON Dashboard'!$B43&'PCON Dashboard'!$C43,'Apps-Ach-PCON (R)'!$D$3:$CE$3,0))","v":101200},{"$f":"INDEX('Apps-Ach-PCON (R)'!$D$545:$CE$556,MATCH($E43,'Apps-Ach-PCON (R)'!$B$545:$B$556,0),MATCH('PCON Dashboard'!I$8&'PCON Dashboard'!$B43&'PCON Dashboard'!$C43,'Apps-Ach-PCON (R)'!$D$3:$CE$3,0))","v":95300},{"$f":"INDEX('Apps-Ach-PCON (R)'!$D$545:$CE$556,MATCH($E43,'Apps-Ach-PCON (R)'!$B$545:$B$556,0),MATCH('PCON Dashboard'!J$8&'PCON Dashboard'!$B43&'PCON Dashboard'!$C43,'Apps-Ach-PCON (R)'!$D$3:$CE$3,0))","v":99800}]
[null,"Advanced","All","Total","Grand Total",{"$f":"INDEX('Apps-Ach-PCON (R)'!$D$545:$CE$556,MATCH($E44,'Apps-Ach-PCON (R)'!$B$545:$B$556,0),MATCH('PCON Dashboard'!F$8&'PCON Dashboard'!$B44&'PCON Dashboard'!$C44,'Apps-Ach-PCON (R)'!$D$3:$CE$3,0))","v":84700},{"$f":"INDEX('Apps-Ach-PCON (R)'!$D$545:$CE$556,MATCH($E44,'Apps-Ach-PCON (R)'!$B$545:$B$556,0),MATCH('PCON Dashboard'!G$8&'PCON Dashboard'!$B44&'PCON Dashboard'!$C44,'Apps-Ach-PCON (R)'!$D$3:$CE$3,0))","v":95000},{"$f":"INDEX('Apps-Ach-PCON (R)'!$D$545:$CE$556,MATCH($E44,'Apps-Ach-PCON (R)'!$B$545:$B$556,0),MATCH('PCON Dashboard'!H$8&'PCON Dashboard'!$B44&'PCON Dashboard'!$C44,'Apps-Ach-PCON (R)'!$D$3:$CE$3,0))","v":102200},{"$f":"INDEX('Apps-Ach-PCON (R)'!$D$545:$CE$556,MATCH($E44,'Apps-Ach-PCON (R)'!$B$545:$B$556,0),MATCH('PCON Dashboard'!I$8&'PCON Dashboard'!$B44&'PCON Dashboard'!$C44,'Apps-Ach-PCON (R)'!$D$3:$CE$3,0))","v":96200},{"$f":"INDEX('Apps-Ach-PCON (R)'!$D$545:$CE$556,MATCH($E44,'Apps-Ach-PCON (R)'!$B$545:$B$556,0),MATCH('PCON Dashboard'!J$8&'PCON Dashboard'!$B44&'PCON Dashboard'!$C44,'Apps-Ach-PCON (R)'!$D$3:$CE$3,0))","v":100900}]
[null,"Advanced","Under 19","PCON",{"$f":"INDEX('Apps-Ach-PCON (R)'!$B:$B,MATCH('PCON Dashboard'!$E$3,'Apps-Ach-PCON (R)'!$A:$A,0))","v":"Aldershot"},{"$f":"INDEX('Apps-Ach-PCON (R)'!$D$7:$CE$539,MATCH('PCON Dashboard'!$E$3,'Apps-Ach-PCON (R)'!$A$7:$A$539,0),MATCH(F$8&$B45&$C45,'Apps-Ach-PCON (R)'!$D$3:$CE$3,0))","v":40},{"$f":"INDEX('Apps-Ach-PCON (R)'!$D$7:$CE$539,MATCH('PCON Dashboard'!$E$3,'Apps-Ach-PCON (R)'!$A$7:$A$539,0),MATCH(G$8&$B45&$C45,'Apps-Ach-PCON (R)'!$D$3:$CE$3,0))","v":30},{"$f":"INDEX('Apps-Ach-PCON (R)'!$D$7:$CE$539,MATCH('PCON Dashboard'!$E$3,'Apps-Ach-PCON (R)'!$A$7:$A$539,0),MATCH(H$8&$B45&$C45,'Apps-Ach-PCON (R)'!$D$3:$CE$3,0))","v":100},{"$f":"INDEX('Apps-Ach-PCON (R)'!$D$7:$CE$539,MATCH('PCON Dashboard'!$E$3,'Apps-Ach-PCON (R)'!$A$7:$A$539,0),MATCH(I$8&$B45&$C45,'Apps-Ach-PCON (R)'!$D$3:$CE$3,0))","v":30},{"$f":"INDEX('Apps-Ach-PCON (R)'!$D$7:$CE$539,MATCH('PCON Dashboard'!$E$3,'Apps-Ach-PCON (R)'!$A$7:$A$539,0),MATCH(J$8&$B45&$C45,'Apps-Ach-PCON (R)'!$D$3:$CE$3,0))","v":80}]
[null,"Advanced","Under 19","Region",{"$f":"INDEX(Lists!$H:$H,MATCH('PCON Dashboard'!E45,Lists!$I:$I,0))","v":"South East"},{"$f":"INDEX('Apps-Ach-PCON (R)'!$D$545:$CE$556,MATCH($E46,'Apps-Ach-PCON (R)'!$B$545:$B$556,0),MATCH('PCON Dashboard'!F$8&'PCON Dashboard'!$B46&'PCON Dashboard'!$C46,'Apps-Ach-PCON (R)'!$D$3:$CE$3,0))","v":2520},{"$f":"INDEX('Apps-Ach-PCON (R)'!$D$545:$CE$556,MATCH($E46,'Apps-Ach-PCON (R)'!$B$545:$B$556,0),MATCH('PCON Dashboard'!G$8&'PCON Dashboard'!$B46&'PCON Dashboard'!$C46,'Apps-Ach-PCON (R)'!$D$3:$CE$3,0))","v":2510},{"$f":"INDEX('Apps-Ach-PCON (R)'!$D$545:$CE$556,MATCH($E46,'Apps-Ach-PCON (R)'!$B$545:$B$556,0),MATCH('PCON Dashboard'!H$8&'PCON Dashboard'!$B46&'PCON Dashboard'!$C46,'Apps-Ach-PCON (R)'!$D$3:$CE$3,0))","v":2850},{"$f":"INDEX('Apps-Ach-PCON (R)'!$D$545:$CE$556,MATCH($E46,'Apps-Ach-PCON (R)'!$B$545:$B$556,0),MATCH('PCON Dashboard'!I$8&'PCON Dashboard'!$B46&'PCON Dashboard'!$C46,'Apps-Ach-PCON (R)'!$D$3:$CE$3,0))","v":3030},{"$f":"INDEX('Apps-Ach-PCON (R)'!$D$545:$CE$556,MATCH($E46,'Apps-Ach-PCON (R)'!$B$545:$B$556,0),MATCH('PCON Dashboard'!J$8&'PCON Dashboard'!$B46&'PCON Dashboard'!$C46,'Apps-Ach-PCON (R)'!$D$3:$CE$3,0))","v":3290}]
[null,"Advanced","Under 19","National","England",{"$f":"INDEX('Apps-Ach-PCON (R)'!$D$545:$CE$556,MATCH($E47,'Apps-Ach-PCON (R)'!$B$545:$B$556,0),MATCH('PCON Dashboard'!F$8&'PCON Dashboard'!$B47&'PCON Dashboard'!$C47,'Apps-Ach-PCON (R)'!$D$3:$CE$3,0))","v":21000},{"$f":"INDEX('Apps-Ach-PCON (R)'!$D$545:$CE$556,MATCH($E47,'Apps-Ach-PCON (R)'!$B$545:$B$556,0),MATCH('PCON Dashboard'!G$8&'PCON Dashboard'!$B47&'PCON Dashboard'!$C47,'Apps-Ach-PCON (R)'!$D$3:$CE$3,0))","v":18300},{"$f":"INDEX('Apps-Ach-PCON (R)'!$D$545:$CE$556,MATCH($E47,'Apps-Ach-PCON (R)'!$B$545:$B$556,0),MATCH('PCON Dashboard'!H$8&'PCON Dashboard'!$B47&'PCON Dashboard'!$C47,'Apps-Ach-PCON (R)'!$D$3:$CE$3,0))","v":19700},{"$f":"INDEX('Apps-Ach-PCON (R)'!$D$545:$CE$556,MATCH($E47,'Apps-Ach-PCON (R)'!$B$545:$B$556,0),MATCH('PCON Dashboard'!I$8&'PCON Dashboard'!$B47&'PCON Dashboard'!$C47,'Apps-Ach-PCON (R)'!$D$3:$CE$3,0))","v":22300},{"$f":"INDEX('Apps-Ach-PCON (R)'!$D$545:$CE$556,MATCH($E47,'Apps-Ach-PCON (R)'!$B$545:$B$556,0),MATCH('PCON Dashboard'!J$8&'PCON Dashboard'!$B47&'PCON Dashboard'!$C47,'Apps-Ach-PCON (R)'!$D$3:$CE$3,0))","v":23700}]
[null,"Advanced","Under 19","Total","Grand Total",{"$f":"INDEX('Apps-Ach-PCON (R)'!$D$545:$CE$556,MATCH($E48,'Apps-Ach-PCON (R)'!$B$545:$B$556,0),MATCH('PCON Dashboard'!F$8&'PCON Dashboard'!$B48&'PCON Dashboard'!$C48,'Apps-Ach-PCON (R)'!$D$3:$CE$3,0))","v":21300},{"$f":"INDEX('Apps-Ach-PCON (R)'!$D$545:$CE$556,MATCH($E48,'Apps-Ach-PCON (R)'!$B$545:$B$556,0),MATCH('PCON Dashboard'!G$8&'PCON Dashboard'!$B48&'PCON Dashboard'!$C48,'Apps-Ach-PCON (R)'!$D$3:$CE$3,0))","v":18600},{"$f":"INDEX('Apps-Ach-PCON (R)'!$D$545:$CE$556,MATCH($E48,'Apps-Ach-PCON (R)'!$B$545:$B$556,0),MATCH('PCON Dashboard'!H$8&'PCON Dashboard'!$B48&'PCON Dashboard'!$C48,'Apps-Ach-PCON (R)'!$D$3:$CE$3,0))","v":20000},{"$f":"INDEX('Apps-Ach-PCON (R)'!$D$545:$CE$556,MATCH($E48,'Apps-Ach-PCON (R)'!$B$545:$B$556,0),MATCH('PCON Dashboard'!I$8&'PCON Dashboard'!$B48&'PCON Dashboard'!$C48,'Apps-Ach-PCON (R)'!$D$3:$CE$3,0))","v":22500},{"$f":"INDEX('Apps-Ach-PCON (R)'!$D$545:$CE$556,MATCH($E48,'Apps-Ach-PCON (R)'!$B$545:$B$556,0),MATCH('PCON Dashboard'!J$8&'PCON Dashboard'!$B48&'PCON Dashboard'!$C48,'Apps-Ach-PCON (R)'!$D$3:$CE$3,0))","v":24000}]
[null,"Advanced","19-24","PCON",{"$f":"INDEX('Apps-Ach-PCON (R)'!$B:$B,MATCH('PCON Dashboard'!$E$3,'Apps-Ach-PCON (R)'!$A:$A,0))","v":"Aldershot"},{"$f":"INDEX('Apps-Ach-PCON (R)'!$D$7:$CE$539,MATCH('PCON Dashboard'!$E$3,'Apps-Ach-PCON (R)'!$A$7:$A$539,0),MATCH(F$8&$B49&$C49,'Apps-Ach-PCON (R)'!$D$3:$CE$3,0))","v":60},{"$f":"INDEX('Apps-Ach-PCON (R)'!$D$7:$CE$539,MATCH('PCON Dashboard'!$E$3,'Apps-Ach-PCON (R)'!$A$7:$A$539,0),MATCH(G$8&$B49&$C49,'Apps-Ach-PCON (R)'!$D$3:$CE$3,0))","v":60},{"$f":"INDEX('Apps-Ach-PCON (R)'!$D$7:$CE$539,MATCH('PCON Dashboard'!$E$3,'Apps-Ach-PCON (R)'!$A$7:$A$539,0),MATCH(H$8&$B49&$C49,'Apps-Ach-PCON (R)'!$D$3:$CE$3,0))","v":60},{"$f":"INDEX('Apps-Ach-PCON (R)'!$D$7:$CE$539,MATCH('PCON Dashboard'!$E$3,'Apps-Ach-PCON (R)'!$A$7:$A$539,0),MATCH(I$8&$B49&$C49,'Apps-Ach-PCON (R)'!$D$3:$CE$3,0))","v":70},{"$f":"INDEX('Apps-Ach-PCON (R)'!$D$7:$CE$539,MATCH('PCON Dashboard'!$E$3,'Apps-Ach-PCON (R)'!$A$7:$A$539,0),MATCH(J$8&$B49&$C49,'Apps-Ach-PCON (R)'!$D$3:$CE$3,0))","v":60}]
[null,"Advanced","19-24","Region",{"$f":"INDEX(Lists!$H:$H,MATCH('PCON Dashboard'!E49,Lists!$I:$I,0))","v":"South East"},{"$f":"INDEX('Apps-Ach-PCON (R)'!$D$545:$CE$556,MATCH($E50,'Apps-Ach-PCON (R)'!$B$545:$B$556,0),MATCH('PCON Dashboard'!F$8&'PCON Dashboard'!$B50&'PCON Dashboard'!$C50,'Apps-Ach-PCON (R)'!$D$3:$CE$3,0))","v":4340},{"$f":"INDEX('Apps-Ach-PCON (R)'!$D$545:$CE$556,MATCH($E50,'Apps-Ach-PCON (R)'!$B$545:$B$556,0),MATCH('PCON Dashboard'!G$8&'PCON Dashboard'!$B50&'PCON Dashboard'!$C50,'Apps-Ach-PCON (R)'!$D$3:$CE$3,0))","v":4680},{"$f":"INDEX('Apps-Ach-PCON (R)'!$D$545:$CE$556,MATCH($E50,'Apps-Ach-PCON (R)'!$B$545:$B$556,0),MATCH('PCON Dashboard'!H$8&'PCON Dashboard'!$B50&'PCON Dashboard'!$C50,'Apps-Ach-PCON (R)'!$D$3:$CE$3,0))","v":5470},{"$f":"INDEX('Apps-Ach-PCON (R)'!$D$545:$CE$556,MATCH($E50,'Apps-Ach-PCON (R)'!$B$545:$B$556,0),MATCH('PCON Dashboard'!I$8&'PCON Dashboard'!$B50&'PCON Dashboard'!$C50,'Apps-Ach-PCON (R)'!$D$3:$CE$3,0))","v":5810},{"$f":"INDEX('Apps-Ach-PCON (R)'!$D$545:$CE$556,MATCH($E50,'Apps-Ach-PCON (R)'!$B$545:$B$556,0),MATCH('PCON Dashboard'!J$8&'PCON Dashboard'!$B50&'PCON Dashboard'!$C50,'Apps-Ach-PCON (R)'!$D$3:$CE$3,0))","v":5420}]
[null,"Advanced","19-24","National","England",{"$f":"INDEX('Apps-Ach-PCON (R)'!$D$545:$CE$556,MATCH($E51,'Apps-Ach-PCON (R)'!$B$545:$B$556,0),MATCH('PCON Dashboard'!F$8&'PCON Dashboard'!$B51&'PCON Dashboard'!$C51,'Apps-Ach-PCON (R)'!$D$3:$CE$3,0))","v":30400},{"$f":"INDEX('Apps-Ach-PCON (R)'!$D$545:$CE$556,MATCH($E51,'Apps-Ach-PCON (R)'!$B$545:$B$556,0),MATCH('PCON Dashboard'!G$8&'PCON Dashboard'!$B51&'PCON Dashboard'!$C51,'Apps-Ach-PCON (R)'!$D$3:$CE$3,0))","v":30400},{"$f":"INDEX('Apps-Ach-PCON (R)'!$D$545:$CE$556,MATCH($E51,'Apps-Ach-PCON (R)'!$B$545:$B$556,0),MATCH('PCON Dashboard'!H$8&'PCON Dashboard'!$B51&'PCON Dashboard'!$C51,'Apps-Ach-PCON (R)'!$D$3:$CE$3,0))","v":34700},{"$f":"INDEX('Apps-Ach-PCON (R)'!$D$545:$CE$556,MATCH($E51,'Apps-Ach-PCON (R)'!$B$545:$B$556,0),MATCH('PCON Dashboard'!I$8&'PCON Dashboard'!$B51&'PCON Dashboard'!$C51,'Apps-Ach-PCON (R)'!$D$3:$CE$3,0))","v":36800},{"$f":"INDEX('Apps-Ach-PCON (R)'!$D$545:$CE$556,MATCH($E51,'Apps-Ach-PCON (R)'!$B$545:$B$556,0),MATCH('PCON Dashboard'!J$8&'PCON Dashboard'!$B51&'PCON Dashboard'!$C51,'Apps-Ach-PCON (R)'!$D$3:$CE$3,0))","v":36500}]
[null,"Advanced","19-24","Total","Grand Total",{"$f":"INDEX('Apps-Ach-PCON (R)'!$D$545:$CE$556,MATCH($E52,'Apps-Ach-PCON (R)'!$B$545:$B$556,0),MATCH('PCON Dashboard'!F$8&'PCON Dashboard'!$B52&'PCON Dashboard'!$C52,'Apps-Ach-PCON (R)'!$D$3:$CE$3,0))","v":30600},{"$f":"INDEX('Apps-Ach-PCON (R)'!$D$545:$CE$556,MATCH($E52,'Apps-Ach-PCON (R)'!$B$545:$B$556,0),MATCH('PCON Dashboard'!G$8&'PCON Dashboard'!$B52&'PCON Dashboard'!$C52,'Apps-Ach-PCON (R)'!$D$3:$CE$3,0))","v":30800},{"$f":"INDEX('Apps-Ach-PCON (R)'!$D$545:$CE$556,MATCH($E52,'Apps-Ach-PCON (R)'!$B$545:$B$556,0),MATCH('PCON Dashboard'!H$8&'PCON Dashboard'!$B52&'PCON Dashboard'!$C52,'Apps-Ach-PCON (R)'!$D$3:$CE$3,0))","v":35000},{"$f":"INDEX('Apps-Ach-PCON (R)'!$D$545:$CE$556,MATCH($E52,'Apps-Ach-PCON (R)'!$B$545:$B$556,0),MATCH('PCON Dashboard'!I$8&'PCON Dashboard'!$B52&'PCON Dashboard'!$C52,'Apps-Ach-PCON (R)'!$D$3:$CE$3,0))","v":37100},{"$f":"INDEX('Apps-Ach-PCON (R)'!$D$545:$CE$556,MATCH($E52,'Apps-Ach-PCON (R)'!$B$545:$B$556,0),MATCH('PCON Dashboard'!J$8&'PCON Dashboard'!$B52&'PCON Dashboard'!$C52,'Apps-Ach-PCON (R)'!$D$3:$CE$3,0))","v":36900}]
[null,"Advanced","25+","PCON",{"$f":"INDEX('Apps-Ach-PCON (R)'!$B:$B,MATCH('PCON Dashboard'!$E$3,'Apps-Ach-PCON (R)'!$A:$A,0))","v":"Aldershot"},{"$f":"INDEX('Apps-Ach-PCON (R)'!$D$7:$CE$539,MATCH('PCON Dashboard'!$E$3,'Apps-Ach-PCON (R)'!$A$7:$A$539,0),MATCH(F$8&$B53&$C53,'Apps-Ach-PCON (R)'!$D$3:$CE$3,0))","v":60},{"$f":"INDEX('Apps-Ach-PCON (R)'!$D$7:$CE$539,MATCH('PCON Dashboard'!$E$3,'Apps-Ach-PCON (R)'!$A$7:$A$539,0),MATCH(G$8&$B53&$C53,'Apps-Ach-PCON (R)'!$D$3:$CE$3,0))","v":90},{"$f":"INDEX('Apps-Ach-PCON (R)'!$D$7:$CE$539,MATCH('PCON Dashboard'!$E$3,'Apps-Ach-PCON (R)'!$A$7:$A$539,0),MATCH(H$8&$B53&$C53,'Apps-Ach-PCON (R)'!$D$3:$CE$3,0))","v":90},{"$f":"INDEX('Apps-Ach-PCON (R)'!$D$7:$CE$539,MATCH('PCON Dashboard'!$E$3,'Apps-Ach-PCON (R)'!$A$7:$A$539,0),MATCH(I$8&$B53&$C53,'Apps-Ach-PCON (R)'!$D$3:$CE$3,0))","v":50},{"$f":"INDEX('Apps-Ach-PCON (R)'!$D$7:$CE$539,MATCH('PCON Dashboard'!$E$3,'Apps-Ach-PCON (R)'!$A$7:$A$539,0),MATCH(J$8&$B53&$C53,'Apps-Ach-PCON (R)'!$D$3:$CE$3,0))","v":70}]
[null,"Advanced","25+","Region",{"$f":"INDEX(Lists!$H:$H,MATCH('PCON Dashboard'!E53,Lists!$I:$I,0))","v":"South East"},{"$f":"INDEX('Apps-Ach-PCON (R)'!$D$545:$CE$556,MATCH($E54,'Apps-Ach-PCON (R)'!$B$545:$B$556,0),MATCH('PCON Dashboard'!F$8&'PCON Dashboard'!$B54&'PCON Dashboard'!$C54,'Apps-Ach-PCON (R)'!$D$3:$CE$3,0))","v":4230},{"$f":"INDEX('Apps-Ach-PCON (R)'!$D$545:$CE$556,MATCH($E54,'Apps-Ach-PCON (R)'!$B$545:$B$556,0),MATCH('PCON Dashboard'!G$8&'PCON Dashboard'!$B54&'PCON Dashboard'!$C54,'Apps-Ach-PCON (R)'!$D$3:$CE$3,0))","v":6210},{"$f":"INDEX('Apps-Ach-PCON (R)'!$D$545:$CE$556,MATCH($E54,'Apps-Ach-PCON (R)'!$B$545:$B$556,0),MATCH('PCON Dashboard'!H$8&'PCON Dashboard'!$B54&'PCON Dashboard'!$C54,'Apps-Ach-PCON (R)'!$D$3:$CE$3,0))","v":6240},{"$f":"INDEX('Apps-Ach-PCON (R)'!$D$545:$CE$556,MATCH($E54,'Apps-Ach-PCON (R)'!$B$545:$B$556,0),MATCH('PCON Dashboard'!I$8&'PCON Dashboard'!$B54&'PCON Dashboard'!$C54,'Apps-Ach-PCON (R)'!$D$3:$CE$3,0))","v":5010},{"$f":"INDEX('Apps-Ach-PCON (R)'!$D$545:$CE$556,MATCH($E54,'Apps-Ach-PCON (R)'!$B$545:$B$556,0),MATCH('PCON Dashboard'!J$8&'PCON Dashboard'!$B54&'PCON Dashboard'!$C54,'Apps-Ach-PCON (R)'!$D$3:$CE$3,0))","v":5470}]
[null,"Advanced","25+","National","England",{"$f":"INDEX('Apps-Ach-PCON (R)'!$D$545:$CE$556,MATCH($E55,'Apps-Ach-PCON (R)'!$B$545:$B$556,0),MATCH('PCON Dashboard'!F$8&'PCON Dashboard'!$B55&'PCON Dashboard'!$C55,'Apps-Ach-PCON (R)'!$D$3:$CE$3,0))","v":32500},{"$f":"INDEX('Apps-Ach-PCON (R)'!$D$545:$CE$556,MATCH($E55,'Apps-Ach-PCON (R)'!$B$545:$B$556,0),MATCH('PCON Dashboard'!G$8&'PCON Dashboard'!$B55&'PCON Dashboard'!$C55,'Apps-Ach-PCON (R)'!$D$3:$CE$3,0))","v":45200},{"$f":"INDEX('Apps-Ach-PCON (R)'!$D$545:$CE$556,MATCH($E55,'Apps-Ach-PCON (R)'!$B$545:$B$556,0),MATCH('PCON Dashboard'!H$8&'PCON Dashboard'!$B55&'PCON Dashboard'!$C55,'Apps-Ach-PCON (R)'!$D$3:$CE$3,0))","v":46800},{"$f":"INDEX('Apps-Ach-PCON (R)'!$D$545:$CE$556,MATCH($E55,'Apps-Ach-PCON (R)'!$B$545:$B$556,0),MATCH('PCON Dashboard'!I$8&'PCON Dashboard'!$B55&'PCON Dashboard'!$C55,'Apps-Ach-PCON (R)'!$D$3:$CE$3,0))","v":36200},{"$f":"INDEX('Apps-Ach-PCON (R)'!$D$545:$CE$556,MATCH($E55,'Apps-Ach-PCON (R)'!$B$545:$B$556,0),MATCH('PCON Dashboard'!J$8&'PCON Dashboard'!$B55&'PCON Dashboard'!$C55,'Apps-Ach-PCON (R)'!$D$3:$CE$3,0))","v":39700}]
[null,"Advanced","25+","Total","Grand Total",{"$f":"INDEX('Apps-Ach-PCON (R)'!$D$545:$CE$556,MATCH($E56,'Apps-Ach-PCON (R)'!$B$545:$B$556,0),MATCH('PCON Dashboard'!F$8&'PCON Dashboard'!$B56&'PCON Dashboard'!$C56,'Apps-Ach-PCON (R)'!$D$3:$CE$3,0))","v":32800},{"$f":"INDEX('Apps-Ach-PCON (R)'!$D$545:$CE$556,MATCH($E56,'Apps-Ach-PCON (R)'!$B$545:$B$556,0),MATCH('PCON Dashboard'!G$8&'PCON Dashboard'!$B56&'PCON Dashboard'!$C56,'Apps-Ach-PCON (R)'!$D$3:$CE$3,0))","v":45700},{"$f":"INDEX('Apps-Ach-PCON (R)'!$D$545:$CE$556,MATCH($E56,'Apps-Ach-PCON (R)'!$B$545:$B$556,0),MATCH('PCON Dashboard'!H$8&'PCON Dashboard'!$B56&'PCON Dashboard'!$C56,'Apps-Ach-PCON (R)'!$D$3:$CE$3,0))","v":47200},{"$f":"INDEX('Apps-Ach-PCON (R)'!$D$545:$CE$556,MATCH($E56,'Apps-Ach-PCON (R)'!$B$545:$B$556,0),MATCH('PCON Dashboard'!I$8&'PCON Dashboard'!$B56&'PCON Dashboard'!$C56,'Apps-Ach-PCON (R)'!$D$3:$CE$3,0))","v":36600},{"$f":"INDEX('Apps-Ach-PCON (R)'!$D$545:$CE$556,MATCH($E56,'Apps-Ach-PCON (R)'!$B$545:$B$556,0),MATCH('PCON Dashboard'!J$8&'PCON Dashboard'!$B56&'PCON Dashboard'!$C56,'Apps-Ach-PCON (R)'!$D$3:$CE$3,0))","v":40000}]
[null,"Higher","All","PCON",{"$f":"INDEX('Apps-Ach-PCON (R)'!$B:$B,MATCH('PCON Dashboard'!$E$3,'Apps-Ach-PCON (R)'!$A:$A,0))","v":"Aldershot"},{"$f":"INDEX('Apps-Ach-PCON (R)'!$D$7:$CE$539,MATCH('PCON Dashboard'!$E$3,'Apps-Ach-PCON (R)'!$A$7:$A$539,0),MATCH(F$8&$B57&$C57,'Apps-Ach-PCON (R)'!$D$3:$CE$3,0))","v":"-"},{"$f":"INDEX('Apps-Ach-PCON (R)'!$D$7:$CE$539,MATCH('PCON Dashboard'!$E$3,'Apps-Ach-PCON (R)'!$A$7:$A$539,0),MATCH(G$8&$B57&$C57,'Apps-Ach-PCON (R)'!$D$3:$CE$3,0))","v":"-"},{"$f":"INDEX('Apps-Ach-PCON (R)'!$D$7:$CE$539,MATCH('PCON Dashboard'!$E$3,'Apps-Ach-PCON (R)'!$A$7:$A$539,0),MATCH(H$8&$B57&$C57,'Apps-Ach-PCON (R)'!$D$3:$CE$3,0))","v":10},{"$f":"INDEX('Apps-Ach-PCON (R)'!$D$7:$CE$539,MATCH('PCON Dashboard'!$E$3,'Apps-Ach-PCON (R)'!$A$7:$A$539,0),MATCH(I$8&$B57&$C57,'Apps-Ach-PCON (R)'!$D$3:$CE$3,0))","v":10},{"$f":"INDEX('Apps-Ach-PCON (R)'!$D$7:$CE$539,MATCH('PCON Dashboard'!$E$3,'Apps-Ach-PCON (R)'!$A$7:$A$539,0),MATCH(J$8&$B57&$C57,'Apps-Ach-PCON (R)'!$D$3:$CE$3,0))","v":20}]
[null,"Higher","All","Region",{"$f":"INDEX(Lists!$H:$H,MATCH('PCON Dashboard'!E57,Lists!$I:$I,0))","v":"South East"},{"$f":"INDEX('Apps-Ach-PCON (R)'!$D$545:$CE$556,MATCH($E58,'Apps-Ach-PCON (R)'!$B$545:$B$556,0),MATCH('PCON Dashboard'!F$8&'PCON Dashboard'!$B58&'PCON Dashboard'!$C58,'Apps-Ach-PCON (R)'!$D$3:$CE$3,0))","v":100},{"$f":"INDEX('Apps-Ach-PCON (R)'!$D$545:$CE$556,MATCH($E58,'Apps-Ach-PCON (R)'!$B$545:$B$556,0),MATCH('PCON Dashboard'!G$8&'PCON Dashboard'!$B58&'PCON Dashboard'!$C58,'Apps-Ach-PCON (R)'!$D$3:$CE$3,0))","v":150},{"$f":"INDEX('Apps-Ach-PCON (R)'!$D$545:$CE$556,MATCH($E58,'Apps-Ach-PCON (R)'!$B$545:$B$556,0),MATCH('PCON Dashboard'!H$8&'PCON Dashboard'!$B58&'PCON Dashboard'!$C58,'Apps-Ach-PCON (R)'!$D$3:$CE$3,0))","v":300},{"$f":"INDEX('Apps-Ach-PCON (R)'!$D$545:$CE$556,MATCH($E58,'Apps-Ach-PCON (R)'!$B$545:$B$556,0),MATCH('PCON Dashboard'!I$8&'PCON Dashboard'!$B58&'PCON Dashboard'!$C58,'Apps-Ach-PCON (R)'!$D$3:$CE$3,0))","v":490},{"$f":"INDEX('Apps-Ach-PCON (R)'!$D$545:$CE$556,MATCH($E58,'Apps-Ach-PCON (R)'!$B$545:$B$556,0),MATCH('PCON Dashboard'!J$8&'PCON Dashboard'!$B58&'PCON Dashboard'!$C58,'Apps-Ach-PCON (R)'!$D$3:$CE$3,0))","v":960}]
[null,"Higher","All","National","England",{"$f":"INDEX('Apps-Ach-PCON (R)'!$D$545:$CE$556,MATCH($E59,'Apps-Ach-PCON (R)'!$B$545:$B$556,0),MATCH('PCON Dashboard'!F$8&'PCON Dashboard'!$B59&'PCON Dashboard'!$C59,'Apps-Ach-PCON (R)'!$D$3:$CE$3,0))","v":1200},{"$f":"INDEX('Apps-Ach-PCON (R)'!$D$545:$CE$556,MATCH($E59,'Apps-Ach-PCON (R)'!$B$545:$B$556,0),MATCH('PCON Dashboard'!G$8&'PCON Dashboard'!$B59&'PCON Dashboard'!$C59,'Apps-Ach-PCON (R)'!$D$3:$CE$3,0))","v":1500},{"$f":"INDEX('Apps-Ach-PCON (R)'!$D$545:$CE$556,MATCH($E59,'Apps-Ach-PCON (R)'!$B$545:$B$556,0),MATCH('PCON Dashboard'!H$8&'PCON Dashboard'!$B59&'PCON Dashboard'!$C59,'Apps-Ach-PCON (R)'!$D$3:$CE$3,0))","v":2700},{"$f":"INDEX('Apps-Ach-PCON (R)'!$D$545:$CE$556,MATCH($E59,'Apps-Ach-PCON (R)'!$B$545:$B$556,0),MATCH('PCON Dashboard'!I$8&'PCON Dashboard'!$B59&'PCON Dashboard'!$C59,'Apps-Ach-PCON (R)'!$D$3:$CE$3,0))","v":4300},{"$f":"INDEX('Apps-Ach-PCON (R)'!$D$545:$CE$556,MATCH($E59,'Apps-Ach-PCON (R)'!$B$545:$B$556,0),MATCH('PCON Dashboard'!J$8&'PCON Dashboard'!$B59&'PCON Dashboard'!$C59,'Apps-Ach-PCON (R)'!$D$3:$CE$3,0))","v":6900}]
[null,"Higher","All","Total","Grand Total",{"$f":"INDEX('Apps-Ach-PCON (R)'!$D$545:$CE$556,MATCH($E60,'Apps-Ach-PCON (R)'!$B$545:$B$556,0),MATCH('PCON Dashboard'!F$8&'PCON Dashboard'!$B60&'PCON Dashboard'!$C60,'Apps-Ach-PCON (R)'!$D$3:$CE$3,0))","v":1200},{"$f":"INDEX('Apps-Ach-PCON (R)'!$D$545:$CE$556,MATCH($E60,'Apps-Ach-PCON (R)'!$B$545:$B$556,0),MATCH('PCON Dashboard'!G$8&'PCON Dashboard'!$B60&'PCON Dashboard'!$C60,'Apps-Ach-PCON (R)'!$D$3:$CE$3,0))","v":1600},{"$f":"INDEX('Apps-Ach-PCON (R)'!$D$545:$CE$556,MATCH($E60,'Apps-Ach-PCON (R)'!$B$545:$B$556,0),MATCH('PCON Dashboard'!H$8&'PCON Dashboard'!$B60&'PCON Dashboard'!$C60,'Apps-Ach-PCON (R)'!$D$3:$CE$3,0))","v":2700},{"$f":"INDEX('Apps-Ach-PCON (R)'!$D$545:$CE$556,MATCH($E60,'Apps-Ach-PCON (R)'!$B$545:$B$556,0),MATCH('PCON Dashboard'!I$8&'PCON Dashboard'!$B60&'PCON Dashboard'!$C60,'Apps-Ach-PCON (R)'!$D$3:$CE$3,0))","v":4300},{"$f":"INDEX('Apps-Ach-PCON (R)'!$D$545:$CE$556,MATCH($E60,'Apps-Ach-PCON (R)'!$B$545:$B$556,0),MATCH('PCON Dashboard'!J$8&'PCON Dashboard'!$B60&'PCON Dashboard'!$C60,'Apps-Ach-PCON (R)'!$D$3:$CE$3,0))","v":7000}]
[null,"Higher","Under 19","PCON",{"$f":"INDEX('Apps-Ach-PCON (R)'!$B:$B,MATCH('PCON Dashboard'!$E$3,'Apps-Ach-PCON (R)'!$A:$A,0))","v":"Aldershot"},{"$f":"INDEX('Apps-Ach-PCON (R)'!$D$7:$CE$539,MATCH('PCON Dashboard'!$E$3,'Apps-Ach-PCON (R)'!$A$7:$A$539,0),MATCH(F$8&$B61&$C61,'Apps-Ach-PCON (R)'!$D$3:$CE$3,0))","v":"-"},{"$f":"INDEX('Apps-Ach-PCON (R)'!$D$7:$CE$539,MATCH('PCON Dashboard'!$E$3,'Apps-Ach-PCON (R)'!$A$7:$A$539,0),MATCH(G$8&$B61&$C61,'Apps-Ach-PCON (R)'!$D$3:$CE$3,0))","v":"-"},{"$f":"INDEX('Apps-Ach-PCON (R)'!$D$7:$CE$539,MATCH('PCON Dashboard'!$E$3,'Apps-Ach-PCON (R)'!$A$7:$A$539,0),MATCH(H$8&$B61&$C61,'Apps-Ach-PCON (R)'!$D$3:$CE$3,0))","v":"-"},{"$f":"INDEX('Apps-Ach-PCON (R)'!$D$7:$CE$539,MATCH('PCON Dashboard'!$E$3,'Apps-Ach-PCON (R)'!$A$7:$A$539,0),MATCH(I$8&$B61&$C61,'Apps-Ach-PCON (R)'!$D$3:$CE$3,0))","v":"-"},{"$f":"INDEX('Apps-Ach-PCON (R)'!$D$7:$CE$539,MATCH('PCON Dashboard'!$E$3,'Apps-Ach-PCON (R)'!$A$7:$A$539,0),MATCH(J$8&$B61&$C61,'Apps-Ach-PCON (R)'!$D$3:$CE$3,0))","v":"-"}]
[null,"Higher","Under 19","Region",{"$f":"INDEX(Lists!$H:$H,MATCH('PCON Dashboard'!E61,Lists!$I:$I,0))","v":"South East"},{"$f":"INDEX('Apps-Ach-PCON (R)'!$D$545:$CE$556,MATCH($E62,'Apps-Ach-PCON (R)'!$B$545:$B$556,0),MATCH('PCON Dashboard'!F$8&'PCON Dashboard'!$B62&'PCON Dashboard'!$C62,'Apps-Ach-PCON (R)'!$D$3:$CE$3,0))","v":"-"},{"$f":"INDEX('Apps-Ach-PCON (R)'!$D$545:$CE$556,MATCH($E62,'Apps-Ach-PCON (R)'!$B$545:$B$556,0),MATCH('PCON Dashboard'!G$8&'PCON Dashboard'!$B62&'PCON Dashboard'!$C62,'Apps-Ach-PCON (R)'!$D$3:$CE$3,0))","v":10},{"$f":"INDEX('Apps-Ach-PCON (R)'!$D$545:$CE$556,MATCH($E62,'Apps-Ach-PCON (R)'!$B$545:$B$556,0),MATCH('PCON Dashboard'!H$8&'PCON Dashboard'!$B62&'PCON Dashboard'!$C62,'Apps-Ach-PCON (R)'!$D$3:$CE$3,0))","v":20},{"$f":"INDEX('Apps-Ach-PCON (R)'!$D$545:$CE$556,MATCH($E62,'Apps-Ach-PCON (R)'!$B$545:$B$556,0),MATCH('PCON Dashboard'!I$8&'PCON Dashboard'!$B62&'PCON Dashboard'!$C62,'Apps-Ach-PCON (R)'!$D$3:$CE$3,0))","v":30},{"$f":"INDEX('Apps-Ach-PCON (R)'!$D$545:$CE$556,MATCH($E62,'Apps-Ach-PCON (R)'!$B$545:$B$556,0),MATCH('PCON Dashboard'!J$8&'PCON Dashboard'!$B62&'PCON Dashboard'!$C62,'Apps-Ach-PCON (R)'!$D$3:$CE$3,0))","v":50}]
[null,"Higher","Under 19","National","England",{"$f":"INDEX('Apps-Ach-PCON (R)'!$D$545:$CE$556,MATCH($E63,'Apps-Ach-PCON (R)'!$B$545:$B$556,0),MATCH('PCON Dashboard'!F$8&'PCON Dashboard'!$B63&'PCON Dashboard'!$C63,'Apps-Ach-PCON (R)'!$D$3:$CE$3,0))","v":100},{"$f":"INDEX('Apps-Ach-PCON (R)'!$D$545:$CE$556,MATCH($E63,'Apps-Ach-PCON (R)'!$B$545:$B$556,0),MATCH('PCON Dashboard'!G$8&'PCON Dashboard'!$B63&'PCON Dashboard'!$C63,'Apps-Ach-PCON (R)'!$D$3:$CE$3,0))","v":100},{"$f":"INDEX('Apps-Ach-PCON (R)'!$D$545:$CE$556,MATCH($E63,'Apps-Ach-PCON (R)'!$B$545:$B$556,0),MATCH('PCON Dashboard'!H$8&'PCON Dashboard'!$B63&'PCON Dashboard'!$C63,'Apps-Ach-PCON (R)'!$D$3:$CE$3,0))","v":200},{"$f":"INDEX('Apps-Ach-PCON (R)'!$D$545:$CE$556,MATCH($E63,'Apps-Ach-PCON (R)'!$B$545:$B$556,0),MATCH('PCON Dashboard'!I$8&'PCON Dashboard'!$B63&'PCON Dashboard'!$C63,'Apps-Ach-PCON (R)'!$D$3:$CE$3,0))","v":300},{"$f":"INDEX('Apps-Ach-PCON (R)'!$D$545:$CE$556,MATCH($E63,'Apps-Ach-PCON (R)'!$B$545:$B$556,0),MATCH('PCON Dashboard'!J$8&'PCON Dashboard'!$B63&'PCON Dashboard'!$C63,'Apps-Ach-PCON (R)'!$D$3:$CE$3,0))","v":400}]
[null,"Higher","Under 19","Total","Grand Total",{"$f":"INDEX('Apps-Ach-PCON (R)'!$D$545:$CE$556,MATCH($E64,'Apps-Ach-PCON (R)'!$B$545:$B$556,0),MATCH('PCON Dashboard'!F$8&'PCON Dashboard'!$B64&'PCON Dashboard'!$C64,'Apps-Ach-PCON (R)'!$D$3:$CE$3,0))","v":100},{"$f":"INDEX('Apps-Ach-PCON (R)'!$D$545:$CE$556,MATCH($E64,'Apps-Ach-PCON (R)'!$B$545:$B$556,0),MATCH('PCON Dashboard'!G$8&'PCON Dashboard'!$B64&'PCON Dashboard'!$C64,'Apps-Ach-PCON (R)'!$D$3:$CE$3,0))","v":100},{"$f":"INDEX('Apps-Ach-PCON (R)'!$D$545:$CE$556,MATCH($E64,'Apps-Ach-PCON (R)'!$B$545:$B$556,0),MATCH('PCON Dashboard'!H$8&'PCON Dashboard'!$B64&'PCON Dashboard'!$C64,'Apps-Ach-PCON (R)'!$D$3:$CE$3,0))","v":200},{"$f":"INDEX('Apps-Ach-PCON (R)'!$D$545:$CE$556,MATCH($E64,'Apps-Ach-PCON (R)'!$B$545:$B$556,0),MATCH('PCON Dashboard'!I$8&'PCON Dashboard'!$B64&'PCON Dashboard'!$C64,'Apps-Ach-PCON (R)'!$D$3:$CE$3,0))","v":300},{"$f":"INDEX('Apps-Ach-PCON (R)'!$D$545:$CE$556,MATCH($E64,'Apps-Ach-PCON (R)'!$B$545:$B$556,0),MATCH('PCON Dashboard'!J$8&'PCON Dashboard'!$B64&'PCON Dashboard'!$C64,'Apps-Ach-PCON (R)'!$D$3:$CE$3,0))","v":400}]
[null,"Higher","19-24","PCON",{"$f":"INDEX('Apps-Ach-PCON (R)'!$B:$B,MATCH('PCON Dashboard'!$E$3,'Apps-Ach-PCON (R)'!$A:$A,0))","v":"Aldershot"},{"$f":"INDEX('Apps-Ach-PCON (R)'!$D$7:$CE$539,MATCH('PCON Dashboard'!$E$3,'Apps-Ach-PCON (R)'!$A$7:$A$539,0),MATCH(F$8&$B65&$C65,'Apps-Ach-PCON (R)'!$D$3:$CE$3,0))","v":"-"},{"$f":"INDEX('Apps-Ach-PCON (R)'!$D$7:$CE$539,MATCH('PCON Dashboard'!$E$3,'Apps-Ach-PCON (R)'!$A$7:$A$539,0),MATCH(G$8&$B65&$C65,'Apps-Ach-PCON (R)'!$D$3:$CE$3,0))","v":"-"},{"$f":"INDEX('Apps-Ach-PCON (R)'!$D$7:$CE$539,MATCH('PCON Dashboard'!$E$3,'Apps-Ach-PCON (R)'!$A$7:$A$539,0),MATCH(H$8&$B65&$C65,'Apps-Ach-PCON (R)'!$D$3:$CE$3,0))","v":"-"},{"$f":"INDEX('Apps-Ach-PCON (R)'!$D$7:$CE$539,MATCH('PCON Dashboard'!$E$3,'Apps-Ach-PCON (R)'!$A$7:$A$539,0),MATCH(I$8&$B65&$C65,'Apps-Ach-PCON (R)'!$D$3:$CE$3,0))","v":"-"},{"$f":"INDEX('Apps-Ach-PCON (R)'!$D$7:$CE$539,MATCH('PCON Dashboard'!$E$3,'Apps-Ach-PCON (R)'!$A$7:$A$539,0),MATCH(J$8&$B65&$C65,'Apps-Ach-PCON (R)'!$D$3:$CE$3,0))","v":10}]
[null,"Higher","19-24","Region",{"$f":"INDEX(Lists!$H:$H,MATCH('PCON Dashboard'!E65,Lists!$I:$I,0))","v":"South East"},{"$f":"INDEX('Apps-Ach-PCON (R)'!$D$545:$CE$556,MATCH($E66,'Apps-Ach-PCON (R)'!$B$545:$B$556,0),MATCH('PCON Dashboard'!F$8&'PCON Dashboard'!$B66&'PCON Dashboard'!$C66,'Apps-Ach-PCON (R)'!$D$3:$CE$3,0))","v":80},{"$f":"INDEX('Apps-Ach-PCON (R)'!$D$545:$CE$556,MATCH($E66,'Apps-Ach-PCON (R)'!$B$545:$B$556,0),MATCH('PCON Dashboard'!G$8&'PCON Dashboard'!$B66&'PCON Dashboard'!$C66,'Apps-Ach-PCON (R)'!$D$3:$CE$3,0))","v":100},{"$f":"INDEX('Apps-Ach-PCON (R)'!$D$545:$CE$556,MATCH($E66,'Apps-Ach-PCON (R)'!$B$545:$B$556,0),MATCH('PCON Dashboard'!H$8&'PCON Dashboard'!$B66&'PCON Dashboard'!$C66,'Apps-Ach-PCON (R)'!$D$3:$CE$3,0))","v":140},{"$f":"INDEX('Apps-Ach-PCON (R)'!$D$545:$CE$556,MATCH($E66,'Apps-Ach-PCON (R)'!$B$545:$B$556,0),MATCH('PCON Dashboard'!I$8&'PCON Dashboard'!$B66&'PCON Dashboard'!$C66,'Apps-Ach-PCON (R)'!$D$3:$CE$3,0))","v":150},{"$f":"INDEX('Apps-Ach-PCON (R)'!$D$545:$CE$556,MATCH($E66,'Apps-Ach-PCON (R)'!$B$545:$B$556,0),MATCH('PCON Dashboard'!J$8&'PCON Dashboard'!$B66&'PCON Dashboard'!$C66,'Apps-Ach-PCON (R)'!$D$3:$CE$3,0))","v":210}]
[null,"Higher","19-24","National","England",{"$f":"INDEX('Apps-Ach-PCON (R)'!$D$545:$CE$556,MATCH($E67,'Apps-Ach-PCON (R)'!$B$545:$B$556,0),MATCH('PCON Dashboard'!F$8&'PCON Dashboard'!$B67&'PCON Dashboard'!$C67,'Apps-Ach-PCON (R)'!$D$3:$CE$3,0))","v":800},{"$f":"INDEX('Apps-Ach-PCON (R)'!$D$545:$CE$556,MATCH($E67,'Apps-Ach-PCON (R)'!$B$545:$B$556,0),MATCH('PCON Dashboard'!G$8&'PCON Dashboard'!$B67&'PCON Dashboard'!$C67,'Apps-Ach-PCON (R)'!$D$3:$CE$3,0))","v":800},{"$f":"INDEX('Apps-Ach-PCON (R)'!$D$545:$CE$556,MATCH($E67,'Apps-Ach-PCON (R)'!$B$545:$B$556,0),MATCH('PCON Dashboard'!H$8&'PCON Dashboard'!$B67&'PCON Dashboard'!$C67,'Apps-Ach-PCON (R)'!$D$3:$CE$3,0))","v":1100},{"$f":"INDEX('Apps-Ach-PCON (R)'!$D$545:$CE$556,MATCH($E67,'Apps-Ach-PCON (R)'!$B$545:$B$556,0),MATCH('PCON Dashboard'!I$8&'PCON Dashboard'!$B67&'PCON Dashboard'!$C67,'Apps-Ach-PCON (R)'!$D$3:$CE$3,0))","v":1100},{"$f":"INDEX('Apps-Ach-PCON (R)'!$D$545:$CE$556,MATCH($E67,'Apps-Ach-PCON (R)'!$B$545:$B$556,0),MATCH('PCON Dashboard'!J$8&'PCON Dashboard'!$B67&'PCON Dashboard'!$C67,'Apps-Ach-PCON (R)'!$D$3:$CE$3,0))","v":1500}]
[null,"Higher","19-24","Total","Grand Total",{"$f":"INDEX('Apps-Ach-PCON (R)'!$D$545:$CE$556,MATCH($E68,'Apps-Ach-PCON (R)'!$B$545:$B$556,0),MATCH('PCON Dashboard'!F$8&'PCON Dashboard'!$B68&'PCON Dashboard'!$C68,'Apps-Ach-PCON (R)'!$D$3:$CE$3,0))","v":800},{"$f":"INDEX('Apps-Ach-PCON (R)'!$D$545:$CE$556,MATCH($E68,'Apps-Ach-PCON (R)'!$B$545:$B$556,0),MATCH('PCON Dashboard'!G$8&'PCON Dashboard'!$B68&'PCON Dashboard'!$C68,'Apps-Ach-PCON (R)'!$D$3:$CE$3,0))","v":800},{"$f":"INDEX('Apps-Ach-PCON (R)'!$D$545:$CE$556,MATCH($E68,'Apps-Ach-PCON (R)'!$B$545:$B$556,0),MATCH('PCON Dashboard'!H$8&'PCON Dashboard'!$B68&'PCON Dashboard'!$C68,'Apps-Ach-PCON (R)'!$D$3:$CE$3,0))","v":1100},{"$f":"INDEX('Apps-Ach-PCON (R)'!$D$545:$CE$556,MATCH($E68,'Apps-Ach-PCON (R)'!$B$545:$B$556,0),MATCH('PCON Dashboard'!I$8&'PCON Dashboard'!$B68&'PCON Dashboard'!$C68,'Apps-Ach-PCON (R)'!$D$3:$CE$3,0))","v":1100},{"$f":"INDEX('Apps-Ach-PCON (R)'!$D$545:$CE$556,MATCH($E68,'Apps-Ach-PCON (R)'!$B$545:$B$556,0),MATCH('PCON Dashboard'!J$8&'PCON Dashboard'!$B68&'PCON Dashboard'!$C68,'Apps-Ach-PCON (R)'!$D$3:$CE$3,0))","v":1600}]
[null,"Higher","25+","PCON",{"$f":"INDEX('Apps-Ach-PCON (R)'!$B:$B,MATCH('PCON Dashboard'!$E$3,'Apps-Ach-PCON (R)'!$A:$A,0))","v":"Aldershot"},{"$f":"INDEX('Apps-Ach-PCON (R)'!$D$7:$CE$539,MATCH('PCON Dashboard'!$E$3,'Apps-Ach-PCON (R)'!$A$7:$A$539,0),MATCH(F$8&$B69&$C69,'Apps-Ach-PCON (R)'!$D$3:$CE$3,0))","v":"-"},{"$f":"INDEX('Apps-Ach-PCON (R)'!$D$7:$CE$539,MATCH('PCON Dashboard'!$E$3,'Apps-Ach-PCON (R)'!$A$7:$A$539,0),MATCH(G$8&$B69&$C69,'Apps-Ach-PCON (R)'!$D$3:$CE$3,0))","v":"-"},{"$f":"INDEX('Apps-Ach-PCON (R)'!$D$7:$CE$539,MATCH('PCON Dashboard'!$E$3,'Apps-Ach-PCON (R)'!$A$7:$A$539,0),MATCH(H$8&$B69&$C69,'Apps-Ach-PCON (R)'!$D$3:$CE$3,0))","v":"-"},{"$f":"INDEX('Apps-Ach-PCON (R)'!$D$7:$CE$539,MATCH('PCON Dashboard'!$E$3,'Apps-Ach-PCON (R)'!$A$7:$A$539,0),MATCH(I$8&$B69&$C69,'Apps-Ach-PCON (R)'!$D$3:$CE$3,0))","v":10},{"$f":"INDEX('Apps-Ach-PCON (R)'!$D$7:$CE$539,MATCH('PCON Dashboard'!$E$3,'Apps-Ach-PCON (R)'!$A$7:$A$539,0),MATCH(J$8&$B69&$C69,'Apps-Ach-PCON (R)'!$D$3:$CE$3,0))","v":10}]
[null,"Higher","25+","Region",{"$f":"INDEX(Lists!$H:$H,MATCH('PCON Dashboard'!E69,Lists!$I:$I,0))","v":"South East"},{"$f":"INDEX('Apps-Ach-PCON (R)'!$D$545:$CE$556,MATCH($E70,'Apps-Ach-PCON (R)'!$B$545:$B$556,0),MATCH('PCON Dashboard'!F$8&'PCON Dashboard'!$B70&'PCON Dashboard'!$C70,'Apps-Ach-PCON (R)'!$D$3:$CE$3,0))","v":20},{"$f":"INDEX('Apps-Ach-PCON (R)'!$D$545:$CE$556,MATCH($E70,'Apps-Ach-PCON (R)'!$B$545:$B$556,0),MATCH('PCON Dashboard'!G$8&'PCON Dashboard'!$B70&'PCON Dashboard'!$C70,'Apps-Ach-PCON (R)'!$D$3:$CE$3,0))","v":40},{"$f":"INDEX('Apps-Ach-PCON (R)'!$D$545:$CE$556,MATCH($E70,'Apps-Ach-PCON (R)'!$B$545:$B$556,0),MATCH('PCON Dashboard'!H$8&'PCON Dashboard'!$B70&'PCON Dashboard'!$C70,'Apps-Ach-PCON (R)'!$D$3:$CE$3,0))","v":140},{"$f":"INDEX('Apps-Ach-PCON (R)'!$D$545:$CE$556,MATCH($E70,'Apps-Ach-PCON (R)'!$B$545:$B$556,0),MATCH('PCON Dashboard'!I$8&'PCON Dashboard'!$B70&'PCON Dashboard'!$C70,'Apps-Ach-PCON (R)'!$D$3:$CE$3,0))","v":310},{"$f":"INDEX('Apps-Ach-PCON (R)'!$D$545:$CE$556,MATCH($E70,'Apps-Ach-PCON (R)'!$B$545:$B$556,0),MATCH('PCON Dashboard'!J$8&'PCON Dashboard'!$B70&'PCON Dashboard'!$C70,'Apps-Ach-PCON (R)'!$D$3:$CE$3,0))","v":700}]
[null,"Higher","25+","National","England",{"$f":"INDEX('Apps-Ach-PCON (R)'!$D$545:$CE$556,MATCH($E71,'Apps-Ach-PCON (R)'!$B$545:$B$556,0),MATCH('PCON Dashboard'!F$8&'PCON Dashboard'!$B71&'PCON Dashboard'!$C71,'Apps-Ach-PCON (R)'!$D$3:$CE$3,0))","v":300},{"$f":"INDEX('Apps-Ach-PCON (R)'!$D$545:$CE$556,MATCH($E71,'Apps-Ach-PCON (R)'!$B$545:$B$556,0),MATCH('PCON Dashboard'!G$8&'PCON Dashboard'!$B71&'PCON Dashboard'!$C71,'Apps-Ach-PCON (R)'!$D$3:$CE$3,0))","v":600},{"$f":"INDEX('Apps-Ach-PCON (R)'!$D$545:$CE$556,MATCH($E71,'Apps-Ach-PCON (R)'!$B$545:$B$556,0),MATCH('PCON Dashboard'!H$8&'PCON Dashboard'!$B71&'PCON Dashboard'!$C71,'Apps-Ach-PCON (R)'!$D$3:$CE$3,0))","v":1400},{"$f":"INDEX('Apps-Ach-PCON (R)'!$D$545:$CE$556,MATCH($E71,'Apps-Ach-PCON (R)'!$B$545:$B$556,0),MATCH('PCON Dashboard'!I$8&'PCON Dashboard'!$B71&'PCON Dashboard'!$C71,'Apps-Ach-PCON (R)'!$D$3:$CE$3,0))","v":2800},{"$f":"INDEX('Apps-Ach-PCON (R)'!$D$545:$CE$556,MATCH($E71,'Apps-Ach-PCON (R)'!$B$545:$B$556,0),MATCH('PCON Dashboard'!J$8&'PCON Dashboard'!$B71&'PCON Dashboard'!$C71,'Apps-Ach-PCON (R)'!$D$3:$CE$3,0))","v":4900}]
[null,"Higher","25+","Total","Grand Total",{"$f":"INDEX('Apps-Ach-PCON (R)'!$D$545:$CE$556,MATCH($E72,'Apps-Ach-PCON (R)'!$B$545:$B$556,0),MATCH('PCON Dashboard'!F$8&'PCON Dashboard'!$B72&'PCON Dashboard'!$C72,'Apps-Ach-PCON (R)'!$D$3:$CE$3,0))","v":300},{"$f":"INDEX('Apps-Ach-PCON (R)'!$D$545:$CE$556,MATCH($E72,'Apps-Ach-PCON (R)'!$B$545:$B$556,0),MATCH('PCON Dashboard'!G$8&'PCON Dashboard'!$B72&'PCON Dashboard'!$C72,'Apps-Ach-PCON (R)'!$D$3:$CE$3,0))","v":600},{"$f":"INDEX('Apps-Ach-PCON (R)'!$D$545:$CE$556,MATCH($E72,'Apps-Ach-PCON (R)'!$B$545:$B$556,0),MATCH('PCON Dashboard'!H$8&'PCON Dashboard'!$B72&'PCON Dashboard'!$C72,'Apps-Ach-PCON (R)'!$D$3:$CE$3,0))","v":1400},{"$f":"INDEX('Apps-Ach-PCON (R)'!$D$545:$CE$556,MATCH($E72,'Apps-Ach-PCON (R)'!$B$545:$B$556,0),MATCH('PCON Dashboard'!I$8&'PCON Dashboard'!$B72&'PCON Dashboard'!$C72,'Apps-Ach-PCON (R)'!$D$3:$CE$3,0))","v":2900},{"$f":"INDEX('Apps-Ach-PCON (R)'!$D$545:$CE$556,MATCH($E72,'Apps-Ach-PCON (R)'!$B$545:$B$556,0),MATCH('PCON Dashboard'!J$8&'PCON Dashboard'!$B72&'PCON Dashboard'!$C72,'Apps-Ach-PCON (R)'!$D$3:$CE$3,0))","v":5000}]

{"sheet":"Apps Ach - LEALA (R)","index":4,"n_rows":374,"n_cols":82,"rows_kept":374,"cut":false,"hidden":true,"merged":[]}
["Apprenticeship Framework Achievements by Local Education Authority, Local Authority, Level and Age (2011/12 to 2015/16)"]
[null,null,1,2,3,4,5,6,7,8,9,10,11,12,13,14,15,16,1,2,3,4,5,6,7,8,9,10,11,12,13,14,15,16,1,2,3,4,5,6,7,8,9,10,11,12,13,14,15,16,1,2,3,4,5,6,7,8,9,10,11,12,13,14,15,16,1,2,3,4,5,6,7,8,9,10,11,12,13,14,15,16]
[null,null,{"$f":"C4&C5&C6","v":"2011/12IntermediateUnder 19"},{"$f":"D4&D5&D6","v":"2011/12Intermediate19-24"},"2011/12Intermediate25+","2011/12IntermediateAll","2011/12AdvancedUnder 19","2011/12Advanced19-24","2011/12Advanced25+","2011/12AdvancedAll","2011/12HigherUnder 19","2011/12Higher19-24","2011/12Higher25+","2011/12HigherAll","2011/12AllUnder 19","2011/12All19-24","2011/12All25+","2011/12AllAll","2012/13IntermediateUnder 19","2012/13Intermediate19-24","2012/13Intermediate25+","2012/13IntermediateAll","2012/13AdvancedUnder 19","2012/13Advanced19-24","2012/13Advanced25+","2012/13AdvancedAll","2012/13HigherUnder 19","2012/13Higher19-24","2012/13Higher25+","2012/13HigherAll","2012/13AllUnder 19","2012/13All19-24","2012/13All25+","2012/13AllAll","2013/14IntermediateUnder 19","2013/14Intermediate19-24","2013/14Intermediate25+","2013/14IntermediateAll","2013/14AdvancedUnder 19","2013/14Advanced19-24","2013/14Advanced25+","2013/14AdvancedAll","2013/14HigherUnder 19","2013/14Higher19-24","2013/14Higher25+","2013/14HigherAll","2013/14AllUnder 19","2013/14All19-24","2013/14All25+","2013/14AllAll","2014/15IntermediateUnder 19","2014/15Intermediate19-24","2014/15Intermediate25+","2014/15IntermediateAll","2014/15AdvancedUnder 19","2014/15Advanced19-24","2014/15Advanced25+","2014/15AdvancedAll","2014/15HigherUnder 19","2014/15Higher19-24","2014/15Higher25+","2014/15HigherAll","2014/15AllUnder 19","2014/15All19-24","2014/15All25+","2014/15AllAll","2015/16IntermediateUnder 19",{"$f":"BP4&BP5&BP6","v":"2015/16Intermediate19-24"},"2015/16Intermediate25+","2015/16IntermediateAll","2015/16AdvancedUnder 19","2015/16Advanced19-24","2015/16Advanced25+","2015/16AdvancedAll","2015/16HigherUnder 19","2015/16Higher19-24","2015/16Higher25+","2015/16HigherAll","2015/16AllUnder 19","2015/16All19-24","2015/16All25+","2015/16AllAll"]
["Local Education Authority /\nLocal Authority                                         Year",null,"2011/12",{"$f":"C4","v":"2011/12"},{"$f":"D4","v":"2011/12"},"2011/12","2011/12","2011/12","2011/12","2011/12","2011/12","2011/12","2011/12","2011/12","2011/12","2011/12","2011/12","2011/12","2012/13",{"$f":"S4","v":"2012/13"},{"$f":"T4","v":"2012/13"},"2012/13","2012/13","2012/13","2012/13","2012/13","2012/13","2012/13","2012/13","2012/13","2012/13","2012/13","2012/13","2012/13","2013/14",{"$f":"AI4","v":"2013/14"},{"$f":"AJ4","v":"2013/14"},"2013/14","2013/14","2013/14","2013/14","2013/14","2013/14","2013/14","2013/14","2013/14","2013/14","2013/14","2013/14","2013/14","2014/15",{"$f":"AY4","v":"2014/15"},{"$f":"AZ4","v":"2014/15"},"2014/15","2014/15","2014/15","2014/15","2014/15","2014/15","2014/15","2014/15","2014/15","2014/15","2014/15","2014/15",{"$f":"BM4","v":"2014/15"},"2015/16",{"$f":"BO4","v":"2015/16"},{"$f":"BP4","v":"2015/16"},"2015/16","2015/16","2015/16","2015/16","2015/16","2015/16","2015/16","2015/16","2015/16","2015/16","2015/16","2015/16","2015/16"]
[null,"Level","Intermediate","Intermediate","Intermediate","Intermediate","Advanced","Advanced","Advanced","Advanced","Higher","Higher","Higher","Higher","All","All","All","All","Intermediate","Intermediate","Intermediate","Intermediate","Advanced","Advanced","Advanced","Advanced","Higher","Higher","Higher","Higher","All","All","All","All","Intermediate","Intermediate","Intermediate","Intermediate","Advanced","Advanced","Advanced","Advanced","Higher","Higher","Higher","Higher","All","All","All","All","Intermediate","Intermediate","Intermediate","Intermediate","Advanced","Advanced","Advanced","Advanced","Higher","Higher","Higher","Higher","All","All","All","All","Intermediate","Intermediate","Intermediate","Intermediate","Advanced","Advanced","Advanced","Advanced","Higher","Higher","Higher","Higher","All","All","All","All"]
[null,"                                                        Age","Under 19","19-24","25+","All","Under 19","19-24","25+","All","Under 19","19-24","25+","All","Under 19","19-24","25+","All","Under 19","19-24","25+","All","Under 19","19-24","25+","All","Under 19","19-24","25+","All","Under 19","19-24","25+","All","Under 19","19-24","25+","All","Under 19","19-24","25+","All","Under 19","19-24","25+","All","Under 19","19-24","25+","All","Under 19","19-24","25+","All","Under 19","19-24","25+","All","Under 19","19-24","25+","All","Under 19","19-24","25+","All","Under 19","19-24","25+","All","Under 19","19-24","25+","All","Under 19","19-24","25+","All","Under 19","19-24","25+","All"]
[1,"Adur",null,null,null,null,null,null,null,null,null,null,null,null,null,null,null,null,50,40,40,120,20,40,60,110,"-","-","-","-",70,70,100,230,50,50,50,150,20,50,50,110,"-","-","-","-",60,100,100,260,60,60,50,160,30,30,30,80,"-","-","-","-",80,90,80,250,40,60,50,150,20,30,20,80,"-","-",10,10,60,100,80,240]
[2,"Allerdale",null,null,null,null,null,null,null,null,null,null,null,null,null,null,null,null,140,100,130,370,80,70,70,230,"-","-","-","-",220,180,200,600,160,120,120,400,90,120,130,330,"-",10,"-",10,250,240,250,750,170,130,140,440,130,110,80,320,"-","-","-",10,310,250,220,770,160,130,150,440,130,120,60,310,"-","-","-",10,290,250,220,760]
[3,"Amber Valley",null,null,null,null,null,null,null,null,null,null,null,null,null,null,null,null,170,140,180,490,80,80,130,290,"-",10,"-",10,250,230,310,780,150,160,140,460,60,110,130,300,"-",10,10,10,210,280,280,770,180,140,140,460,90,120,80,290,10,10,10,20,270,270,230,780,210,150,170,530,90,110,120,320,"-",10,20,30,310,260,300,870]
[4,"Arun",null,null,null,null,null,null,null,null,null,null,null,null,null,null,null,null,80,140,170,390,40,100,140,270,"-","-","-","-",120,240,310,660,90,130,150,370,30,100,140,270,"-","-","-","-",120,220,290,630,100,160,160,420,40,90,110,240,"-","-",10,10,140,250,290,670,80,130,170,380,30,90,110,220,"-","-",30,30,110,220,300,630]
[5,"Ashfield",null,null,null,null,null,null,null,null,null,null,null,null,null,null,null,null,170,190,270,620,50,110,150,310,"-",10,"-",10,210,300,420,930,160,170,180,510,60,90,150,310,"-","-",10,10,230,270,330,830,170,180,170,520,90,120,110,320,"-",10,10,20,270,300,290,860,230,150,200,580,80,110,90,290,"-","-",30,30,310,270,320,900]
[6,"Ashford",null,null,null,null,null,null,null,null,null,null,null,null,null,null,null,null,90,160,250,500,30,70,90,180,"-","-","-","-",110,230,340,690,100,110,120,330,90,80,110,280,"-","-","-","-",190,190,230,610,90,100,100,290,50,70,60,190,"-","-",10,10,140,170,170,480,110,90,140,340,50,60,80,190,"-","-",10,20,150,160,240,550]
[7,"Aylesbury Vale",null,null,null,null,null,null,null,null,null,null,null,null,null,null,null,null,130,140,120,400,60,100,100,250,"-","-","-","-",190,240,220,650,150,160,140,460,60,90,120,270,"-","-","-",10,210,250,270,730,130,140,120,390,70,100,120,280,"-","-","-","-",200,240,240,670,150,160,140,450,80,100,100,290,"-","-",20,20,230,260,260,750]
[8,"Babergh",null,null,null,null,null,null,null,null,null,null,null,null,null,null,null,null,70,60,80,210,20,30,50,100,"-","-","-",10,90,100,130,320,90,70,50,210,30,50,60,140,"-","-","-","-",120,120,110,350,100,90,80,270,40,60,40,140,"-","-",10,10,140,140,130,410,90,70,70,220,40,50,70,160,"-","-",10,20,130,120,150,390]
[9,"Barking and Dagenham",130,120,210,450,60,70,110,240,"-","-","-","-",180,190,310,690,130,110,180,420,50,80,150,280,"-","-","-","-",170,190,330,700,130,140,190,460,50,90,190,330,"-","-","-","-",180,230,380,790,160,160,260,570,70,90,150,310,"-","-",20,20,230,250,420,900,160,160,300,620,100,120,180,400,"-","-",20,20,260,280,500,1030]
[10,"Barnet",90,120,200,410,30,80,100,210,"-","-","-",10,120,200,300,620,80,110,230,420,30,70,130,230,"-","-","-","-",110,180,360,650,90,130,160,370,40,90,130,270,"-","-","-","-",130,220,290,640,70,130,180,380,40,100,100,230,"-",10,10,10,110,230,290,620,80,120,210,410,70,100,140,310,"-",10,20,30,150,220,370,750]
[11,"Barnsley",440,300,390,1130,150,200,220,570,"-",10,10,20,590,510,620,1720,270,250,450,980,130,220,370,720,"-",10,10,10,400,470,830,1700,390,300,350,1040,140,220,300,660,"-","-",10,10,520,520,660,1700,480,330,400,1220,140,230,260,630,"-","-",10,10,620,560,670,1850,390,330,420,1140,160,250,200,610,"-",10,20,40,550,580,640,1780]
[12,"Barrow in Furness",null,null,null,null,null,null,null,null,null,null,null,null,null,null,null,null,90,90,110,290,90,60,130,280,"-","-","-","-",180,150,240,570,90,90,100,280,80,80,120,290,"-","-","-",10,170,180,220,570,90,80,80,260,150,100,70,320,"-","-","-","-",240,180,160,580,100,90,60,250,130,100,90,320,"-",10,10,20,240,190,160,590]
[13,"Basildon",null,null,null,null,null,null,null,null,null,null,null,null,null,null,null,null,170,120,140,440,60,80,100,230,"-","-","-","-",230,200,240,670,200,130,120,440,90,110,110,310,"-","-","-","-",290,240,230,760,190,190,110,490,60,110,100,270,"-","-",10,20,250,300,230,770,210,170,160,540,80,140,110,340,"-","-",10,10,290,320,280,890]
[14,"Basingstoke and Deane",null,null,null,null,null,null,null,null,null,null,null,null,null,null,null,null,120,130,220,470,60,90,140,290,"-","-","-","-",180,220,360,760,110,120,130,360,60,80,100,240,"-","-","-",10,170,200,230,600,120,120,160,400,70,120,90,280,"-",10,"-",10,190,250,250,690,130,100,150,380,110,120,120,340,"-",10,10,20,240,220,280,740]
[15,"Bassetlaw",null,null,null,null,null,null,null,null,null,null,null,null,null,null,null,null,100,110,150,370,40,100,130,270,"-","-","-",10,150,210,290,650,140,110,120,370,50,90,110,240,"-","-",10,10,180,200,240,620,160,150,140,450,60,80,90,230,"-","-",10,20,220,230,250,700,130,110,150,390,60,100,110,270,"-",10,10,20,200,210,270,680]
[16,"Bath and North East Somerset",110,120,130,360,40,70,70,170,"-","-","-","-",150,190,190,530,130,100,160,390,60,100,80,240,"-","-","-","-",190,200,250,630,90,120,130,340,70,100,80,250,"-","-","-",10,160,220,210,590,110,110,120,350,60,100,80,230,"-","-","-",10,170,210,210,590,110,90,140,330,60,90,80,220,"-","-",10,10,170,170,220,560]
[17,"Bedford Borough",80,80,110,270,70,60,50,180,"-","-","-","-",150,130,170,450,60,90,130,280,40,50,100,190,"-","-","-","-",100,140,230,470,80,100,140,310,40,70,100,210,"-","-","-",10,120,160,250,520,90,100,250,440,60,70,100,240,"-","-","-",10,150,180,360,680,90,90,140,330,70,90,90,260,"-",10,20,30,170,190,260,620]
[18,"Bexley",290,170,170,620,130,130,70,330,"-","-","-","-",420,300,240,960,200,180,230,610,100,120,140,350,"-","-","-",10,290,300,370,960,250,190,140,570,100,140,170,410,"-",10,10,10,350,330,310,990,270,170,130,570,120,130,130,370,"-",10,10,10,400,310,260,960,250,160,180,590,120,160,140,420,"-",10,20,30,370,340,330,1030]
[19,"Birmingham",1070,950,1370,3390,430,540,620,1600,"-",10,"-",10,1510,1500,1990,5000,730,870,1480,3080,300,570,930,1800,"-",20,40,60,1030,1470,2440,4940,800,1190,1560,3540,380,600,870,1850,10,20,60,90,1190,1810,2480,5480,820,1060,1440,3320,390,650,690,1740,"-",20,120,150,1220,1740,2260,5210,820,1310,1920,4050,420,650,830,1890,10,50,220,280,1240,2020,2960,6230]
[20,"Blaby",null,null,null,null,null,null,null,null,null,null,null,null,null,null,null,null,110,80,130,320,50,60,70,180,"-","-","-",10,160,140,200,510,110,100,100,310,40,70,90,200,"-","-","-","-",150,170,190,520,130,100,100,330,50,80,50,190,"-","-",10,10,180,190,160,520,130,110,80,320,60,80,60,200,"-",10,10,10,190,190,150,530]
[21,"Blackburn with Darwen",270,180,200,640,70,100,140,300,"-","-","-","-",340,270,330,950,200,180,220,600,80,130,210,410,"-","-","-","-",270,310,440,1020,170,160,220,540,70,120,240,420,"-","-",10,10,240,280,460,970,150,220,270,640,70,160,150,370,"-","-",10,20,230,380,430,1030,220,140,190,550,70,140,140,340,"-","-",30,30,290,280,360,930]
[22,"Blackpool",190,180,210,580,70,110,160,340,"-","-","-","-",250,290,380,920,130,190,310,620,40,140,200,380,"-","-","-",10,170,330,510,1010,90,150,180,420,60,110,220,400,"-",10,10,10,160,270,410,840,160,180,280,610,50,140,220,410,"-","-",20,20,220,320,520,1050,150,160,270,580,50,130,220,400,10,"-",50,60,210,290,540,1030]
[23,"Bolsover",null,null,null,null,null,null,null,null,null,null,null,null,null,null,null,null,120,90,150,370,30,60,90,180,"-","-","-",10,160,160,240,550,100,110,140,340,50,80,90,220,"-","-",10,10,150,180,240,570,110,110,120,330,40,70,60,180,"-","-","-","-",150,180,180,520,110,100,140,350,50,80,100,230,"-",10,10,20,170,180,250,590]
[24,"Bolton",340,360,360,1060,120,190,230,540,"-",10,"-",10,460,550,590,1610,240,310,420,970,100,220,290,620,"-",10,"-",10,350,540,710,1600,240,310,340,890,90,220,350,660,"-","-",10,10,330,540,700,1570,280,330,340,950,130,250,230,620,10,10,10,30,420,590,580,1590,300,320,410,1040,120,240,300,660,"-","-",20,30,430,560,740,1720]
[25,"Boston",null,null,null,null,null,null,null,null,null,null,null,null,null,null,null,null,60,50,60,170,30,30,40,100,"-","-","-","-",100,80,100,280,40,50,50,140,30,50,50,130,"-","-","-",10,70,110,100,280,50,50,60,170,30,40,40,110,"-","-",10,10,80,90,110,280,80,60,80,210,40,30,50,110,"-","-","-","-",110,90,130,320]
[26,"Bournemouth",110,170,210,490,40,100,150,290,"-","-","-","-",150,270,360,780,120,150,240,510,50,120,200,360,"-","-","-",10,170,270,440,870,130,190,230,560,60,110,200,370,"-","-","-","-",190,300,440,930,150,180,230,560,50,140,160,350,"-","-",10,10,200,320,400,920,170,170,250,580,60,120,150,320,"-","-",30,30,230,290,420,930]
[27,"Bracknell Forest",90,80,80,250,50,50,80,180,"-","-","-","-",130,130,160,430,70,80,120,270,40,70,60,170,"-","-","-","-",120,150,180,440,90,90,100,270,50,80,60,190,"-","-","-","-",140,160,160,460,90,60,120,270,60,90,60,210,"-",10,"-",10,150,160,180,490,80,80,80,240,50,70,70,200,"-",10,10,20,130,160,160,450]
[28,"Bradford",630,490,640,1760,200,290,310,800,"-",10,10,10,830,790,950,2570,540,430,610,1590,170,270,410,850,"-",10,10,20,720,710,1030,2450,450,400,480,1330,210,310,450,970,"-",10,20,30,660,720,950,2330,430,480,530,1430,230,320,370,920,"-",10,20,30,660,800,920,2370,460,440,610,1500,210,350,400,950,"-",10,30,40,660,790,1030,2490]
[29,"Braintree",null,null,null,null,null,null,null,null,null,null,null,null,null,null,null,null,110,110,150,360,40,80,100,220,"-","-","-","-",150,190,250,580,130,130,140,410,40,110,110,260,"-",10,10,20,160,250,270,680,140,140,130,400,40,100,90,230,"-","-",20,20,170,240,240,650,180,120,120,410,50,100,100,260,"-","-",20,20,230,220,240,690]
[30,"Breckland",null,null,null,null,null,null,null,null,null,null,null,null,null,null,null,null,120,130,140,390,30,60,120,210,"-",10,"-",10,150,190,260,610,120,100,90,310,40,80,130,250,"-","-","-","-",160,180,220,560,130,140,150,410,50,80,80,210,"-",10,"-",10,180,220,230,630,130,120,160,420,40,70,110,220,"-",10,30,40,170,200,300,680]
[31,"Brent",140,150,270,550,30,60,110,200,"-","-","-","-",160,210,390,760,70,120,290,480,30,80,170,280,"-","-","-",10,100,200,460,760,80,100,210,390,30,90,170,280,"-","-","-","-",110,190,380,680,60,140,260,460,30,90,100,220,"-","-",10,10,90,230,360,680,80,160,410,650,60,110,200,360,"-",10,10,10,130,280,620,1020]
[32,"Brentwood",null,null,null,null,null,null,null,null,null,null,null,null,null,null,null,null,50,40,40,120,30,30,40,90,"-","-","-","-",70,70,80,220,60,40,30,130,30,30,30,90,"-","-","-","-",90,70,70,220,70,50,40,160,20,40,30,80,"-","-","-","-",90,80,70,250,60,50,40,140,30,40,30,100,"-","-","-",10,80,90,70,250]
[33,"Brighton and Hove",140,190,150,490,60,90,100,250,"-","-","-","-",200,280,250,740,130,170,160,460,50,100,200,340,"-","-","-","-",180,270,350,800,120,160,130,410,40,120,150,310,"-","-","-","-",160,280,280,720,160,210,180,540,50,120,130,310,"-","-",10,10,210,330,320,860,110,150,160,420,70,140,130,330,"-","-",10,10,180,290,290,760]
[34,"Bristol",320,400,530,1240,170,200,230,600,"-",10,10,20,490,600,760,1860,290,280,530,1100,140,200,250,590,"-",10,"-",10,430,480,780,1690,330,320,360,1010,110,220,300,630,"-","-",10,10,440,540,670,1650,340,290,490,1120,140,210,220,570,"-","-",10,20,470,510,730,1710,260,260,390,910,170,250,220,630,10,10,30,40,440,520,630,1590]
[35,"Broadland",null,null,null,null,null,null,null,null,null,null,null,null,null,null,null,null,140,90,280,510,50,50,120,220,"-",10,"-",10,190,150,400,740,140,100,70,310,60,90,70,220,"-",10,"-",10,200,190,150,540,190,120,90,410,40,80,80,200,"-","-",10,10,240,200,180,620,120,100,70,290,70,90,70,230,"-",10,10,20,190,200,150,530]
[36,"Bromley",210,170,140,520,90,130,130,350,"-",10,"-",10,300,310,270,880,160,170,150,480,80,110,160,340,"-","-","-",10,230,290,310,830,190,180,130,500,120,140,160,420,"-",10,"-",10,310,320,290,930,220,200,150,570,130,140,120,400,"-","-",10,10,350,340,280,980,170,140,200,520,100,130,130,360,"-",10,20,30,280,290,340,910]
[37,"Bromsgrove",null,null,null,null,null,null,null,null,null,null,null,null,null,null,null,null,80,100,120,290,40,70,70,170,"-","-","-","-",110,170,190,470,70,100,100,270,30,80,70,190,"-","-",10,10,100,190,170,460,80,100,100,290,50,50,60,160,"-","-",10,10,130,150,170,450,70,90,80,230,50,60,60,170,"-","-",20,20,130,150,160,430]
[38,"Broxbourne",null,null,null,null,null,null,null,null,null,null,null,null,null,null,null,null,50,50,80,170,40,30,50,110,"-","-","-","-",80,80,120,280,60,70,50,190,50,40,40,130,"-","-","-","-",110,110,100,320,70,70,70,210,50,60,40,160,"-","-",10,10,120,140,110,370,80,60,70,220,40,80,70,180,"-","-",10,10,130,140,150,410]
[39,"Broxtowe",null,null,null,null,null,null,null,null,null,null,null,null,null,null,null,null,120,90,100,310,40,70,70,180,"-","-","-","-",160,160,180,500,110,130,100,350,60,60,90,210,"-","-","-",10,170,200,200,560,120,110,110,340,60,70,50,180,10,10,"-",20,190,190,160,530,120,90,100,320,70,80,60,200,"-","-",10,20,190,180,170,530]
[40,"Buckinghamshire",330,390,290,1010,140,210,150,490,"-","-","-","-",470,600,430,1500,290,300,330,920,150,250,270,670,"-",10,"-",10,440,560,600,1600,310,310,290,910,160,270,270,690,"-",10,10,20,460,590,560,1610,300,320,280,900,170,260,260,690,"-",10,10,20,480,590,540,1610,330,310,310,940,200,240,220,650,"-",10,30,50,520,560,560,1640]
[41,"Burnley",null,null,null,null,null,null,null,null,null,null,null,null,null,null,null,null,90,110,150,350,50,80,130,260,"-","-","-","-",150,190,280,620,110,110,120,350,50,110,160,310,"-","-","-","-",160,220,280,670,120,120,90,330,40,110,120,270,"-","-",10,10,160,240,220,610,120,120,110,360,70,90,80,250,"-","-",20,20,190,220,220,630]
[42,"Bury",250,220,220,690,70,140,150,360,"-",10,"-",10,330,360,370,1060,160,210,260,630,70,110,190,380,"-","-",10,10,230,330,450,1010,160,250,200,610,70,140,210,430,"-",10,10,20,230,400,430,1060,160,190,200,560,80,160,170,410,"-","-",10,20,250,360,380,990,150,180,240,570,80,140,180,400,"-","-",10,20,230,330,430,990]
[43,"Calderdale",280,210,260,750,130,200,240,570,"-",10,"-",10,410,410,490,1320,220,200,280,690,130,150,270,540,"-",10,"-",10,340,350,550,1250,190,220,210,610,120,170,250,540,"-",10,10,10,310,390,470,1170,250,250,260,760,120,180,270,560,"-","-",10,10,370,430,540,1330,230,240,280,760,110,180,250,540,"-",10,30,40,350,430,550,1330]
[44,"Cambridge",null,null,null,null,null,null,null,null,null,null,null,null,null,null,null,null,30,60,80,180,10,40,50,90,"-","-","-","-",40,100,130,270,40,60,100,200,10,30,50,100,"-","-","-",10,50,100,150,300,30,50,90,170,10,50,50,110,"-","-","-","-",40,100,140,280,30,50,80,170,20,30,40,90,"-","-",10,10,50,90,130,260]
[45,"Cambridgeshire",430,470,360,1260,160,300,240,700,"-",10,"-",20,590,780,600,1980,360,430,550,1340,130,240,340,710,"-",10,10,20,490,680,900,2060,380,470,470,1320,150,310,370,830,"-",20,20,40,530,790,860,2190,400,420,470,1290,200,330,320,850,"-",10,30,40,600,760,820,2180,410,400,490,1300,220,330,320,860,"-",20,40,60,630,740,850,2220]
[46,"Camden",50,70,90,210,20,40,50,100,"-","-","-","-",70,110,140,320,40,80,80,200,20,40,40,110,"-","-","-","-",70,120,130,310,40,50,70,160,20,30,50,100,"-","-","-","-",60,90,120,270,50,70,80,200,30,60,30,120,"-","-","-","-",80,140,110,330,60,60,90,210,30,60,40,120,"-",10,"-",10,80,120,130,330]
[47,"Cannock Chase",null,null,null,null,null,null,null,null,null,null,null,null,null,null,null,null,110,120,160,390,60,70,90,210,"-","-","-",10,170,190,250,610,120,130,150,410,40,90,120,240,"-","-",10,10,160,220,280,660,140,130,140,410,60,100,100,260,"-","-",10,20,200,230,250,690,140,110,150,400,60,90,100,240,"-",10,30,40,190,210,270,670]
[48,"Canterbury",null,null,null,null,null,null,null,null,null,null,null,null,null,null,null,null,80,90,90,270,30,60,100,190,"-","-","-","-",110,150,190,460,100,110,90,300,30,70,80,170,"-","-","-","-",130,170,170,470,80,130,100,300,30,70,80,180,"-","-","-",10,110,200,180,490,70,80,120,270,30,50,110,190,"-","-",20,20,100,130,250,480]
[49,"Carlisle",null,null,null,null,null,null,null,null,null,null,null,null,null,null,null,null,150,120,150,420,50,80,80,210,"-","-","-","-",200,200,230,630,140,130,110,370,70,80,120,270,"-","-","-","-",210,210,230,640,180,150,160,490,50,100,90,240,"-","-","-","-",240,250,250,730,210,120,120,440,70,100,80,240,"-","-",10,10,270,220,200,700]
[50,"Castle Point",null,null,null,null,null,null,null,null,null,null,null,null,null,null,null,null,120,80,70,270,50,30,40,120,"-","-","-","-",170,110,110,390,120,80,50,250,40,60,60,170,"-","-","-","-",170,140,110,420,100,90,60,250,50,60,40,150,"-","-","-","-",150,150,100,400,110,90,60,260,40,70,30,140,"-","-",10,10,150,150,110,410]
[51,"Central Bedfordshire",180,210,210,600,130,130,100,360,"-","-","-","-",310,340,310,960,180,190,220,590,90,140,160,390,"-",10,"-",10,270,330,390,990,160,200,180,540,80,160,180,410,"-",10,"-",10,240,370,360,970,190,180,220,590,140,190,120,440,"-","-",10,10,330,380,340,1050,180,160,230,560,140,190,150,480,"-",10,20,40,320,360,400,1070]
[52,"Charnwood",null,null,null,null,null,null,null,null,null,null,null,null,null,null,null,null,140,130,200,470,50,100,100,240,"-","-","-","-",190,220,300,720,150,150,120,430,60,110,110,280,"-","-",10,10,210,260,240,710,160,150,190,500,90,110,90,290,"-","-",10,10,260,260,290,810,190,140,160,490,70,110,100,280,"-",10,10,20,260,250,260,780]
[53,"Chelmsford",null,null,null,null,null,null,null,null,null,null,null,null,null,null,null,null,120,100,120,340,50,80,90,220,"-","-","-","-",160,190,210,560,170,120,80,380,80,80,100,260,"-","-",10,10,250,210,190,650,150,140,90,380,40,100,50,200,"-",10,10,10,190,250,150,590,150,110,110,370,70,110,90,260,"-",10,20,30,220,220,220,660]
[54,"Cheltenham",null,null,null,null,null,null,null,null,null,null,null,null,null,null,null,null,50,110,110,280,20,50,50,130,"-","-","-","-",80,160,160,410,70,70,80,220,20,60,70,150,"-","-","-",10,90,130,150,380,60,60,120,230,30,60,50,140,"-",10,"-",10,90,130,160,380,70,80,110,260,40,40,50,130,"-","-",10,10,100,130,160,390]
[55,"Cherwell",null,null,null,null,null,null,null,null,null,null,null,null,null,null,null,null,90,110,160,370,30,70,100,200,"-","-",10,10,120,180,270,580,100,110,140,340,60,90,110,270,"-","-",10,10,160,200,260,620,100,110,130,330,60,100,70,230,"-","-",10,10,160,210,210,570,90,80,120,290,60,80,60,200,"-","-",10,10,150,160,200,510]
[56,"Cheshire East",460,380,300,1140,130,230,190,550,"-",20,10,20,590,630,500,1710,240,370,480,1090,130,270,280,670,"-",10,10,20,370,650,770,1790,270,340,380,990,190,290,300,780,"-",20,20,40,460,650,700,1810,320,340,300,950,180,260,190,640,"-",20,20,40,500,620,510,1630,330,350,320,990,190,300,270,750,10,20,20,60,530,670,610,1800]
[57,"Cheshire West and Chester",360,430,430,1210,160,260,300,720,"-",10,10,10,520,690,740,1940,230,360,480,1070,140,240,370,750,"-",10,"-",10,370,610,850,1840,300,320,400,1030,160,260,340,760,"-",10,10,20,470,590,760,1810,270,370,420,1060,170,270,310,750,"-",10,30,40,450,640,760,1850,310,320,330,950,160,250,260,680,"-",10,40,50,470,580,630,1680]
[58,"Chesterfield",null,null,null,null,null,null,null,null,null,null,null,null,null,null,null,null,100,160,240,500,40,80,120,240,"-","-","-","-",140,240,370,750,160,150,170,480,40,120,160,320,"-","-","-","-",200,270,330,800,160,130,150,440,50,110,100,250,"-","-",10,10,200,240,250,700,160,150,190,500,80,110,120,310,"-","-",10,10,240,260,320,820]
[59,"Chichester",null,null,null,null,null,null,null,null,null,null,null,null,null,null,null,null,50,70,60,170,20,40,70,130,"-","-","-","-",60,110,130,300,60,80,70,200,20,50,60,130,"-","-","-","-",80,130,130,330,50,60,70,180,20,60,50,130,"-","-","-",10,70,120,130,320,50,70,70,180,20,60,50,120,"-","-","-",10,60,130,120,310]
[60,"Chiltern",null,null,null,null,null,null,null,null,null,null,null,null,null,null,null,null,50,40,30,120,30,40,40,110,"-","-","-","-",70,90,70,230,50,40,30,120,30,40,40,100,"-","-","-","-",70,80,70,220,40,30,40,120,20,40,30,90,"-","-","-","-",60,70,70,210,50,30,40,120,30,30,20,80,"-","-",10,10,80,70,60,210]
[61,"Chorley",null,null,null,null,null,null,null,null,null,null,null,null,null,null,null,null,120,110,160,380,40,70,150,270,"-",10,"-",10,160,190,310,660,120,120,120,350,60,110,130,290,"-",10,10,20,170,230,260,670,120,100,90,300,60,110,90,250,"-","-",10,10,170,210,190,570,110,90,140,340,80,70,90,230,"-",10,10,20,190,170,240,590]
[62,"Christchurch",null,null,null,null,null,null,null,null,null,null,null,null,null,null,null,null,30,30,40,100,10,30,40,80,"-","-","-","-",40,70,80,180,40,40,30,110,10,30,40,90,"-","-","-","-",60,70,70,200,40,30,40,110,20,40,30,90,"-","-","-","-",60,70,70,200,40,40,40,110,20,50,30,90,"-","-",10,10,60,80,70,210]
[63,"City Of London","-","-","-",10,"-","-","-","-","-","-","-","-","-","-",10,10,"-","-","-",10,"-","-","-","-","-","-","-","-","-","-",10,10,"-","-","-",10,"-","-","-","-","-","-","-","-","-","-",10,10,"-","-",10,10,"-",10,"-",10,"-","-","-","-","-",10,10,20,"-","-","-","-","-","-","-","-","-","-","-","-","-","-","-",10]
[64,"Colchester",null,null,null,null,null,null,null,null,null,null,null,null,null,null,null,null,120,130,160,400,50,100,170,310,"-",10,"-",10,170,240,330,730,120,170,170,450,50,120,170,340,"-","-",10,20,170,290,350,810,130,190,200,520,60,120,120,300,"-",10,30,40,190,320,360,870,150,180,200,530,50,130,160,340,"-",10,50,60,200,320,410,920]
[65,"Copeland",null,null,null,null,null,null,null,null,null,null,null,null,null,null,null,null,110,70,110,280,90,60,70,220,"-","-","-","-",200,120,180,500,110,90,80,290,90,80,60,230,"-","-","-",10,200,170,140,520,140,80,80,300,130,80,50,260,"-","-","-",10,280,160,130,570,130,90,60,280,120,70,50,240,"-",10,"-",10,240,170,110,520]
[66,"Corby",null,null,null,null,null,null,null,null,null,null,null,null,null,null,null,null,50,70,180,300,10,40,60,120,"-","-","-","-",60,110,240,410,40,100,120,260,20,60,80,150,"-","-","-","-",60,160,200,420,60,80,120,270,20,70,70,150,"-","-","-","-",80,150,190,420,80,90,180,350,30,40,50,130,"-","-","-",10,110,140,240,490]
[67,"Cornwall",null,null,null,null,null,null,null,null,null,null,null,null,null,null,null,null,440,610,800,1850,130,340,540,1010,"-",20,30,50,570,970,1370,2910,530,700,570,1810,150,450,670,1260,"-",30,30,60,680,1180,1260,3120,550,700,600,1850,160,450,430,1040,"-",20,30,40,710,1160,1060,2930,610,750,690,2040,170,400,520,1090,"-",10,70,80,780,1150,1280,3210]
[68,"Cornwall (Includes Isles of Scilly)",550,830,800,2180,170,400,480,1050,"-",20,30,50,720,1250,1310,3280,440,610,800,1850,130,340,540,1010,"-",20,30,50,570,970,1370,2910,540,700,570,1810,150,450,670,1260,"-",30,30,60,680,1180,1260,3130,550,700,600,1850,160,450,430,1040,"-",20,30,40,710,1160,1060,2930,610,750,690,2040,170,400,520,1090,"-",10,70,80,780,1150,1280,3210]
[69,"Cotswold",null,null,null,null,null,null,null,null,null,null,null,null,null,null,null,null,50,50,70,160,20,40,40,100,"-","-","-","-",70,90,110,270,50,60,50,150,20,30,50,100,"-","-","-","-",60,90,100,250,70,50,50,180,30,50,40,120,"-","-","-","-",100,110,90,300,60,50,40,150,30,40,30,100,"-","-","-","-",90,90,70,250]
[70,"Coventry",360,370,440,1160,210,230,190,630,"-","-","-",10,580,600,630,1800,280,340,530,1140,120,180,350,650,"-","-","-",10,400,520,880,1800,340,370,450,1150,120,180,320,620,"-",10,20,30,450,560,790,1800,280,310,500,1100,180,240,320,730,"-",10,30,40,470,560,850,1870,290,320,450,1060,180,250,240,680,"-",10,40,40,470,580,730,1780]
[71,"Craven",null,null,null,null,null,null,null,null,null,null,null,null,null,null,null,null,60,60,60,180,30,30,30,80,"-","-","-","-",90,80,90,270,50,50,40,150,30,30,40,90,"-","-","-","-",80,80,80,240,80,40,20,140,30,30,40,100,"-","-","-","-",110,70,70,240,50,40,40,130,40,40,30,110,"-","-",10,10,90,80,80,240]
[72,"Crawley",null,null,null,null,null,null,null,null,null,null,null,null,null,null,null,null,60,80,130,270,40,40,80,150,"-","-","-","-",90,130,200,420,70,80,110,260,10,40,70,130,"-","-","-","-",80,120,190,390,80,100,120,290,40,60,50,140,"-","-","-","-",110,160,170,430,70,70,110,260,40,50,60,140,"-","-",10,10,110,120,170,410]
[73,"Croydon",200,240,250,700,80,160,210,450,"-","-","-","-",290,410,460,1150,160,200,390,740,100,170,260,530,"-",10,"-",10,260,370,650,1280,180,210,230,620,80,170,250,500,"-",10,10,20,260,390,480,1130,180,200,290,680,100,170,210,470,"-",10,10,20,290,380,510,1170,140,190,320,650,100,140,280,520,"-",10,30,40,250,340,620,1210]
[74,"Cumbria",790,630,600,2020,450,430,340,1220,"-",10,"-",10,1240,1060,940,3250,670,540,680,1890,370,380,500,1240,"-",10,"-",20,1030,940,1180,3150,680,620,550,1840,420,500,590,1500,"-",10,10,20,1100,1130,1140,3370,760,610,640,2010,570,520,380,1470,10,10,10,30,1340,1130,1040,3510,800,590,550,1940,550,540,400,1490,10,20,30,60,1350,1150,980,3480]
[75,"Dacorum",null,null,null,null,null,null,null,null,null,null,null,null,null,null,null,null,70,90,140,310,20,50,50,130,"-","-","-","-",100,150,200,440,80,100,110,290,30,80,100,210,"-","-","-",10,110,180,210,500,80,100,100,280,30,80,60,180,"-","-",10,10,120,180,170,470,70,80,120,270,50,70,70,200,"-",10,10,20,120,160,200,480]
[76,"Darlington",170,170,230,570,80,90,130,300,"-","-","-","-",250,260,360,860,110,210,310,620,50,80,170,290,"-","-","-","-",150,280,480,910,130,150,170,450,60,90,150,300,"-","-",10,10,180,250,330,760,120,120,170,410,70,100,100,280,"-","-",10,10,190,220,280,690,110,140,210,460,70,110,120,310,"-","-",20,20,190,250,350,790]
[77,"Dartford",null,null,null,null,null,null,null,null,null,null,null,null,null,null,null,null,40,60,90,190,30,50,80,160,"-","-","-","-",70,110,170,350,90,60,80,220,30,50,80,150,"-","-","-","-",120,110,160,380,90,70,80,240,30,60,60,140,"-","-","-",10,120,130,140,390,80,80,80,240,50,70,70,190,"-","-",10,20,130,160,150,440]
[78,"Daventry",null,null,null,null,null,null,null,null,null,null,null,null,null,null,null,null,60,60,70,200,30,60,40,130,"-","-","-","-",90,120,120,330,80,80,70,240,40,60,70,170,"-","-","-",10,120,150,150,410,80,100,90,260,30,60,40,140,"-","-",10,10,110,150,140,410,80,80,80,250,40,50,40,130,"-","-",10,10,120,140,130,390]
[79,"Derby",330,300,430,1060,160,170,140,460,"-",10,10,20,490,470,570,1530,300,260,380,940,130,150,180,460,10,10,10,20,430,420,560,1420,270,260,270,800,140,180,190,510,"-",10,20,30,410,450,480,1340,340,310,290,930,170,190,150,510,10,10,"-",20,520,510,440,1460,320,220,310,850,210,210,180,590,10,20,30,60,540,450,510,1500]
[80,"Derbyshire",1100,850,1020,2970,460,540,530,1520,10,20,10,30,1560,1410,1550,4530,930,870,1200,3000,400,550,690,1640,"-",20,10,40,1330,1440,1900,4670,1020,980,1000,3010,430,680,820,1930,10,30,30,70,1460,1690,1850,5000,1150,940,910,2990,500,730,560,1790,10,30,40,80,1660,1700,1510,4860,1170,890,1090,3160,570,720,710,2000,20,30,80,130,1750,1650,1880,5280]
[81,"Derbyshire Dales",null,null,null,null,null,null,null,null,null,null,null,null,null,null,null,null,60,60,60,170,30,30,30,90,"-","-","-","-",80,80,100,260,90,80,40,210,30,50,50,120,"-",10,"-",10,120,130,90,340,100,70,50,220,40,70,40,150,"-","-","-",10,140,140,90,370,90,60,70,230,30,60,40,130,"-","-","-",10,130,130,110,360]
[82,"Devon",880,1030,870,2790,280,510,550,1340,"-",20,20,40,1170,1560,1440,4170,800,1100,910,2800,260,430,580,1260,"-",10,10,20,1060,1530,1490,4090,850,940,670,2460,260,550,630,1440,"-",20,20,40,1110,1520,1310,3940,980,1070,900,2950,340,580,450,1370,"-",20,20,40,1320,1670,1370,4360,890,930,760,2570,330,600,570,1500,10,20,50,80,1220,1550,1380,4150]
[83,"Doncaster",530,370,460,1360,160,220,270,640,"-",10,"-",10,690,590,740,2010,380,350,520,1250,120,250,550,920,"-","-","-","-",490,610,1070,2170,330,330,440,1110,140,270,440,850,"-","-",10,10,470,600,890,1960,400,390,450,1240,150,240,290,670,"-","-",20,20,540,630,760,1930,390,390,680,1450,150,190,320,660,"-","-",30,30,530,590,1020,2150]
[84,"Dorset",520,690,480,1680,180,530,310,1020,"-",10,"-",10,690,1220,780,2700,470,470,490,1430,310,580,410,1290,"-","-",10,10,780,1050,910,2730,480,620,430,1540,210,670,560,1440,"-",10,"-",10,700,1290,990,2980,520,690,420,1630,240,650,420,1310,"-","-",20,30,770,1340,860,2970,550,710,430,1690,230,600,450,1280,"-",10,30,40,780,1320,910,3010]
[85,"Dover",null,null,null,null,null,null,null,null,null,null,null,null,null,null,null,null,60,100,110,280,10,50,70,130,"-","-","-","-",80,150,190,410,80,110,70,270,30,70,100,190,"-",10,"-",10,110,180,180,470,100,100,100,310,30,80,70,180,"-","-",10,10,130,180,180,500,130,100,110,340,20,50,100,170,"-","-",20,20,150,160,220,530]
[86,"Dudley",500,340,350,1190,120,200,260,580,"-",10,"-",20,620,550,610,1780,300,280,400,990,90,210,320,620,"-","-",20,20,390,500,740,1630,340,300,390,1030,130,240,350,720,10,10,20,30,470,550,760,1780,380,360,350,1090,150,250,290,680,10,10,50,60,530,610,690,1830,380,370,360,1110,140,250,240,630,10,20,70,100,530,650,660,1830]
[87,"Durham",910,610,1230,2760,330,420,630,1380,"-",10,"-",20,1250,1050,1860,4150,440,640,1500,2580,270,420,890,1580,"-",10,10,20,720,1070,2390,4180,600,670,960,2240,320,500,720,1540,"-",10,20,40,920,1180,1710,3810,560,680,960,2200,320,460,580,1370,"-",20,90,110,880,1160,1640,3680,690,690,1300,2680,370,510,670,1550,"-",20,110,140,1060,1220,2080,4370]
[88,"Ealing",170,200,280,660,50,90,130,270,"-","-","-","-",210,300,420,930,100,150,290,540,60,90,160,310,"-","-","-","-",160,240,450,850,90,140,210,440,50,120,160,330,"-","-","-",10,140,260,370,780,100,190,310,590,40,100,110,250,"-","-","-",10,140,290,420,850,90,150,260,500,60,110,140,300,"-",10,10,20,150,260,410,820]
[89,"East Cambridgeshire",null,null,null,null,null,null,null,null,null,null,null,null,null,null,null,null,50,70,90,210,30,30,40,100,"-","-","-","-",80,100,130,310,80,70,80,230,30,40,60,130,"-","-","-",10,100,120,150,360,70,70,60,200,30,60,40,130,"-","-","-",10,90,140,110,340,80,50,60,190,30,50,70,150,"-","-","-",10,110,110,130,340]
[90,"East Devon",null,null,null,null,null,null,null,null,null,null,null,null,null,null,null,null,230,530,170,920,60,80,90,230,"-","-","-","-",290,610,260,1150,170,350,160,670,40,100,90,230,"-","-","-",10,210,450,250,910,260,460,210,920,70,100,60,230,"-",10,"-",10,330,560,270,1160,200,300,150,660,70,110,80,260,"-","-",20,20,270,420,250,940]
[91,"East Dorset",null,null,null,null,null,null,null,null,null,null,null,null,null,null,null,null,90,80,70,250,40,60,60,160,"-","-","-",10,130,140,140,410,100,80,70,240,40,70,60,160,"-","-","-","-",130,150,120,400,100,60,40,200,50,70,50,170,"-","-",10,10,150,130,90,380,110,100,70,280,60,70,50,180,"-","-",10,10,170,170,120,470]
[92,"East Hampshire",null,null,null,null,null,null,null,null,null,null,null,null,null,null,null,null,60,70,100,230,30,80,60,170,"-","-","-","-",90,140,160,390,80,70,60,210,40,50,60,150,"-","-","-","-",120,120,120,360,70,80,90,250,40,80,60,180,"-","-","-","-",110,160,160,430,100,100,70,270,50,120,60,230,"-",10,10,20,150,230,140,520]
[93,"East Hertfordshire",null,null,null,null,null,null,null,null,null,null,null,null,null,null,null,null,80,150,120,350,30,50,70,150,"-","-","-","-",110,200,180,500,80,100,70,250,30,50,50,130,"-","-","-","-",120,150,120,390,90,80,60,230,50,70,30,150,"-","-",10,10,140,150,100,390,90,70,70,230,30,60,60,150,"-","-",10,10,120,140,130,380]
[94,"East Lindsey",null,null,null,null,null,null,null,null,null,null,null,null,null,null,null,null,110,130,130,360,50,90,110,250,"-","-","-","-",160,220,240,620,120,130,120,380,50,90,150,290,"-","-",10,10,170,230,280,680,120,160,140,420,40,110,100,250,"-","-",10,10,160,270,250,680,130,140,170,440,60,80,120,260,"-","-",10,10,190,220,300,710]
[95,"East Northamptonshire",null,null,null,null,null,null,null,null,null,null,null,null,null,null,null,null,80,80,120,280,20,50,70,140,"-","-","-","-",100,130,200,420,70,60,110,250,30,50,80,160,"-","-","-",10,100,120,190,410,80,90,130,300,20,70,50,140,"-","-","-","-",100,160,180,450,110,100,100,300,40,80,50,170,"-","-",10,10,150,170,160,480]
[96,"East Riding of Yorkshire",550,870,720,2140,190,450,420,1060,"-",10,10,10,740,1330,1150,3220,540,690,680,1910,180,310,480,970,"-",10,"-",20,720,1010,1170,2900,490,570,540,1610,130,260,460,850,"-",10,10,20,630,840,1010,2470,480,710,640,1820,160,290,350,810,"-",10,20,30,640,1020,1010,2660,470,750,650,1870,200,300,370,870,"-",10,30,40,670,1060,1050,2780]
[97,"East Staffordshire",null,null,null,null,null,null,null,null,null,null,null,null,null,null,null,null,100,130,180,400,60,90,100,250,"-","-","-","-",160,220,280,650,90,140,160,390,40,60,90,200,"-","-","-",10,130,200,260,590,140,140,200,480,50,100,70,210,"-","-",10,10,180,240,270,700,110,120,230,460,70,100,90,250,"-",10,10,20,180,230,330,740]
[98,"East Sussex",430,420,620,1470,160,240,200,600,"-","-","-","-",590,660,820,2080,310,390,460,1160,130,240,390,760,"-","-","-","-",450,630,850,1930,310,380,390,1080,160,280,440,880,"-",10,10,10,470,670,840,1970,370,390,360,1120,150,290,330,760,"-",10,20,30,520,680,710,1910,350,370,490,1200,130,240,340,710,"-",10,70,70,480,620,900,1990]
[99,"Eastbourne",null,null,null,null,null,null,null,null,null,null,null,null,null,null,null,null,50,90,100,250,30,60,110,200,"-","-","-","-",80,150,210,450,60,80,100,240,40,50,130,210,"-","-","-","-",100,130,230,460,80,80,90,250,40,70,90,190,"-","-",10,10,110,140,190,450,60,70,120,260,20,50,80,150,"-","-",10,20,80,130,220,430]
[100,"Eastleigh",null,null,null,null,null,null,null,null,null,null,null,null,null,null,null,null,100,90,90,280,60,90,80,220,"-","-","-","-",160,180,160,500,100,100,110,320,60,120,100,280,"-",10,"-",10,160,230,220,610,110,100,110,320,80,100,80,270,"-","-",10,10,200,210,200,600,130,120,130,370,80,90,100,280,"-",10,10,20,210,220,240,670]
[101,"Eden",null,null,null,null,null,null,null,null,null,null,null,null,null,null,null,null,70,60,60,190,10,30,40,80,"-","-","-","-",90,90,100,280,80,60,40,180,30,40,40,110,"-","-","-","-",100,110,80,290,80,50,80,210,30,50,30,110,"-","-","-","-",120,100,110,320,100,50,40,190,30,60,30,120,"-","-","-","-",140,110,70,310]
[102,"Elmbridge",null,null,null,null,null,null,null,null,null,null,null,null,null,null,null,null,40,40,40,120,20,40,50,110,"-","-","-","-",60,80,90,220,30,40,60,130,20,50,40,110,"-","-","-","-",50,90,100,240,50,60,60,160,30,40,40,110,"-","-","-","-",70,100,100,270,40,40,40,120,30,30,40,90,"-","-",10,10,60,70,90,220]
[103,"Enfield",130,130,200,460,70,110,110,290,"-","-","-","-",190,240,310,750,120,110,310,530,80,100,160,340,"-","-","-","-",190,220,470,880,140,170,200,510,70,130,170,370,"-","-",10,10,210,300,380,890,150,190,240,580,100,130,120,340,"-","-",10,10,250,320,360,930,140,170,300,610,90,150,210,460,"-",10,20,20,240,330,530,1100]
[104,"Epping Forest",null,null,null,null,null,null,null,null,null,null,null,null,null,null,null,null,110,90,100,290,30,70,70,170,"-","-","-","-",140,160,170,460,90,70,50,210,40,60,70,160,"-","-","-","-",130,130,120,380,90,80,70,250,40,80,50,170,"-","-","-","-",140,160,120,420,90,70,80,240,60,60,70,190,"-","-",10,20,150,130,160,450]
[105,"Epsom and Ewell",null,null,null,null,null,null,null,null,null,null,null,null,null,null,null,null,30,20,30,90,20,20,50,90,"-","-","-","-",50,50,80,180,40,50,30,120,10,40,20,80,"-","-","-",10,60,90,60,200,30,30,40,100,20,40,30,80,"-","-","-","-",50,70,60,180,30,30,50,100,20,20,40,80,"-","-","-",10,50,50,90,190]
[106,"Erewash",null,null,null,null,null,null,null,null,null,null,null,null,null,null,null,null,170,120,170,460,70,100,100,260,"-",10,"-",10,240,230,260,730,180,140,160,480,90,100,90,280,"-",10,10,20,270,250,250,770,220,140,140,500,100,90,80,270,"-",10,10,10,320,240,220,780,180,130,150,470,90,100,80,270,"-","-",20,30,270,240,250,770]
[107,"Essex",1670,1270,1100,4040,470,650,570,1690,"-",20,"-",20,2140,1940,1670,5740,1140,1030,1160,3340,430,670,900,1990,"-",30,10,30,1570,1730,2060,5360,1310,1160,1020,3490,490,870,1000,2360,10,20,50,80,1810,2050,2070,5920,1280,1270,1110,3650,480,900,770,2140,"-",30,130,170,1760,2200,2000,5960,1410,1130,1190,3720,580,970,920,2470,10,50,190,250,1990,2150,2290,6440]
[108,"Exeter",null,null,null,null,null,null,null,null,null,null,null,null,null,null,null,null,100,100,140,350,40,80,100,210,"-","-","-","-",140,180,240,570,110,120,100,320,30,90,80,200,"-",10,"-",10,140,220,180,540,120,120,100,340,30,90,70,190,"-","-","-","-",160,210,170,540,120,120,120,360,40,110,90,240,"-","-",10,10,160,230,220,600]
[109,"Fareham",null,null,null,null,null,null,null,null,null,null,null,null,null,null,null,null,120,270,130,520,40,100,120,270,"-","-","-","-",160,370,260,790,140,350,140,630,50,130,140,310,"-","-","-",10,180,490,280,950,200,510,160,860,50,140,70,260,"-","-",10,10,250,650,240,1140,240,450,200,890,70,140,100,310,"-","-",10,10,310,600,310,1210]
[110,"Fenland",null,null,null,null,null,null,null,null,null,null,null,null,null,null,null,null,70,80,110,260,20,50,90,160,"-","-","-","-",90,130,210,430,70,100,90,260,20,50,80,150,"-","-","-",10,100,150,170,420,70,80,90,230,40,60,70,160,"-","-",10,10,110,130,170,400,100,80,90,270,60,60,70,190,"-","-",10,10,160,140,170,460]
[111,"Forest Heath",null,null,null,null,null,null,null,null,null,null,null,null,null,null,null,null,40,40,80,150,10,20,50,80,"-","-","-","-",50,60,120,230,40,50,70,150,30,40,60,120,"-","-","-","-",60,90,130,270,40,40,70,150,20,40,50,100,"-","-","-","-",50,80,120,260,40,50,60,150,20,30,60,110,"-","-","-",10,60,80,130,270]
[112,"Forest of Dean",null,null,null,null,null,null,null,null,null,null,null,null,null,null,null,null,80,80,80,240,30,60,60,150,"-","-","-","-",120,130,140,390,80,80,60,220,40,70,50,160,"-","-","-",10,130,150,120,390,80,80,60,210,70,80,60,200,"-","-",10,10,150,160,120,430,110,90,90,290,60,80,40,180,"-","-",20,20,170,170,150,490]
[113,"Fylde",null,null,null,null,null,null,null,null,null,null,null,null,null,null,null,null,60,100,120,280,40,40,70,150,"-","-","-","-",90,150,190,430,60,70,100,230,30,60,90,180,"-","-","-","-",90,130,190,410,60,90,90,240,40,70,70,180,"-","-",10,10,100,160,160,420,80,70,100,240,30,50,100,190,"-",10,20,30,110,130,210,450]
[114,"Gateshead",300,220,400,910,130,140,200,470,"-",10,"-",10,420,360,600,1390,170,180,460,810,120,150,280,550,"-",10,"-",10,290,330,740,1370,220,240,320,780,110,170,220,500,"-","-",10,10,330,410,550,1280,270,250,340,850,130,170,230,530,"-","-",20,20,400,420,580,1400,280,210,380,870,150,160,180,490,"-",10,20,30,440,370,580,1390]
[115,"Gedling",null,null,null,null,null,null,null,null,null,null,null,null,null,null,null,null,140,120,150,410,50,80,80,210,"-","-","-","-",190,200,230,630,130,130,120,380,50,100,90,240,"-","-","-","-",180,230,210,620,140,130,120,390,70,110,60,240,"-","-","-",10,210,240,190,640,140,110,130,380,70,80,70,220,"-",10,10,20,210,210,200,620]
[116,"Gloucester",null,null,null,null,null,null,null,null,null,null,null,null,null,null,null,null,110,120,160,390,40,100,110,250,"-","-","-",10,150,220,270,640,110,170,150,430,70,90,110,270,"-",10,10,10,180,260,260,710,130,120,130,380,70,110,90,280,"-",10,10,20,210,240,230,670,170,120,160,450,70,140,110,310,10,10,30,40,240,260,300,800]
[117,"Gloucestershire",490,570,530,1590,240,350,360,940,"-",10,"-",10,730,920,890,2540,420,510,590,1520,180,360,390,930,10,10,"-",20,600,890,990,2470,440,550,490,1490,230,360,380,970,"-",20,30,50,670,940,900,2510,500,480,520,1500,310,420,310,1040,10,20,20,50,810,930,850,2590,580,500,560,1640,290,430,340,1050,10,10,60,90,870,940,960,2770]
[118,"Gosport",null,null,null,null,null,null,null,null,null,null,null,null,null,null,null,null,100,250,190,540,30,120,140,290,"-","-","-","-",130,370,330,840,120,340,170,630,40,130,150,320,"-","-","-",10,160,470,320,950,170,410,160,740,50,100,120,270,"-","-",10,10,220,510,290,1010,200,430,190,820,40,140,180,360,"-",10,10,20,240,570,380,1190]
[119,"Gravesham",null,null,null,null,null,null,null,null,null,null,null,null,null,null,null,null,60,60,80,200,30,50,70,140,"-","-","-","-",90,110,140,340,70,90,90,250,40,50,80,170,"-","-","-",10,110,150,170,430,70,80,90,240,40,70,80,190,"-","-",10,10,110,150,170,430,70,90,100,250,40,60,80,180,"-","-",10,10,110,150,180,440]
[120,"Great Yarmouth",null,null,null,null,null,null,null,null,null,null,null,null,null,null,null,null,60,70,100,220,40,60,90,190,"-","-","-","-",100,130,190,420,110,80,100,290,50,60,100,210,"-","-","-",10,160,150,200,510,110,110,90,310,50,60,50,170,"-","-",20,20,160,180,160,490,110,110,80,290,60,90,70,220,"-","-",20,30,160,200,170,530]
[121,"Greenwich",420,210,240,860,60,100,110,270,"-","-","-","-",480,300,340,1120,180,160,210,540,50,80,150,270,"-","-","-","-",230,230,360,820,130,170,210,510,60,90,190,340,"-","-","-",10,190,270,400,860,170,200,240,610,70,110,140,320,"-","-",10,10,240,310,390,940,160,170,250,580,60,130,170,350,"-",10,10,20,220,300,430,950]
[122,"Guildford",null,null,null,null,null,null,null,null,null,null,null,null,null,null,null,null,60,170,100,330,10,60,90,160,"-","-","-","-",70,230,190,490,80,230,110,420,30,70,70,170,"-","-","-","-",110,300,180,600,80,90,90,250,30,70,60,160,"-",10,"-",10,110,170,150,420,60,50,80,190,30,60,50,140,"-","-",10,10,90,110,140,340]
[123,"Hackney",80,130,190,390,50,50,90,190,"-","-","-","-",130,180,270,580,50,80,200,330,30,70,150,250,"-","-","-","-",90,150,350,580,50,90,150,290,30,60,120,200,"-","-","-","-",80,150,270,490,60,120,200,390,50,60,70,180,"-","-","-","-",120,180,270,570,70,100,200,370,50,70,110,240,"-",10,30,30,120,180,340,640]
[124,"Halton",200,220,310,730,70,100,150,320,"-","-","-",10,270,320,470,1060,120,150,290,550,60,80,200,340,"-","-","-",10,180,230,490,900,140,120,220,480,80,90,160,340,"-","-","-",10,220,220,380,820,120,150,190,470,100,120,130,350,"-","-",10,10,220,280,330,830,110,120,210,440,80,110,140,330,"-","-",10,10,190,240,350,790]
[125,"Hambleton",null,null,null,null,null,null,null,null,null,null,null,null,null,null,null,null,80,80,120,290,40,50,80,170,"-","-","-","-",120,140,200,450,110,100,110,310,40,80,80,200,"-","-","-","-",150,170,190,510,90,100,90,280,40,70,80,200,"-","-",10,10,130,180,180,490,120,110,120,340,60,90,100,250,"-","-",10,10,170,200,220,590]
[126,"Hammersmith and Fulham",70,80,80,230,10,40,60,120,"-","-","-","-",80,120,140,350,30,70,70,170,10,40,70,110,"-","-","-","-",40,100,140,280,20,50,70,140,10,30,40,80,"-","-","-","-",30,80,110,220,40,60,80,190,20,30,30,80,"-","-","-","-",60,90,120,270,30,60,80,170,20,30,50,100,"-","-","-","-",40,90,140,270]
[127,"Hampshire",1310,2050,1700,5050,500,830,830,2160,"-",20,"-",20,1810,2900,2540,7240,1120,1540,1580,4230,460,950,1170,2580,"-",20,10,30,1580,2500,2760,6840,1150,1830,1280,4260,580,1100,1190,2870,"-",30,20,60,1730,2950,2490,7180,1270,2010,1540,4820,590,1220,900,2710,"-",30,70,90,1870,3260,2500,7630,1410,2000,1660,5060,720,1300,1040,3060,10,50,120,180,2140,3350,2810,8300]
[128,"Harborough",null,null,null,null,null,null,null,null,null,null,null,null,null,null,null,null,80,60,80,230,20,60,60,130,"-",10,"-",10,100,120,140,360,90,90,110,300,30,40,50,120,"-","-","-","-",120,140,160,420,80,60,70,220,40,60,50,150,"-","-","-",10,120,120,130,370,100,80,80,260,40,60,80,180,"-","-","-",10,140,140,160,440]
[129,"Haringey",70,100,220,390,30,50,80,160,"-","-","-","-",100,150,310,550,40,110,220,370,30,60,140,230,"-","-","-","-",60,170,360,600,50,90,170,310,20,60,140,220,"-","-","-","-",70,150,310,530,50,120,250,420,40,60,80,180,"-",10,10,10,80,190,340,610,50,110,290,440,50,80,140,260,"-",10,20,30,100,190,440,730]
[130,"Harlow",null,null,null,null,null,null,null,null,null,null,null,null,null,null,null,null,70,70,140,280,30,50,70,140,"-","-","-","-",100,120,200,410,70,80,110,260,20,50,80,160,"-","-","-",10,90,140,200,430,60,60,100,220,30,60,60,160,"-","-",10,10,90,120,170,380,60,60,100,220,20,50,70,140,"-",10,10,20,80,120,190,390]
[131,"Harrogate",null,null,null,null,null,null,null,null,null,null,null,null,null,null,null,null,440,150,170,760,60,90,140,290,"-","-","-","-",500,240,310,1050,520,130,100,760,70,110,140,310,"-","-","-","-",590,240,240,1070,120,140,140,400,70,120,100,290,"-","-","-",10,200,260,250,700,120,90,140,350,80,130,120,330,"-","-",10,20,200,220,280,690]
[132,"Harrow",130,120,180,430,30,40,70,140,"-","-","-","-",160,160,250,570,70,70,190,330,40,50,110,200,"-","-","-","-",120,120,300,530,60,80,120,260,20,40,90,150,"-","-","-","-",90,120,200,410,60,100,140,300,40,60,70,160,"-","-",10,10,100,150,220,470,50,90,170,320,50,60,70,170,"-",10,10,10,100,160,240,500]
[133,"Hart",null,null,null,null,null,null,null,null,null,null,null,null,null,null,null,null,50,50,80,180,30,40,70,140,"-","-","-","-",80,100,140,320,70,70,40,180,40,60,60,150,"-","-","-","-",110,120,100,330,70,50,60,180,30,50,30,110,"-","-","-","-",100,90,90,290,50,60,60,160,40,60,30,130,"-","-","-",10,90,130,90,300]
[134,"Hartlepool",160,110,160,430,70,70,100,240,"-","-","-","-",230,180,260,670,60,120,160,350,100,70,110,280,"-","-","-","-",160,200,270,630,130,140,180,440,70,70,100,240,"-","-","-","-",200,210,280,690,120,170,190,470,100,100,90,290,"-","-",10,10,220,270,280,770,150,180,150,480,100,110,110,320,"-","-",10,10,250,290,270,810]
[135,"Hastings",null,null,null,null,null,null,null,null,null,null,null,null,null,null,null,null,60,90,110,250,30,50,90,160,"-","-","-","-",80,130,200,420,40,60,70,170,30,60,80,170,"-","-","-","-",70,120,160,340,60,80,80,220,10,50,60,120,"-","-","-","-",70,120,150,340,50,60,110,220,10,40,80,130,"-","-",20,20,60,110,210,380]
[136,"Havant",null,null,null,null,null,null,null,null,null,null,null,null,null,null,null,null,120,110,150,370,50,70,90,210,"-","-","-","-",170,180,240,590,130,130,100,370,50,100,90,240,"-","-","-","-",180,230,190,610,120,130,130,380,50,100,60,220,"-",10,10,10,180,240,200,610,120,110,110,340,70,110,90,270,"-","-",20,20,200,220,210,630]
[137,"Havering",200,150,140,490,110,110,100,310,"-","-","-","-",300,260,230,790,230,150,150,520,90,100,130,330,"-","-","-",10,320,250,280,850,240,150,140,530,100,150,140,390,"-","-",10,10,340,300,290,930,240,210,190,650,130,170,110,410,"-",10,20,40,380,390,330,1100,250,190,210,650,150,160,130,450,10,10,30,50,410,360,370,1150]
[138,"Herefordshire",240,220,190,650,90,130,90,310,"-","-","-","-",340,350,280,960,160,200,250,610,80,150,180,410,"-",10,"-",10,240,360,430,1030,190,190,230,600,80,150,190,420,"-","-",10,10,270,340,420,1030,220,210,250,690,90,140,150,380,"-","-","-",10,320,350,410,1070,170,180,190,530,90,160,180,420,"-",10,10,30,260,350,380,980]
[139,"Hertfordshire",690,680,830,2200,340,440,350,1130,"-",10,"-",10,1030,1130,1180,3340,610,730,900,2230,250,430,520,1200,"-",10,10,20,860,1170,1430,3450,580,750,810,2140,280,480,600,1360,10,10,10,40,860,1250,1420,3540,640,740,830,2200,310,540,390,1230,10,30,40,80,950,1300,1260,3510,640,620,730,1990,310,530,500,1340,10,40,50,110,970,1190,1280,3440]
[140,"Hertsmere",null,null,null,null,null,null,null,null,null,null,null,null,null,null,null,null,80,80,90,250,20,40,60,130,"-","-","-","-",100,120,150,370,50,60,80,190,30,50,50,130,"-","-","-","-",80,120,130,320,60,70,80,210,20,40,40,90,"-","-","-",10,90,110,110,310,50,40,50,150,30,40,40,100,"-",10,10,10,80,90,100,260]
[141,"High Peak",null,null,null,null,null,null,null,null,null,null,null,null,null,null,null,null,80,90,90,260,50,50,70,170,"-","-","-",10,130,140,160,430,80,100,110,290,40,70,110,210,"-","-","-","-",120,170,220,510,100,100,90,290,40,90,70,200,"-","-","-",10,140,190,160,490,100,100,90,280,70,80,80,230,"-","-",10,10,170,180,180,530]
[142,"Hillingdon",240,220,240,700,100,120,130,360,"-","-","-","-",340,350,370,1060,180,170,260,610,100,150,150,400,"-","-","-","-",280,320,420,1010,200,150,230,570,100,140,140,380,"-",10,10,10,300,290,380,970,190,170,220,570,110,160,100,370,"-","-","-",10,300,330,320,950,160,180,250,590,120,130,100,350,"-",10,20,30,280,310,370,970]
[143,"Hinckley and Bosworth",null,null,null,null,null,null,null,null,null,null,null,null,null,null,null,null,100,110,160,370,40,70,100,200,"-","-","-","-",140,180,250,570,110,110,110,330,40,70,110,210,"-","-",10,10,150,180,220,550,110,120,110,340,40,80,70,190,"-","-",10,10,150,200,180,530,130,100,140,380,60,70,90,220,"-","-",10,20,190,170,250,610]
[144,"Horsham",null,null,null,null,null,null,null,null,null,null,null,null,null,null,null,null,70,90,60,220,30,60,60,150,"-","-","-","-",90,160,120,370,70,90,60,220,40,80,60,180,"-","-","-","-",110,170,120,400,80,100,80,250,40,70,50,160,"-",10,"-",10,110,170,130,420,70,60,60,190,40,80,50,160,"-","-","-",10,100,150,110,360]
[145,"Hounslow",90,150,240,480,40,70,100,210,"-","-","-","-",130,220,340,700,140,140,270,550,50,90,130,270,"-","-","-","-",190,240,400,830,110,150,220,470,50,90,120,270,"-","-","-","-",160,240,340,740,110,120,230,460,90,100,100,290,"-",10,"-",10,200,230,330,750,110,130,240,470,90,120,120,330,"-",10,10,20,200,250,370,830]
[146,"Huntingdonshire",null,null,null,null,null,null,null,null,null,null,null,null,null,null,null,null,130,110,170,400,50,60,90,200,"-","-","-","-",170,180,260,610,100,140,130,360,50,110,110,270,"-","-",10,10,140,240,250,640,140,150,150,430,60,100,100,250,"-","-","-","-",200,250,240,690,120,130,140,390,80,100,100,270,"-","-",20,20,200,230,260,680]
[147,"Hyndburn",null,null,null,null,null,null,null,null,null,null,null,null,null,null,null,null,150,110,110,370,50,70,130,250,"-","-","-","-",190,180,250,620,140,110,140,390,60,70,120,250,"-","-","-","-",200,180,260,640,130,110,120,360,70,100,80,250,"-","-",10,10,200,210,200,620,130,110,140,380,70,110,100,270,"-","-",20,20,200,220,250,670]
[148,"Ipswich",null,null,null,null,null,null,null,null,null,null,null,null,null,null,null,null,150,160,120,430,40,80,110,230,"-",10,"-",10,190,250,240,670,130,130,110,370,50,80,100,230,"-",10,"-",10,180,230,210,620,150,140,140,430,50,80,70,210,10,10,10,20,210,230,220,660,180,180,180,540,50,80,120,250,10,"-",10,20,230,270,310,810]
[149,"Isle of Wight",160,230,210,600,60,140,220,410,"-","-","-","-",220,370,430,1010,160,200,200,560,50,130,270,450,"-","-","-","-",210,330,470,1010,160,190,160,510,50,180,260,490,"-","-","-","-",210,370,420,1000,150,170,180,490,70,170,170,400,"-",10,10,20,220,340,350,910,130,170,160,460,60,160,210,420,"-","-",30,30,180,330,400,910]
[150,"Isles of Scilly",null,null,null,null,null,null,null,null,null,null,null,null,null,null,null,null,"-","-","-","-","-","-","-","-","-","-","-","-","-","-","-","-","-","-","-","-","-","-","-","-","-","-","-","-","-","-","-","-","-","-","-","-","-","-","-","-","-","-","-","-","-","-","-","-","-","-","-","-","-","-","-","-","-","-","-","-","-","-","-","-"]
[151,"Islington",70,80,100,260,20,60,60,140,"-","-","-","-",100,140,170,400,40,60,100,210,20,40,70,120,"-","-","-",10,60,100,170,330,70,80,100,240,40,50,90,170,"-","-","-","-",100,130,190,420,60,110,150,320,30,50,60,140,"-","-","-","-",90,160,200,450,50,80,120,240,30,60,60,150,"-","-","-",10,80,140,180,400]
[152,"Kensington and Chelsea",20,20,40,70,10,20,20,40,"-","-","-","-",20,40,60,120,10,30,50,90,10,20,20,50,"-","-","-","-",20,50,70,140,20,20,30,70,10,20,20,40,"-","-","-","-",30,40,50,110,10,30,40,80,10,20,20,50,"-","-","-","-",30,40,50,120,20,20,20,60,10,20,20,50,"-","-","-","-",30,50,50,120]
[153,"Kent",1170,1200,1230,3590,350,610,640,1600,"-",10,"-",10,1520,1820,1870,5200,900,1110,1410,3420,330,680,1030,2030,"-",20,"-",20,1230,1810,2440,5470,1030,1170,1090,3290,460,750,1030,2230,10,30,30,60,1500,1940,2140,5570,1070,1260,1260,3590,420,790,860,2070,"-",20,70,90,1490,2070,2190,5750,1130,1170,1400,3710,460,740,1010,2210,10,30,160,200,1600,1930,2580,6110]
[154,"Kettering",null,null,null,null,null,null,null,null,null,null,null,null,null,null,null,null,90,100,130,310,30,60,80,170,"-","-","-","-",120,160,210,480,100,80,100,290,30,80,90,200,"-","-","-","-",130,160,190,490,90,100,140,330,40,80,50,170,"-",10,"-",10,130,190,190,500,90,90,120,310,40,80,70,190,"-","-",10,10,130,170,200,500]
[155,"Kings Lynn and West Norfolk",null,null,null,null,null,null,null,null,null,null,null,null,null,null,null,null,120,150,180,450,40,90,160,280,"-","-","-","-",160,240,330,740,120,120,130,370,50,120,170,350,"-","-","-","-",180,240,300,720,150,110,150,410,50,100,120,270,"-","-",10,10,200,210,270,680,170,110,100,380,60,90,70,220,"-",10,20,30,230,210,190,630]
[156,"Kingston upon Hull",590,310,350,1240,190,180,170,540,"-",10,"-",10,780,500,520,1790,420,280,470,1170,140,190,270,590,"-",10,"-",10,560,480,740,1780,430,250,420,1100,160,180,270,620,"-",10,10,10,600,440,700,1740,380,330,340,1050,160,210,240,610,"-",10,10,20,550,540,590,1680,420,320,380,1120,150,210,290,650,"-","-",20,20,570,530,690,1780]
[157,"Kingston Upon Thames",50,60,60,170,40,40,40,120,"-","-","-","-",90,100,100,290,40,50,80,170,20,40,60,120,"-","-","-","-",70,90,140,300,60,60,60,180,30,60,50,140,"-","-","-","-",90,120,110,320,60,60,80,200,40,50,40,130,"-",10,"-",10,100,110,120,340,50,70,60,170,20,50,40,110,"-","-","-","-",70,120,100,290]
[158,"Kirklees",710,450,590,1760,200,320,350,870,"-",10,"-",10,910,780,950,2640,460,410,560,1430,180,280,370,830,"-",10,"-",10,640,690,930,2270,500,410,490,1400,220,340,390,950,"-",10,10,20,720,760,890,2370,490,440,400,1330,210,340,300,850,"-",10,20,30,700,790,720,2210,570,400,520,1490,260,350,360,970,10,10,30,50,840,760,910,2510]
[159,"Knowsley",390,290,430,1110,130,140,150,410,"-","-","-",10,510,440,580,1530,190,240,430,870,100,140,220,450,"-","-",10,10,290,380,660,1330,210,220,320,750,110,160,250,520,"-",10,10,20,320,390,580,1290,270,230,300,800,90,170,210,480,"-","-",20,20,370,410,530,1300,230,210,260,700,120,140,180,440,"-","-",20,20,350,350,460,1160]
[160,"Lambeth",110,120,230,460,40,70,130,230,"-","-","-","-",150,190,360,690,70,110,270,440,30,70,170,280,"-","-",10,10,100,190,450,730,60,120,180,350,30,80,160,270,"-","-","-","-",90,200,340,620,80,130,250,460,40,70,100,210,"-",10,"-",10,120,200,350,670,70,150,280,490,40,90,150,270,"-","-",10,10,110,240,430,770]
[161,"Lancashire",1440,1290,1280,4000,640,840,900,2380,"-",30,10,40,2080,2160,2180,6420,1270,1300,1650,4220,590,830,1520,2950,"-",30,20,50,1860,2160,3200,7210,1240,1380,1470,4090,610,1060,1590,3250,10,30,40,70,1850,2460,3100,7410,1340,1290,1240,3860,610,1070,1100,2790,10,30,90,130,1970,2390,2430,6780,1340,1230,1440,4010,680,1000,1050,2740,20,40,170,230,2040,2270,2670,6980]
[162,"Lancaster",null,null,null,null,null,null,null,null,null,null,null,null,null,null,null,null,110,120,170,390,50,90,180,310,"-","-","-","-",160,200,350,710,120,160,140,420,60,110,170,340,"-","-","-","-",180,270,310,770,130,150,150,420,60,110,150,320,"-",10,10,20,190,260,310,760,140,130,120,390,70,100,90,270,"-","-",10,10,210,240,220,670]
[163,"Leeds",830,800,910,2530,360,470,560,1390,"-",20,"-",20,1190,1290,1470,3950,740,690,900,2330,250,350,600,1190,"-",20,10,20,990,1050,1500,3540,630,650,770,2050,280,450,560,1290,"-",20,10,30,910,1110,1340,3360,660,710,760,2130,300,490,520,1310,"-",20,30,50,960,1210,1310,3490,720,690,900,2310,340,530,540,1410,"-",20,40,70,1060,1240,1490,3790]
[164,"Leicester",200,230,430,850,100,90,120,310,"-","-","-","-",300,320,550,1160,150,250,450,850,80,150,240,470,"-","-","-","-",230,410,690,1330,180,250,390,830,60,140,260,460,"-","-",10,10,240,400,660,1290,210,300,400,910,70,150,190,410,"-","-",10,20,280,450,600,1330,240,310,410,960,90,160,240,490,"-",10,30,40,320,480,670,1480]
[165,"Leicestershire",670,630,1030,2330,320,370,280,970,"-",10,"-",10,1000,1000,1310,3310,600,550,800,1960,230,400,480,1110,"-",10,10,20,840,970,1290,3090,680,680,660,2010,250,410,510,1170,"-",10,20,30,930,1100,1190,3210,680,670,680,2030,320,500,400,1210,10,10,30,50,1010,1180,1110,3290,800,630,690,2120,330,460,460,1250,10,30,50,80,1140,1110,1200,3450]
[166,"Lewes",null,null,null,null,null,null,null,null,null,null,null,null,null,null,null,null,60,70,70,210,20,40,60,110,"-","-","-","-",80,110,130,320,70,80,60,210,20,60,50,130,"-","-","-","-",90,140,110,340,70,80,60,210,30,60,50,140,"-","-","-","-",110,140,110,350,60,70,80,210,30,50,60,140,"-","-","-","-",90,120,140,350]
[167,"Lewisham",170,180,190,540,60,80,110,240,"-","-","-","-",220,260,300,780,140,170,250,570,60,100,240,400,"-","-","-","-",200,270,490,960,100,180,200,480,50,120,180,340,"-",10,"-",10,150,310,380,830,150,250,240,640,70,120,160,350,"-","-","-",10,220,380,400,990,100,200,280,580,80,140,150,370,"-",10,10,20,180,350,440,970]
[168,"Lichfield",null,null,null,null,null,null,null,null,null,null,null,null,null,null,null,null,70,100,130,300,30,60,70,160,"-",10,"-",10,100,170,200,470,70,110,110,290,30,70,90,190,"-",10,"-",10,100,190,200,490,90,100,130,320,40,70,70,180,"-","-",10,20,140,170,210,510,100,90,100,290,60,80,80,220,"-","-",20,20,160,170,200,540]
[169,"Lincoln",null,null,null,null,null,null,null,null,null,null,null,null,null,null,null,null,90,140,130,360,20,70,80,180,"-",10,"-",10,110,220,210,540,90,110,110,310,30,90,110,230,"-","-","-","-",120,190,230,540,100,110,100,300,30,80,70,190,"-","-",10,10,130,190,180,500,90,90,150,330,30,80,100,210,"-",10,10,10,110,180,260,560]
[170,"Lincolnshire",780,800,820,2410,280,460,550,1290,"-",20,10,30,1060,1280,1380,3730,640,700,700,2030,250,450,680,1380,"-",20,10,30,880,1170,1390,3440,670,640,610,1910,290,580,740,1620,"-",20,30,40,960,1240,1380,3580,710,740,720,2170,330,570,490,1390,"-",10,50,60,1040,1320,1260,3620,750,670,770,2190,330,510,610,1450,"-",10,40,60,1080,1190,1420,3690]
[171,"Liverpool",880,750,1130,2760,280,320,450,1050,"-",10,10,20,1160,1080,1580,3820,450,610,1050,2110,210,300,620,1120,"-",10,10,20,660,920,1670,3250,450,470,830,1740,190,350,680,1220,"-",10,20,30,640,830,1530,2990,500,480,810,1790,190,340,580,1110,"-",10,50,60,690,820,1440,2960,480,490,660,1620,180,350,490,1020,"-",10,40,50,660,840,1180,2680]
[172,"Luton",130,140,230,500,70,80,60,210,"-","-","-","-",210,220,290,710,100,110,270,470,70,90,110,280,"-","-","-",10,170,200,380,750,100,130,250,480,50,80,140,270,"-","-","-",10,150,220,390,750,120,140,340,610,80,90,70,230,"-","-",10,10,200,240,420,850,140,170,370,690,60,100,100,270,"-",10,20,30,210,290,490,980]
[173,"Maidstone",null,null,null,null,null,null,null,null,null,null,null,null,null,null,null,null,120,100,180,400,40,80,90,200,"-","-","-","-",160,180,270,600,90,140,120,340,40,90,100,220,"-","-","-",10,130,230,210,570,110,140,150,400,40,80,90,210,"-","-",10,10,150,220,250,630,110,130,130,370,50,60,90,200,"-","-",10,20,170,200,230,590]
[174,"Maldon",null,null,null,null,null,null,null,null,null,null,null,null,null,null,null,null,60,50,50,150,20,30,30,90,"-","-","-","-",80,80,80,240,70,70,40,170,30,50,40,120,"-","-","-","-",100,120,80,300,70,30,30,140,30,40,20,90,"-","-","-",10,100,80,60,230,80,40,40,160,30,50,30,110,"-","-",10,10,110,90,80,280]
[175,"Malvern Hills",null,null,null,null,null,null,null,null,null,null,null,null,null,null,null,null,40,80,60,170,20,40,80,130,"-","-","-",10,50,110,140,310,50,80,50,180,30,60,90,180,"-","-",10,10,70,150,150,360,50,60,70,170,30,50,50,130,"-","-","-","-",80,110,120,300,50,70,80,200,40,60,40,140,"-","-",10,10,90,130,140,360]
[176,"Manchester",650,520,560,1730,140,220,300,660,"-",10,10,20,790,750,870,2400,250,410,670,1340,110,210,410,740,"-","-","-",10,370,630,1090,2080,320,470,580,1360,90,270,490,850,"-",10,10,10,410,740,1080,2220,320,440,620,1390,140,240,430,800,10,10,30,40,470,680,1080,2230,330,410,830,1570,160,250,440,850,10,10,40,50,490,670,1310,2470]
[177,"Mansfield",null,null,null,null,null,null,null,null,null,null,null,null,null,null,null,null,120,150,220,500,40,100,110,240,"-","-","-","-",160,250,330,740,140,160,180,480,30,100,130,270,"-","-","-",10,170,260,320,750,120,160,170,450,50,100,80,230,"-","-",10,20,170,260,260,700,140,150,240,530,50,100,120,270,"-","-",20,20,190,260,370,820]
[178,"Medway",330,320,310,950,100,150,170,410,"-","-","-","-",430,470,480,1370,280,280,340,900,90,140,240,470,"-",10,"-",10,370,430,580,1380,280,310,250,840,80,170,230,480,"-","-",10,10,360,490,490,1330,250,460,330,1040,80,160,210,450,"-",10,10,20,340,630,560,1520,290,410,380,1080,80,180,250,510,"-",10,20,30,370,590,650,1610]
[179,"Melton",null,null,null,null,null,null,null,null,null,null,null,null,null,null,null,null,30,50,60,130,20,40,40,90,"-","-","-","-",50,80,100,230,40,60,50,150,20,20,40,80,"-","-","-","-",60,80,80,230,50,50,40,150,30,40,50,120,"-","-","-","-",80,100,100,270,60,50,50,150,20,40,30,90,"-","-","-",10,90,80,80,250]
[180,"Mendip",null,null,null,null,null,null,null,null,null,null,null,null,null,null,null,null,100,100,130,330,30,70,70,170,"-","-","-","-",140,160,200,500,120,90,100,310,70,60,90,210,"-","-","-",10,190,160,180,530,100,100,100,300,50,70,50,170,"-","-",10,10,150,170,150,470,100,110,90,300,40,60,50,150,"-","-",10,10,130,180,150,460]
[181,"Merton",120,100,130,340,30,60,80,170,"-","-","-","-",150,160,210,520,60,70,130,260,30,70,100,190,"-","-","-","-",90,140,230,450,40,90,100,230,30,60,110,200,"-","-","-","-",70,150,210,420,70,80,130,280,40,60,60,160,"-","-","-","-",110,150,190,440,50,80,100,230,40,70,90,200,"-",10,10,10,90,150,200,440]
[182,"Mid Devon",null,null,null,null,null,null,null,null,null,null,null,null,null,null,null,null,80,60,80,220,20,30,50,100,"-","-","-",10,100,90,120,320,90,70,50,210,30,50,50,130,"-","-","-",10,120,120,110,350,90,70,90,250,50,70,40,150,"-","-","-","-",140,140,130,400,90,70,90,240,50,50,50,140,"-","-","-",10,140,120,130,390]
[183,"Mid Suffolk",null,null,null,null,null,null,null,null,null,null,null,null,null,null,null,null,90,70,90,250,30,60,50,140,"-","-","-",10,120,130,140,390,110,80,50,240,50,70,60,180,"-","-","-",10,150,150,120,430,110,90,80,270,60,70,50,180,"-","-","-",10,170,160,130,460,110,70,80,250,60,60,70,190,"-",10,"-",10,170,130,150,450]
[184,"Mid Sussex",null,null,null,null,null,null,null,null,null,null,null,null,null,null,null,null,70,90,60,220,30,70,70,170,"-","-","-","-",100,160,140,390,60,70,60,190,40,60,50,150,"-","-","-","-",100,130,120,340,80,80,70,230,40,70,50,160,"-","-",10,10,120,160,120,400,100,80,90,260,50,70,60,190,"-","-",10,10,150,150,160,460]
[185,"Middlesbrough",280,210,220,710,110,110,80,300,"-","-","-","-",400,320,300,1010,170,140,230,540,110,110,160,380,"-","-","-","-",280,250,390,920,170,170,240,570,100,100,100,300,"-","-","-","-",260,270,340,870,180,190,240,610,110,120,130,360,"-","-",10,20,290,310,390,980,170,170,280,630,90,120,150,360,"-","-",20,20,270,290,450,1010]
[186,"Milton Keynes",270,250,340,860,90,130,150,370,"-",10,"-",10,360,390,500,1240,120,200,280,600,60,120,140,320,"-","-","-",10,180,330,430,930,160,180,240,570,80,130,200,410,"-",10,"-",10,240,320,440,1000,140,180,320,640,90,160,140,390,"-",10,10,10,230,340,470,1040,130,150,260,550,90,130,150,370,"-",10,10,20,230,290,420,940]
[187,"Mole Valley",null,null,null,null,null,null,null,null,null,null,null,null,null,null,null,null,30,40,30,110,20,20,30,70,"-","-","-","-",50,60,70,180,50,30,30,110,10,30,30,70,"-","-","-","-",60,60,70,180,30,40,30,100,20,40,30,80,"-","-","-","-",50,80,60,190,30,30,40,100,20,30,20,70,"-","-",10,10,50,70,60,180]
[188,"New Forest",null,null,null,null,null,null,null,null,null,null,null,null,null,null,null,null,120,160,200,470,70,110,200,380,"-","-","-",10,190,270,400,860,140,180,160,480,80,130,140,350,"-","-","-","-",220,310,300,830,170,150,170,480,80,160,110,360,"-",10,10,20,250,320,290,860,170,170,150,490,80,160,120,360,"-",10,20,30,250,340,300,890]
[189,"Newark and Sherwood",null,null,null,null,null,null,null,null,null,null,null,null,null,null,null,null,110,150,160,420,40,70,110,230,"-","-","-","-",150,220,270,650,130,140,130,400,50,80,120,250,"-","-",10,10,180,220,260,650,120,150,160,430,40,90,100,230,"-","-",20,20,160,250,270,680,120,140,180,440,60,100,110,270,"-",10,10,20,180,240,310,730]
[190,"Newcastle under Lyme",null,null,null,null,null,null,null,null,null,null,null,null,null,null,null,null,120,160,160,440,40,80,140,260,"-",10,10,10,160,250,310,720,130,130,140,400,80,110,160,340,"-","-",10,10,200,240,310,750,160,140,200,500,80,90,170,340,"-",10,10,20,240,240,380,860,160,130,200,500,70,110,140,320,"-","-",20,20,240,250,360,840]
[191,"Newcastle upon Tyne",380,260,390,1030,150,130,230,500,"-",10,"-",10,530,390,620,1530,210,240,510,960,120,140,320,580,"-","-","-",10,330,380,830,1540,220,250,380,850,90,130,260,480,"-",10,10,10,310,390,640,1340,300,280,460,1040,100,190,210,500,"-","-",20,20,400,470,690,1560,280,260,420,970,110,170,200,490,"-","-",20,20,400,440,650,1490]
[192,"Newham",200,210,360,760,50,90,140,280,"-","-","-","-",250,300,490,1040,150,150,270,570,50,100,150,300,"-","-","-","-",200,250,430,870,150,180,280,600,60,110,240,420,"-","-","-","-",210,290,520,1020,190,220,350,770,90,110,150,340,"-",10,10,10,280,340,500,1120,190,220,410,820,110,140,210,470,"-","-",20,20,300,360,640,1310]
[193,"Norfolk",810,900,810,2520,280,450,420,1150,"-",10,10,20,1100,1360,1230,3680,720,720,1250,2680,230,410,740,1390,"-",20,10,20,950,1150,2000,4100,780,700,660,2140,300,540,710,1540,"-",30,10,50,1080,1270,1380,3730,930,820,780,2520,280,530,520,1330,"-",20,40,60,1210,1360,1340,3920,850,750,730,2330,340,550,540,1430,10,40,120,170,1190,1340,1390,3920]
[194,"North Devon",null,null,null,null,null,null,null,null,null,null,null,null,null,null,null,null,70,70,100,240,30,30,40,110,"-","-","-","-",100,100,140,340,100,80,70,250,30,50,80,150,"-","-","-","-",130,130,140,400,80,90,110,280,40,70,60,160,"-","-","-",10,120,150,170,440,90,90,80,250,40,60,60,170,"-","-","-",10,130,150,150,420]
[195,"North Dorset",null,null,null,null,null,null,null,null,null,null,null,null,null,null,null,null,70,60,80,210,160,300,110,560,"-","-","-","-",220,360,190,770,80,120,60,250,60,350,190,600,"-","-","-","-",140,460,250,850,90,110,70,270,70,320,140,530,"-","-","-",10,160,430,210,800,90,100,70,260,60,290,150,490,"-","-","-","-",150,380,220,750]
[196,"North East Derbyshire",null,null,null,null,null,null,null,null,null,null,null,null,null,null,null,null,120,130,150,400,60,60,90,210,"-","-","-","-",180,190,230,610,150,130,110,390,80,80,120,270,"-","-","-","-",230,210,220,660,150,140,100,390,80,100,70,250,"-","-","-","-",230,240,170,640,170,110,130,410,80,110,110,300,"-","-",10,20,250,220,250,720]
[197,"North East Lincolnshire",170,170,160,500,120,90,100,310,"-",10,"-",10,280,270,260,820,140,150,240,530,90,100,150,340,"-","-","-",10,230,250,390,870,150,160,140,450,80,110,140,330,"-",10,"-",10,230,280,290,790,160,150,200,510,80,120,90,290,"-","-",10,10,240,270,300,810,160,180,200,540,100,110,130,340,"-","-",10,10,260,290,340,890]
[198,"North Hertfordshire",null,null,null,null,null,null,null,null,null,null,null,null,null,null,null,null,70,80,100,250,20,50,40,110,"-","-","-","-",100,130,140,370,70,90,90,250,30,50,80,170,"-","-","-","-",100,140,170,420,80,100,100,270,40,50,40,120,"-","-",10,10,110,150,140,400,70,90,80,240,30,60,40,140,"-","-","-",10,110,160,120,380]
[199,"North Kesteven",null,null,null,null,null,null,null,null,null,null,null,null,null,null,null,null,120,110,80,310,30,60,150,240,"-","-","-","-",150,170,240,560,130,90,90,310,50,100,150,300,"-","-",10,10,180,190,250,620,130,100,100,340,60,90,90,230,"-","-",10,10,190,190,200,580,140,100,110,340,60,90,120,280,"-","-","-",10,200,190,230,620]
[200,"North Lincolnshire",170,190,190,550,130,110,140,370,"-",10,"-",10,300,310,330,930,150,160,240,560,100,90,170,360,"-",10,"-",10,260,260,410,920,180,150,160,490,100,120,140,360,"-",10,"-",10,270,280,300,860,200,200,200,600,110,140,130,390,"-","-",10,10,320,340,340,1000,250,200,230,680,110,160,140,410,"-","-",20,20,360,360,390,1100]
[201,"North Norfolk",null,null,null,null,null,null,null,null,null,null,null,null,null,null,null,null,110,100,90,290,20,60,70,150,"-","-","-","-",120,160,160,440,100,120,80,300,20,70,70,160,"-",10,"-",10,130,190,150,460,100,100,70,270,30,60,60,140,"-","-","-","-",130,160,130,420,110,110,110,330,40,70,60,170,"-","-",10,10,150,190,180,510]
[202,"North Somerset",230,190,300,720,110,110,160,390,"-","-","-","-",340,310,460,1110,170,200,240,610,90,110,160,360,"-","-","-",10,260,310,410,980,190,190,190,570,90,130,170,390,"-","-",10,10,290,330,370,980,190,180,200,570,90,140,130,360,"-","-",20,20,280,330,350,950,190,220,230,630,100,130,140,380,"-",10,10,20,290,350,380,1030]
[203,"North Tyneside",520,260,430,1210,160,110,160,430,"-","-","-",10,680,370,600,1650,190,230,440,850,110,130,290,530,"-","-","-","-",300,360,730,1390,190,260,350,810,120,180,250,540,"-",10,10,10,310,440,610,1370,250,260,360,860,110,140,190,440,"-","-",20,20,360,390,570,1320,240,200,460,900,130,140,190,460,"-","-",20,20,370,340,670,1380]
[204,"North Warwickshire",null,null,null,null,null,null,null,null,null,null,null,null,null,null,null,null,40,80,90,200,30,40,50,120,"-","-","-","-",60,120,140,320,60,80,90,230,20,30,60,110,"-","-","-",10,80,110,150,340,80,50,70,210,30,50,40,120,"-",10,10,10,120,110,110,340,60,80,100,250,30,40,40,120,"-","-",10,20,100,130,160,380]
[205,"North West Leicestershire",null,null,null,null,null,null,null,null,null,null,null,null,null,null,null,null,80,80,110,280,40,60,80,170,"-","-","-","-",120,140,190,450,120,110,120,350,40,60,80,180,"-","-","-","-",160,180,200,540,100,120,110,330,50,90,60,200,"-","-",10,10,150,210,180,530,130,110,120,360,60,80,50,190,"-","-",10,10,180,190,190,560]
[206,"North Yorkshire",1210,750,670,2630,310,460,380,1150,"-",10,10,20,1520,1220,1060,3800,840,660,860,2360,230,360,520,1110,"-",10,10,10,1070,1020,1390,3480,1190,1400,840,3430,260,440,520,1220,"-",10,10,20,1450,1850,1370,4670,990,1750,1010,3740,280,480,490,1250,"-",20,30,60,1270,2260,1530,5060,1200,2050,1090,4340,320,490,520,1330,"-",10,40,60,1530,2550,1640,5730]
[207,"Northampton",null,null,null,null,null,null,null,null,null,null,null,null,null,null,null,null,180,250,510,940,60,120,140,320,"-","-","-",10,250,370,650,1270,160,230,440,830,60,130,240,440,"-","-",10,10,220,360,700,1280,190,210,430,830,70,140,120,330,"-","-",10,20,260,350,560,1170,170,220,420,810,70,130,140,340,"-","-",10,10,250,350,570,1160]
[208,"Northamptonshire",720,660,930,2310,250,420,390,1060,"-",20,10,20,970,1100,1320,3390,590,680,1190,2460,200,430,500,1130,"-",10,10,20,790,1120,1700,3600,610,700,1040,2350,240,490,660,1380,"-",20,20,40,850,1210,1720,3780,640,750,1080,2470,240,530,440,1210,"-",20,30,50,880,1290,1560,3730,690,710,1050,2450,300,480,460,1230,"-",20,40,60,990,1210,1550,3740]
[209,"Northumberland",490,360,640,1490,200,250,330,780,"-",10,"-",20,690,630,970,2290,360,390,670,1420,150,230,460,840,"-","-",10,10,510,630,1130,2270,360,390,540,1290,180,310,420,900,"-",10,10,20,530,710,970,2220,370,400,820,1590,180,340,330,850,"-",10,50,60,550,750,1200,2490,400,410,620,1430,180,290,340,810,"-",10,30,40,590,710,990,2290]
[210,"Norwich",null,null,null,null,null,null,null,null,null,null,null,null,null,null,null,null,80,110,340,520,10,50,110,170,"-","-","-","-",90,150,450,690,70,110,130,310,20,50,100,170,"-","-","-",10,90,160,230,480,90,140,130,370,20,70,80,170,"-","-",10,10,120,200,220,540,60,100,140,300,20,60,90,180,"-","-",20,20,80,170,250,500]
[211,"Nottingham",300,350,490,1140,80,140,140,360,"-","-","-",10,390,490,630,1510,230,280,440,950,100,120,190,410,"-","-","-",10,330,410,630,1360,290,330,350,960,110,160,270,530,"-","-",10,10,400,490,620,1510,250,350,370,960,110,200,190,490,"-",10,10,20,350,560,570,1480,260,390,420,1080,100,190,220,510,"-",10,40,50,370,590,680,1630]
[212,"Nottinghamshire",980,960,1040,2980,380,520,520,1420,"-",20,"-",20,1360,1500,1560,4410,830,900,1130,2860,300,580,710,1580,10,20,10,30,1130,1490,1850,4470,890,920,900,2710,350,570,770,1700,10,20,30,50,1250,1510,1700,4460,920,960,940,2820,410,640,530,1580,20,30,60,110,1360,1620,1530,4510,960,840,1060,2860,450,630,610,1690,10,30,100,140,1420,1500,1780,4690]
[213,"Nuneaton and Bedworth",null,null,null,null,null,null,null,null,null,null,null,null,null,null,null,null,120,120,200,440,60,100,140,300,"-","-","-",10,180,220,350,750,140,160,200,500,70,80,130,280,"-",10,10,20,210,250,340,790,170,130,180,490,50,100,110,270,"-",10,20,30,230,250,310,780,170,150,190,510,70,90,100,260,"-",10,20,30,240,250,310,800]
[214,"Oadby and Wigston",null,null,null,null,null,null,null,null,null,null,null,null,null,null,null,null,50,40,60,160,20,40,40,100,"-","-","-","-",70,80,100,250,50,50,50,150,20,40,40,90,"-","-","-","-",70,90,90,250,50,60,60,170,30,40,30,90,"-","-","-","-",80,100,80,260,60,50,60,170,20,30,50,100,"-","-",10,10,80,80,110,280]
[215,"Oldham",350,270,340,950,110,190,160,450,"-","-","-","-",460,460,490,1400,210,240,380,830,90,170,280,530,"-","-","-",10,300,410,650,1360,220,290,320,820,80,180,280,540,"-","-",10,10,300,470,610,1370,220,320,290,820,110,170,180,460,"-",10,30,30,330,490,500,1310,250,370,390,1000,100,220,210,530,"-",10,20,30,360,590,610,1560]
[216,"Oxford",null,null,null,null,null,null,null,null,null,null,null,null,null,null,null,null,40,50,120,220,30,50,70,150,"-","-","-","-",80,110,190,370,60,80,90,230,50,40,60,150,"-","-","-","-",120,120,150,380,40,50,120,210,30,30,40,100,"-","-","-","-",70,90,150,310,50,60,160,270,30,50,70,150,"-","-",10,10,80,110,230,420]
[217,"Oxfordshire",370,500,500,1370,210,260,260,720,"-","-","-",10,570,760,770,2100,380,490,560,1430,220,300,380,900,"-","-",10,10,600,790,940,2340,450,480,440,1370,280,340,370,980,"-",10,20,30,720,830,830,2380,420,430,470,1320,260,330,270,850,"-","-",20,20,690,760,750,2190,450,400,560,1410,260,340,300,900,"-",10,50,70,710,760,910,2380]
[218,"Pendle",null,null,null,null,null,null,null,null,null,null,null,null,null,null,null,null,110,100,140,340,60,70,120,240,"-","-","-","-",160,170,250,580,90,140,120,350,60,80,120,260,"-","-","-","-",150,220,240,610,110,80,90,280,50,80,100,230,"-","-","-",10,160,160,200,520,100,90,90,270,60,80,70,220,"-","-",10,10,160,170,170,500]
[219,"Peterborough",150,190,220,560,40,100,90,220,"-","-","-","-",190,290,310,790,120,130,240,490,40,100,180,310,"-",10,"-",10,150,230,420,800,130,140,200,470,40,100,180,330,"-",10,"-",10,170,250,390,810,140,160,230,530,60,110,150,320,"-","-",10,10,210,280,380,860,110,140,260,510,80,90,150,310,"-","-",10,10,180,230,420,830]
[220,"Plymouth",460,360,450,1270,140,240,280,660,"-",10,10,20,600,610,730,1940,410,390,620,1420,160,250,300,700,"-",10,"-",10,560,640,930,2130,420,370,390,1180,120,270,310,690,"-",10,10,20,540,640,700,1880,520,410,470,1400,170,270,210,650,"-",10,20,30,700,690,690,2080,520,380,490,1390,160,300,280,740,"-",10,20,30,680,690,790,2160]
[221,"Poole",130,120,120,370,40,90,70,200,"-","-","-","-",170,210,190,570,100,140,170,410,50,80,110,240,"-",10,"-",10,150,220,280,650,130,140,140,410,60,90,150,300,"-",10,"-",10,180,240,290,710,140,130,150,420,60,110,80,260,"-","-","-",10,200,250,230,690,180,130,140,450,60,100,80,240,"-","-",10,10,230,240,230,700]
[222,"Portsmouth",160,230,270,670,70,100,110,280,"-","-","-","-",230,330,380,950,120,200,270,580,50,110,170,330,"-","-","-","-",180,310,440,920,160,220,260,630,70,140,180,390,"-","-","-","-",230,360,440,1020,180,210,200,590,100,150,110,360,"-","-",10,10,290,360,320,960,230,210,220,660,90,160,180,430,"-","-",20,20,330,370,420,1110]
[223,"Preston",null,null,null,null,null,null,null,null,null,null,null,null,null,null,null,null,150,150,210,520,60,90,190,340,"-",10,"-",10,210,250,410,860,110,160,200,470,60,110,180,350,"-","-","-","-",170,270,380,820,160,170,190,510,60,110,110,270,"-","-",10,10,220,270,300,790,170,150,190,510,80,110,110,300,"-","-",20,30,250,270,320,840]
[224,"Purbeck",null,null,null,null,null,null,null,null,null,null,null,null,null,null,null,null,130,130,90,350,20,80,90,190,"-","-","-","-",150,210,180,540,100,210,110,420,10,100,120,230,"-","-","-","-",120,310,230,660,120,280,110,510,20,80,110,210,"-","-","-","-",140,360,220,720,90,320,120,540,30,90,120,230,"-","-","-","-",120,410,240,770]
[225,"Reading",120,120,170,410,70,60,70,190,"-","-","-",10,190,180,240,610,130,100,130,360,50,80,120,250,"-","-","-",10,190,180,250,620,90,130,150,360,90,80,90,260,"-","-","-",10,180,210,240,630,90,130,150,360,80,100,70,250,"-","-",10,10,170,230,220,620,90,90,160,330,90,80,100,260,10,"-",10,20,180,170,260,610]
[226,"Redbridge",100,110,170,380,50,80,80,210,"-","-","-","-",150,190,250,590,80,100,170,350,50,70,130,250,"-","-","-","-",130,180,290,600,110,110,150,370,60,100,130,290,"-",10,"-",10,170,210,280,660,110,130,190,430,70,100,110,290,"-","-",10,10,180,240,310,730,120,130,230,480,110,140,110,360,"-",10,30,40,230,280,370,870]
[227,"Redcar and Cleveland",270,250,260,780,120,110,130,360,"-","-","-","-",390,360,390,1140,170,230,270,670,100,110,140,350,"-","-","-","-",280,340,410,1030,200,230,220,650,110,110,140,360,"-",10,"-",10,310,340,360,1010,200,210,230,640,140,130,140,410,"-","-",10,10,340,350,380,1060,200,210,220,630,110,150,150,420,"-","-",10,20,310,370,380,1060]
[228,"Redditch",null,null,null,null,null,null,null,null,null,null,null,null,null,null,null,null,50,100,170,320,30,60,110,190,"-","-","-",10,80,160,280,520,60,90,160,310,30,80,100,220,"-","-",10,10,90,180,270,530,70,90,180,330,30,60,60,150,"-","-",10,10,100,150,250,500,70,100,120,290,40,70,100,200,"-",10,20,30,110,180,240,530]
[229,"Reigate and Banstead",null,null,null,null,null,null,null,null,null,null,null,null,null,null,null,null,50,60,100,220,30,50,70,160,"-","-","-",10,90,120,180,380,60,70,70,200,20,40,70,130,"-","-",10,10,80,110,140,330,70,80,80,220,40,70,50,150,"-","-",10,10,100,140,140,380,70,60,100,230,30,70,80,170,"-","-",10,10,100,130,180,410]
[230,"Ribble Valley",null,null,null,null,null,null,null,null,null,null,null,null,null,null,null,null,60,60,50,170,40,40,60,150,"-","-","-","-",110,110,110,320,80,70,50,200,30,40,60,130,"-","-","-",10,120,110,110,340,70,50,40,160,40,60,40,130,"-","-",10,10,110,110,90,300,80,60,40,170,50,60,30,140,"-","-",10,20,130,120,80,330]
[231,"Richmond Upon Thames",40,40,70,150,30,40,30,100,"-","-","-","-",70,80,100,250,50,70,60,180,20,40,40,110,"-","-","-","-",70,110,100,280,50,60,40,140,30,50,40,120,"-","-","-","-",70,110,80,260,50,40,70,150,30,50,30,120,"-","-","-","-",80,90,100,270,40,40,50,120,40,50,30,110,"-","-","-","-",90,80,70,240]
[232,"Richmondshire",null,null,null,null,null,null,null,null,null,null,null,null,null,null,null,null,30,70,100,200,10,30,60,100,"-","-","-","-",40,100,170,310,270,830,290,1380,10,30,50,90,"-","-","-","-",280,860,340,1470,440,1200,490,2120,20,30,60,110,"-","-","-",10,460,1240,550,2240,640,1540,500,2680,10,40,70,120,"-","-","-","-",650,1580,570,2800]
[233,"Rochdale",300,280,290,870,100,160,180,440,"-",10,"-",10,400,450,470,1320,200,210,350,760,90,160,300,550,"-","-",10,10,290,370,650,1310,210,250,260,720,90,200,280,570,"-",10,10,10,300,460,550,1310,200,240,260,710,130,210,160,510,"-",10,30,30,330,460,450,1240,230,240,330,790,110,190,270,580,"-",10,30,30,340,440,620,1400]
[234,"Rochford",null,null,null,null,null,null,null,null,null,null,null,null,null,null,null,null,70,70,60,200,30,30,40,100,"-","-","-","-",100,100,90,290,100,70,50,210,30,60,60,150,"-","-","-","-",130,130,110,360,90,80,50,210,40,50,30,120,"-","-","-",10,130,130,80,340,110,70,60,240,40,70,40,150,"-","-",10,10,150,140,100,400]
[235,"Rossendale",null,null,null,null,null,null,null,null,null,null,null,null,null,null,null,null,60,80,70,220,50,50,80,170,"-","-","-","-",110,130,150,390,90,90,90,280,30,80,110,220,"-","-",10,10,120,180,200,500,90,70,70,220,30,40,70,150,"-","-",10,10,120,110,150,380,90,100,90,280,50,70,60,180,"-","-",10,10,140,170,150,470]
[236,"Rother",null,null,null,null,null,null,null,null,null,null,null,null,null,null,null,null,50,50,50,150,20,40,60,120,"-","-","-","-",70,90,110,260,50,50,60,160,20,40,70,130,"-","-","-","-",70,90,130,290,50,50,60,160,20,40,50,120,"-","-","-","-",70,90,120,280,70,50,90,200,20,40,60,110,"-","-",10,20,90,90,160,330]
[237,"Rotherham",440,320,410,1180,170,190,180,540,"-","-","-",10,610,510,590,1720,250,290,380,910,160,200,290,650,"-",10,"-",10,400,500,670,1570,370,300,330,1000,150,210,290,650,"-",10,"-",10,520,510,620,1650,390,330,370,1090,190,220,200,620,"-",20,10,20,580,570,580,1730,340,330,400,1070,190,220,230,640,"-",10,20,30,530,560,650,1730]
[238,"Rugby",null,null,null,null,null,null,null,null,null,null,null,null,null,null,null,null,80,90,160,330,40,70,100,210,"-","-","-","-",120,160,260,540,100,100,120,320,60,70,120,250,"-","-",10,10,160,160,250,570,60,80,160,300,50,60,60,170,"-","-",10,10,110,140,230,480,80,100,160,350,60,70,70,200,"-","-",10,10,140,180,240,560]
[239,"Runnymede",null,null,null,null,null,null,null,null,null,null,null,null,null,null,null,null,40,50,70,160,20,40,40,100,"-","-","-","-",70,90,110,260,50,40,40,130,30,40,30,100,"-","-","-","-",80,80,60,230,60,50,50,160,30,40,30,90,"-","-","-","-",90,90,80,260,50,40,50,140,30,40,40,110,"-","-","-","-",80,90,90,250]
[240,"Rushcliffe",null,null,null,null,null,null,null,null,null,null,null,null,null,null,null,null,70,90,80,240,30,50,60,140,"-","-","-",10,110,140,140,390,90,80,60,230,50,50,80,180,"-","-",10,10,140,140,150,430,100,80,60,240,40,60,50,150,"-",10,10,20,140,150,110,410,80,80,60,230,60,60,60,180,"-","-",10,10,140,150,130,410]
[241,"Rushmoor",null,null,null,null,null,null,null,null,null,null,null,null,null,null,null,null,150,90,150,390,20,50,80,150,"-","-","-","-",180,140,230,540,80,100,120,300,100,50,80,230,"-","-","-",10,180,160,200,540,50,100,150,300,30,60,40,140,"-","-",10,10,90,160,200,450,70,80,100,260,80,50,70,200,"-",10,10,20,150,140,180,480]
[242,"Rutland",30,30,30,80,"-",20,10,30,"-","-","-","-",30,50,40,110,20,30,50,90,10,20,30,50,"-","-","-","-",30,40,80,150,30,40,30,90,10,20,40,70,"-","-","-","-",30,50,70,160,30,30,30,90,10,20,10,40,"-","-","-","-",40,50,40,130,30,30,30,90,10,30,30,70,"-","-","-","-",40,70,60,160]
[243,"Ryedale",null,null,null,null,null,null,null,null,null,null,null,null,null,null,null,null,60,50,90,200,20,30,50,100,"-","-","-","-",80,80,140,300,60,40,40,150,20,50,40,120,"-","-","-","-",90,90,90,270,70,40,40,150,30,50,50,120,"-",10,"-",10,100,90,90,280,60,40,50,150,30,40,30,100,"-","-","-","-",100,80,80,250]
[244,"Salford",420,270,330,1020,120,150,200,470,"-",10,"-",10,540,420,540,1500,270,280,380,920,80,150,250,480,"-",10,10,10,350,430,630,1410,200,250,340,780,100,180,270,550,"-","-",10,10,290,430,620,1340,210,300,370,870,130,200,240,580,"-","-",10,20,340,500,620,1470,240,300,370,910,120,190,230,540,"-",10,30,40,360,500,630,1490]
[245,"Sandwell",490,340,490,1310,170,190,230,590,"-","-","-",10,660,530,710,1910,280,280,520,1080,100,210,330,640,"-",10,10,10,380,500,860,1740,340,370,450,1160,120,230,370,720,10,10,30,40,470,610,850,1920,340,390,450,1180,130,250,270,650,"-",10,50,60,470,650,760,1890,390,390,480,1260,140,260,310,720,10,20,100,120,540,670,890,2090]
[246,"Scarborough",null,null,null,null,null,null,null,null,null,null,null,null,null,null,null,null,80,130,180,400,40,80,90,210,"-","-","-","-",120,220,280,610,100,160,140,400,50,80,90,220,"-","-","-",10,150,240,240,630,110,160,120,400,40,110,100,250,"-",10,10,20,160,280,230,670,130,160,140,420,40,90,100,240,"-","-","-","-",170,250,240,670]
[247,"Sedgemoor",null,null,null,null,null,null,null,null,null,null,null,null,null,null,null,null,100,120,130,350,60,70,90,220,"-","-","-","-",160,200,220,570,120,120,100,340,60,70,100,230,"-","-","-","-",180,190,200,580,130,110,90,330,80,90,70,240,"-","-","-",10,210,200,160,570,120,120,130,360,60,100,100,260,"-","-",10,10,180,220,240,630]
[248,"Sefton",380,420,530,1330,120,210,320,650,"-",10,10,20,500,630,860,1990,250,310,540,1100,130,200,390,730,"-","-",10,10,370,510,950,1830,270,310,600,1180,100,250,370,720,"-",10,20,20,370,560,980,1920,320,350,400,1070,110,240,400,750,"-","-",40,40,430,600,840,1870,320,340,390,1050,130,240,340,700,"-","-",40,50,450,570,780,1800]
[249,"Selby",null,null,null,null,null,null,null,null,null,null,null,null,null,null,null,null,80,110,140,330,40,50,70,160,"-","-","-","-",120,170,200,490,80,90,110,280,40,70,80,190,"-",10,"-",10,120,160,200,480,80,70,100,260,50,70,60,180,"-","-","-","-",130,150,170,440,90,80,110,270,70,60,70,200,"-","-",10,10,150,150,180,480]
[250,"Sevenoaks",null,null,null,null,null,null,null,null,null,null,null,null,null,null,null,null,60,70,70,200,30,40,60,120,"-","-","-","-",90,100,130,320,60,70,70,190,30,30,60,110,"-","-","-","-",80,100,120,300,60,60,80,200,30,50,40,110,"-","-","-","-",90,110,120,310,60,60,60,180,50,50,50,160,"-","-",10,10,110,120,120,350]
[251,"Sheffield",670,590,690,1950,320,340,470,1130,"-",20,10,20,990,940,1170,3100,470,460,640,1570,240,290,470,1010,10,10,10,30,720,770,1120,2610,550,470,580,1600,240,390,450,1070,"-",10,10,20,790,870,1030,2690,650,450,540,1640,300,350,330,990,"-",10,20,30,950,810,900,2660,570,520,580,1680,310,380,400,1090,"-",20,30,50,880,930,1010,2820]
[252,"Shepway",null,null,null,null,null,null,null,null,null,null,null,null,null,null,null,null,70,110,110,290,20,60,130,210,"-","-","-","-",90,170,240,500,90,110,120,310,30,80,110,220,"-","-","-","-",120,190,230,530,80,120,140,340,50,70,80,200,"-","-",10,10,140,180,230,550,110,110,180,400,30,60,100,190,"-","-",30,30,150,170,310,620]
[253,"Shropshire",300,440,340,1080,210,550,330,1080,"-","-","-","-",510,990,670,2170,330,520,370,1210,140,610,420,1170,"-","-",10,10,470,1120,800,2390,310,440,280,1030,120,610,470,1200,"-",10,"-",20,430,1060,760,2250,350,480,330,1160,130,580,390,1100,"-",10,20,20,490,1070,740,2290,350,510,330,1180,130,430,400,960,"-",10,30,40,480,950,750,2180]
[254,"Slough",70,100,120,290,30,60,40,130,"-","-","-","-",100,160,160,420,50,70,140,260,30,70,100,200,"-","-","-","-",90,140,240,460,70,80,140,280,40,90,70,190,"-","-",10,10,100,160,210,480,80,70,150,300,30,70,50,150,"-",10,10,10,100,150,210,460,70,90,160,310,50,50,100,200,"-",10,"-",10,120,140,260,520]
[255,"Solihull",190,180,220,590,100,120,100,320,"-","-","-","-",290,300,320,910,170,210,320,700,70,110,140,320,"-","-",10,20,240,330,460,1030,190,290,300,790,90,140,170,400,"-","-",10,10,280,430,490,1190,180,260,210,650,120,130,120,370,"-",10,10,20,300,400,350,1040,190,280,370,840,120,150,140,410,10,10,30,40,310,440,540,1290]
[256,"Somerset",590,590,560,1740,260,310,330,890,"-","-",10,10,850,910,890,2640,500,510,720,1740,230,320,350,900,"-",10,"-",10,740,830,1080,2650,540,510,480,1540,290,340,490,1130,"-",10,"-",20,840,870,980,2690,610,510,490,1600,290,370,340,1000,"-",20,20,40,900,900,850,2640,560,520,610,1680,280,390,340,1020,"-",10,50,50,840,920,990,2750]
[257,"South Bucks",null,null,null,null,null,null,null,null,null,null,null,null,null,null,null,null,40,30,40,110,20,30,40,90,"-","-","-","-",60,60,80,200,30,30,30,80,30,40,20,90,"-","-","-","-",60,70,50,180,40,40,30,110,30,30,30,90,"-","-","-",10,70,80,50,200,40,40,20,100,30,30,20,70,"-",10,"-",10,60,70,50,180]
[258,"South Cambridgeshire",null,null,null,null,null,null,null,null,null,null,null,null,null,null,null,null,80,100,100,280,30,60,70,160,"-",10,"-",10,110,170,170,450,90,100,70,270,40,80,70,190,"-",10,10,10,140,180,140,460,110,70,80,260,60,70,70,200,"-","-",10,10,170,150,160,470,90,80,110,280,30,90,50,170,"-",10,10,10,120,180,160,460]
[259,"South Derbyshire",null,null,null,null,null,null,null,null,null,null,null,null,null,null,null,null,100,100,160,360,50,70,80,190,"-","-","-","-",150,170,240,550,120,110,140,370,50,70,80,210,"-",10,10,10,170,190,230,590,140,110,120,370,60,80,70,210,"-","-",10,20,200,190,210,590,150,100,160,400,70,80,70,220,"-",10,"-",10,220,190,230,630]
[260,"South Gloucestershire",340,270,290,890,180,190,190,570,"-",10,"-",10,520,470,480,1470,280,200,340,810,150,200,200,550,"-",10,"-",10,430,410,540,1370,310,240,230,770,170,190,220,570,"-","-","-",10,480,420,450,1350,360,250,280,890,170,210,170,550,"-","-",10,10,530,460,460,1450,300,230,240,780,230,230,170,620,"-",10,10,30,530,470,430,1430]
[261,"South Hams",null,null,null,null,null,null,null,null,null,null,null,null,null,null,null,null,80,90,110,280,30,40,80,150,"-","-","-","-",110,130,190,430,110,80,60,250,40,60,70,160,"-","-",10,10,150,140,130,430,120,80,80,280,50,70,60,170,"-","-","-","-",170,150,140,460,100,80,80,260,40,60,60,160,"-","-",10,10,140,150,140,420]
[262,"South Holland",null,null,null,null,null,null,null,null,null,null,null,null,null,null,null,null,80,70,90,240,40,50,80,160,"-","-","-","-",120,120,170,410,70,70,70,210,40,80,70,190,"-","-","-","-",100,150,150,400,90,80,90,250,50,90,60,200,"-","-",10,10,140,170,150,460,90,80,80,250,50,70,50,170,"-","-","-",10,140,150,130,430]
[263,"South Kesteven",null,null,null,null,null,null,null,null,null,null,null,null,null,null,null,null,110,120,120,350,40,90,140,270,"-","-","-",10,160,210,260,630,120,110,90,320,50,110,120,290,"-","-",10,10,170,230,220,610,120,140,120,380,60,110,90,260,"-","-","-","-",180,250,210,650,130,110,120,360,60,80,90,230,"-","-","-","-",190,190,210,590]
[264,"South Lakeland",null,null,null,null,null,null,null,null,null,null,null,null,null,null,null,null,100,110,130,330,50,80,100,230,"-","-","-","-",150,190,230,570,100,130,100,330,60,90,120,270,"-","-","-","-",160,220,210,600,90,120,110,320,80,70,70,220,"-","-","-",10,170,190,190,550,100,110,120,330,70,100,100,260,"-","-","-",10,170,210,220,600]
[265,"South Norfolk",null,null,null,null,null,null,null,null,null,null,null,null,null,null,null,null,90,80,140,310,40,50,80,160,"-","-","-","-",130,130,210,470,120,70,70,260,50,70,70,190,"-",10,"-",10,170,160,140,470,150,100,100,350,40,80,60,180,"-","-","-","-",200,190,150,540,150,100,70,320,50,70,70,200,"-",10,10,20,200,180,160,540]
[266,"South Northamptonshire",null,null,null,null,null,null,null,null,null,null,null,null,null,null,null,null,60,60,80,210,20,50,40,110,"-","-","-","-",90,110,120,320,90,80,80,240,40,70,50,150,"-","-","-",10,130,150,130,400,80,80,90,240,40,70,50,160,"-","-","-",10,120,160,130,410,90,60,60,210,50,60,50,160,"-","-",10,10,140,120,120,380]
[267,"South Oxfordshire",null,null,null,null,null,null,null,null,null,null,null,null,null,null,null,null,90,110,90,290,60,60,80,200,"-","-","-",10,140,170,180,490,100,100,60,260,60,90,60,200,"-","-",10,10,160,190,130,470,90,90,90,260,50,90,50,180,"-","-","-",10,140,170,140,450,110,70,90,280,60,80,60,200,"-","-",20,20,170,160,160,490]
[268,"South Ribble",null,null,null,null,null,null,null,null,null,null,null,null,null,null,null,null,150,130,180,450,70,90,150,300,"-","-","-",10,210,220,330,760,140,140,140,410,70,110,180,360,"-",10,10,10,210,260,320,780,150,140,100,380,70,120,80,270,"-",10,10,20,210,260,190,660,130,110,150,390,60,110,90,260,"-","-",20,20,200,220,250,660]
[269,"South Somerset",null,null,null,null,null,null,null,null,null,null,null,null,null,null,null,null,180,130,260,570,90,90,110,290,"-","-","-","-",270,230,370,860,190,150,140,480,100,130,160,390,"-",10,"-",10,290,280,310,880,200,150,180,540,100,130,120,350,"-",10,10,20,310,290,310,900,220,150,180,540,110,130,110,350,"-","-",10,10,330,280,300,910]
[270,"South Staffordshire",null,null,null,null,null,null,null,null,null,null,null,null,null,null,null,null,130,110,120,360,50,70,90,210,"-","-","-",10,180,180,210,580,110,130,100,330,50,90,100,240,"-",10,10,20,160,220,210,590,130,120,120,360,70,80,70,230,"-",10,10,30,200,210,200,610,150,100,110,360,60,70,100,230,"-",10,10,20,210,170,220,600]
[271,"South Tyneside",310,210,350,870,120,100,190,410,"-","-","-","-",430,320,540,1290,180,200,340,710,100,110,210,430,"-","-","-","-",280,310,550,1140,200,230,290,710,110,120,190,420,"-","-","-",10,310,350,480,1140,210,190,300,700,120,160,200,480,"-","-",20,20,330,350,510,1200,220,210,350,770,150,150,170,470,"-","-",20,20,370,360,530,1260]
[272,"Southampton",170,210,310,690,90,120,150,360,"-",10,"-",10,260,340,450,1050,130,160,280,570,60,120,180,360,"-",10,"-",10,190,290,460,940,150,170,240,560,60,130,180,360,"-",10,"-",10,210,310,420,930,150,190,270,600,70,130,160,360,"-","-",10,10,220,320,430,970,200,210,310,720,80,140,190,410,"-",10,20,20,290,360,520,1160]
[273,"Southend on Sea",190,140,110,450,30,50,50,130,"-","-","-","-",220,200,160,580,90,110,120,320,40,60,100,200,"-","-","-","-",130,170,220,520,100,140,130,370,40,70,140,250,"-","-","-","-",140,200,270,620,130,140,160,430,40,110,110,250,"-",10,10,20,170,270,280,710,140,130,140,400,40,80,100,220,"-","-",20,20,180,210,260,650]
[274,"Southwark",140,140,220,510,40,60,150,260,"-","-","-","-",190,210,380,770,100,130,240,470,20,80,220,320,"-","-","-","-",120,210,460,790,90,150,200,440,50,110,180,330,"-","-","-","-",140,250,380,770,100,130,230,470,40,100,120,260,"-","-",10,10,140,230,360,730,90,160,290,550,50,110,170,320,"-",10,10,20,140,280,470,890]
[275,"Spelthorne",null,null,null,null,null,null,null,null,null,null,null,null,null,null,null,null,50,60,70,180,40,50,50,150,"-","-","-","-",100,110,120,330,70,70,60,210,40,70,40,150,"-","-","-","-",120,140,100,360,90,80,60,220,60,60,50,160,"-","-","-",10,150,130,110,390,80,60,70,220,50,60,40,150,"-","-",10,10,130,130,120,380]
[276,"St Edmundsbury",null,null,null,null,null,null,null,null,null,null,null,null,null,null,null,null,100,140,90,330,30,50,80,160,"-","-","-","-",140,190,170,490,80,130,100,310,40,60,80,170,"-",10,"-",10,120,200,180,490,100,120,100,320,40,60,70,170,"-",10,10,10,150,190,180,510,130,130,110,380,50,70,90,210,"-","-",10,10,190,200,210,600]
[277,"St Helens",240,280,330,850,110,110,180,400,"-","-","-",10,350,390,510,1250,220,200,440,850,90,140,260,500,"-","-",10,10,310,340,710,1360,220,200,330,750,80,150,290,520,"-","-",20,20,300,350,630,1280,210,230,280,720,80,160,210,450,"-",10,20,20,290,390,510,1190,250,220,330,800,90,180,230,510,"-","-",20,30,340,410,590,1330]
[278,"St. Albans District",null,null,null,null,null,null,null,null,null,null,null,null,null,null,null,null,60,60,70,180,30,50,50,130,"-","-","-","-",80,100,120,310,40,50,70,160,20,50,60,120,"-","-","-",10,60,100,130,290,60,60,60,170,20,60,30,110,"-","-","-",10,80,120,90,290,50,60,50,160,30,50,40,120,"-",10,10,20,90,120,90,290]
[279,"Stafford",null,null,null,null,null,null,null,null,null,null,null,null,null,null,null,null,90,120,140,340,40,80,130,250,"-","-","-","-",130,190,270,590,100,140,130,370,50,80,110,230,"-","-",10,10,140,220,240,610,90,130,160,380,40,100,120,250,"-","-",10,20,130,230,290,650,110,90,130,330,60,80,100,230,"-",10,30,40,170,180,250,600]
[280,"Staffordshire",940,1050,1230,3220,440,560,630,1620,"-",10,10,20,1380,1620,1870,4870,760,910,1170,2840,350,560,760,1670,10,20,20,50,1110,1500,1950,4560,790,980,1020,2780,360,610,860,1830,10,30,50,80,1150,1620,1930,4700,930,920,1230,3090,430,660,760,1850,20,40,80,130,1380,1610,2070,5070,930,840,1190,2960,480,660,740,1880,10,50,140,190,1410,1540,2080,5030]
[281,"Staffordshire Moorlands",null,null,null,null,null,null,null,null,null,null,null,null,null,null,null,null,90,90,130,310,50,80,90,220,"-","-","-",10,140,170,230,540,110,90,120,320,60,60,110,230,"-",10,10,10,170,160,230,560,130,90,120,340,50,70,90,210,"-","-",10,20,190,170,220,570,110,80,150,350,60,80,80,220,"-",10,10,20,170,160,250,590]
[282,"Stevenage",null,null,null,null,null,null,null,null,null,null,null,null,null,null,null,null,50,70,90,210,30,40,50,120,"-","-","-","-",70,120,140,330,60,90,110,260,30,60,60,160,"-","-","-",10,90,160,170,420,70,90,100,250,20,50,30,110,"-","-","-",10,90,140,130,370,70,90,90,250,30,50,60,140,"-","-","-",10,100,140,150,390]
[283,"Stockport",430,330,340,1100,160,200,200,550,"-",10,"-",20,590,540,540,1660,270,310,330,920,120,210,300,630,"-",10,"-",20,390,540,640,1570,310,260,290,860,170,230,260,660,"-",10,10,30,480,500,560,1540,320,270,270,860,180,230,190,600,10,10,30,40,500,520,490,1510,310,260,320,890,150,230,220,600,10,10,30,50,470,500,570,1540]
[284,"Stockton-on-Tees",300,270,300,870,130,180,190,490,"-",10,"-",10,420,450,490,1360,220,200,360,790,160,160,280,600,"-","-","-",10,380,370,650,1390,250,280,400,930,150,150,200,490,"-",10,10,10,400,430,600,1430,270,250,290,810,120,180,190,500,"-","-",10,10,400,430,490,1320,240,250,290,790,170,200,210,570,"-","-",20,30,410,450,530,1380]
[285,"Stoke-on-Trent",390,320,320,1030,110,200,220,530,"-",10,10,10,500,530,540,1570,250,270,400,920,100,190,300,580,"-",10,10,10,350,460,700,1510,300,300,440,1040,80,180,350,600,"-","-",20,20,380,490,810,1670,280,330,500,1110,90,200,320,620,"-",10,30,30,370,540,850,1760,370,350,610,1340,110,210,330,640,"-",10,30,40,480,570,970,2010]
[286,"Stratford on Avon",null,null,null,null,null,null,null,null,null,null,null,null,null,null,null,null,80,90,120,290,30,60,70,150,"-","-","-","-",100,150,190,440,100,100,100,300,30,60,70,170,"-","-","-","-",140,160,180,470,70,80,120,280,60,80,60,200,"-","-",10,10,130,160,190,490,80,90,100,270,50,70,50,170,"-","-",10,10,130,160,160,450]
[287,"Stroud",null,null,null,null,null,null,null,null,null,null,null,null,null,null,null,null,60,90,90,240,30,70,50,150,"-","-","-",10,100,150,140,390,80,100,70,250,40,60,60,160,"-",10,10,10,120,160,140,420,90,100,100,290,60,60,40,160,"-","-","-",10,150,160,140,450,80,90,70,250,70,80,50,190,"-","-",10,10,150,170,130,450]
[288,"Suffolk",750,780,750,2290,230,420,340,1000,"-",10,"-",10,980,1210,1100,3290,650,690,660,2010,210,380,520,1110,"-",30,10,40,870,1100,1190,3150,690,710,550,1950,330,460,520,1310,"-",30,10,40,1020,1190,1080,3290,730,720,670,2120,300,460,410,1180,20,30,30,80,1060,1210,1110,3380,790,740,680,2210,340,460,540,1340,10,30,60,100,1140,1220,1280,3640]
[289,"Suffolk Coastal",null,null,null,null,null,null,null,null,null,null,null,null,null,null,null,null,120,130,80,330,40,80,90,210,"-",10,"-",10,160,220,170,550,140,120,70,320,60,80,70,210,"-","-","-",10,200,200,140,540,120,120,90,330,40,80,60,180,10,10,"-",20,170,210,160,530,120,130,100,350,50,80,70,190,"-",10,10,20,180,210,170,560]
[290,"Sunderland",640,360,740,1730,240,230,300,770,"-",10,"-",10,880,590,1040,2510,310,360,690,1360,180,210,460,860,"-",10,10,10,500,580,1160,2230,350,390,600,1340,220,200,360,780,"-",10,10,20,570,600,970,2140,360,350,640,1350,260,220,280,760,"-",10,40,50,620,580,950,2150,470,430,740,1630,250,240,310,800,"-","-",20,30,720,670,1070,2460]
[291,"Surrey",650,780,640,2070,230,410,390,1030,"-",10,"-",10,880,1200,1030,3110,490,670,670,1830,250,420,550,1230,"-",10,"-",10,740,1100,1230,3070,570,750,620,1940,250,540,500,1290,"-",20,20,40,820,1310,1140,3270,580,640,620,1850,330,540,400,1270,10,20,20,60,920,1200,1040,3170,500,490,670,1660,340,480,470,1290,10,30,60,100,850,1000,1200,3050]
[292,"Surrey Heath",null,null,null,null,null,null,null,null,null,null,null,null,null,null,null,null,40,50,50,140,30,40,30,90,"-","-","-","-",70,100,70,230,50,60,40,150,30,50,40,120,"-","-","-",10,80,110,80,270,50,40,60,150,30,40,30,90,"-","-","-",10,80,80,90,250,50,50,70,160,50,40,40,120,"-","-",10,10,100,90,110,300]
[293,"Sutton",160,130,110,400,60,90,110,260,"-","-","-","-",220,230,220,670,100,110,130,340,70,100,120,280,"-","-","-",10,160,210,250,620,120,110,110,340,70,110,140,320,"-","-","-",10,190,220,260,660,100,100,120,320,90,110,90,280,"-","-",10,20,180,210,230,620,110,100,120,320,70,100,120,280,"-",10,20,20,180,200,250,630]
[294,"Swale",null,null,null,null,null,null,null,null,null,null,null,null,null,null,null,null,120,120,150,390,30,50,120,210,"-","-","-","-",160,180,270,610,130,100,90,310,50,70,90,210,"-","-","-",10,180,170,180,520,160,120,180,460,40,80,120,240,"-","-",10,10,200,210,300,710,150,100,150,400,40,90,140,270,"-","-",20,20,190,190,300,680]
[295,"Swindon",160,230,270,660,70,110,110,290,"-","-","-",10,230,340,380,960,130,170,250,550,70,120,180,370,"-","-","-",10,200,290,430,920,150,200,170,520,60,120,190,370,"-",10,10,20,210,330,360,900,170,190,190,550,90,140,110,350,"-","-","-",10,270,330,310,910,160,170,210,540,120,130,150,400,"-",10,"-",10,280,310,360,950]
[296,"Tameside",380,340,390,1100,130,190,170,480,"-",10,"-",10,510,530,560,1600,230,310,350,890,110,160,260,520,"-","-","-",10,340,470,610,1420,270,320,310,900,140,180,250,570,"-",10,10,20,410,510,570,1490,250,290,350,890,150,210,170,540,10,10,10,20,400,510,530,1450,290,280,310,870,140,200,190,530,"-","-",20,30,430,480,520,1420]
[297,"Tamworth",null,null,null,null,null,null,null,null,null,null,null,null,null,null,null,null,50,90,160,290,20,30,60,120,"-","-","-","-",70,120,220,410,60,110,120,290,30,50,80,160,"-","-",10,10,90,170,200,450,60,70,170,300,50,50,60,170,"-","-",10,10,110,120,240,480,50,110,130,280,40,60,70,170,"-","-",10,10,90,170,200,460]
[298,"Tandridge",null,null,null,null,null,null,null,null,null,null,null,null,null,null,null,null,30,50,50,130,30,40,40,110,"-","-","-","-",60,80,90,230,50,40,50,140,20,40,40,100,"-","-","-","-",70,80,90,240,50,50,40,150,30,40,30,90,"-","-","-",10,80,90,70,240,30,30,40,100,20,30,40,90,"-","-",10,10,60,60,80,200]
[299,"Taunton Deane",null,null,null,null,null,null,null,null,null,null,null,null,null,null,null,null,100,100,130,330,50,60,70,180,"-","-","-","-",150,170,200,510,90,120,120,330,50,70,110,230,"-","-","-",10,140,190,230,560,140,110,100,350,50,70,80,200,"-","-","-",10,190,190,190,560,100,110,190,400,60,80,60,210,"-","-",10,10,160,200,260,620]
[300,"Teignbridge",null,null,null,null,null,null,null,null,null,null,null,null,null,null,null,null,130,140,150,410,50,100,120,270,"-","-","-","-",170,240,270,680,140,130,130,410,40,120,130,290,"-",10,"-",10,180,260,270,710,140,150,160,440,60,100,90,240,"-","-",10,10,190,240,250,690,140,160,130,430,40,110,120,270,"-","-",10,10,180,270,260,710]
[301,"Telford and Wrekin",190,180,210,580,70,130,170,370,"-","-","-","-",270,310,380,950,180,200,290,660,60,110,180,350,"-","-",10,10,230,310,480,1020,170,240,290,700,60,130,260,450,"-","-",10,10,240,370,560,1160,170,160,280,610,50,150,180,380,"-",10,10,30,220,320,480,1020,200,200,240,640,50,130,170,360,10,10,30,40,260,340,440,1040]
[302,"Tendring",null,null,null,null,null,null,null,null,null,null,null,null,null,null,null,null,110,100,120,340,40,60,110,220,"-","-","-","-",160,170,230,560,140,140,130,410,30,100,120,240,"-","-",10,10,160,240,250,650,140,180,170,490,40,100,130,270,"-",10,40,40,180,280,330,790,180,130,160,470,70,130,150,350,"-",10,40,50,240,270,360,870]
[303,"Test Valley",null,null,null,null,null,null,null,null,null,null,null,null,null,null,null,null,90,160,120,370,20,80,80,190,"-","-","-","-",110,240,200,550,90,200,160,450,30,90,100,220,"-",10,10,10,120,300,260,680,100,220,260,580,60,130,100,290,"-","-","-","-",160,350,360,870,100,200,390,690,60,140,80,280,"-","-","-",10,150,340,480,970]
[304,"Tewkesbury",null,null,null,null,null,null,null,null,null,null,null,null,null,null,null,null,60,70,80,220,30,50,70,150,"-","-","-",10,90,130,150,370,60,80,80,220,30,60,50,140,"-","-",10,10,90,150,130,370,70,70,60,210,40,60,50,150,"-","-","-","-",120,140,110,370,90,70,90,250,30,60,60,150,"-","-",10,10,120,130,150,400]
[305,"Thanet",null,null,null,null,null,null,null,null,null,null,null,null,null,null,null,null,90,130,120,340,30,80,120,240,"-","-","-","-",120,210,240,570,120,160,140,420,50,80,130,270,"-","-",10,10,180,240,270,690,120,220,130,460,30,80,80,190,"-","-",10,10,150,300,220,660,100,190,190,470,50,80,120,240,"-","-",20,20,140,270,330,740]
[306,"Three Rivers",null,null,null,null,null,null,null,null,null,null,null,null,null,null,null,null,50,50,60,150,10,30,30,70,"-","-","-","-",60,80,90,230,40,50,60,160,20,30,40,80,"-","-","-","-",60,80,100,240,50,50,60,160,20,30,40,90,"-",10,"-",10,70,90,100,250,70,40,40,150,30,30,30,90,"-","-","-",10,90,70,70,240]
[307,"Thurrock",140,110,130,380,50,70,60,180,"-","-","-","-",190,180,190,560,130,110,130,380,50,70,100,220,"-","-","-","-",180,180,240,600,150,100,140,390,50,70,90,220,"-","-","-",10,200,180,240,610,170,160,160,490,70,100,100,270,"-","-","-",10,240,270,260,770,170,150,150,470,60,110,120,290,"-","-",20,20,240,260,290,790]
[308,"Tonbridge and Malling",null,null,null,null,null,null,null,null,null,null,null,null,null,null,null,null,60,60,100,220,40,60,70,160,"-","-","-","-",100,120,160,390,60,70,70,200,40,60,50,150,"-","-","-","-",100,130,120,340,60,80,60,200,30,50,50,130,"-","-",10,10,90,130,120,340,90,80,90,250,30,50,50,120,"-","-","-",10,110,130,140,380]
[309,"Torbay",160,190,270,620,50,120,140,310,"-",10,"-",10,200,320,410,930,120,160,240,510,30,90,140,260,"-",10,10,10,150,250,390,790,140,180,190,510,40,130,200,380,"-","-","-",10,190,320,390,890,140,170,240,550,40,130,130,310,"-","-",10,10,190,310,380,870,130,210,240,580,60,100,150,310,"-","-",20,30,190,310,410,910]
[310,"Torridge",null,null,null,null,null,null,null,null,null,null,null,null,null,null,null,null,60,70,100,230,20,30,50,100,"-","-","-","-",80,100,150,330,80,60,60,190,40,50,70,160,"-","-","-","-",110,110,130,350,100,60,60,230,30,50,50,130,"-","-","-",10,130,110,120,360,100,60,60,210,30,50,60,140,"-","-",10,10,130,110,130,370]
[311,"Tower Hamlets",230,200,230,660,40,90,120,250,"-","-","-","-",270,290,350,910,100,110,130,350,30,70,100,200,"-","-","-",10,130,180,240,550,120,160,160,440,60,110,110,280,"-","-","-","-",180,280,270,720,140,240,170,550,90,110,80,280,"-","-","-",10,230,360,250,840,180,210,210,610,50,120,100,260,"-",10,"-",10,230,340,310,880]
[312,"Trafford",210,170,200,580,80,110,120,310,"-",10,"-",10,300,280,320,890,130,170,230,530,90,130,220,440,"-",10,10,10,230,310,450,980,190,180,170,540,80,140,230,460,"-","-",10,10,280,320,410,1010,180,210,210,600,150,170,170,480,"-",10,10,20,330,380,390,1100,170,180,280,640,100,160,160,410,"-",10,20,30,280,350,460,1080]
[313,"Tunbridge Wells",null,null,null,null,null,null,null,null,null,null,null,null,null,null,null,null,40,50,50,140,20,40,40,100,"-","-","-","-",60,90,100,250,40,60,50,160,20,40,50,100,"-","-","-","-",60,100,100,260,60,50,50,150,20,40,60,110,"-","-","-",10,80,90,110,270,60,70,70,190,20,40,40,110,"-","-",10,10,80,110,120,310]
[314,"Uttlesford",null,null,null,null,null,null,null,null,null,null,null,null,null,null,null,null,40,80,40,160,10,30,50,90,"-","-","-","-",50,110,90,250,60,60,50,170,20,50,40,110,"-","-","-","-",80,100,100,280,60,50,50,160,20,50,40,100,"-","-","-",10,80,100,90,270,60,50,50,160,30,30,30,90,"-","-","-",10,90,80,80,250]
[315,"Vale of White Horse",null,null,null,null,null,null,null,null,null,null,null,null,null,null,null,null,90,100,80,260,60,70,70,200,"-","-","-","-",150,170,150,460,120,80,60,260,60,60,70,190,"-","-","-",10,180,140,130,450,90,70,80,240,70,60,50,180,"-","-","-","-",160,130,140,430,100,70,80,250,70,70,60,200,"-","-",10,10,170,140,150,460]
[316,"Wakefield",400,410,570,1380,150,240,230,620,"-",10,10,20,550,650,810,2010,310,380,610,1300,150,210,310,670,"-","-","-",10,460,590,930,1970,340,330,440,1110,150,250,310,710,"-",10,10,10,490,590,760,1840,380,370,490,1240,180,270,310,750,"-",10,10,20,560,650,810,2010,380,350,460,1190,180,300,280,760,"-",10,20,40,550,660,770,1980]
[317,"Walsall",390,280,430,1090,120,140,220,480,"-","-","-","-",510,420,650,1580,270,250,460,980,110,150,250,500,"-","-",10,10,380,400,710,1490,290,290,350,940,100,200,290,580,"-",10,20,30,390,500,660,1550,310,320,310,940,110,200,190,500,"-",10,30,40,420,520,540,1480,310,350,350,1010,130,220,240,590,"-",10,60,70,440,580,650,1670]
[318,"Waltham Forest",150,190,230,570,60,80,100,240,"-","-","-","-",210,270,330,810,120,150,230,500,60,80,140,280,"-","-","-","-",180,230,370,790,150,160,190,500,70,90,170,330,"-","-","-","-",210,260,360,830,120,180,280,580,70,130,150,360,"-","-",10,10,190,320,440,950,100,190,290,580,70,140,170,390,"-",10,30,40,180,340,490,1000]
[319,"Wandsworth",60,90,130,280,20,50,90,150,"-","-","-","-",80,140,210,430,40,60,150,250,30,50,120,200,"-","-","-","-",70,110,270,450,40,80,120,240,30,60,110,200,"-","-","-","-",70,140,230,440,50,70,130,240,40,70,70,170,"-","-","-",10,90,140,200,420,50,70,150,260,40,50,90,170,"-","-",10,10,80,120,240,440]
[320,"Warrington",240,250,290,770,110,110,120,340,"-",10,"-",10,350,370,410,1120,150,210,320,670,100,160,330,600,"-",10,10,20,250,380,660,1280,170,210,250,640,90,170,250,510,"-",10,10,20,270,390,510,1170,210,270,230,710,110,180,190,480,"-",10,20,30,320,460,440,1220,200,220,310,740,110,180,200,490,"-",10,20,40,320,410,540,1270]
[321,"Warwick",null,null,null,null,null,null,null,null,null,null,null,null,null,null,null,null,60,80,80,220,30,60,90,180,"-","-","-","-",100,140,170,410,80,80,130,290,30,70,90,200,"-","-","-",10,120,160,220,490,70,110,170,350,50,60,80,190,"-","-",10,20,120,170,260,550,100,90,140,330,40,70,90,210,"-","-",10,10,140,170,250,550]
[322,"Warwickshire",480,470,530,1480,250,300,350,910,"-",10,"-",10,730,790,890,2400,370,450,650,1470,190,320,460,970,"-",10,"-",20,560,790,1110,2460,480,510,640,1630,210,310,470,1000,10,20,20,50,700,840,1130,2670,470,460,700,1620,240,350,350,940,"-",20,50,80,710,830,1100,2640,480,520,700,1700,250,350,360,960,10,10,60,80,750,880,1110,2740]
[323,"Watford",null,null,null,null,null,null,null,null,null,null,null,null,null,null,null,null,40,60,80,180,20,40,50,110,"-","-","-","-",60,90,140,290,40,60,110,200,20,40,60,120,"-","-","-","-",60,100,170,320,30,60,140,220,20,40,40,100,"-","-","-","-",50,100,180,330,30,40,100,160,20,30,50,110,"-","-",10,10,50,70,160,280]
[324,"Waveney",null,null,null,null,null,null,null,null,null,null,null,null,null,null,null,null,80,100,130,320,40,60,80,180,"-","-","-","-",120,160,220,500,120,120,90,340,80,80,100,250,"-","-","-","-",200,210,190,600,120,120,100,340,60,80,60,200,"-","-",10,20,170,210,180,560,120,120,90,320,70,100,60,230,"-",10,10,20,190,220,160,570]
[325,"Waverley",null,null,null,null,null,null,null,null,null,null,null,null,null,null,null,null,50,50,40,140,20,40,60,110,"-","-","-","-",60,90,100,250,40,70,60,170,20,50,50,120,"-","-","-","-",60,120,110,290,40,70,50,160,20,50,30,110,"-","-",10,10,70,120,90,270,40,50,70,170,30,40,40,110,"-","-","-","-",70,100,110,280]
[326,"Wealden",null,null,null,null,null,null,null,null,null,null,null,null,null,null,null,null,90,100,120,310,40,50,80,170,"-","-","-","-",130,150,200,480,100,110,90,300,50,80,110,240,"-","-","-",10,150,180,210,540,110,110,60,290,50,80,70,200,"-","-","-",10,170,190,140,500,100,110,90,310,40,70,70,180,"-","-",20,20,150,180,170,510]
[327,"Wellingborough",null,null,null,null,null,null,null,null,null,null,null,null,null,null,null,null,60,60,100,230,20,50,60,140,"-","-","-","-",90,120,170,370,70,70,110,250,30,40,60,120,"-","-","-",10,90,110,170,370,70,80,100,240,20,50,60,120,"-","-",10,10,90,130,160,370,80,70,80,230,20,40,50,120,"-","-",10,10,110,110,130,350]
[328,"Welwyn Hatfield District",null,null,null,null,null,null,null,null,null,null,null,null,null,null,null,null,60,50,70,180,30,50,70,150,"-","-","-","-",90,100,150,330,50,80,70,200,30,30,60,120,"-","-","-","-",80,110,130,320,60,60,90,200,30,60,40,130,"-","-","-",10,90,120,130,340,60,50,60,180,30,40,50,130,"-",10,10,20,90,110,120,320]
[329,"West Berkshire",170,120,120,410,70,100,70,240,"-","-","-","-",240,230,190,660,140,90,100,340,70,100,110,270,"-","-","-",10,210,190,220,610,140,130,120,390,70,100,100,260,"-",10,"-",10,210,230,220,660,170,120,110,400,60,120,50,230,"-",10,"-",20,230,250,170,650,150,120,110,370,80,110,70,260,"-",10,10,20,220,230,190,650]
[330,"West Devon",null,null,null,null,null,null,null,null,null,null,null,null,null,null,null,null,50,50,70,170,10,30,50,100,"-","-","-","-",60,80,120,270,50,50,50,150,20,30,60,110,"-","-","-","-",70,90,110,260,70,60,80,210,20,50,40,100,"-","-","-","-",90,110,120,310,60,60,50,170,20,50,60,120,"-","-","-","-",80,110,110,300]
[331,"West Dorset",null,null,null,null,null,null,null,null,null,null,null,null,null,null,null,null,90,70,110,260,50,50,70,170,"-","-","-","-",140,120,180,440,100,100,80,270,50,60,70,180,"-","-","-","-",150,160,140,450,110,110,70,290,50,90,50,190,"-","-","-","-",160,200,130,490,130,80,70,280,50,70,60,170,"-","-","-","-",170,150,130,450]
[332,"West Lancashire",null,null,null,null,null,null,null,null,null,null,null,null,null,null,null,null,110,100,160,370,40,60,130,230,"-","-","-","-",150,160,290,600,90,110,160,360,50,90,150,290,"-","-",10,10,150,200,310,660,120,100,120,330,60,80,70,210,"-","-","-",10,170,190,190,550,100,100,160,360,30,60,110,200,"-","-",10,20,140,160,280,580]
[333,"West Lindsey",null,null,null,null,null,null,null,null,null,null,null,null,null,null,null,null,70,70,90,230,30,60,80,180,"-","-","-","-",100,140,170,410,100,70,80,240,50,70,80,200,"-","-","-","-",150,140,160,450,100,100,110,310,50,50,50,150,"-","-",10,10,150,150,160,470,100,90,70,260,40,80,80,200,"-","-",10,10,140,170,160,470]
[334,"West Oxfordshire",null,null,null,null,null,null,null,null,null,null,null,null,null,null,null,null,80,120,100,290,40,50,60,150,"-","-","-","-",120,170,160,440,70,120,90,280,40,60,70,180,"-","-","-","-",120,180,170,460,110,110,50,270,50,50,60,160,"-","-","-","-",160,160,120,430,100,120,100,330,50,60,60,160,"-","-",10,10,150,180,170,500]
[335,"West Somerset",null,null,null,null,null,null,null,null,null,null,null,null,null,null,null,null,20,50,80,160,10,20,20,50,"-","-","-","-",30,80,100,210,20,40,30,80,20,20,30,60,"-","-","-","-",40,50,50,140,40,30,20,90,10,20,20,40,"-","-",10,10,50,50,50,140,30,30,30,80,10,10,20,40,"-","-","-","-",40,40,50,130]
[336,"West Sussex",520,680,550,1750,180,380,300,860,"-","-","-",10,700,1060,850,2610,440,590,610,1640,200,420,550,1170,"-",10,"-",10,640,1020,1160,2820,440,590,590,1630,180,450,520,1150,"-",10,10,20,620,1050,1120,2790,520,630,640,1790,240,470,390,1090,"-",10,30,50,760,1110,1060,2920,470,550,640,1660,240,440,430,1110,"-",20,60,80,710,1020,1130,2860]
[337,"Westminster",70,170,130,370,10,30,50,80,"-","-","-","-",80,190,180,450,70,110,90,270,10,30,40,90,"-","-","-","-",70,140,140,350,60,130,100,280,10,40,60,110,"-","-","-","-",70,170,160,400,50,100,110,260,20,40,90,140,"-","-","-","-",60,150,190,400,60,110,90,250,20,40,70,130,"-",10,"-",10,80,150,170,390]
[338,"Weymouth and Portland",null,null,null,null,null,null,null,null,null,null,null,null,null,null,null,null,70,90,100,260,30,60,50,130,"-","-","-","-",90,150,150,390,60,90,90,240,30,60,90,180,"-","-","-","-",100,150,170,420,70,100,90,250,20,60,50,130,"-","-","-",10,90,160,140,390,100,70,60,220,20,50,60,130,"-","-",10,10,120,120,120,360]
[339,"Wigan",580,430,540,1540,210,260,360,830,"-","-","-","-",790,680,900,2370,430,390,570,1390,190,270,470,930,"-","-","-",10,610,670,1050,2330,360,410,500,1270,170,290,450,910,"-",10,30,40,540,700,980,2220,440,420,450,1320,200,320,310,830,10,10,20,30,650,750,780,2180,410,430,550,1390,210,270,330,810,"-",20,30,60,630,720,910,2260]
[340,"Wiltshire",490,840,690,2020,110,300,340,750,"-","-","-",10,600,1140,1040,2780,350,660,520,1520,140,300,440,880,"-",10,"-",10,490,960,960,2410,440,630,460,1530,130,340,580,1060,"-",10,"-",10,580,980,1050,2600,400,710,600,1710,140,400,550,1090,"-",10,10,20,540,1120,1160,2820,370,700,650,1730,180,450,550,1170,10,10,20,40,550,1160,1220,2940]
[341,"Winchester",null,null,null,null,null,null,null,null,null,null,null,null,null,null,null,null,90,170,160,420,40,120,120,280,"-","-","-","-",130,290,280,690,100,160,90,350,50,150,170,370,"-","-","-","-",150,320,260,720,80,150,90,330,50,170,120,340,"-","-","-","-",130,320,220,680,110,180,110,390,50,170,90,310,"-","-",10,10,160,350,210,710]
[342,"Windsor and Maidenhead",70,80,90,240,30,50,50,130,"-","-","-","-",100,140,140,380,60,70,90,220,30,70,60,160,"-","-","-","-",90,140,150,380,70,110,90,270,50,60,70,180,"-","-","-",10,120,180,160,460,90,90,80,260,40,70,40,150,"-","-","-",10,130,160,120,410,60,80,70,210,40,60,60,160,"-",10,"-",10,100,140,140,380]
[343,"Wirral",680,440,580,1700,170,270,280,720,"-",10,10,20,850,720,860,2440,370,410,670,1450,150,300,490,940,"-",10,10,10,510,720,1160,2390,290,390,510,1190,150,290,490,930,"-",10,10,30,440,690,1010,2140,290,370,530,1190,160,290,490,940,"-",10,60,60,450,660,1080,2190,270,400,450,1120,170,270,430,870,10,10,50,60,450,680,930,2050]
[344,"Woking",null,null,null,null,null,null,null,null,null,null,null,null,null,null,null,null,60,70,90,220,20,40,50,100,"-","-","-","-",70,110,140,320,40,70,70,180,20,60,70,150,"-","-","-",10,60,130,140,330,50,60,70,180,30,70,40,140,"-","-","-",10,80,130,120,320,30,50,70,150,40,60,60,160,"-","-","-",10,70,120,130,310]
[345,"Wokingham",130,180,100,410,70,360,240,670,"-","-","-",10,200,540,350,1080,120,150,110,380,190,340,220,750,"-","-","-","-",300,500,330,1130,120,140,110,370,120,480,340,940,"-","-","-",10,240,620,450,1310,100,100,70,260,130,610,420,1160,"-",10,"-",10,230,710,490,1430,90,70,80,240,150,380,180,710,"-",10,"-",10,240,460,260,960]
[346,"Wolverhampton",240,230,390,860,90,110,180,390,"-","-","-","-",330,340,580,1250,200,240,380,820,70,140,250,470,"-",10,10,20,270,390,640,1300,210,260,320,790,80,140,240,460,"-",10,20,30,290,410,580,1270,260,250,350,860,90,160,190,440,"-",10,40,40,350,410,570,1330,260,240,400,900,90,180,230,500,"-","-",50,50,350,430,680,1460]
[347,"Worcester",null,null,null,null,null,null,null,null,null,null,null,null,null,null,null,null,60,100,140,290,20,70,130,210,"-","-","-","-",70,170,260,500,100,110,120,330,30,80,120,230,"-",10,10,20,130,200,250,580,110,100,120,330,40,70,70,180,"-","-",10,10,140,170,200,510,80,100,150,320,50,80,70,190,"-","-",10,10,130,180,230,530]
[348,"Worcestershire",490,600,710,1790,180,330,340,860,"-",10,"-",20,670,940,1050,2660,370,560,730,1650,140,350,560,1060,"-",10,10,20,510,920,1310,2730,450,620,670,1750,180,450,610,1240,"-",20,40,70,640,1100,1320,3060,500,570,740,1820,250,370,390,1010,"-",20,40,60,760,960,1170,2890,460,570,640,1660,290,420,450,1160,"-",20,100,120,750,1010,1180,2940]
[349,"Worthing",null,null,null,null,null,null,null,null,null,null,null,null,null,null,null,null,80,90,90,260,40,70,80,190,"-","-","-","-",110,160,170,440,50,100,90,250,20,80,80,180,"-","-","-","-",70,180,180,430,80,90,90,250,40,90,50,170,"-","-",10,10,120,180,150,440,70,80,100,250,40,70,80,190,"-","-",10,20,110,150,190,460]
[350,"Wychavon",null,null,null,null,null,null,null,null,null,null,null,null,null,null,null,null,70,100,120,290,30,70,80,180,"-","-","-","-",100,160,210,470,90,120,120,330,30,70,100,210,"-",10,10,20,120,200,230,550,100,110,140,340,60,80,80,220,"-","-",10,10,160,190,220,570,90,110,110,300,60,90,100,240,"-","-",10,10,150,200,210,560]
[351,"Wycombe",null,null,null,null,null,null,null,null,null,null,null,null,null,null,null,null,70,90,130,290,50,80,100,220,"-",10,"-",10,120,170,230,520,80,90,90,250,40,100,90,230,"-",10,"-",10,120,190,180,490,80,110,90,280,60,90,90,230,"-","-","-",10,140,200,180,520,90,80,110,280,60,80,70,210,"-",10,10,20,150,170,180,500]
[352,"Wyre",null,null,null,null,null,null,null,null,null,null,null,null,null,null,null,null,110,130,140,380,50,90,150,290,"-","-","-",10,170,220,290,670,90,100,90,280,50,90,130,270,"-","-","-","-",130,190,220,550,100,110,110,310,60,90,120,270,"-","-",10,20,160,210,230,600,90,110,130,320,40,80,120,240,"-","-",30,40,130,190,280,600]
[353,"Wyre Forest",null,null,null,null,null,null,null,null,null,null,null,null,null,null,null,null,70,100,110,280,30,50,100,180,"-","-","-",10,100,150,220,470,100,110,130,340,30,70,120,230,"-","-","-",10,130,190,260,570,110,110,140,360,40,70,70,180,"-",10,10,20,150,190,220,560,90,110,110,300,60,80,80,210,"-","-",20,30,150,180,210,540]
[354,"York",160,260,220,640,80,120,130,330,"-",10,10,20,240,390,350,980,160,170,210,540,50,100,140,290,"-","-","-","-",200,280,350,830,170,160,160,500,80,130,180,380,"-",10,"-",10,250,290,340,890,160,140,170,480,70,120,110,300,"-",10,"-",10,230,270,280,780,150,190,250,580,80,130,130,340,"-",10,10,20,230,330,380,940]
[]
[null,"Region"]
[1,"North East",4710,3290,5340,13350,1840,1920,2650,6420,10,60,10,80,6560,5270,8010,19840,2580,3150,5920,11650,1580,1920,3780,7280,10,40,30,70,4170,5110,9730,19000,3010,3400,4650,11050,1610,2120,3110,6830,10,70,80,160,4620,5590,7840,18040,3190,3320,4990,11510,1770,2310,2670,6740,10,60,290,360,4970,5690,7950,18620,3460,3360,5420,12240,1900,2350,2800,7050,10,60,330,390,5360,5770,8550,19680]
[2,"North West",10420,8900,10150,29470,3740,5010,5730,14480,20,170,80,260,14170,14080,15960,44210,6840,7920,11490,26250,3230,5100,8550,16890,20,140,120,290,10090,13170,20160,43420,6970,7870,9540,24380,3400,5820,8850,18060,30,170,290,500,10400,13860,18680,42940,7490,8090,9260,24840,3920,6070,6830,16820,80,160,570,800,11490,14320,16650,42460,7690,7750,9720,25160,3890,5900,6880,16660,90,220,790,1090,11660,13860,17390,42910]
[3,"Yorkshire and The Humber",7780,6480,7230,21490,2840,3880,4170,10890,10,130,60,200,10630,10490,11460,32580,5870,5570,7650,19090,2310,3350,5360,11020,20,110,50,180,8200,9030,13070,30290,6340,6110,6370,18820,2450,3830,5150,11430,10,130,100,240,8790,10070,11620,30490,6490,7020,6760,20270,2680,4000,4260,10930,20,130,210,360,9190,11150,11230,31570,6700,7360,7640,21700,2850,4150,4550,11550,30,150,360,540,9580,11660,12560,33790]
[4,"East Midlands",5110,4800,6210,16110,2040,2720,2670,7430,10,100,30,140,7150,7630,8900,23680,4280,4510,6330,15120,1690,2850,3700,8230,20,100,50,160,5990,7460,10070,23520,4630,4800,5240,14670,1860,3220,4270,9350,30,110,150,290,6520,8130,9660,24320,4930,5040,5400,15370,2160,3530,2960,8650,50,120,240,410,7140,8680,8610,24430,5230,4690,5820,15740,2370,3380,3510,9260,50,160,420,630,7650,8230,9750,25630]
[5,"West Midlands",6260,5950,7220,19420,2590,3730,3930,10250,20,80,20,120,8870,9760,11170,29800,4640,5580,7930,18150,1900,3860,5440,11200,20,100,150,280,6560,9540,13520,29620,5200,6350,7380,18920,2110,4170,5810,12090,40,150,330,520,7350,10670,13520,31530,5500,6070,7660,19240,2460,4320,4600,11380,50,160,560,760,8010,10560,12810,31380,5590,6420,8220,20230,2620,4320,4840,11790,60,240,960,1250,8270,10990,14020,33270]
[6,"East of England",5230,4960,4850,15040,1870,2760,2320,6950,"-",70,20,90,7100,7780,7190,22070,4160,4340,5630,14130,1570,2640,3760,7970,10,100,60,160,5730,7070,9460,22260,4450,4590,4550,13600,1850,3200,4030,9080,30,130,110,270,6330,7930,8700,22950,4830,4860,5200,14890,2010,3430,3050,8490,40,140,310,490,6880,8430,8560,23870,4920,4470,5110,14500,2240,3510,3520,9270,50,200,570,820,7210,8190,9200,24590]
[7,"London",4390,4360,5710,14460,1520,2380,3070,6970,"-",30,10,50,5910,6780,8790,21480,3130,3640,6050,12820,1450,2460,4110,8020,"-",40,40,90,4580,6140,10210,20920,3250,3910,4840,12000,1580,2830,4200,8610,10,70,80,150,4830,6810,9120,20760,3500,4430,5970,13910,1960,2950,3070,7980,30,100,170,290,5490,7480,9210,22180,3310,4160,6650,14110,2080,3150,3910,9140,40,190,390,620,5430,7490,10950,23870]
[8,"South East",6660,8120,7790,22570,2520,4340,4230,11090,"-",80,20,100,9180,12540,12040,33760,5450,6870,7810,20130,2510,4680,6210,13400,10,100,40,150,7970,11650,14060,33680,5850,7390,6670,19910,2850,5470,6240,14560,20,140,140,300,8720,13000,13050,34770,6170,7680,7310,21150,3030,5810,5010,13840,30,150,310,490,9220,13640,12620,35480,6240,7130,7860,21230,3290,5420,5470,14180,50,210,700,960,9580,12760,14020,36370]
[9,"South West",5550,6600,6470,18610,2070,3620,3770,9460,10,110,70,190,7620,10330,10310,28260,4720,5620,6820,17170,2030,3580,4330,9940,20,90,70,170,6770,9290,11220,27280,5190,5910,5120,16210,2050,4070,5110,11230,10,140,120,280,7240,10120,10360,27720,5670,6080,5900,17660,2340,4330,3800,10470,30,110,190,340,8040,10520,9900,28460,5560,5960,6020,17540,2480,4310,4170,10960,40,120,420,580,8070,10390,10610,29070]
[10,"England",56100,53500,61000,170500,21000,30400,32500,83900,100,800,300,1200,77200,84700,93800,255700,41700,47200,65600,154500,18300,30400,45200,93900,100,800,600,1500,60100,78500,111500,250000,44900,50300,54400,149600,19700,34700,46800,101200,200,1100,1400,2700,64800,86200,102600,253500,47800,52600,58500,158800,22300,36800,36200,95300,300,1100,2800,4300,70400,90500,97500,258400,48700,51300,62500,162500,23700,36500,39700,99800,400,1500,4900,6900,72800,89300,107000,269200]
[11,"Other",460,660,800,1910,240,250,260,760,"-",10,"-",10,700,920,1060,2680,400,520,860,1780,300,330,450,1080,"-",10,"-",10,700,850,1320,2870,330,450,530,1300,250,260,410,920,"-",10,10,20,580,710,940,2230,420,480,590,1490,240,340,360,940,"-",10,20,40,660,840,970,2460,430,410,510,1360,290,380,360,1040,10,20,50,80,740,810,930,2470]
[12,"Grand Total",56500,54100,61800,172400,21300,30600,32800,84700,100,800,300,1200,77900,85600,94900,258400,42100,47700,66500,156300,18600,30800,45700,95000,100,800,600,1600,60800,79300,112800,252900,45200,50800,54900,150900,20000,35000,47200,102200,200,1100,1400,2700,65400,86900,103500,255800,48200,53100,59100,160300,22500,37100,36600,96200,300,1100,2900,4300,71100,91300,98500,260900,49100,51700,63000,163800,24000,36900,40000,100900,400,1600,5000,7000,73600,90100,108000,271700]

{"sheet":"Apps-Ach-PCON (R)","index":5,"n_rows":556,"n_cols":83,"rows_kept":556,"cut":false,"hidden":true,"merged":[]}
["Apprenticeship Framework Achievements by Parliamentary Constituency, Level and Age (2011/12 to 2015/16)"]
[]
[null,null,null,{"$f":"D4&D5&D6","v":"2011/12IntermediateUnder 19"},{"$f":"E4&E5&E6","v":"2011/12Intermediate19-24"},"2011/12Intermediate25+","2011/12IntermediateAll","2011/12AdvancedUnder 19","2011/12Advanced19-24","2011/12Advanced25+","2011/12AdvancedAll","2011/12HigherUnder 19","2011/12Higher19-24","2011/12Higher25+","2011/12HigherAll","2011/12AllUnder 19","2011/12All19-24","2011/12All25+","2011/12AllAll","2012/13IntermediateUnder 19","2012/13Intermediate19-24","2012/13Intermediate25+","2012/13IntermediateAll","2012/13AdvancedUnder 19","2012/13Advanced19-24","2012/13Advanced25+","2012/13AdvancedAll","2012/13HigherUnder 19","2012/13Higher19-24","2012/13Higher25+","2012/13HigherAll","2012/13AllUnder 19","2012/13All19-24","2012/13All25+","2012/13AllAll","2013/14IntermediateUnder 19","2013/14Intermediate19-24","2013/14Intermediate25+","2013/14IntermediateAll","2013/14AdvancedUnder 19","2013/14Advanced19-24","2013/14Advanced25+","2013/14AdvancedAll","2013/14HigherUnder 19","2013/14Higher19-24","2013/14Higher25+","2013/14HigherAll","2013/14AllUnder 19","2013/14All19-24","2013/14All25+","2013/14AllAll","2014/15IntermediateUnder 19","2014/15Intermediate19-24","2014/15Intermediate25+","2014/15IntermediateAll","2014/15AdvancedUnder 19","2014/15Advanced19-24","2014/15Advanced25+","2014/15AdvancedAll","2014/15HigherUnder 19","2014/15Higher19-24","2014/15Higher25+","2014/15HigherAll","2014/15AllUnder 19","2014/15All19-24","2014/15All25+","2014/15AllAll","2015/16IntermediateUnder 19",{"$f":"BQ4&BQ5&BQ6","v":"2015/16Intermediate19-24"},"2015/16Intermediate25+","2015/16IntermediateAll","2015/16AdvancedUnder 19","2015/16Advanced19-24","2015/16Advanced25+","2015/16AdvancedAll","2015/16HigherUnder 19","2015/16Higher19-24","2015/16Higher25+","2015/16HigherAll","2015/16AllUnder 19","2015/16All19-24","2015/16All25+","2015/16AllAll"]
[null,"Parliamentary Constituency","Year","2011/12",{"$f":"D4","v":"2011/12"},{"$f":"E4","v":"2011/12"},"2011/12","2011/12","2011/12","2011/12","2011/12","2011/12","2011/12","2011/12","2011/12","2011/12","2011/12","2011/12","2011/12","2012/13",{"$f":"T4","v":"2012/13"},{"$f":"U4","v":"2012/13"},"2012/13","2012/13","2012/13","2012/13","2012/13","2012/13","2012/13","2012/13","2012/13","2012/13","2012/13","2012/13","2012/13","2013/14",{"$f":"AJ4","v":"2013/14"},{"$f":"AK4","v":"2013/14"},"2013/14","2013/14","2013/14","2013/14","2013/14","2013/14","2013/14","2013/14","2013/14","2013/14","2013/14","2013/14","2013/14","2014/15",{"$f":"AZ4","v":"2014/15"},{"$f":"BA4","v":"2014/15"},"2014/15","2014/15","2014/15","2014/15","2014/15","2014/15","2014/15","2014/15","2014/15","2014/15","2014/15","2014/15",{"$f":"BN4","v":"2014/15"},"2015/16",{"$f":"BP4","v":"2015/16"},{"$f":"BQ4","v":"2015/16"},"2015/16","2015/16","2015/16","2015/16","2015/16","2015/16","2015/16","2015/16","2015/16","2015/16","2015/16","2015/16","2015/16"]
[null,null,"Level","Intermediate","Intermediate","Intermediate","Intermediate","Advanced","Advanced","Advanced","Advanced","Higher","Higher","Higher","Higher","All","All","All","All","Intermediate","Intermediate","Intermediate","Intermediate","Advanced","Advanced","Advanced","Advanced","Higher","Higher","Higher","Higher","All","All","All","All","Intermediate","Intermediate","Intermediate","Intermediate","Advanced","Advanced","Advanced","Advanced","Higher","Higher","Higher","Higher","All","All","All","All","Intermediate","Intermediate","Intermediate","Intermediate","Advanced","Advanced","Advanced","Advanced","Higher","Higher","Higher","Higher","All","All","All","All","Intermediate","Intermediate","Intermediate","Intermediate","Advanced","Advanced","Advanced","Advanced","Higher","Higher","Higher","Higher","All","All","All","All"]
[null,"PCON","Age","Under 19","19-24","25+","All","Under 19","19-24","25+","All","Under 19","19-24","25+","All","Under 19","19-24","25+","All","Under 19","19-24","25+","All","Under 19","19-24","25+","All","Under 19","19-24","25+","All","Under 19","19-24","25+","All","Under 19","19-24","25+","All","Under 19","19-24","25+","All","Under 19","19-24","25+","All","Under 19","19-24","25+","All","Under 19","19-24","25+","All","Under 19","19-24","25+","All","Under 19","19-24","25+","All","Under 19","19-24","25+","All","Under 19","19-24","25+","All","Under 19","19-24","25+","All","Under 19","19-24","25+","All","Under 19","19-24","25+","All"]
[1,"Aldershot",null,100,140,120,350,40,60,60,160,"-","-","-","-",140,200,170,510,150,100,160,410,30,60,90,170,"-","-","-","-",180,160,240,580,90,110,130,320,100,60,90,250,"-","-","-",10,190,180,210,580,60,100,160,330,30,70,50,150,"-","-",10,10,100,170,210,480,80,90,110,280,80,60,70,210,"-",10,10,20,160,150,190,500]
[2,"Aldridge Brownhills",null,140,90,110,330,40,50,70,160,"-","-","-","-",180,140,180,490,70,80,120,270,50,50,60,150,"-","-","-",10,110,130,180,420,100,70,90,260,40,70,80,180,"-","-",10,10,140,140,170,450,110,90,90,290,50,70,60,180,"-","-",10,10,160,160,160,480,110,90,100,300,50,70,60,180,"-","-",20,30,160,160,170,500]
[3,"Altrincham and Sale West",null,70,60,40,170,30,40,40,100,"-","-","-","-",100,100,80,270,40,60,70,170,40,50,90,170,"-","-","-","-",80,110,160,340,70,60,50,180,30,50,80,160,"-","-","-","-",100,110,130,340,50,70,80,200,50,60,50,170,"-","-",10,10,110,140,140,380,50,60,100,200,40,50,50,140,"-","-",10,10,90,110,150,350]
[4,"Amber Valley",null,130,90,120,340,80,70,60,210,"-","-","-",10,210,160,180,550,130,100,140,360,60,60,90,210,"-",10,"-",10,180,170,230,570,120,130,120,370,50,80,100,230,"-","-",10,10,160,220,220,600,130,120,110,350,60,80,70,210,10,10,10,20,190,200,180,570,160,110,130,400,70,80,90,240,"-",10,10,20,230,200,230,660]
[5,"Arundel and South Downs",null,60,70,40,180,20,50,30,100,"-","-","-","-",80,120,70,270,60,60,40,160,20,50,50,110,"-","-","-","-",80,110,90,280,60,60,40,150,20,50,30,100,"-","-","-","-",80,100,70,250,40,60,50,150,20,50,30,100,"-","-","-","-",70,100,80,250,50,50,40,140,20,40,20,90,"-","-",10,10,70,100,70,240]
[6,"Ashfield",null,150,140,190,470,50,70,100,220,"-","-","-","-",200,200,280,690,130,160,230,520,40,90,130,260,"-",10,"-",10,170,260,360,790,150,160,140,440,50,80,130,260,"-","-",10,10,200,240,270,710,140,150,140,430,80,100,90,270,"-","-",10,10,220,250,240,710,190,120,170,490,80,100,70,240,"-","-",20,30,270,220,270,750]
[7,"Ashford",null,100,130,170,400,30,70,80,180,"-","-","-","-",130,210,250,590,80,160,250,490,20,70,90,180,"-","-","-","-",100,230,340,670,90,110,120,320,90,70,110,270,"-","-","-","-",180,180,230,590,80,100,100,280,50,70,60,180,"-","-",10,10,130,170,170,460,110,80,140,330,40,60,80,190,"-","-",10,20,150,150,230,530]
[8,"Ashton under Lyne",null,200,140,170,510,50,70,80,200,"-","-","-","-",250,210,240,710,90,140,140,370,50,60,120,240,"-","-","-","-",140,200,260,600,90,150,140,380,60,70,100,230,"-","-","-",10,150,230,240,620,110,110,140,360,60,80,90,220,"-","-","-",10,170,190,230,590,110,120,140,370,40,70,80,200,"-","-",10,10,150,190,230,570]
[9,"Aylesbury",null,120,170,130,420,40,60,40,140,"-","-","-","-",160,240,160,560,80,100,90,270,40,70,70,170,"-","-","-","-",120,170,160,450,100,120,100,330,40,60,90,190,"-","-","-","-",140,180,200,520,90,90,90,270,50,60,80,190,"-","-","-","-",140,150,170,450,90,130,110,330,40,70,70,180,"-","-",10,10,140,200,190,520]
[10,"Banbury",null,60,80,120,260,30,50,70,150,"-","-","-","-",90,130,190,400,60,90,140,290,30,60,90,170,"-","-","-","-",90,150,230,470,80,100,120,300,40,80,90,210,"-","-",10,10,120,180,220,520,80,100,120,290,50,70,70,190,"-","-",10,10,130,170,190,490,60,70,110,240,50,70,50,170,"-","-",10,10,110,140,170,420]
[11,"Barking",null,90,80,130,300,40,50,70,160,"-","-","-","-",130,130,200,450,80,70,120,260,20,50,90,170,"-","-","-","-",100,120,210,430,80,100,130,310,30,60,120,220,"-","-","-","-",110,160,250,530,110,110,180,400,50,60,100,210,"-","-",10,10,160,170,300,620,100,110,200,410,60,70,130,260,"-","-",10,10,170,180,340,690]
[12,"Barnsley Central",null,150,110,150,400,50,80,90,220,"-","-",10,10,200,190,250,640,90,110,180,380,50,80,140,260,"-","-","-",10,140,190,310,650,140,120,130,390,40,90,110,230,"-","-",10,10,180,210,240,630,190,140,160,490,50,90,100,250,"-","-","-",10,240,230,270,740,140,110,150,400,50,90,70,210,"-",10,10,20,190,200,230,620]
[13,"Barnsley East",null,210,120,160,490,50,80,90,210,"-","-","-",10,260,200,260,710,120,90,190,400,50,90,160,290,"-","-","-","-",170,180,350,700,160,120,150,420,70,80,150,300,"-","-","-","-",230,200,300,730,200,130,170,500,60,90,100,250,"-","-","-",10,260,230,270,760,160,130,180,460,70,100,80,250,"-",10,10,20,220,230,270,720]
[14,"Barrow and Furness",null,150,110,170,430,150,90,120,360,"-","-","-","-",300,210,290,800,110,100,130,350,110,80,160,350,"-","-","-","-",220,180,290,700,110,110,120,340,110,100,150,360,"-","-","-",10,220,220,270,700,110,100,100,310,170,120,80,370,"-","-",10,10,270,220,180,680,130,110,80,310,150,120,110,380,"-",10,10,20,280,240,190,710]
[15,"Basildon and Billericay",null,100,70,50,230,30,40,40,100,"-","-","-","-",130,110,90,330,80,60,70,210,20,30,60,110,"-","-","-","-",100,90,130,320,100,70,50,210,40,50,50,150,"-","-","-","-",150,120,100,360,90,100,50,250,20,50,50,120,"-","-",10,10,110,160,110,380,110,90,90,290,40,80,60,180,"-","-","-",10,150,170,150,480]
[16,"Basingstoke",null,90,120,130,340,40,60,60,160,"-","-","-","-",130,180,190,500,90,90,190,360,40,70,100,210,"-","-","-","-",130,160,290,570,80,70,100,250,40,50,80,170,"-","-","-","-",120,130,170,420,70,80,140,290,50,80,70,200,"-","-","-",10,120,160,210,490,80,70,120,280,80,80,100,250,"-","-",10,10,160,160,230,540]
[17,"Bassetlaw",null,130,110,140,380,70,70,60,200,"-","-","-","-",200,180,200,580,90,100,150,340,40,90,120,250,"-","-","-",10,130,200,270,600,120,100,120,340,40,80,100,230,"-","-",10,10,160,190,230,580,150,140,140,430,50,80,90,210,"-","-",10,20,210,220,230,660,120,90,150,350,60,90,110,250,"-",10,10,20,180,180,260,620]
[18,"Bath",null,30,60,80,170,10,30,40,70,"-","-","-","-",30,90,120,240,40,50,70,150,20,40,40,100,"-","-","-","-",60,90,110,250,30,50,50,130,20,40,40,100,"-","-","-","-",50,100,90,240,40,50,50,130,20,40,40,100,"-","-","-","-",60,90,90,240,30,30,70,140,20,30,30,90,"-","-","-","-",50,70,110,220]
[19,"Batley and Spen",null,180,120,180,470,50,90,100,230,"-","-","-","-",230,210,280,710,110,90,160,360,40,60,70,170,"-","-","-","-",150,150,230,530,130,120,160,410,50,80,120,260,"-","-","-","-",180,200,280,670,120,100,120,340,50,80,80,210,"-","-",10,10,180,190,210,570,170,110,140,420,60,90,110,260,"-",10,10,20,230,210,250,690]
[20,"Battersea",null,20,30,50,100,10,20,30,60,"-","-","-","-",30,50,80,160,20,20,40,80,10,20,40,70,"-","-","-","-",30,40,80,150,20,30,40,90,10,20,40,60,"-","-","-","-",20,50,80,150,20,20,40,90,10,20,20,50,"-","-","-","-",30,40,70,140,20,30,60,110,20,20,20,60,"-","-","-","-",40,50,90,170]
[21,"Beaconsfield",null,60,60,40,160,20,30,30,90,"-","-","-","-",80,90,70,240,60,40,60,170,30,40,50,120,"-","-","-","-",90,80,120,290,40,40,40,120,40,60,30,130,"-","-","-","-",80,100,70,250,60,60,40,150,50,40,40,130,"-","-","-",10,110,100,80,290,50,50,30,130,30,40,30,100,"-",10,"-",10,80,100,70,250]
[22,"Beckenham",null,60,40,30,120,30,40,40,110,"-","-","-","-",90,70,70,230,40,40,30,120,20,30,30,90,"-","-","-","-",60,80,70,200,70,40,30,140,40,40,30,110,"-","-","-","-",110,80,60,250,50,50,20,130,50,50,30,130,"-","-","-",10,100,100,60,260,40,40,40,120,30,40,30,100,"-","-","-",10,70,80,70,220]
[23,"Bedford",null,50,60,90,190,50,30,40,120,"-","-","-","-",90,90,120,310,30,60,100,190,20,30,60,120,"-","-","-","-",60,90,160,310,40,70,100,210,20,40,70,130,"-","-","-","-",60,110,170,340,40,80,190,310,40,50,70,160,"-","-","-","-",80,120,260,460,60,60,100,220,40,60,70,170,"-","-",10,20,100,120,180,400]
[24,"Bermondsey and Old Southwark",null,60,70,90,220,30,30,70,130,"-","-","-","-",90,110,160,360,50,60,100,210,10,40,90,130,"-","-","-","-",60,90,190,340,40,70,90,200,30,50,80,160,"-","-","-","-",70,120,170,360,40,70,100,210,20,40,60,120,"-","-","-",10,60,110,160,330,50,80,120,240,30,50,60,130,"-",10,10,10,80,130,180,390]
[25,"Berwick upon Tweed",null,80,70,120,280,40,40,90,170,"-","-","-","-",120,120,220,450,70,80,130,270,20,50,90,160,"-","-","-","-",90,130,220,440,70,90,160,310,40,90,120,250,"-","-","-",10,110,190,280,570,80,80,230,390,30,80,70,180,"-","-",10,10,110,170,310,580,90,80,140,310,30,70,80,170,"-","-","-","-",110,150,220,480]
[26,"Bethnal Green and Bow",null,100,100,110,310,10,30,50,90,"-","-","-","-",110,140,160,400,40,60,60,160,10,30,50,90,"-","-","-","-",50,100,110,250,50,70,70,200,30,50,50,130,"-","-","-","-",80,130,120,330,70,110,70,240,30,50,30,120,"-","-","-","-",100,160,100,360,80,90,110,280,30,60,50,140,"-","-","-",10,110,160,160,430]
[27,"Beverley and Holderness",null,260,620,450,1330,70,320,280,680,"-","-","-",10,340,940,740,2020,330,460,420,1210,70,160,290,520,"-",10,"-",10,400,630,710,1730,230,380,300,910,60,90,250,400,"-","-","-",10,290,470,550,1310,210,490,330,1040,50,130,210,380,"-","-",10,10,260,620,550,1430,220,520,390,1130,60,120,200,380,"-","-",10,10,270,650,600,1520]
[28,"Bexhill and Battle",null,70,50,110,230,20,50,30,100,"-","-","-","-",90,100,130,320,70,60,50,180,20,40,70,140,"-","-","-","-",90,100,120,320,60,70,60,190,30,50,80,150,"-","-","-","-",90,120,140,350,60,70,60,190,30,60,50,140,"-","-","-","-",90,130,110,330,90,60,90,230,20,50,60,130,"-","-",20,20,110,110,170,380]
[29,"Bexleyheath and Crayford",null,100,70,70,240,50,50,20,120,"-","-","-","-",150,110,90,360,80,60,90,230,30,40,60,130,"-","-","-","-",100,100,160,360,90,80,50,220,40,50,60,150,"-","-",10,10,130,140,110,380,120,60,50,230,50,50,50,150,"-","-","-","-",170,110,110,380,90,60,60,220,40,70,60,170,"-","-",10,10,140,140,130,400]
[30,"Birkenhead",null,250,130,170,550,40,90,80,200,"-","-","-",10,290,220,250,760,110,130,200,430,50,100,140,290,"-","-","-","-",160,230,330,720,80,140,170,380,40,90,170,300,"-",10,"-",10,110,230,340,690,100,120,190,410,50,90,150,290,"-","-",20,20,150,210,360,720,70,140,170,370,50,80,130,260,"-","-",10,20,110,230,300,640]
[31,"Birmingham Edgbaston",null,90,80,90,260,30,30,50,100,"-","-","-","-",110,120,140,370,70,60,110,230,20,40,70,130,"-","-","-","-",90,100,180,370,60,80,80,230,30,50,70,140,"-","-","-",10,90,130,150,370,50,90,90,230,40,50,50,150,"-","-",10,10,90,140,150,390,50,90,120,260,20,50,60,130,"-",10,20,30,70,150,190,410]
[32,"Birmingham Erdington",null,160,80,130,370,40,60,60,160,"-","-","-","-",200,140,190,530,110,100,180,380,30,70,90,190,"-","-",10,10,140,170,270,580,130,140,220,490,50,70,110,230,"-","-",10,10,180,210,340,720,110,140,200,440,60,70,100,230,"-","-",20,30,170,210,320,700,120,150,220,480,50,60,90,200,"-",10,40,50,160,220,350,730]
[33,"Birmingham Hall Green",null,60,70,110,240,40,40,50,130,"-","-","-","-",100,110,170,370,40,80,120,240,20,60,60,140,"-","-","-","-",60,140,190,380,50,100,110,260,30,60,60,160,"-","-","-",10,80,160,180,420,50,100,120,270,30,50,40,120,"-","-",20,20,80,150,180,420,60,120,190,370,30,50,60,140,"-",10,20,30,90,170,270,540]
[34,"Birmingham Hodge Hill",null,110,100,150,350,30,50,60,140,"-","-","-","-",150,140,210,490,80,100,150,330,20,50,80,150,"-","-","-",10,90,150,230,480,70,140,200,410,20,40,70,140,"-","-","-","-",90,180,270,550,90,120,180,390,40,70,70,180,"-","-",10,10,130,200,260,580,90,170,270,540,40,70,80,190,"-","-",20,20,140,240,380,750]
[35,"Birmingham Ladywood",null,90,90,180,360,30,40,80,150,"-","-","-","-",120,130,260,520,60,70,160,280,20,50,110,180,"-","-","-","-",80,120,270,460,50,110,150,320,20,60,100,180,"-","-",10,10,70,170,260,500,60,110,160,330,20,50,60,140,"-","-",10,10,80,160,230,470,60,110,220,390,20,70,100,190,"-","-",20,30,90,180,340,610]
[36,"Birmingham Northfield",null,140,150,190,480,50,90,80,230,"-","-","-","-",200,240,270,710,130,130,190,450,60,90,140,280,"-","-","-","-",180,220,330,730,120,140,190,450,70,70,100,240,"-","-",10,10,190,220,290,700,120,130,170,410,50,100,100,240,"-","-",20,20,160,220,290,670,90,160,180,430,50,80,130,260,"-",10,20,30,140,240,340,720]
[37,"Birmingham Perry Barr",null,120,100,170,390,70,60,70,190,"-","-","-","-",190,160,240,590,60,80,170,300,30,60,100,190,"-",10,"-",10,80,140,270,500,80,120,180,380,50,60,120,230,"-","-",10,10,130,180,310,620,90,100,170,360,40,60,80,180,"-","-",10,10,130,160,260,550,80,130,210,420,50,70,90,210,"-",10,30,40,130,210,330,670]
[38,"Birmingham Selly Oak",null,100,110,120,320,40,60,60,160,"-","-","-","-",140,170,170,480,60,90,130,290,30,50,90,180,"-","-",10,10,100,150,230,480,60,100,150,320,30,80,90,190,"-","-",10,10,90,180,250,520,60,90,120,280,40,70,60,170,"-","-",10,10,100,160,200,460,90,140,130,350,40,60,70,170,"-","-",20,20,130,200,220,540]
[39,"Birmingham Yardley",null,110,110,180,410,60,70,70,200,"-","-","-","-",170,180,250,610,70,110,180,360,40,60,120,220,"-","-",10,10,110,170,300,590,100,170,200,460,30,70,100,200,"-","-",10,10,130,230,300,670,90,130,170,390,40,80,80,200,"-","-",10,20,140,210,260,610,110,180,300,580,60,90,90,230,"-",10,20,20,170,270,400,840]
[40,"Bishop Auckland",null,150,110,240,500,50,80,110,230,"-","-","-",10,200,190,340,740,90,120,250,460,30,80,150,250,"-",10,"-",10,120,200,400,720,110,130,170,410,60,90,120,270,"-","-","-",10,170,220,300,680,120,130,130,370,60,90,90,240,"-",10,20,20,180,220,230,630,140,100,180,420,70,100,120,280,"-",10,20,30,210,210,320,730]
[41,"Blackburn",null,180,110,140,430,50,80,100,220,"-","-","-","-",230,190,240,650,130,120,160,410,60,80,150,290,"-","-","-","-",190,210,310,700,110,110,140,360,50,80,160,290,"-","-","-","-",160,200,310,660,90,170,200,470,50,120,100,270,"-","-",10,10,150,290,310,750,120,90,150,370,50,110,100,250,"-","-",20,20,180,200,270,640]
[42,"Blackley and Broughton",null,190,110,140,430,30,50,80,160,"-","-","-","-",220,160,220,590,80,100,160,340,30,50,110,190,"-","-","-","-",110,150,270,540,90,120,130,340,30,80,140,240,"-","-","-","-",110,200,270,580,90,110,160,360,30,80,110,220,"-","-",10,10,120,190,280,590,80,110,200,390,40,70,120,240,"-","-",10,10,120,180,330,630]
[43,"Blackpool North and Cleveleys",null,100,100,110,310,40,70,80,190,"-","-","-","-",140,180,180,500,80,110,150,340,40,80,140,250,"-","-","-","-",120,190,290,600,50,80,80,210,50,70,120,230,"-",10,"-",10,100,150,200,450,90,90,130,320,40,70,110,210,"-","-",10,10,130,160,250,540,80,80,130,290,30,70,120,210,"-","-",30,30,110,150,280,540]
[44,"Blackpool South",null,110,100,130,340,40,60,110,210,"-","-","-","-",150,160,240,550,70,110,200,380,20,80,110,210,"-","-","-","-",90,190,300,590,60,90,120,260,30,60,130,230,"-","-","-",10,90,160,250,490,90,110,170,360,30,80,150,260,"-","-",10,10,120,190,330,630,90,100,160,350,30,80,130,240,"-","-",30,30,120,180,320,620]
[45,"Blaydon",null,130,100,170,400,50,70,100,220,"-","-","-","-",190,170,270,620,80,80,210,370,60,60,120,240,"-","-","-",10,140,140,330,610,110,110,140,360,50,80,80,210,"-","-","-","-",160,200,210,570,120,110,130,360,50,90,100,240,"-","-",10,10,170,200,250,610,130,90,170,380,70,80,80,230,"-","-",10,20,200,170,260,620]
[46,"Blyth Valley",null,210,90,240,550,80,70,90,230,"-",10,"-",10,280,170,330,780,100,130,230,450,60,70,140,270,"-","-","-",10,160,200,370,720,110,120,150,370,50,70,120,240,"-","-","-",10,150,190,270,620,120,130,250,500,50,90,110,250,"-","-",10,10,170,220,370,760,130,130,200,460,60,80,100,240,"-","-",10,20,180,220,310,720]
[47,"Bognor Regis and Littlehampton",null,70,140,130,340,20,60,50,130,"-","-","-","-",90,200,170,460,50,110,140,300,20,70,100,190,"-","-","-","-",70,180,240,490,70,100,120,280,20,70,110,200,"-","-","-","-",80,170,230,470,80,110,140,330,20,60,90,180,"-","-",10,10,100,180,240,510,60,110,140,300,20,70,100,180,"-","-",20,20,80,170,250,500]
[48,"Bolsover",null,130,110,140,380,40,70,60,180,"-","-","-","-",180,180,200,560,150,110,170,430,50,70,100,220,"-","-","-",10,200,190,270,650,130,130,150,420,60,90,120,270,"-","-",10,10,190,230,280,700,140,130,140,410,60,90,80,230,"-","-","-","-",200,220,220,640,150,120,180,440,70,100,120,280,"-",10,10,20,220,220,300,740]
[49,"Bolton North East",null,120,140,120,380,30,80,90,200,"-","-","-","-",160,210,210,580,80,90,150,320,30,90,90,200,"-","-","-","-",110,180,240,530,80,120,110,310,30,90,120,230,"-","-","-","-",110,210,230,540,90,120,120,330,40,80,90,210,"-",10,"-",10,130,210,210,550,100,110,160,370,30,90,120,240,"-","-",10,10,130,200,280,610]
[50,"Bolton South East",null,110,120,140,380,50,60,80,190,"-","-","-","-",160,190,220,580,80,130,160,370,40,70,120,230,"-","-","-",10,120,200,280,600,90,110,120,320,20,70,140,230,"-","-",10,10,110,190,270,560,100,110,140,350,40,100,90,230,"-","-","-",10,150,210,230,590,120,120,150,390,50,80,100,230,"-","-",10,10,160,200,270,630]
[51,"Bolton West",null,130,110,120,360,50,60,80,190,"-","-","-","-",180,170,200,550,100,120,130,350,50,80,110,230,"-","-","-","-",150,190,240,580,90,90,130,310,40,80,110,230,"-","-","-","-",140,180,240,550,110,130,100,330,60,90,70,220,"-","-","-",10,180,210,170,560,110,110,140,360,50,90,90,230,"-","-",10,10,160,210,240,610]
[52,"Bootle",null,190,190,260,640,60,90,140,290,"-",10,10,10,250,280,400,930,110,130,270,500,50,90,170,310,"-","-","-",10,160,220,440,820,130,130,310,570,40,100,150,290,"-","-",10,10,170,240,460,860,150,150,170,460,40,100,180,320,"-","-",20,20,190,250,360,800,160,140,170,470,40,110,180,320,"-","-",10,10,210,250,350,800]
[53,"Boston and Skegness",null,100,120,130,340,50,60,80,180,"-","-","-","-",140,170,210,520,90,90,110,300,40,60,60,160,"-","-","-","-",140,150,170,460,70,90,100,260,40,80,100,210,"-",10,10,10,120,170,200,490,80,90,110,290,40,70,80,190,"-","-",10,10,120,160,210,490,110,100,140,340,50,50,80,180,"-","-",10,10,150,150,220,520]
[54,"Bosworth",null,110,140,240,490,40,50,60,150,"-","-","-","-",150,190,300,640,90,100,150,340,40,70,90,200,"-","-","-","-",130,170,240,540,110,110,100,310,30,60,100,190,"-","-",10,10,140,170,200,510,100,110,100,310,40,70,60,170,"-","-",10,10,140,190,170,500,120,100,130,350,60,60,90,210,"-","-",10,10,180,160,230,570]
[55,"Bournemouth East",null,60,100,130,290,20,50,90,160,"-","-","-","-",90,150,210,450,70,90,150,300,20,60,110,200,"-","-","-","-",90,150,260,500,70,100,130,300,30,70,120,210,"-","-","-","-",100,170,240,520,80,100,130,310,30,80,90,190,"-","-","-","-",110,180,220,510,100,100,140,330,40,70,90,200,"-","-",20,20,140,170,240,550]
[56,"Bournemouth West",null,60,90,100,260,20,50,70,140,"-","-","-","-",80,140,170,400,60,80,120,260,30,60,110,190,"-","-","-","-",90,140,230,450,70,120,130,310,30,50,110,190,"-","-","-","-",100,170,240,500,90,90,130,320,30,70,80,190,"-","-",10,10,130,170,220,510,100,90,130,320,20,70,80,170,"-","-",10,10,120,150,220,490]
[57,"Bracknell",null,90,80,80,250,50,50,80,180,"-","-","-","-",130,140,160,430,70,80,120,270,40,60,70,170,"-","-","-","-",110,140,180,440,80,80,100,260,30,80,70,180,"-","-","-","-",120,160,160,440,90,60,110,260,60,80,60,190,"-",10,"-",10,150,140,170,460,80,80,80,230,50,70,70,190,"-","-",10,20,120,150,160,440]
[58,"Bradford East",null,150,130,160,440,40,60,80,170,"-","-",10,10,190,190,240,620,140,100,140,380,40,70,80,190,"-","-","-",10,180,170,230,580,100,90,100,280,40,60,90,190,"-","-",10,10,140,150,190,470,100,110,120,320,40,70,80,180,"-","-","-","-",140,170,200,500,100,80,150,330,40,70,90,200,"-","-",10,10,140,160,240,540]
[59,"Bradford South",null,170,100,160,420,40,70,70,180,"-","-","-","-",210,170,220,610,130,90,170,400,60,50,120,230,"-","-","-","-",190,150,300,640,120,100,160,380,60,70,140,280,"-","-",10,10,190,170,310,670,120,130,160,400,60,70,100,230,"-","-",10,10,180,200,260,640,130,110,190,440,60,90,130,270,"-","-",10,10,190,200,340,730]
[60,"Bradford West",null,130,80,120,330,20,50,60,120,"-","-","-","-",150,130,180,450,80,60,110,260,30,40,80,150,"-","-","-","-",110,110,190,410,60,50,90,200,30,50,80,160,"-","-","-","-",90,110,170,360,70,70,100,230,40,60,60,170,"-","-","-","-",110,130,160,400,60,90,100,240,30,50,70,160,"-","-","-","-",90,140,180,400]
[61,"Braintree",null,110,90,80,290,40,50,40,130,"-","-","-","-",150,150,120,420,60,80,90,230,30,50,70,150,"-","-","-","-",90,130,160,380,90,90,110,290,20,80,80,180,"-","-",10,10,110,180,190,480,100,100,90,290,30,70,60,160,"-","-",20,20,120,170,170,460,130,90,80,300,40,70,80,190,"-","-",10,20,160,160,170,500]
[62,"Brent Central",null,60,70,150,270,10,30,60,100,"-","-","-","-",70,100,200,380,20,70,120,210,10,50,80,140,"-","-","-","-",30,120,200,350,50,50,110,210,10,50,70,130,"-","-","-","-",60,100,180,330,30,70,120,220,20,40,40,100,"-","-","-","-",40,120,160,330,40,90,190,320,30,50,110,190,"-","-","-",10,70,140,310,510]
[63,"Brent North",null,70,60,100,240,10,30,50,80,"-","-","-","-",80,90,150,320,40,40,150,220,20,30,70,110,"-","-","-","-",60,70,210,330,30,40,70,140,10,30,80,120,"-","-","-","-",40,70,150,260,30,50,110,190,10,30,50,90,"-","-","-","-",40,90,160,290,30,60,170,260,20,40,60,120,"-","-","-","-",50,110,230,390]
[64,"Brentford and Isleworth",null,30,70,100,200,10,30,40,90,"-","-","-","-",40,100,140,280,40,60,90,180,20,30,60,110,"-","-","-","-",60,90,140,290,40,60,70,170,20,30,50,100,"-","-","-","-",50,100,120,270,30,40,90,160,30,40,40,100,"-","-","-",10,60,80,120,260,40,60,90,180,20,40,50,110,"-","-","-",10,50,100,140,290]
[65,"Brentwood and Ongar",null,70,40,40,150,20,50,20,100,"-","-","-","-",90,90,60,250,70,50,50,170,30,40,50,120,"-","-","-","-",100,100,90,290,70,50,40,170,40,50,40,120,"-","-","-","-",110,100,80,290,90,60,50,200,20,40,40,100,"-","-","-","-",110,110,90,310,80,60,50,190,40,50,40,130,"-","-","-",10,120,110,100,330]
[66,"Bridgwater and West Somerset",null,110,150,150,410,40,50,60,150,"-","-","-","-",150,210,200,560,90,120,160,370,40,70,80,190,"-","-","-","-",130,190,240,560,100,120,90,300,60,60,100,220,"-","-","-","-",160,170,190,520,120,100,80,300,60,70,60,200,"-","-",10,10,180,170,140,500,110,110,120,330,60,80,100,230,"-","-",10,10,160,190,220,580]
[67,"Brigg and Goole",null,110,110,120,340,60,50,70,180,"-",10,"-",10,170,160,180,520,90,90,140,320,50,60,100,210,"-","-","-","-",140,150,240,530,100,100,100,290,40,90,80,210,"-","-","-",10,140,190,180,510,100,110,120,320,60,80,60,200,"-","-","-",10,160,190,180,530,110,100,100,320,60,80,60,200,"-","-",10,10,180,190,170,530]
[68,"Brighton Kemptown",null,70,90,70,230,30,30,40,100,"-","-","-","-",100,120,110,330,70,60,60,190,20,40,70,130,"-","-","-","-",90,100,130,320,60,60,60,180,20,50,50,120,"-","-","-","-",90,110,110,300,70,90,80,240,30,60,50,140,"-","-","-",10,100,150,140,390,50,70,70,180,40,60,50,150,"-","-","-",10,80,130,120,340]
[69,"Brighton Pavilion",null,50,70,70,180,20,30,30,80,"-","-","-","-",60,100,100,260,40,60,50,160,10,40,70,110,"-","-","-","-",50,100,120,270,20,60,40,120,10,40,50,100,"-","-","-","-",30,100,90,220,50,60,50,150,10,40,50,100,"-","-","-","-",60,100,90,250,40,50,50,130,20,50,40,110,"-","-","-","-",60,90,80,240]
[70,"Bristol East",null,100,120,170,390,50,50,80,180,"-","-","-","-",150,170,250,570,100,90,160,340,50,60,70,180,"-","-","-","-",150,140,230,530,110,80,110,290,40,60,80,180,"-","-","-",10,150,140,190,480,120,80,170,370,50,70,70,190,"-","-","-","-",180,150,240,560,90,60,100,250,50,70,70,200,"-","-",10,10,140,140,180,460]
[71,"Bristol North West",null,70,90,110,260,40,40,60,140,"-","-","-","-",100,130,170,410,50,70,130,250,20,40,50,120,"-","-","-","-",80,120,180,370,70,90,100,250,20,50,80,140,"-","-","-","-",90,140,170,400,70,70,110,250,30,50,50,130,"-","-",10,10,110,120,160,390,50,70,110,230,40,60,50,140,"-","-",10,10,90,130,170,390]
[72,"Bristol South",null,120,110,160,400,80,70,50,200,"-","-","-","-",190,190,220,600,120,90,150,350,50,70,70,180,"-","-","-","-",170,150,220,540,120,120,100,340,50,80,80,220,"-","-","-","-",180,200,180,560,110,90,130,330,50,60,70,170,"-","-",10,10,160,150,210,510,110,80,100,290,60,80,60,210,"-","-","-",10,170,170,170,510]
[73,"Bristol West",null,30,70,90,200,10,30,40,80,"-","-","-",10,50,110,130,280,20,40,90,150,10,30,60,100,"-","-","-","-",30,70,150,250,20,40,60,120,10,30,60,90,"-","-","-","-",30,70,120,220,30,60,80,170,10,40,30,70,"-","-","-","-",30,90,120,240,20,50,70,140,20,40,30,80,"-","-",10,10,30,90,110,230]
[74,"Broadland",null,110,100,90,300,30,40,40,120,"-","-","-","-",150,140,130,420,120,70,170,350,40,40,90,160,"-","-","-","-",150,110,250,520,90,90,60,240,50,70,60,180,"-","-","-","-",140,160,120,410,150,100,70,310,30,70,60,150,"-","-",10,10,170,170,130,470,100,70,80,250,60,70,40,170,"-","-",10,20,160,140,130,430]
[75,"Bromley and Chislehurst",null,50,50,50,150,20,50,40,110,"-","-","-","-",80,100,80,260,50,50,30,130,20,40,50,110,"-","-","-","-",70,90,80,240,50,50,40,150,30,40,50,110,"-","-","-",10,80,100,100,270,60,60,50,170,30,30,40,100,"-","-","-","-",100,90,90,270,50,40,70,150,20,30,50,100,"-","-",10,10,70,70,120,270]
[76,"Bromsgrove",null,80,110,110,310,40,60,60,160,"-","-","-","-",120,180,170,470,80,100,120,290,40,70,70,170,"-","-","-","-",110,170,190,470,70,100,100,270,30,80,70,190,"-","-",10,10,100,190,170,460,80,100,100,290,50,50,60,160,"-","-",10,10,130,150,170,450,70,90,80,230,50,60,60,170,"-","-",20,20,130,150,160,430]
[77,"Broxbourne",null,70,50,70,190,40,40,30,100,"-","-","-","-",110,90,100,290,50,50,80,180,40,30,50,120,"-","-","-","-",90,80,120,290,60,70,60,190,50,40,40,130,"-","-","-","-",110,110,100,330,70,70,70,210,50,70,40,160,"-","-",10,10,120,140,120,380,80,60,80,220,40,80,70,190,"-","-",10,10,130,140,150,420]
[78,"Broxtowe",null,120,90,90,290,50,50,40,130,"-","-","-","-",160,140,120,430,100,80,90,260,40,60,60,160,"-","-","-","-",140,140,150,430,90,110,90,290,50,50,80,180,"-","-","-",10,130,160,180,470,100,100,90,290,50,60,30,140,10,10,"-",20,160,160,120,440,100,80,90,270,60,60,50,170,"-","-",10,20,160,150,150,450]
[79,"Buckingham",null,70,60,20,140,30,30,30,90,"-","-","-","-",90,90,50,240,60,60,40,170,30,40,40,110,"-","-","-","-",90,110,80,280,70,60,50,190,40,50,40,130,"-","-","-","-",110,110,100,320,60,70,50,180,30,60,50,130,"-","-","-","-",100,130,100,320,70,50,50,170,60,40,50,150,"-","-",10,10,130,90,100,320]
[80,"Burnley",null,120,100,90,320,40,60,110,210,"-","-","-","-",170,170,200,530,90,110,150,350,50,80,130,260,"-","-","-","-",150,190,280,620,110,110,120,350,50,110,160,310,"-","-","-","-",160,220,280,670,120,120,90,330,40,110,120,270,"-","-",10,10,160,240,220,610,120,120,110,360,70,90,80,250,"-","-",20,20,190,220,220,630]
[81,"Burton",null,110,130,160,400,40,70,60,170,"-","-","-","-",140,200,220,570,90,120,160,380,60,80,90,230,"-","-","-","-",150,210,260,610,80,130,160,370,40,60,90,180,"-","-","-",10,120,190,240,550,130,130,190,450,50,90,60,200,"-","-",10,10,170,230,260,660,100,120,220,440,60,100,80,240,"-",10,10,20,170,220,320,700]
[82,"Bury North",null,120,100,110,320,30,80,60,170,"-",10,"-",10,140,180,170,500,70,110,130,310,40,60,100,190,"-","-","-","-",100,170,230,500,80,130,100,300,30,80,110,210,"-","-",10,10,100,210,210,520,70,110,110,280,40,70,80,190,"-","-",10,10,100,180,190,470,60,100,110,270,30,60,90,180,"-","-",10,10,90,160,210,460]
[83,"Bury South",null,140,120,110,370,50,60,80,190,"-","-","-","-",180,180,200,560,90,100,130,320,40,60,90,190,"-","-","-",10,120,160,220,510,80,120,110,310,50,60,100,210,"-",10,10,10,130,190,210,540,100,90,90,280,40,90,90,220,"-","-",10,10,140,180,200,510,90,90,120,300,50,80,90,220,"-","-",10,10,140,170,230,530]
[84,"Bury St Edmunds",null,120,170,130,420,50,80,50,190,"-","-","-","-",180,250,190,620,110,150,120,380,40,50,70,150,"-","-","-",10,150,200,190,540,110,140,110,360,50,70,90,200,"-",10,"-",10,160,220,200,570,120,140,120,380,60,80,70,210,"-",10,10,10,180,220,190,590,140,130,120,390,60,60,100,210,"-",10,10,10,200,190,220,610]
[85,"Calder Valley",null,130,100,120,350,60,100,130,280,"-","-","-","-",190,200,250,640,110,90,110,310,60,80,120,260,"-","-","-","-",180,160,230,570,80,100,80,270,60,90,130,270,"-",10,"-",10,140,190,210,550,120,100,110,340,60,90,130,270,"-","-",10,10,180,190,240,610,130,100,120,350,60,90,110,250,"-","-",10,20,190,190,240,620]
[86,"Camberwell and Peckham",null,70,60,120,250,10,30,70,110,"-","-","-","-",80,80,190,360,40,60,120,230,10,40,120,160,"-","-","-","-",50,100,240,390,40,70,100,220,20,40,80,140,"-","-","-","-",60,110,180,360,50,60,120,230,20,50,50,130,"-","-","-","-",70,110,180,360,40,70,160,270,20,60,90,170,"-","-","-",10,60,140,250,450]
[87,"Camborne and Redruth",null,90,110,110,310,30,60,90,170,"-",10,10,10,120,170,200,490,80,80,100,250,20,50,80,150,"-","-",10,10,100,130,190,410,90,90,80,260,20,80,100,200,"-","-","-",10,110,170,180,460,80,90,80,250,40,80,70,180,"-","-","-",10,110,170,160,440,100,100,100,290,20,60,80,160,"-","-",20,20,120,160,200,470]
[88,"Cambridge",null,30,70,60,150,10,30,30,70,"-","-","-","-",40,100,90,220,30,60,70,160,10,30,50,90,"-","-","-","-",40,90,120,250,40,60,100,190,10,30,50,90,"-","-","-","-",50,90,150,290,20,50,80,150,10,40,50,100,"-","-","-","-",40,90,130,260,30,50,80,160,20,30,40,90,"-","-",10,10,40,80,130,250]
[89,"Cannock Chase",null,110,140,200,460,50,70,90,210,"-","-","-","-",160,210,290,670,110,120,160,390,60,70,90,210,"-","-","-",10,170,190,250,610,120,130,150,410,40,90,120,240,"-","-",10,10,160,220,280,660,140,130,140,410,60,100,100,260,"-","-",10,20,200,230,250,690,140,110,150,400,60,90,100,240,"-",10,30,40,190,210,270,670]
[90,"Canterbury",null,60,80,70,210,10,40,30,80,"-","-","-","-",70,120,100,290,50,60,50,160,20,30,60,110,"-","-","-","-",70,90,100,270,70,70,60,190,20,40,50,100,"-","-","-","-",90,110,100,300,40,80,50,170,20,40,40,100,"-","-","-","-",60,120,90,270,40,50,70,160,20,40,60,120,"-","-",10,10,60,80,140,290]
[91,"Carlisle",null,190,130,80,400,40,100,70,200,"-","-","-","-",230,230,150,600,120,100,130,350,40,60,60,160,"-","-","-","-",160,170,190,510,110,110,90,310,50,70,100,220,"-","-","-","-",160,170,190,520,150,130,150,420,40,90,70,210,"-","-","-","-",190,220,220,630,160,100,100,360,60,80,70,200,"-","-",10,10,220,180,180,570]
[92,"Carshalton and Wallington",null,100,70,50,220,40,50,60,150,"-","-","-","-",140,120,110,360,60,60,70,180,30,50,70,150,"-","-","-","-",90,110,140,340,70,70,70,210,40,60,80,180,"-","-","-","-",110,130,160,390,60,60,70,180,40,60,50,150,"-","-","-",10,100,130,120,340,60,60,70,190,40,50,70,160,"-",10,10,20,90,120,150,360]
[93,"Castle Point",null,160,60,60,280,40,50,30,120,"-","-","-","-",210,110,90,410,120,80,70,270,50,30,40,120,"-","-","-","-",170,110,110,390,120,80,50,250,40,60,60,170,"-","-","-","-",170,140,110,420,100,90,60,250,50,60,40,150,"-","-","-","-",150,150,100,400,110,90,60,260,40,70,30,140,"-","-",10,10,150,150,110,410]
[94,"Central Devon",null,90,80,70,240,30,70,60,160,"-","-","-",10,120,150,140,410,100,70,90,260,30,50,70,150,"-","-","-","-",130,120,170,420,110,80,60,240,20,60,70,150,"-","-","-",10,130,140,130,400,90,100,80,270,40,60,50,160,"-","-","-","-",130,170,130,430,90,100,70,260,40,70,50,160,"-","-","-","-",130,160,120,420]
[95,"Central Suffolk and North Ipswich",null,110,90,110,310,30,50,40,120,"-","-","-","-",140,140,150,430,100,90,50,230,40,60,50,160,"-","-","-",10,140,150,110,390,110,90,50,250,50,60,50,160,"-","-","-",10,160,160,110,420,110,90,50,250,50,50,40,140,"-",10,"-",10,160,150,90,400,120,90,80,290,50,60,60,170,"-",10,10,20,180,150,150,470]
[96,"Charnwood",null,110,80,110,300,50,70,30,150,"-","-","-","-",160,150,140,450,110,100,150,360,40,60,60,160,"-","-","-","-",150,160,210,520,110,100,80,290,50,70,80,200,"-","-","-","-",160,170,170,490,130,90,100,320,60,80,50,190,"-","-","-",10,190,170,160,520,130,90,80,300,40,80,60,180,"-",10,10,10,180,170,150,500]
[97,"Chatham and Aylesford",null,100,80,110,290,30,50,40,120,"-","-","-","-",140,120,150,410,80,90,130,290,40,60,70,170,"-","-","-",10,110,150,200,470,90,80,80,250,40,50,60,150,"-","-","-","-",120,140,140,400,60,90,80,230,40,60,70,170,"-","-",10,10,90,160,160,410,90,100,110,300,30,60,70,160,"-","-",10,10,120,160,180,460]
[98,"Cheadle",null,110,70,60,240,30,60,50,140,"-",10,"-",10,140,130,120,390,60,70,70,190,40,60,60,150,"-","-","-",10,90,130,130,350,80,70,60,210,50,50,50,150,"-","-",10,10,130,120,120,370,70,60,60,190,40,60,40,140,"-","-",10,10,110,120,110,340,80,50,60,190,40,60,40,140,"-","-",10,10,120,120,110,340]
[99,"Chelmsford",null,140,120,90,340,50,60,50,150,"-","-","-","-",180,170,140,490,70,70,90,230,30,60,70,150,"-","-","-","-",100,130,160,380,100,80,60,240,50,40,70,170,"-","-","-",10,150,130,140,420,90,90,70,250,30,70,40,130,"-","-",10,10,120,160,110,390,90,70,80,230,40,70,60,170,"-",10,20,20,120,150,160,430]
[100,"Chelsea and Fulham",null,20,30,30,70,10,10,20,40,"-","-","-","-",20,40,50,110,20,20,30,60,10,20,10,40,"-","-","-","-",20,40,40,100,10,20,20,60,10,10,20,40,"-","-","-","-",20,30,40,90,10,20,20,50,10,10,10,30,"-","-","-","-",20,30,30,80,10,10,20,50,10,10,20,30,"-","-","-","-",20,30,40,80]
[101,"Cheltenham",null,60,90,80,230,30,50,40,120,"-","-","-","-",90,140,120,350,50,100,110,250,20,50,40,110,"-","-","-","-",70,150,150,360,60,70,70,200,20,50,60,140,"-","-","-",10,80,120,140,340,50,60,110,210,30,50,40,120,"-",10,"-",10,80,120,150,340,60,80,100,240,30,40,50,120,"-","-",10,10,100,110,150,360]
[102,"Chesham and Amersham",null,50,50,30,120,20,40,20,80,"-","-","-","-",70,80,50,200,50,40,30,120,30,40,40,110,"-","-","-","-",70,90,70,230,50,40,30,120,30,40,40,100,"-","-","-","-",70,80,70,220,40,30,40,120,20,40,30,90,"-","-","-","-",60,70,70,210,50,30,40,120,30,30,20,80,"-","-",10,10,80,70,60,210]
[103,"Chesterfield",null,150,120,190,460,40,60,80,180,"-","-","-","-",190,180,270,640,90,140,210,450,30,70,110,210,"-","-","-","-",120,220,320,660,140,140,150,430,40,110,140,290,"-","-","-","-",180,250,300,720,140,120,140,390,40,90,90,220,"-","-","-",10,180,210,230,620,140,140,160,430,70,100,120,280,"-","-",10,10,210,240,280,730]
[104,"Chichester",null,70,80,80,220,20,60,40,110,"-","-","-","-",90,140,110,340,40,60,50,160,20,40,60,120,"-","-","-","-",60,100,120,280,50,80,60,190,20,40,60,120,"-","-","-","-",70,120,130,320,40,50,70,170,20,60,50,130,"-","-","-",10,60,110,130,300,40,70,60,170,20,50,50,120,"-","-","-",10,60,120,110,290]
[105,"Chingford and Woodford Green",null,60,60,50,170,30,40,20,90,"-","-","-","-",90,100,60,260,70,50,50,170,30,40,40,100,"-","-","-","-",100,90,90,280,70,50,40,150,30,40,50,120,"-","-","-","-",100,90,90,280,50,60,60,180,40,50,30,120,"-","-",10,10,90,110,100,300,60,50,60,170,40,60,40,140,"-","-",10,20,100,120,110,320]
[106,"Chippenham",null,70,90,90,240,20,60,50,120,"-","-","-","-",90,150,140,370,50,70,70,180,30,50,70,150,"-","-","-","-",70,120,140,340,70,110,60,250,30,60,60,140,"-","-","-","-",100,170,130,390,60,90,80,230,30,50,40,120,"-","-","-",10,90,140,120,350,70,80,90,240,40,50,60,150,"-","-",10,10,120,140,150,400]
[107,"Chipping Barnet",null,40,40,60,140,10,40,30,80,"-","-","-","-",50,80,90,220,30,30,70,130,10,20,40,80,"-","-","-","-",40,50,110,210,40,40,50,130,20,30,40,90,"-","-","-","-",60,70,90,220,30,40,50,120,10,30,40,80,"-","-","-","-",50,70,90,200,30,40,40,120,30,30,40,100,"-","-",10,10,60,80,90,230]
[108,"Chorley",null,120,120,110,350,60,80,80,210,"-","-","-",10,180,200,180,560,110,100,150,360,40,70,130,240,"-",10,"-",10,140,170,290,600,110,110,110,330,50,100,120,270,"-",10,10,20,160,210,250,620,100,100,80,280,50,100,80,230,"-","-",10,10,160,200,170,520,100,80,130,310,60,70,80,210,"-",10,10,20,160,160,220,540]
[109,"Christchurch",null,100,60,50,210,40,60,40,140,"-","-","-","-",130,120,100,350,60,70,60,190,20,60,60,140,"-","-","-","-",80,130,130,340,80,70,60,210,20,60,60,140,"-","-","-","-",100,130,120,350,70,60,50,180,40,70,50,160,"-","-",10,10,110,120,110,340,70,80,60,210,40,60,50,150,"-","-",10,10,110,140,120,370]
[110,"Cities of London and Westminster",null,50,130,110,290,10,10,20,40,"-","-","-","-",60,150,130,330,60,80,70,210,10,20,20,40,"-","-","-","-",60,100,90,250,50,100,60,210,10,20,40,70,"-","-","-","-",50,120,110,280,30,80,80,190,10,40,70,110,"-","-","-","-",40,110,150,300,40,80,50,170,10,30,50,80,"-","-","-","-",50,110,100,260]
[111,"City of Chester",null,70,110,110,290,40,40,60,140,"-","-","-","-",110,150,180,430,60,100,140,300,30,50,90,170,"-","-","-","-",90,150,230,470,80,100,110,300,30,50,90,160,"-","-","-",10,110,150,200,460,60,80,80,220,30,60,90,180,"-","-",10,10,90,140,180,410,60,70,80,210,30,50,60,150,"-","-","-",10,90,130,140,360]
[112,"City of Durham",null,100,70,140,310,40,60,100,200,"-","-","-","-",140,130,240,510,30,70,180,280,20,60,110,190,"-","-","-","-",60,130,280,470,50,80,120,250,30,60,100,180,"-","-","-","-",80,140,220,430,60,80,100,240,30,60,80,160,"-","-",10,10,90,140,190,410,70,90,160,330,30,70,100,200,"-","-",20,20,110,160,280,540]
[113,"Clacton",null,110,120,130,350,20,40,50,120,"-","-","-","-",130,170,180,470,70,60,60,190,20,40,70,140,"-","-","-","-",100,100,140,340,90,90,80,270,20,60,80,150,"-","-","-",10,110,160,160,420,90,120,120,330,20,60,80,160,"-","-",30,30,110,180,230,520,110,80,120,310,40,80,110,220,"-","-",30,30,150,160,250,570]
[114,"Cleethorpes",null,90,100,80,270,80,60,50,190,"-","-","-","-",170,160,130,460,100,100,140,330,60,60,90,220,"-","-","-","-",160,160,230,550,100,90,90,280,70,70,90,220,"-",10,"-",10,170,160,180,510,120,90,110,320,70,80,60,220,"-","-",10,10,200,170,170,540,110,100,90,300,80,80,90,250,"-","-",10,10,190,180,190,560]
[115,"Colchester",null,100,140,90,330,30,50,60,140,"-","-","-","-",130,190,150,470,80,90,120,290,20,60,130,220,"-","-","-",10,110,160,250,510,70,120,120,310,30,80,120,230,"-","-",10,10,100,200,250,550,80,150,140,370,30,90,90,210,"-",10,30,30,110,240,260,610,90,140,170,400,30,90,120,250,"-",10,40,40,130,240,330,690]
[116,"Colne Valley",null,150,100,150,400,70,80,100,250,"-","-","-","-",220,180,250,650,150,120,130,390,50,90,100,230,"-","-","-",10,190,210,220,630,140,90,100,330,70,100,100,260,"-",10,"-",10,200,190,200,590,130,110,70,310,60,100,70,230,"-","-",10,10,190,210,150,550,140,100,120,370,70,100,80,250,"-","-",10,10,210,200,210,630]
[117,"Congleton",null,100,100,100,300,40,80,50,170,"-","-","-",10,140,180,150,470,60,90,130,280,30,80,70,180,"-",10,"-",10,100,170,200,470,90,100,90,280,60,100,60,220,"-","-",10,10,160,190,160,510,100,80,90,270,50,90,50,190,"-",10,10,10,150,180,150,470,120,90,70,280,70,80,70,210,"-",10,10,20,190,180,140,500]
[118,"Copeland",null,130,90,70,290,90,70,40,200,"-","-","-","-",220,160,110,490,120,80,110,310,90,60,80,230,"-","-","-","-",210,140,190,540,130,110,100,330,90,90,60,250,"-","-","-",10,220,200,160,580,150,90,90,330,140,90,60,290,"-","-","-",10,290,190,150,630,140,110,80,320,120,80,50,250,"-",10,"-",10,260,190,130,580]
[119,"Corby",null,100,100,140,340,40,70,60,170,"-","-","-",10,140,180,190,510,90,110,240,430,20,70,100,180,"-","-","-","-",100,180,340,620,90,140,170,400,30,90,110,230,"-","-","-",10,120,230,290,640,100,130,190,430,30,110,100,240,"-","-","-",10,130,240,290,670,130,130,240,510,60,90,80,220,"-","-","-",10,190,230,320,730]
[120,"Coventry North East",null,140,120,180,440,70,80,90,230,"-","-","-","-",210,200,260,670,110,160,220,490,40,70,130,250,"-","-","-","-",150,230,350,730,110,130,190,430,40,70,140,250,"-",10,"-",10,160,210,330,690,80,100,200,390,50,80,150,280,"-","-",10,10,140,190,360,680,100,120,180,390,60,90,110,260,"-","-",10,10,160,200,290,650]
[121,"Coventry North West",null,130,140,150,420,70,80,50,200,"-","-","-",10,200,230,200,630,100,100,170,370,50,60,130,230,"-","-","-",10,150,160,300,610,130,150,140,420,40,60,100,200,"-","-",10,10,170,210,250,640,130,130,170,430,70,80,100,250,"-",10,10,10,200,210,270,690,100,120,150,360,80,100,80,270,"-","-",20,20,190,220,250,650]
[122,"Coventry South",null,90,110,110,310,80,70,60,210,"-","-","-","-",170,180,170,510,70,80,130,290,30,50,90,170,"-","-","-","-",100,130,220,460,90,90,120,300,30,50,90,170,"-","-","-",10,130,140,210,470,70,80,130,280,60,80,80,210,"-","-",10,10,130,160,220,500,90,90,130,310,40,60,50,160,"-","-",10,10,130,160,190,470]
[123,"Crawley",null,80,90,110,280,30,50,50,120,"-","-","-","-",110,140,160,400,60,80,130,270,40,40,80,150,"-","-","-","-",90,130,200,420,70,80,110,260,10,40,70,130,"-","-","-","-",80,120,190,390,80,100,120,290,40,60,50,140,"-","-","-","-",110,160,170,430,70,70,110,260,40,50,60,140,"-","-",10,10,110,120,170,410]
[124,"Crewe and Nantwich",null,220,160,120,500,50,80,50,170,"-",10,"-",10,270,240,170,680,70,160,190,420,50,100,100,240,"-","-","-",10,120,260,290,670,90,120,160,370,50,100,110,260,"-",10,10,10,140,230,270,640,110,140,110,360,70,70,60,200,"-",10,10,20,180,220,180,580,110,130,120,360,60,100,100,270,"-",10,10,20,180,240,230,650]
[125,"Croydon Central",null,80,100,90,260,30,60,60,150,"-","-","-","-",110,160,140,420,70,90,140,290,50,80,100,230,"-","-","-","-",120,170,230,530,80,70,60,210,30,70,80,180,"-","-",10,10,110,140,140,390,80,80,90,250,30,70,50,160,"-","-",10,10,110,150,150,410,50,80,110,240,40,50,100,180,"-","-",10,10,90,130,210,430]
[126,"Croydon North",null,60,90,120,270,30,60,70,160,"-","-","-","-",90,150,190,430,50,60,180,280,20,40,110,170,"-","-","-","-",70,100,290,460,50,80,110,230,30,60,110,200,"-","-","-","-",70,130,220,430,50,70,130,250,30,50,80,160,"-","-","-","-",80,120,210,410,60,80,140,270,20,50,100,170,"-","-",10,10,80,120,250,460]
[127,"Croydon South",null,60,60,40,160,20,40,80,150,"-","-","-","-",90,100,130,310,40,50,80,170,20,50,60,130,"-","-","-","-",60,110,130,300,50,70,60,180,30,50,60,130,"-","-","-","-",80,120,120,310,60,50,70,180,30,50,70,160,"-","-",10,10,100,110,150,350,30,40,70,140,40,50,80,170,"-",10,10,20,80,90,160,330]
[128,"Dagenham and Rainham",null,80,70,100,260,40,40,50,120,"-","-","-","-",120,110,150,380,80,70,90,250,40,50,80,170,"-","-","-","-",120,120,170,410,100,80,90,270,40,50,90,180,"-","-","-","-",140,130,190,450,90,90,110,290,40,60,60,160,"-",10,10,10,130,150,180,460,110,90,140,330,60,70,80,200,"-","-",10,20,170,160,230,560]
[129,"Darlington",null,150,150,220,520,70,80,120,270,"-","-","-","-",220,230,340,790,90,190,280,570,40,70,150,260,"-","-","-","-",130,260,430,830,120,140,160,420,50,80,140,270,"-","-",10,10,170,230,300,690,100,110,160,370,60,90,90,250,"-","-",10,10,160,200,260,630,110,130,190,430,70,100,120,290,"-","-",10,20,180,230,320,730]
[130,"Dartford",null,100,90,90,270,40,50,60,150,"-","-","-","-",140,140,150,420,50,60,90,200,30,50,80,170,"-","-","-","-",80,120,170,360,90,60,80,240,30,50,80,160,"-","-","-","-",120,110,170,400,90,80,80,250,30,60,60,150,"-","-","-",10,130,140,150,410,90,80,80,250,50,80,70,200,"-","-",10,20,140,170,150,460]
[131,"Daventry",null,90,80,70,240,40,60,40,140,"-","-","-","-",130,140,100,380,80,70,90,230,40,70,50,160,"-","-","-","-",120,140,140,390,100,100,90,290,50,80,80,210,"-",10,"-",10,150,190,170,510,90,110,100,300,40,70,50,170,"-","-",10,10,140,190,150,480,100,100,90,300,50,70,50,170,"-",10,10,10,160,180,150,480]
[132,"Denton and Reddish",null,150,140,180,470,50,90,60,200,"-","-","-",10,200,230,240,670,100,130,150,380,40,80,130,240,"-","-","-",10,140,210,280,630,150,110,120,380,60,100,110,270,"-","-","-",10,210,210,230,650,100,110,130,340,80,90,90,260,"-","-",10,10,180,200,220,600,140,100,130,370,60,80,90,230,"-","-",10,20,200,180,230,620]
[133,"Derby North",null,160,120,170,440,60,70,60,190,"-",10,"-",10,220,200,230,640,120,110,140,360,50,60,80,190,"-","-","-",10,170,170,220,560,120,120,110,350,60,70,80,210,"-","-",10,10,180,200,190,560,130,120,120,380,80,70,50,190,10,10,"-",10,220,200,170,580,130,90,110,330,80,90,60,230,"-",10,10,20,210,190,180,580]
[134,"Derby South",null,120,130,190,440,60,70,60,180,"-","-","-",10,180,200,250,630,120,120,190,420,50,60,70,190,"-","-","-",10,170,180,260,610,100,100,130,330,50,80,90,210,"-",10,10,20,150,190,220,560,130,140,140,410,60,90,80,230,"-","-","-",10,190,230,230,650,120,100,160,370,80,80,90,250,"-",10,20,30,200,190,260,650]
[135,"Derbyshire Dales",null,100,70,40,210,30,50,40,120,"-","-","-","-",130,120,80,330,60,60,70,190,30,30,30,90,"-","-","-","-",90,90,100,280,90,80,50,220,30,50,50,130,"-",10,"-",10,120,130,100,350,110,70,60,240,50,80,40,170,"-","-","-",10,170,150,90,410,100,70,80,250,40,60,40,140,"-","-","-",10,140,140,120,390]
[136,"Devizes",null,210,440,310,970,20,90,160,270,"-","-","-","-",230,530,480,1230,160,320,180,660,30,100,180,320,"-","-","-","-",180,430,360,970,190,250,130,560,30,150,290,480,"-","-","-","-",220,400,420,1040,140,320,230,690,30,190,370,590,"-","-","-","-",160,510,600,1280,100,340,220,670,40,120,210,360,"-",10,"-",10,140,470,430,1040]
[137,"Dewsbury",null,250,140,130,510,50,80,100,220,"-","-","-","-",300,220,220,730,110,100,110,310,60,80,100,240,"-","-","-","-",160,180,210,550,120,100,130,360,60,90,80,220,"-","-","-",10,180,190,210,580,140,120,100,360,40,80,70,190,"-","-",10,10,180,210,170,560,150,90,120,370,70,90,80,230,"-","-",10,10,220,180,200,600]
[138,"Don Valley",null,180,100,140,420,60,70,90,220,"-","-","-","-",240,180,240,650,130,130,160,420,40,80,190,310,"-","-","-","-",170,210,340,730,110,100,140,350,50,110,130,290,"-","-","-","-",170,210,270,640,150,130,140,410,50,70,90,210,"-","-",10,10,200,200,230,630,140,120,170,420,50,80,90,210,"-","-",10,10,180,200,270,650]
[139,"Doncaster Central",null,160,130,140,420,40,60,80,190,"-","-","-","-",200,190,220,610,110,110,190,410,30,70,170,280,"-","-","-","-",140,180,360,690,100,120,160,380,40,80,160,280,"-","-","-","-",140,200,320,670,140,130,170,430,50,90,110,250,"-","-","-",10,190,220,280,690,120,120,260,490,60,60,120,230,"-","-",10,10,180,180,380,740]
[140,"Doncaster North",null,200,130,180,510,50,80,100,240,"-","-","-","-",250,220,280,750,130,110,180,420,40,100,190,330,"-","-","-","-",180,210,370,750,110,120,140,370,50,80,150,280,"-","-","-","-",160,200,300,660,110,130,150,390,40,80,90,210,"-","-",10,10,150,210,250,610,130,160,250,540,40,60,120,220,"-","-",10,10,170,210,380,760]
[141,"Dover",null,100,70,90,250,20,40,60,120,"-","-","-","-",110,110,150,370,60,90,110,260,10,40,70,120,"-","-","-","-",70,130,180,380,80,100,70,240,30,60,90,180,"-",10,"-",10,110,160,160,430,90,90,100,280,30,60,70,160,"-","-",10,10,120,160,170,450,120,90,100,320,20,50,90,160,"-","-",20,20,140,140,210,490]
[142,"Dudley North",null,150,100,90,340,30,40,70,150,"-",10,"-",10,190,150,160,490,100,90,120,310,40,50,90,180,"-","-",10,10,140,140,220,500,100,70,100,270,40,60,100,190,"-","-","-",10,130,140,200,470,130,100,110,330,40,60,80,180,"-","-",10,20,170,160,200,530,130,110,90,330,40,90,70,200,"-",10,20,30,170,200,180,560]
[143,"Dudley South",null,150,100,90,340,20,60,70,140,"-","-","-","-",170,160,160,490,90,80,110,280,10,60,80,160,"-","-",10,10,100,140,200,440,90,80,120,300,30,70,90,190,"-","-","-",10,130,150,220,500,110,80,100,300,40,70,90,190,"-","-",10,10,150,150,200,500,90,80,100,270,30,60,60,150,"-",10,20,20,120,150,180,440]
[144,"Dulwich and West Norwood",null,40,50,80,170,10,20,50,80,"-","-","-","-",60,60,130,250,20,40,100,150,10,20,70,100,"-","-","-","-",30,60,160,250,20,40,40,100,20,30,70,120,"-","-","-","-",40,70,110,210,30,40,70,140,10,30,30,80,"-","-","-","-",40,70,100,220,30,50,80,160,10,20,70,100,"-","-","-","-",40,70,150,260]
[145,"Ealing Central and Acton",null,30,50,70,150,10,20,50,80,"-","-","-","-",40,70,120,230,10,40,70,130,10,20,50,80,"-","-","-","-",30,60,120,200,20,30,60,110,10,20,50,90,"-","-","-","-",30,60,110,200,20,50,70,140,10,30,40,70,"-","-","-","-",20,80,120,220,10,40,60,100,10,20,60,90,"-","-","-","-",20,60,110,190]
[146,"Ealing North",null,90,100,120,310,20,50,50,110,"-","-","-","-",110,140,170,420,60,70,130,260,30,50,70,150,"-","-","-","-",90,120,200,400,40,50,100,200,30,60,50,140,"-","-","-","-",70,110,160,340,50,80,140,260,20,50,30,100,"-","-","-","-",70,120,170,360,50,70,120,250,30,50,60,140,"-","-",10,10,90,130,180,390]
[147,"Ealing Southall",null,50,60,90,200,10,30,40,80,"-","-","-","-",60,80,130,280,20,40,90,160,20,30,50,90,"-","-","-","-",40,70,140,240,30,50,60,140,10,40,50,110,"-","-","-","-",40,100,110,250,30,60,100,190,20,30,30,80,"-","-","-","-",50,90,130,270,30,40,90,160,20,40,30,80,"-","-","-",10,40,80,120,240]
[148,"Easington",null,160,120,250,530,60,80,110,250,"-","-","-","-",220,200,360,780,100,120,290,510,50,70,140,260,"-","-","-","-",150,190,440,770,130,120,220,460,60,60,130,240,"-","-","-","-",180,180,350,710,120,150,220,490,60,60,120,230,"-","-",10,20,180,210,350,740,140,140,280,560,80,70,120,270,"-","-",10,20,220,220,410,850]
[149,"East Devon",null,160,340,130,630,40,50,60,150,"-","-","-","-",200,390,180,780,180,480,140,800,40,60,80,180,"-","-","-","-",230,540,210,980,130,300,130,570,30,70,70,160,"-","-","-",10,160,380,200,730,190,410,160,760,40,80,50,170,"-","-","-","-",230,490,210,940,160,260,120,540,50,80,70,190,"-","-",10,10,200,340,190,740]
[150,"East Ham",null,90,110,170,370,30,50,50,130,"-","-","-","-",120,160,220,500,60,60,120,240,20,50,70,140,"-","-","-","-",80,110,190,380,80,70,120,270,30,50,100,180,"-","-","-","-",110,130,210,450,90,100,160,340,40,50,60,160,"-","-","-","-",130,150,220,500,80,100,170,350,50,60,90,200,"-","-",10,10,130,150,270,560]
[151,"East Hampshire",null,60,70,40,170,10,50,40,90,"-","-","-","-",60,120,80,260,50,50,80,180,20,60,50,130,"-","-","-","-",60,110,120,300,50,60,50,170,30,40,50,120,"-","-","-","-",80,100,100,280,50,70,80,200,20,70,60,150,"-","-","-","-",80,140,140,350,70,80,60,210,40,110,50,190,"-",10,10,20,110,190,120,420]
[152,"East Surrey",null,70,50,50,170,30,50,40,130,"-","-","-","-",100,110,90,300,50,70,80,190,30,50,50,130,"-","-","-","-",80,120,130,330,70,60,70,190,20,50,50,130,"-","-","-",10,90,110,130,330,70,80,70,210,30,50,40,120,"-","-","-",10,100,120,110,330,50,40,60,150,30,40,60,120,"-","-",10,10,80,80,120,290]
[153,"East Worthing and Shoreham",null,80,90,60,220,20,40,40,100,"-","-","-","-",100,120,90,310,80,60,60,200,30,50,90,170,"-","-","-","-",110,110,150,370,60,90,80,230,30,70,70,160,"-","-","-","-",90,160,150,390,80,80,80,240,50,60,40,150,"-","-",10,10,130,140,120,390,60,80,80,220,40,50,50,140,"-","-",10,10,110,140,130,370]
[154,"East Yorkshire",null,70,110,110,290,30,60,50,130,"-","-","-","-",100,160,160,420,70,90,110,260,30,60,90,180,"-","-","-",10,100,150,200,450,90,80,110,280,20,60,100,180,"-","-","-",10,110,140,210,470,100,110,180,380,30,60,50,140,"-","-","-",10,130,170,230,530,90,110,150,350,30,70,80,170,"-","-",10,10,130,180,230,530]
[155,"Eastbourne",null,80,110,140,330,30,60,60,150,"-","-","-","-",110,170,200,480,50,100,110,260,30,60,110,210,"-","-","-","-",90,160,220,470,60,80,110,260,40,60,130,230,"-","-","-","-",100,140,240,490,80,80,100,250,40,70,90,200,"-","-",10,10,120,150,190,460,60,80,130,270,20,50,80,160,"-","-",20,20,90,140,230,450]
[156,"Eastleigh",null,90,110,110,310,60,70,70,190,"-","-","-","-",150,180,170,500,90,80,80,250,60,80,60,190,"-","-","-","-",150,160,140,450,90,90,100,280,50,100,90,240,"-",10,"-",10,140,200,190,530,100,90,90,280,70,90,80,240,"-","-",10,10,170,180,180,520,110,100,110,330,70,80,90,240,"-",10,10,10,180,190,210,580]
[157,"Eddisbury",null,110,120,90,320,30,70,70,170,"-","-","-","-",140,190,160,490,70,90,80,240,30,60,80,180,"-","-","-","-",100,150,160,420,60,70,80,210,30,70,70,170,"-","-","-","-",100,140,150,390,90,80,90,250,50,70,70,180,"-","-",10,10,130,150,170,440,90,90,70,250,30,80,50,150,"-","-",10,10,120,170,120,420]
[158,"Edmonton",null,40,40,90,180,20,30,50,100,"-","-","-","-",70,70,140,270,40,40,150,220,20,50,70,140,"-","-","-","-",60,90,210,360,40,70,80,190,30,70,70,160,"-","-","-","-",70,130,150,360,60,80,110,240,30,50,60,140,"-","-","-","-",90,130,170,380,50,60,150,270,40,50,100,180,"-","-",10,10,90,110,260,460]
[159,"Ellesmere Port and Neston",null,110,130,150,390,60,70,110,240,"-","-","-","-",170,200,260,630,60,100,180,330,50,80,140,270,"-","-","-","-",110,180,310,600,100,80,150,330,70,80,120,270,"-","-",10,10,170,170,270,610,90,120,150,360,60,80,100,240,"-","-",10,20,150,200,270,610,100,90,110,310,70,70,110,240,"-","-",20,20,170,160,240,570]
[160,"Elmet and Rothwell",null,110,100,120,330,40,70,80,190,"-","-","-","-",150,170,200,520,80,80,100,260,50,50,90,190,"-","-","-",10,130,130,190,450,90,80,90,250,60,70,60,200,"-","-","-","-",150,150,150,450,100,90,90,280,60,80,70,210,"-","-","-","-",160,170,170,500,90,90,80,260,70,80,70,220,"-","-",10,20,160,180,160,500]
[161,"Eltham",null,130,60,60,250,40,40,40,110,"-","-","-","-",160,100,100,360,80,50,50,190,30,30,50,120,"-","-","-","-",120,80,100,300,50,50,50,150,40,50,60,140,"-","-","-","-",90,100,100,290,70,60,60,190,30,40,50,130,"-","-","-",10,110,110,110,330,60,60,80,190,20,50,50,120,"-","-",10,10,80,110,130,320]
[162,"Enfield North",null,50,60,70,180,40,50,30,130,"-","-","-","-",90,110,100,300,50,50,100,200,40,30,60,130,"-","-","-","-",90,80,160,320,70,80,70,220,30,50,70,140,"-","-","-","-",100,130,140,370,70,80,70,220,30,50,40,130,"-","-","-",10,100,140,120,360,60,60,100,220,30,70,70,170,"-","-",10,10,90,130,170,400]
[163,"Enfield Southgate",null,30,30,50,110,10,20,30,60,"-","-","-","-",40,50,80,170,30,30,60,110,20,20,40,80,"-","-","-","-",50,50,100,190,30,20,50,90,20,20,40,70,"-","-","-","-",40,40,80,170,30,30,60,120,30,30,20,70,"-","-","-","-",60,60,80,190,30,40,50,130,20,40,40,110,"-","-","-","-",60,80,100,240]
[164,"Epping Forest",null,50,60,60,180,20,30,30,80,"-","-","-","-",70,90,90,260,80,60,90,230,20,50,50,130,"-","-","-","-",100,120,140,350,60,50,40,160,30,40,50,120,"-","-","-","-",90,90,100,280,70,60,50,180,30,60,40,140,"-","-","-","-",100,130,90,320,60,50,60,170,50,50,60,150,"-","-",10,20,100,100,130,330]
[165,"Epsom and Ewell",null,60,40,40,150,20,30,40,90,"-","-","-","-",90,70,80,240,40,40,40,120,30,30,60,130,"-","-","-","-",80,70,100,250,60,60,40,150,20,50,30,100,"-","-","-",10,80,110,70,260,40,50,50,130,40,60,40,130,"-","-","-","-",80,110,80,260,40,40,60,130,30,30,50,110,"-",10,10,10,70,80,110,250]
[166,"Erewash",null,160,110,130,390,70,70,70,210,"-","-","-",10,230,180,190,600,150,110,140,400,60,90,80,220,"-",10,"-",10,200,200,230,630,150,130,140,420,70,90,80,240,"-",10,"-",10,220,230,220,670,180,120,120,430,80,80,60,220,"-",10,10,10,260,210,190,660,160,110,130,410,70,90,70,230,"-","-",10,20,230,210,220,660]
[167,"Erith and Thamesmead",null,190,90,120,410,30,40,40,110,"-","-","-","-",220,130,170,520,100,90,140,330,30,60,70,160,"-","-","-","-",130,150,210,490,90,80,110,280,30,50,110,190,"-","-","-","-",120,140,220,470,120,100,100,320,30,60,80,170,"-","-","-","-",150,160,190,490,120,70,140,330,40,50,90,180,"-",10,10,20,160,130,240,520]
[168,"Esher and Walton",null,30,40,40,110,20,30,30,80,"-","-","-","-",50,70,70,180,30,30,40,100,20,40,50,100,"-","-","-","-",50,70,80,200,30,30,50,110,20,40,40,100,"-","-","-","-",50,80,90,210,40,50,50,140,20,40,40,90,"-","-","-","-",70,90,90,240,40,40,40,110,20,30,30,80,"-","-",10,10,60,70,70,200]
[169,"Exeter",null,100,100,110,320,20,70,80,170,"-","-","-",10,130,180,200,500,90,100,130,320,30,70,80,190,"-","-","-","-",120,170,220,510,100,110,90,300,30,80,70,180,"-",10,"-",10,120,200,170,490,110,110,100,310,30,80,60,170,"-","-","-","-",140,190,160,490,100,110,110,320,40,100,80,210,"-","-","-",10,140,210,190,540]
[170,"Fareham",null,90,100,130,330,50,60,60,170,"-","-","-","-",140,160,200,490,60,90,90,240,40,70,80,180,"-","-","-","-",100,160,170,420,80,100,80,270,40,70,80,190,"-","-","-",10,120,180,160,460,100,110,60,270,50,90,40,170,"-","-",10,10,150,200,110,450,90,90,90,270,60,100,60,220,"-","-",10,10,150,190,160,510]
[171,"Faversham and Mid Kent",null,80,70,90,230,20,40,40,100,"-","-","-","-",100,110,120,330,70,70,100,250,20,50,50,120,"-","-","-","-",100,110,150,360,60,70,60,200,20,60,50,130,"-","-","-","-",80,130,110,320,80,70,80,220,30,60,60,150,"-","-","-","-",100,130,140,370,80,70,70,220,30,40,70,130,"-","-",10,10,110,110,150,360]
[172,"Feltham and Heston",null,60,80,140,290,30,50,60,130,"-","-","-","-",90,130,200,410,100,80,190,370,30,60,70,160,"-","-","-","-",140,140,260,540,70,80,150,300,30,60,80,170,"-","-","-","-",100,140,230,470,80,80,140,300,60,60,60,190,"-","-","-","-",140,150,210,490,70,70,150,290,80,80,70,230,"-",10,"-",10,150,160,230,540]
[173,"Filton and Bradley Stoke",null,100,90,100,280,60,60,70,190,"-",10,"-",10,160,150,170,480,70,50,110,230,40,60,60,170,"-","-","-","-",110,110,170,400,80,80,80,230,50,50,70,170,"-","-","-","-",120,130,150,400,100,60,90,250,50,70,70,190,"-","-","-","-",150,130,160,440,80,80,100,260,70,60,60,190,"-",10,10,10,150,140,170,460]
[174,"Finchley and Golders Green",null,10,30,60,100,10,10,30,50,"-","-","-","-",20,40,80,150,10,40,50,100,"-",10,30,50,"-","-","-","-",20,50,80,150,20,30,30,80,10,20,30,60,"-","-","-","-",30,60,60,140,20,40,50,110,10,20,30,60,"-","-","-","-",30,70,80,180,20,40,70,130,10,30,40,70,"-","-",10,10,30,70,110,210]
[175,"Folkestone and Hythe",null,80,110,110,300,20,60,50,130,"-","-","-","-",100,170,160,430,80,110,110,300,20,60,130,210,"-","-","-","-",100,170,240,520,90,110,120,320,30,80,110,230,"-","-","-","-",130,190,230,550,90,120,150,350,50,70,80,210,"-","-",10,10,140,190,230,560,110,110,190,410,40,70,100,200,"-","-",30,30,150,180,320,640]
[176,"Forest of Dean",null,100,80,90,270,50,40,50,130,"-","-","-","-",150,120,140,400,90,80,80,250,30,60,60,150,"-","-","-","-",120,130,150,400,90,80,70,230,40,70,50,170,"-","-",10,10,130,150,120,400,80,80,60,220,70,80,60,210,"-","-",10,10,150,170,120,440,120,90,90,290,60,80,40,190,"-","-",20,20,180,170,150,500]
[177,"Fylde",null,80,80,80,230,40,60,50,150,"-","-","-","-",110,150,130,390,70,110,140,310,40,40,70,160,"-","-","-","-",110,160,210,480,70,80,110,260,40,70,100,200,"-","-","-","-",100,160,200,460,80,100,90,270,40,80,70,190,"-","-",10,10,120,180,170,460,90,70,100,270,40,60,110,200,"-",10,20,30,130,140,230,500]
[178,"Gainsborough",null,110,120,130,360,40,60,70,180,"-",10,"-",10,150,190,200,540,70,80,90,240,30,60,80,180,"-","-","-","-",100,140,170,420,100,70,80,250,50,70,80,200,"-","-","-","-",160,140,160,450,110,110,110,320,50,50,50,150,"-","-",10,10,160,160,170,480,100,90,70,260,40,80,80,200,"-","-",10,10,140,170,160,480]
[179,"Garston and Halewood",null,240,200,370,810,80,70,90,240,"-","-","-","-",310,280,460,1050,120,170,280,560,50,70,130,250,"-","-","-",10,170,240,410,810,110,100,160,370,60,90,140,290,"-","-",10,10,170,190,300,670,110,100,150,360,50,70,140,250,"-","-",20,20,160,180,300,640,130,120,170,430,60,80,110,250,"-","-",10,10,190,210,300,690]
[180,"Gateshead",null,130,110,200,440,50,60,90,200,"-","-","-","-",180,170,290,640,70,90,210,360,50,70,140,270,"-","-","-","-",120,160,350,630,90,100,150,340,40,70,120,230,"-","-","-",10,120,170,270,570,130,120,170,410,60,80,100,240,"-","-",10,10,190,190,280,660,120,90,170,390,60,70,80,220,"-","-",10,10,190,170,270,620]
[181,"Gedling",null,130,130,140,400,60,60,50,170,"-","-","-","-",190,200,190,570,120,100,130,350,40,70,60,170,"-","-","-","-",160,170,200,520,100,110,110,310,40,80,70,200,"-","-","-","-",140,190,180,510,120,110,100,340,60,100,50,200,"-","-","-",10,180,210,160,550,120,100,100,320,60,70,60,190,"-",10,10,20,180,170,170,520]
[182,"Gillingham and Rainham",null,90,70,100,270,40,40,70,150,"-","-","-","-",130,120,170,420,70,60,100,220,30,40,90,150,"-","-","-","-",90,90,180,370,70,70,70,210,20,50,80,150,"-","-","-","-",100,120,150,370,80,90,100,260,30,50,70,150,"-","-",10,10,110,140,170,420,80,80,110,270,20,50,60,140,"-","-",10,10,100,140,170,420]
[183,"Gloucester",null,100,130,120,350,50,100,110,260,"-","-","-","-",150,230,240,620,100,110,150,360,40,90,110,240,"-","-","-",10,150,210,260,610,100,160,140,400,60,80,110,250,"-",10,10,10,160,240,260,660,120,110,120,350,60,110,90,260,"-",10,10,20,190,230,210,620,160,110,160,420,60,130,100,290,"-",10,30,40,220,240,280,750]
[184,"Gosport",null,230,580,300,1100,50,140,140,320,"-","-","-","-",270,720,430,1430,160,430,240,830,40,160,180,370,"-","-","-",10,200,590,420,1210,170,590,220,990,50,190,210,450,"-","-","-",10,220,790,430,1440,280,800,260,1330,50,160,150,360,"-","-",10,10,320,960,420,1700,350,790,300,1430,50,180,210,440,"-",10,10,20,400,970,530,1900]
[185,"Grantham and Stamford",null,90,120,150,360,40,70,70,180,"-","-","-","-",130,190,220,540,80,100,100,280,30,70,110,210,"-","-","-",10,110,180,210,490,100,90,70,260,40,90,100,240,"-","-","-",10,140,180,180,500,90,110,110,310,50,100,70,220,"-","-","-","-",140,210,180,520,100,90,100,300,40,70,80,190,"-","-","-","-",150,160,190,490]
[186,"Gravesham",null,60,60,80,200,30,40,20,90,"-","-","-","-",90,90,100,290,60,60,80,200,30,50,70,140,"-","-","-","-",90,110,140,340,70,90,90,250,40,50,80,170,"-","-","-",10,110,150,170,430,70,80,90,240,40,70,80,190,"-","-",10,10,110,150,170,430,70,90,100,250,40,60,80,180,"-","-",10,10,110,150,180,440]
[187,"Great Grimsby",null,100,100,100,290,50,50,70,170,"-","-","-","-",150,150,170,470,70,80,150,300,40,50,90,180,"-","-","-","-",110,130,240,480,70,90,90,250,30,60,80,170,"-","-","-","-",90,150,170,420,70,90,120,280,40,60,50,150,"-","-",10,10,110,150,180,440,80,110,130,320,40,50,70,160,"-","-","-",10,110,160,210,480]
[188,"Great Yarmouth",null,90,110,80,290,30,50,30,120,"-","-","-","-",120,170,110,400,60,70,100,220,40,60,90,190,"-","-","-","-",100,130,190,420,110,80,100,290,50,60,100,210,"-","-","-",10,160,150,200,510,110,110,90,310,50,60,50,170,"-","-",20,20,160,180,160,490,110,110,80,290,60,90,70,220,"-","-",20,30,160,200,170,530]
[189,"Greenwich and Woolwich",null,160,90,100,350,10,40,50,100,"-","-","-","-",170,130,140,440,50,60,80,200,10,20,60,90,"-","-","-","-",60,80,150,290,50,80,110,240,10,30,80,120,"-","-","-","-",70,110,190,360,50,90,120,260,20,40,50,110,"-","-","-","-",70,130,170,370,50,80,100,240,20,50,70,140,"-","-",10,10,70,140,180,390]
[190,"Guildford",null,40,60,40,150,20,40,30,80,"-","-","-","-",60,100,70,230,30,50,60,140,10,30,40,70,"-","-","-","-",40,70,100,210,40,50,40,130,20,40,40,90,"-","-","-","-",50,90,80,220,30,40,40,120,20,40,30,100,"-","-","-",10,60,90,80,220,30,40,60,130,20,30,30,80,"-","-",10,10,50,70,100,220]
[191,"Hackney North and Stoke Newington",null,40,60,90,190,30,30,50,110,"-","-","-","-",70,100,140,300,20,40,100,160,20,30,60,110,"-","-","-","-",50,70,160,270,30,40,60,130,10,30,50,90,"-","-","-","-",40,70,120,220,20,50,100,180,30,30,30,80,"-","-","-","-",50,80,130,260,20,40,90,150,30,30,50,110,"-","-",10,10,50,70,150,280]
[192,"Hackney South and Shoreditch",null,40,60,90,200,20,20,40,80,"-","-","-","-",60,90,130,280,30,40,100,170,10,40,90,140,"-","-","-","-",40,80,190,310,30,50,80,160,10,30,60,110,"-","-","-","-",40,80,150,270,40,70,100,210,30,30,40,100,"-","-","-","-",70,100,140,310,40,70,100,210,20,40,60,130,"-","-",20,20,70,110,180,360]
[193,"Halesowen and Rowley Regis",null,110,80,120,310,50,70,70,180,"-","-","-","-",160,150,190,500,80,70,110,260,30,70,80,180,"-","-","-",10,100,140,200,440,90,120,100,310,40,60,100,210,"-","-",10,10,130,190,210,530,110,120,100,330,50,70,90,210,"-","-",10,20,160,190,200,550,130,120,100,340,30,90,70,190,"-",10,30,30,160,210,190,560]
[194,"Halifax",null,150,100,140,390,70,100,110,280,"-","-","-","-",220,210,250,680,100,110,160,380,60,70,150,290,"-",10,"-",10,170,190,320,670,110,110,130,350,60,80,120,270,"-","-","-",10,170,200,250,620,130,140,150,420,60,100,140,290,"-","-","-","-",190,240,290,720,100,140,160,410,60,100,140,290,"-","-",20,20,160,240,310,720]
[195,"Haltemprice and Howden",null,130,80,80,290,70,50,50,170,"-","-","-","-",200,130,130,460,90,70,60,220,60,60,50,170,"-","-","-","-",150,130,120,390,110,60,70,250,40,60,60,150,"-","-","-",10,150,120,130,400,110,60,70,240,50,70,60,180,"-",10,"-",10,160,140,130,430,90,60,60,220,70,70,50,190,"-",10,"-",10,170,140,120,420]
[196,"Halton",null,150,180,250,580,50,80,100,230,"-","-","-",10,200,260,360,820,100,120,220,430,50,70,160,270,"-","-","-",10,150,180,380,710,110,100,170,380,60,70,120,250,"-","-","-","-",170,180,290,640,100,120,150,370,70,90,90,260,"-","-",10,10,170,210,250,640,90,90,170,340,60,90,110,270,"-","-",10,10,150,180,280,610]
[197,"Hammersmith",null,60,60,60,170,10,30,50,90,"-","-","-","-",60,90,100,260,20,50,50,120,10,20,60,90,"-","-","-","-",30,70,110,210,10,30,60,100,10,30,30,60,"-","-","-","-",20,60,80,160,30,40,70,150,10,20,20,60,"-","-","-","-",40,70,90,200,20,50,70,140,10,30,40,80,"-","-","-","-",30,80,110,210]
[198,"Hampstead and Kilburn",null,30,30,50,110,10,10,20,40,"-","-","-","-",30,40,80,150,10,30,50,90,10,20,40,60,"-","-","-","-",20,50,90,160,20,20,60,90,10,20,40,60,"-","-","-","-",20,40,100,160,10,30,60,100,10,20,20,50,"-","-","-","-",30,50,80,150,20,30,80,130,10,30,40,80,"-","-","-","-",20,60,130,210]
[199,"Harborough",null,80,80,100,250,60,60,40,160,"-","-","-","-",140,140,140,410,90,70,100,260,30,70,70,170,"-","-","-",10,130,140,170,430,80,100,120,310,30,60,60,140,"-","-","-","-",110,160,180,450,100,90,90,280,40,70,50,160,"-","-","-","-",140,160,150,450,110,90,100,300,40,70,100,210,"-","-",10,10,150,160,210,520]
[200,"Harlow",null,100,80,120,300,20,40,30,90,"-","-","-","-",120,120,150,390,80,80,140,300,30,50,80,160,"-","-","-","-",110,130,220,460,70,90,120,280,30,60,90,170,"-","-","-",10,100,150,210,460,70,60,100,240,40,70,70,170,"-","-",10,10,110,130,180,420,70,70,110,240,20,60,80,150,"-",10,20,20,90,130,200,420]
[201,"Harrogate and Knaresborough",null,710,110,90,910,40,80,70,190,"-","-","-","-",740,190,170,1100,380,110,110,590,40,70,100,200,"-","-","-","-",410,180,210,800,470,80,80,630,50,80,100,220,"-","-","-","-",510,160,180,850,80,80,90,250,40,80,60,180,"-","-","-","-",120,160,150,430,70,60,90,220,40,90,90,210,"-","-",10,20,110,150,190,450]
[202,"Harrow East",null,60,50,80,190,20,20,30,70,"-","-","-","-",80,70,110,260,30,40,90,150,20,20,50,80,"-","-","-","-",50,60,130,230,30,40,60,130,10,20,30,60,"-","-","-","-",40,50,100,190,40,40,80,150,20,30,30,70,"-","-","-","-",50,70,110,230,20,40,70,130,20,30,30,80,"-","-","-",10,40,70,100,210]
[203,"Harrow West",null,60,50,80,200,10,20,30,60,"-","-","-","-",70,70,110,250,30,30,90,150,20,20,50,90,"-","-","-","-",60,50,140,240,30,40,50,110,10,20,40,80,"-","-","-","-",40,60,90,190,20,50,60,130,10,20,40,70,"-","-","-","-",40,70,100,200,20,40,90,150,20,20,40,80,"-","-","-","-",40,60,130,230]
[204,"Hartlepool",null,160,110,160,430,70,70,100,240,"-","-","-","-",230,180,260,670,60,120,160,350,100,70,110,280,"-","-","-","-",160,200,270,630,130,140,180,440,70,70,100,240,"-","-","-","-",200,210,280,690,120,170,190,470,100,100,90,290,"-","-",10,10,220,270,280,770,150,180,150,480,100,110,110,320,"-","-",10,10,250,290,270,810]
[205,"Harwich and North Essex",null,90,90,80,260,30,40,40,120,"-","-","-","-",120,130,120,380,60,70,70,200,30,40,60,130,"-","-","-","-",90,110,130,330,70,70,60,210,20,50,70,140,"-","-","-",10,90,130,140,350,80,70,70,220,30,60,70,160,"-","-",10,20,110,130,150,390,80,70,60,220,40,70,70,180,"-",10,20,30,120,150,150,420]
[206,"Hastings and Rye",null,120,90,140,350,30,60,50,140,"-","-","-","-",150,150,190,490,60,90,120,270,30,50,100,180,"-","-","-","-",90,150,220,450,40,70,90,210,40,60,90,200,"-","-","-","-",80,130,190,400,60,90,100,240,20,50,80,140,"-","-","-","-",80,140,170,390,60,70,130,250,20,50,90,150,"-","-",20,20,70,120,240,430]
[207,"Havant",null,100,100,130,320,40,50,30,120,"-","-","-","-",130,150,160,440,80,80,120,280,40,50,70,160,"-","-","-","-",120,130,190,440,100,110,90,290,40,80,70,190,"-","-","-","-",130,190,150,480,90,100,120,310,30,80,50,160,"-","-",10,10,130,190,170,490,100,90,80,270,40,80,70,200,"-","-",10,10,150,170,170,480]
[208,"Hayes and Harlington",null,90,90,130,320,50,50,50,150,"-","-","-","-",140,140,180,460,80,60,140,280,40,50,70,160,"-","-","-","-",120,110,200,440,70,60,130,270,50,60,60,170,"-","-","-","-",120,120,200,440,70,80,120,260,50,70,50,170,"-","-","-",10,120,150,170,440,70,70,140,280,40,50,50,140,"-","-",10,10,110,130,200,430]
[209,"Hazel Grove",null,140,110,90,330,70,60,50,170,"-","-","-",10,200,180,130,510,100,100,80,280,40,60,100,200,"-","-","-",10,150,160,180,490,90,80,90,260,50,80,80,200,"-","-","-",10,140,160,170,470,110,90,80,270,50,60,50,170,"-",10,10,10,160,150,140,450,90,70,90,260,50,80,60,190,"-","-",10,10,150,150,160,450]
[210,"Hemel Hempstead",null,70,60,70,200,20,50,40,120,"-","-","-","-",90,110,110,320,60,70,120,250,20,40,40,90,"-","-","-","-",80,110,160,340,60,80,90,230,20,60,80,160,"-","-","-",10,90,130,170,390,70,80,80,230,30,60,50,140,"-","-",10,10,100,140,140,380,50,60,100,220,40,60,60,150,"-",10,10,10,90,130,160,380]
[211,"Hemsworth",null,130,100,150,380,40,70,70,180,"-","-","-",10,170,170,230,570,80,100,170,350,40,70,90,190,"-","-","-","-",110,180,250,540,100,100,150,340,30,70,90,180,"-","-","-","-",120,170,240,530,100,100,140,340,60,70,90,220,"-","-","-","-",160,180,230,570,110,80,150,340,50,80,80,200,"-","-",10,10,160,170,230,550]
[212,"Hendon",null,40,50,80,170,10,30,50,90,"-","-","-","-",50,80,130,260,40,40,110,190,10,30,60,100,"-","-","-","-",50,80,170,290,30,50,80,170,20,40,70,120,"-","-","-","-",50,90,150,290,20,40,80,150,10,40,40,90,"-","-","-",10,40,90,120,240,30,40,100,170,30,40,70,140,"-","-",10,10,60,80,170,310]
[213,"Henley",null,60,50,50,150,30,50,30,110,"-","-","-","-",80,100,80,270,60,70,60,180,40,40,50,130,"-","-","-","-",100,110,110,320,50,70,30,160,40,60,40,140,"-","-","-",10,90,130,70,300,40,50,50,150,40,60,20,110,"-","-","-","-",80,110,70,270,70,40,50,160,30,50,30,110,"-","-",10,20,100,90,100,290]
[214,"Hereford and South Herefordshire",null,150,120,120,390,50,80,40,180,"-","-","-","-",200,210,160,570,100,110,150,350,40,70,100,220,"-",10,"-",10,140,190,250,580,110,110,140,360,40,90,110,240,"-","-","-","-",150,200,260,600,120,110,150,380,60,70,80,210,"-","-","-","-",170,180,240,590,100,110,120,320,40,80,100,220,"-",10,10,10,140,190,220,560]
[215,"Hertford and Stortford",null,60,70,80,200,20,40,30,90,"-","-","-","-",80,100,110,290,70,140,100,310,30,40,60,130,"-","-","-","-",100,180,160,440,60,80,60,200,30,50,40,110,"-","-","-","-",90,130,100,320,70,60,50,170,30,50,30,110,"-","-",10,10,100,110,80,290,60,50,50,170,20,50,50,120,"-","-","-","-",90,110,100,300]
[216,"Hertsmere",null,60,60,90,210,20,30,50,100,"-","-","-","-",80,90,130,310,80,80,90,250,20,40,60,130,"-","-","-","-",100,120,150,370,50,60,80,190,30,50,50,130,"-","-","-","-",80,120,130,320,60,70,80,210,20,40,40,90,"-","-","-",10,90,110,110,310,50,40,50,150,30,40,40,100,"-",10,10,10,80,90,100,260]
[217,"Hexham",null,80,80,110,270,30,50,60,130,"-","-","-","-",110,130,170,410,70,70,110,260,30,60,90,180,"-","-","-","-",100,140,200,440,70,60,60,190,40,50,70,170,"-","-","-","-",110,120,130,360,80,70,140,290,40,80,60,180,"-","-",10,10,120,150,210,480,80,60,100,240,30,50,50,130,"-","-",10,10,120,110,160,390]
[218,"Heywood and Middleton",null,170,150,160,490,60,80,100,240,"-","-","-",10,230,240,260,740,110,100,200,420,60,100,150,310,"-","-","-",10,170,200,350,730,110,130,150,400,50,110,160,320,"-","-",10,10,160,240,320,720,110,130,140,380,80,110,90,280,"-","-",10,10,200,240,240,670,120,120,170,410,70,100,140,310,"-","-",20,20,190,220,320,730]
[219,"High Peak",null,100,100,90,300,50,60,50,160,"-","-","-",10,150,170,140,460,80,90,90,260,50,50,70,170,"-","-","-",10,130,140,160,430,80,100,110,290,40,70,110,210,"-","-","-","-",120,170,220,510,100,100,90,290,40,90,70,200,"-","-","-",10,140,190,160,490,100,100,90,280,70,80,80,230,"-","-",10,10,170,180,180,530]
[220,"Hitchin and Harpenden",null,40,50,50,130,30,30,20,90,"-","-","-","-",80,80,60,220,20,40,50,120,20,40,30,80,"-","-","-","-",40,80,80,200,40,40,40,120,10,20,40,80,"-","-","-","-",50,60,80,190,50,40,60,150,20,30,20,80,"-","-","-","-",70,80,80,220,30,50,50,130,20,30,20,80,"-","-","-",10,60,80,70,210]
[221,"Holborn and St Pancras",null,30,60,70,150,10,30,30,80,"-","-","-","-",40,90,100,230,40,60,50,150,20,30,30,70,"-","-","-","-",60,90,80,230,30,40,50,120,10,30,30,80,"-","-","-","-",50,70,80,190,40,50,60,150,20,50,20,90,"-","-","-","-",60,110,70,240,40,50,60,150,20,40,30,90,"-","-","-",10,70,90,90,250]
[222,"Hornchurch and Upminster",null,70,60,50,180,50,40,40,140,"-","-","-","-",120,110,90,320,110,60,50,220,40,40,60,140,"-","-","-","-",150,100,110,360,90,60,50,200,40,60,60,160,"-","-","-",10,130,120,110,370,110,100,70,270,60,60,50,180,"-","-",10,10,170,160,130,460,110,80,80,260,60,70,50,180,10,10,10,20,180,150,140,460]
[223,"Hornsey and Wood Green",null,30,40,70,140,10,20,30,70,"-","-","-","-",40,60,110,210,20,40,80,130,20,30,50,90,"-","-","-","-",30,70,120,230,20,40,70,120,10,20,40,70,"-","-","-","-",30,60,110,200,20,50,90,160,20,30,30,80,"-","-","-","-",40,90,120,250,20,40,90,160,20,30,40,90,"-","-",10,10,40,80,130,250]
[224,"Horsham",null,60,80,40,180,30,50,30,100,"-","-","-","-",90,120,70,290,50,70,50,160,20,50,50,120,"-","-","-","-",70,120,100,290,50,70,50,170,30,60,60,150,"-","-","-","-",80,130,110,320,70,80,70,220,30,60,50,150,"-",10,"-",10,100,150,120,370,50,60,50,160,30,60,50,140,"-","-","-",10,80,120,110,310]
[225,"Houghton and Sunderland South",null,220,120,260,610,90,100,100,280,"-","-","-","-",310,220,360,890,110,110,240,450,60,70,160,290,"-","-","-","-",160,180,400,740,110,140,200,450,70,70,120,260,"-","-","-",10,180,210,330,720,120,120,230,480,70,70,100,240,"-","-",10,10,190,190,340,720,140,120,250,520,80,90,100,260,"-","-",10,20,220,210,360,790]
[226,"Hove",null,50,60,40,150,20,40,40,100,"-","-","-","-",60,100,80,240,40,70,60,180,20,40,80,140,"-","-","-","-",60,110,140,310,60,60,40,170,10,50,60,130,"-","-","-","-",80,120,110,300,60,80,70,200,20,50,50,120,"-","-",10,10,80,130,120,330,40,50,60,160,30,40,60,120,"-","-","-",10,70,90,120,290]
[227,"Huddersfield",null,140,100,140,370,30,70,70,170,"-","-","-","-",170,170,210,550,100,90,170,360,40,60,100,200,"-","-","-","-",140,150,260,560,110,100,100,310,50,70,100,220,"-","-","-",10,160,170,200,530,100,100,110,310,50,80,80,210,"-","-","-","-",150,190,200,530,110,100,140,350,70,70,100,240,"-","-",10,10,180,170,240,590]
[228,"Huntingdon",null,80,80,60,220,30,70,30,130,"-","-","-","-",110,150,90,350,60,70,110,250,30,30,60,120,"-","-","-","-",90,110,170,370,60,90,100,240,30,60,70,160,"-","-","-",10,90,160,170,410,80,90,100,270,30,70,70,170,"-","-","-","-",110,160,170,440,70,90,100,250,50,60,70,180,"-","-",10,10,110,150,180,440]
[229,"Hyndburn",null,210,120,110,440,50,70,90,200,"-","-","-","-",260,180,200,640,160,130,120,410,50,80,150,280,"-","-","-",10,210,210,270,690,160,130,160,450,70,80,140,290,"-","-","-","-",220,210,300,740,140,130,120,400,70,110,90,270,"-","-",10,10,220,240,220,680,150,120,150,420,70,120,110,300,"-","-",20,20,220,240,270,730]
[230,"Ilford North",null,50,50,60,160,20,30,40,90,"-","-","-","-",70,80,100,250,40,40,60,140,20,40,60,120,"-","-","-","-",60,80,120,260,50,40,70,160,30,50,50,130,"-","-","-","-",90,90,120,290,40,50,70,160,40,40,40,120,"-","-","-","-",80,90,110,280,50,50,90,190,40,60,40,140,"-",10,20,30,90,120,140,350]
[231,"Ilford South",null,40,60,90,180,10,40,40,90,"-","-","-","-",50,100,130,270,30,50,90,170,10,30,50,100,"-","-","-","-",50,80,140,260,50,60,70,180,20,40,60,120,"-","-","-","-",70,100,140,300,50,70,110,230,20,60,60,140,"-","-",10,10,70,130,170,370,50,70,120,250,50,60,60,170,"-","-",10,10,110,130,190,430]
[232,"Ipswich",null,110,140,110,350,30,60,70,160,"-","-","-","-",140,210,170,520,120,130,100,350,20,60,100,180,"-",10,"-",10,140,200,210,540,100,100,90,290,50,70,80,200,"-",10,"-",10,140,180,180,500,120,110,120,350,40,70,60,160,10,10,10,20,160,180,190,530,140,150,150,430,40,70,100,210,"-","-",10,20,180,220,250,650]
[233,"Isle of Wight",null,160,230,210,600,60,140,220,410,"-","-","-","-",220,370,430,1010,160,200,200,560,50,130,270,450,"-","-","-","-",210,330,470,1010,160,190,160,510,50,180,260,490,"-","-","-","-",210,370,420,1000,150,170,180,490,70,170,170,400,"-",10,10,20,220,340,350,910,130,170,160,460,60,160,210,420,"-","-",30,30,180,330,400,910]
[234,"Islington North",null,20,40,60,120,10,30,40,80,"-","-","-","-",30,70,90,190,20,40,60,110,10,20,30,60,"-","-","-","-",20,60,90,160,20,50,50,110,10,20,50,90,"-","-","-","-",30,70,100,200,30,60,70,160,20,20,30,70,"-","-","-","-",50,80,100,230,20,40,70,130,10,20,40,60,"-","-","-",10,20,60,110,190]
[235,"Islington South and Finsbury",null,50,40,50,140,10,30,20,70,"-","-","-","-",70,70,70,210,30,30,40,100,10,20,30,60,"-","-","-","-",40,50,80,170,50,40,50,130,20,20,40,90,"-","-","-","-",70,60,90,220,30,50,80,160,10,30,20,70,"-","-","-","-",40,80,100,230,30,30,50,120,20,40,20,90,"-","-","-","-",50,80,80,200]
[236,"Jarrow",null,190,110,170,470,70,60,100,230,"-","-","-","-",260,170,270,700,130,100,190,420,60,70,100,230,"-","-","-","-",190,170,290,650,120,130,170,420,70,70,100,240,"-","-","-","-",200,200,270,660,130,110,150,390,80,80,120,270,"-","-",10,10,200,190,280,670,150,120,210,470,90,60,90,240,"-","-",10,10,230,180,310,720]
[237,"Keighley",null,90,110,110,320,40,60,40,150,"-","-","-","-",140,170,160,470,100,100,100,300,30,60,50,150,"-","-","-","-",130,160,150,450,90,100,70,250,30,60,70,160,"-","-","-",10,120,160,140,410,70,80,80,230,30,60,70,160,"-","-","-","-",100,140,150,390,80,90,90,260,40,70,50,160,"-","-","-","-",120,160,140,420]
[238,"Kenilworth and Southam",null,60,40,40,150,40,40,40,120,"-","-","-","-",100,90,80,270,40,50,60,140,30,50,40,110,"-","-","-","-",70,90,100,260,70,50,60,180,20,30,50,100,"-","-","-",10,90,80,110,280,40,50,60,160,40,50,40,130,"-","-",10,10,80,110,110,300,60,50,60,170,30,50,40,120,"-","-",10,10,100,100,100,300]
[239,"Kensington",null,10,20,30,60,10,10,20,40,"-","-","-","-",20,30,50,100,10,30,40,70,10,20,20,40,"-","-","-","-",20,40,60,110,20,10,20,50,"-",20,20,30,"-","-","-","-",20,30,40,80,10,20,30,70,10,10,20,40,"-","-","-","-",20,40,50,110,10,20,20,50,10,20,20,50,"-","-","-","-",20,40,40,100]
[240,"Kettering",null,90,90,110,300,40,60,70,170,"-","-","-","-",130,160,180,470,90,100,130,310,30,60,80,170,"-","-","-","-",120,160,210,480,100,80,100,290,30,80,90,200,"-","-","-","-",130,160,190,490,90,100,140,330,40,80,50,170,"-",10,"-",10,130,190,190,500,90,90,120,310,40,80,70,190,"-","-",10,10,130,170,200,500]
[241,"Kingston and Surbiton",null,40,50,50,140,30,40,30,100,"-","-","-","-",70,90,80,240,30,50,70,140,20,30,50,110,"-","-","-","-",60,80,120,250,50,60,50,150,30,50,40,120,"-","-","-","-",70,110,90,270,50,50,70,170,40,40,30,110,"-","-","-",10,90,100,100,280,40,60,50,150,20,40,40,100,"-","-","-","-",60,100,90,250]
[242,"Kingston upon Hull East",null,250,130,140,510,80,80,70,230,"-","-","-","-",330,210,200,740,180,120,190,490,70,70,110,250,"-","-","-","-",260,190,300,740,170,100,160,430,70,80,100,240,"-","-","-",10,240,180,260,680,170,120,140,430,70,80,100,250,"-","-",10,10,250,200,240,690,190,130,130,450,80,80,110,270,"-","-","-",10,280,210,240,720]
[243,"Kingston upon Hull North",null,200,90,110,400,60,60,50,170,"-","-","-","-",260,140,160,570,140,90,160,380,40,70,80,190,"-","-","-",10,180,160,240,570,130,90,130,350,60,60,90,210,"-","-","-","-",190,140,220,560,140,120,120,380,50,80,70,200,"-","-","-",10,180,200,200,580,120,100,140,370,40,60,100,200,"-","-",10,10,160,160,250,570]
[244,"Kingston upon Hull West and Hessle",null,180,110,130,410,60,60,70,190,"-","-","-","-",230,170,190,600,120,110,150,380,40,60,80,180,"-","-","-","-",160,170,230,560,150,80,160,390,40,60,90,200,"-","-","-","-",190,140,260,590,100,90,100,280,50,70,80,200,"-","-","-",10,150,160,180,490,130,100,120,360,40,80,100,220,"-","-",10,10,170,190,230,590]
[245,"Kingswood",null,130,110,90,330,70,70,90,230,"-","-","-","-",200,180,180,560,130,70,130,330,60,70,80,220,"-","-","-",10,190,150,210,550,150,90,90,320,60,70,80,220,"-","-","-","-",210,160,170,540,150,110,120,380,60,80,60,200,"-","-","-","-",210,190,190,580,130,90,80,300,90,90,60,240,"-",10,"-",10,220,190,140,550]
[246,"Knowsley",null,300,200,300,790,90,100,100,290,"-","-","-","-",380,310,400,1090,140,170,310,620,80,100,160,330,"-","-",10,10,220,270,480,960,160,160,230,540,70,120,180,370,"-","-",10,10,230,280,420,930,220,170,210,600,70,130,150,350,"-","-",10,10,280,300,380,960,170,150,180,490,90,100,130,310,"-","-",10,10,250,250,320,820]
[247,"Lancaster and Fleetwood",null,70,80,70,220,40,50,50,130,"-","-","-","-",110,120,110,350,70,70,80,220,30,60,110,200,"-","-","-",10,100,140,190,420,70,70,70,210,30,60,90,170,"-","-","-","-",100,130,150,380,70,90,80,230,40,50,90,180,"-","-","-",10,110,140,160,410,80,80,80,240,40,50,70,160,"-","-",20,20,120,130,160,410]
[248,"Leeds Central",null,130,140,170,450,50,60,80,190,"-","-","-","-",180,210,250,640,140,140,200,470,20,50,100,170,"-","-","-","-",160,190,300,650,70,100,160,330,20,70,90,190,"-","-","-","-",90,170,250,520,100,130,150,380,20,70,90,170,"-","-","-",10,120,200,240,560,130,120,180,430,30,80,70,180,"-","-",10,10,160,210,260,620]
[249,"Leeds East",null,140,110,150,400,60,60,80,200,"-","-","-","-",200,180,220,600,160,100,150,410,40,50,80,170,"-","-","-","-",200,150,230,590,110,110,130,350,40,50,80,170,"-","-","-","-",150,160,210,520,110,100,120,330,40,80,80,200,"-","-","-",10,160,180,200,540,110,100,130,340,40,60,80,180,"-",10,"-",10,150,160,220,530]
[250,"Leeds North East",null,70,60,80,210,40,40,50,130,"-","-","-","-",110,110,120,340,90,60,80,230,20,30,60,110,"-","-","-","-",120,90,130,340,40,60,70,160,20,50,50,130,"-","-","-","-",60,110,120,290,40,70,70,180,10,40,40,100,"-","-","-",10,60,110,110,280,50,60,90,190,30,50,60,130,"-","-","-","-",80,100,150,330]
[251,"Leeds North West",null,50,70,70,190,40,40,50,120,"-",10,"-",10,90,120,110,320,60,60,50,170,20,40,50,110,"-","-","-","-",80,100,100,280,60,60,50,160,30,40,40,100,"-","-","-","-",80,90,90,260,40,70,40,150,30,50,30,110,"-","-","-","-",70,120,80,270,50,60,50,160,30,50,50,130,"-","-","-","-",70,110,110,290]
[252,"Leeds West",null,130,120,140,390,60,80,80,220,"-","-","-","-",190,200,220,610,100,110,160,370,30,60,90,170,"-","-","-","-",120,170,250,540,100,110,130,340,30,60,100,180,"-","-","-","-",130,170,230,530,90,110,140,340,40,70,80,180,"-","-","-",10,130,180,220,530,90,120,180,390,40,70,80,200,"-","-","-","-",140,190,270,590]
[253,"Leicester East",null,60,60,150,270,40,20,30,90,"-","-","-","-",90,90,180,360,40,80,140,250,30,50,70,150,"-","-","-","-",70,130,200,400,60,90,120,270,20,50,90,160,"-","-","-","-",80,140,220,430,60,70,90,230,30,50,60,140,"-","-","-",10,90,120,160,370,70,90,130,290,20,30,90,140,"-","-",10,10,90,130,220,440]
[254,"Leicester South",null,50,70,130,250,20,40,40,100,"-","-","-","-",80,100,170,350,50,70,100,220,30,50,80,160,"-","-","-","-",80,120,180,380,50,90,100,240,20,30,60,110,"-","-","-","-",70,120,160,350,70,100,120,290,20,50,50,120,"-","-","-","-",90,150,170,410,80,130,120,320,30,60,60,160,"-","-",10,20,110,190,190,490]
[255,"Leicester West",null,80,90,150,330,40,30,50,120,"-","-","-","-",130,130,200,450,60,110,210,380,30,50,90,160,"-","-","-","-",90,150,300,540,70,80,170,320,20,60,110,190,"-","-","-",10,90,150,280,520,80,130,190,390,30,60,80,160,"-","-",10,10,100,180,270,560,90,90,170,350,30,70,90,190,"-","-",10,10,120,160,260,550]
[256,"Leigh",null,160,140,160,460,80,80,100,260,"-","-","-","-",240,220,260,720,120,140,190,440,50,90,140,280,"-","-","-",10,170,230,320,720,100,130,170,400,50,90,140,280,"-","-","-",10,150,220,320,690,130,140,150,420,50,100,110,250,"-","-",10,10,180,240,270,680,120,130,150,410,70,80,100,250,"-",10,10,20,200,220,260,680]
[257,"Lewes",null,60,70,110,240,30,30,30,90,"-","-","-","-",90,90,140,330,50,50,60,160,10,30,50,90,"-","-","-","-",60,80,110,250,50,60,50,160,20,50,50,110,"-","-","-","-",60,110,100,270,60,60,50,170,20,40,40,110,"-","-","-","-",80,100,90,270,50,60,70,180,20,40,40,100,"-","-","-","-",70,100,110,290]
[258,"Lewisham Deptford",null,60,60,80,200,20,20,30,70,"-","-","-","-",80,80,110,270,40,70,120,230,20,40,110,170,"-","-","-","-",60,110,230,400,30,60,90,180,10,30,70,120,"-","-","-","-",40,100,160,300,50,110,110,270,20,40,70,130,"-","-","-","-",70,160,180,400,30,90,120,250,20,40,70,130,"-",10,10,10,60,140,190,390]
[259,"Lewisham East",null,70,70,80,220,30,30,40,100,"-","-","-","-",100,100,120,320,70,70,80,220,20,40,80,140,"-","-","-","-",90,110,160,360,50,80,70,200,20,50,60,140,"-","-","-","-",70,130,130,340,70,90,90,240,40,50,60,140,"-","-","-","-",100,140,150,380,40,70,120,230,30,70,50,150,"-","-","-",10,80,140,170,390]
[260,"Lewisham West and Penge",null,60,90,60,200,20,30,60,110,"-","-","-","-",80,120,120,320,40,50,100,200,20,30,80,130,"-","-","-","-",60,90,180,330,30,60,70,160,20,50,80,150,"-","-","-","-",60,120,150,320,50,80,90,220,20,50,60,130,"-","-","-","-",70,130,150,350,40,60,90,190,30,40,60,140,"-","-","-","-",80,100,150,330]
[261,"Leyton and Wanstead",null,50,60,100,210,20,20,40,80,"-","-","-","-",70,80,140,290,30,60,100,190,20,20,60,100,"-","-","-","-",50,80,160,290,40,60,90,180,10,30,70,110,"-","-","-","-",50,90,150,290,40,70,120,220,20,40,60,120,"-","-","-","-",60,110,180,350,20,80,120,210,20,40,70,130,"-","-","-",10,40,120,190,340]
[262,"Lichfield",null,70,100,140,320,50,60,50,160,"-","-","-","-",130,160,190,480,60,90,130,290,30,60,60,150,"-",10,"-",10,100,160,200,450,70,90,100,260,20,60,80,170,"-","-","-",10,100,160,180,430,80,90,120,290,40,60,70,160,"-","-",10,10,120,160,190,470,90,80,100,270,60,70,80,200,"-","-",20,20,150,150,190,490]
[263,"Lincoln",null,150,140,120,420,50,70,100,220,"-","-","-","-",200,210,230,640,110,160,140,400,30,90,120,240,"-",10,"-",10,140,250,260,650,110,120,120,350,40,100,140,270,"-","-","-","-",150,220,260,630,120,120,110,350,40,100,90,220,"-","-",10,10,160,220,210,590,100,110,170,370,30,90,120,240,"-",10,10,10,130,200,290,630]
[264,"Liverpool Riverside",null,140,140,190,470,50,60,70,190,"-","-","-","-",190,210,270,660,70,110,180,350,30,60,120,200,"-","-","-",10,90,170,300,560,60,70,150,280,30,60,140,220,"-","-","-","-",90,120,290,500,80,90,150,310,20,40,100,170,"-","-",10,10,110,130,250,490,70,80,100,250,30,60,80,170,"-","-","-","-",100,140,180,420]
[265,"Liverpool Walton",null,210,180,260,650,70,80,120,270,"-","-","-","-",280,260,380,920,100,130,260,490,40,70,140,260,"-","-","-","-",140,200,410,750,110,140,230,480,50,90,150,280,"-","-",10,10,160,230,380,770,130,120,210,450,50,90,150,290,"-","-",10,10,170,210,360,750,130,110,150,390,40,70,130,230,"-","-",10,10,170,180,280,630]
[266,"Liverpool Wavertree",null,150,110,190,450,50,60,90,200,"-","-","-","-",190,170,280,640,90,110,190,390,40,60,100,210,"-","-","-","-",130,180,290,600,60,70,140,280,40,60,120,210,"-","-",10,10,100,130,270,510,70,80,150,310,40,60,100,190,"-","-",10,20,110,140,260,510,70,80,120,260,30,60,80,170,"-","-",10,10,90,140,210,450]
[267,"Liverpool West Derby",null,210,170,210,580,60,70,100,230,"-","-","-",10,270,240,300,810,100,130,220,450,60,60,150,270,"-","-","-",10,170,200,360,730,130,120,170,420,40,80,170,290,"-","-","-","-",160,200,350,710,130,110,190,430,50,100,130,280,"-","-",10,10,180,210,320,710,120,120,150,390,40,90,110,240,"-","-",10,10,170,210,270,650]
[268,"Loughborough",null,100,80,180,360,40,40,40,120,"-","-","-","-",140,130,220,480,60,60,100,220,30,50,50,130,"-","-","-","-",90,110,150,340,70,80,70,220,40,50,50,140,"-","-","-","-",100,140,130,370,80,80,110,270,50,60,50,150,"-","-","-",10,130,140,170,430,100,80,100,280,50,50,60,160,"-","-","-",10,140,130,160,440]
[269,"Louth and Horncastle",null,80,80,100,260,30,60,60,150,"-","-","-",10,110,140,160,420,70,80,80,230,40,60,90,190,"-","-","-","-",110,150,170,420,90,100,70,250,30,70,110,200,"-","-","-",10,120,170,180,460,90,110,90,290,30,80,60,170,"-","-","-",10,120,200,150,460,100,100,110,310,50,60,90,190,"-","-",10,10,150,150,200,500]
[270,"Ludlow",null,80,70,50,200,30,50,50,130,"-","-","-","-",120,120,100,330,60,80,80,220,20,40,60,130,"-","-","-","-",80,130,140,340,60,80,70,200,30,60,70,150,"-","-","-",10,90,140,130,360,80,70,80,240,30,70,50,150,"-","-",10,10,110,140,140,390,80,60,80,220,30,40,50,120,"-","-",10,10,110,110,140,350]
[271,"Luton North",null,70,70,110,250,40,40,40,120,"-","-","-","-",110,110,140,370,50,50,130,230,50,40,50,130,"-","-","-","-",90,90,180,370,50,60,100,220,20,40,70,130,"-","-","-","-",70,100,170,350,70,60,140,270,40,40,40,120,"-","-","-","-",110,110,180,390,70,80,160,310,40,50,40,130,"-",10,10,20,110,140,210,460]
[272,"Luton South",null,70,70,120,260,30,40,30,100,"-","-","-","-",100,110,150,360,60,60,140,270,30,60,70,150,"-","-","-","-",90,120,220,420,50,80,140,270,30,40,80,150,"-","-","-",10,80,120,220,430,60,80,210,350,40,50,30,120,"-","-",10,10,100,130,240,470,70,100,220,400,30,60,60,150,"-","-",10,10,110,160,290,550]
[273,"Macclesfield",null,80,70,50,200,30,50,60,140,"-",10,"-",10,110,120,110,340,70,70,110,250,20,60,70,150,"-","-",10,10,90,140,190,410,40,80,80,190,50,60,80,180,"-",10,10,10,90,140,160,390,80,70,60,210,40,60,40,150,"-","-","-","-",120,140,100,360,50,70,90,210,30,70,60,160,10,"-",10,10,90,150,150,390]
[274,"Maidenhead",null,40,60,60,160,30,40,30,90,"-","-","-",10,70,100,90,250,50,40,50,140,30,60,40,130,"-","-","-","-",80,100,90,270,50,60,60,160,40,40,50,120,"-","-","-","-",90,90,100,280,70,60,50,170,30,60,30,120,"-","-","-",10,100,120,80,300,50,60,50,160,30,40,40,110,"-","-","-",10,80,100,90,280]
[275,"Maidstone and The Weald",null,60,60,60,180,30,40,30,100,"-","-","-","-",90,100,90,280,60,60,110,230,20,50,60,130,"-","-","-","-",80,110,170,360,60,90,70,220,20,40,70,130,"-","-","-",10,80,140,140,360,60,90,90,250,20,50,50,120,"-","-",10,10,90,140,160,380,70,90,80,240,30,40,40,120,"-","-",10,10,100,130,140,370]
[276,"Makerfield",null,200,140,170,510,60,80,110,260,"-","-","-","-",270,220,280,770,150,120,180,440,70,90,170,320,"-","-","-","-",220,210,350,770,140,140,160,440,60,90,150,300,"-","-",10,10,200,230,320,750,150,130,140,410,80,110,100,290,"-","-",10,10,240,240,240,710,140,150,170,460,80,80,100,260,"-",10,10,20,220,240,280,730]
[277,"Maldon",null,130,80,50,260,40,40,40,120,"-","-","-","-",170,120,90,380,80,70,60,210,30,40,50,120,"-","-","-","-",110,110,110,320,120,80,50,240,40,80,60,170,"-","-","-","-",150,150,110,410,90,60,40,190,40,60,30,120,"-","-",10,10,120,120,70,310,110,70,60,240,50,60,40,150,"-",10,10,10,160,130,110,400]
[278,"Manchester Central",null,160,140,150,460,30,50,80,160,"-","-","-",10,200,190,240,620,60,120,180,360,30,50,100,180,"-","-","-","-",90,180,270,540,80,120,150,340,30,70,120,220,"-","-","-","-",100,180,270,560,70,120,160,350,30,60,110,190,"-","-","-",10,90,180,270,550,90,100,210,390,40,70,130,230,"-","-",10,10,130,170,340,640]
[279,"Manchester Gorton",null,120,120,100,340,20,50,50,110,"-","-","-","-",150,160,150,460,40,70,140,250,20,30,80,140,"-","-","-","-",60,110,220,390,60,90,130,280,20,60,90,160,"-","-","-","-",80,140,220,440,70,80,100,240,20,40,80,140,"-","-",10,10,90,120,190,400,50,90,150,280,30,40,70,140,"-","-",10,10,80,130,230,430]
[280,"Manchester Withington",null,70,70,60,200,20,40,60,120,"-","-","-","-",90,110,120,320,40,40,80,160,10,40,50,110,"-","-","-","-",50,80,140,270,30,60,70,150,10,40,80,120,"-","-","-","-",40,100,140,280,50,50,70,180,30,40,60,130,"-","-",10,10,80,90,140,310,40,50,100,190,30,40,60,120,"-","-",10,10,70,90,160,320]
[281,"Mansfield",null,130,180,210,520,30,90,110,230,"-",10,"-",10,160,280,320,760,120,150,220,500,40,100,110,240,"-","-","-","-",160,250,330,740,140,160,180,480,30,100,130,270,"-","-","-",10,170,260,320,750,120,160,170,450,50,100,80,230,"-","-",10,20,170,260,260,700,140,150,240,530,50,100,120,270,"-","-",20,20,190,260,370,820]
[282,"Meon Valley",null,90,130,110,330,20,40,40,110,"-","-","-","-",110,180,150,440,80,100,70,250,40,110,70,220,"-","-","-","-",120,210,140,480,90,80,40,210,50,120,80,250,"-","-","-","-",140,190,130,460,80,110,50,240,60,120,50,230,"-","-","-",10,130,230,110,470,80,110,70,260,60,130,50,240,"-","-",10,20,140,250,130,520]
[283,"Meriden",null,90,90,120,310,50,70,60,170,"-","-","-","-",140,160,180,480,100,110,200,410,40,50,70,150,"-","-",10,10,140,170,270,570,100,170,190,460,40,80,100,220,"-","-",10,10,140,250,290,680,100,140,130,370,60,70,80,200,"-",10,10,20,150,210,210,580,110,170,240,520,50,80,90,210,"-","-",30,30,160,250,350,760]
[284,"Mid Bedfordshire",null,60,80,70,210,70,50,30,150,"-","-","-","-",130,130,100,360,60,60,60,180,50,50,60,160,"-","-","-","-",110,120,120,340,70,70,80,220,40,60,60,160,"-","-","-",10,110,140,140,380,70,50,80,200,60,80,50,200,"-",10,"-",10,130,140,140,400,80,50,70,190,80,90,50,220,"-","-",10,10,150,140,130,420]
[285,"Mid Derbyshire",null,120,100,110,330,90,60,50,200,"-",10,"-",10,210,170,160,540,130,80,120,330,60,70,80,200,"-","-","-",10,190,160,190,540,110,70,70,250,60,70,70,200,10,10,10,20,170,150,140,460,160,90,70,310,70,80,50,200,"-","-","-",10,230,170,120,510,130,90,90,310,90,70,60,220,10,10,20,30,230,160,170,560]
[286,"Mid Dorset and North Poole",null,80,60,50,200,20,50,50,120,"-","-","-","-",100,120,100,310,80,70,80,220,40,50,40,130,"-","-","-","-",110,110,120,350,100,60,60,230,40,60,70,160,"-",10,"-",10,140,130,130,390,110,70,50,230,40,70,30,150,"-","-","-","-",160,150,80,380,110,70,70,250,50,70,30,150,"-","-",10,10,160,140,100,400]
[287,"Mid Norfolk",null,120,100,100,320,40,50,50,140,"-","-","-","-",150,160,160,460,90,90,90,270,20,50,90,160,"-",10,"-",10,110,150,170,430,90,80,60,240,40,60,90,190,"-","-","-","-",130,150,160,430,100,100,120,320,40,70,60,160,"-",10,"-",10,140,170,180,490,120,100,120,330,40,60,80,170,"-",10,30,40,150,160,220,540]
[288,"Mid Sussex",null,60,60,50,170,20,50,30,100,"-","-","-","-",80,110,80,270,50,70,50,170,30,50,60,140,"-","-","-","-",80,120,110,310,40,60,50,150,30,40,40,120,"-","-","-","-",70,100,90,260,70,60,50,180,30,50,30,110,"-","-",10,10,100,120,80,300,80,50,70,200,40,60,50,150,"-","-",10,10,120,120,130,360]
[289,"Mid Worcestershire",null,80,90,110,280,30,50,50,130,"-","-","-","-",110,140,160,410,60,90,110,260,20,60,70,150,"-","-","-","-",80,140,190,410,70,100,100,280,30,50,90,170,"-",10,10,10,100,160,200,460,80,90,120,290,50,70,70,190,"-","-","-",10,130,160,190,480,80,90,90,260,40,70,90,200,"-","-",10,10,120,160,190,470]
[290,"Middlesbrough",null,160,150,150,470,60,50,50,160,"-","-","-","-",230,200,200,630,120,100,160,380,60,60,100,220,"-","-","-","-",180,160,260,600,110,120,170,400,70,60,70,210,"-","-","-","-",180,180,240,600,120,130,180,430,70,80,90,240,"-","-",10,10,190,210,280,680,100,140,220,450,60,80,100,240,"-","-",10,10,160,220,320,700]
[291,"Middlesbrough South and East Cleveland",null,200,140,140,480,100,90,70,260,"-","-","-","-",290,230,220,740,110,120,160,380,90,80,100,270,"-","-","-","-",200,200,260,650,120,130,120,380,70,70,80,220,"-","-","-","-",190,200,210,600,120,120,130,370,80,80,90,250,"-","-",10,10,200,200,220,630,150,100,130,390,70,90,100,260,"-","-",20,20,220,190,250,660]
[292,"Milton Keynes North",null,150,140,160,450,50,70,80,200,"-","-","-","-",200,210,240,650,60,110,150,310,30,70,80,180,"-","-","-",10,90,180,230,490,90,90,120,300,40,60,100,200,"-",10,"-",10,130,160,220,500,60,100,160,320,50,80,70,200,"-","-","-",10,110,180,230,520,60,80,130,270,40,60,70,170,"-","-",10,10,100,150,200,450]
[293,"Milton Keynes South",null,130,110,180,410,30,70,80,180,"-","-","-",10,160,180,250,590,60,100,130,290,30,50,70,150,"-","-","-","-",90,150,200,440,70,90,120,280,40,70,100,210,"-","-","-","-",120,160,220,490,80,90,160,330,50,70,70,190,"-","-","-",10,120,160,240,520,80,70,130,280,50,70,80,200,"-","-",10,10,130,140,220,490]
[294,"Mitcham and Morden",null,100,70,90,270,30,40,60,130,"-","-","-","-",120,120,160,400,50,50,100,200,20,50,70,130,"-","-","-","-",70,100,170,340,30,70,70,170,30,50,70,150,"-","-","-","-",60,120,150,320,60,60,100,210,20,50,40,120,"-","-","-","-",80,110,140,330,40,60,80,170,30,50,70,150,"-",10,"-",10,70,120,150,330]
[295,"Mole Valley",null,30,40,40,110,10,20,20,50,"-","-","-","-",40,60,60,150,30,50,40,120,20,20,30,70,"-","-","-","-",50,70,70,190,50,40,30,120,10,40,40,80,"-","-","-","-",60,70,70,200,40,50,40,120,20,30,20,70,"-","-","-","-",50,80,60,200,40,30,40,110,20,40,20,80,"-","-",10,10,60,70,60,190]
[296,"Morecambe and Lunesdale",null,80,110,80,280,40,50,80,170,"-","-","-","-",120,170,160,450,80,90,140,310,30,60,130,230,"-","-","-","-",120,150,270,540,80,120,110,320,50,90,140,270,"-","-","-","-",130,210,250,590,100,110,120,330,40,90,110,240,"-","-",10,10,140,200,240,580,90,100,90,290,50,80,70,200,"-","-",10,10,150,180,170,490]
[297,"Morley and Outwood",null,120,110,140,370,50,80,100,230,"-","-","-","-",180,200,230,610,90,90,130,320,40,50,80,160,"-","-","-","-",130,140,210,480,110,100,110,320,50,90,90,230,"-",10,10,10,160,190,210,560,110,80,100,300,70,60,90,210,"-","-",10,10,180,150,200,520,130,90,120,340,70,100,80,250,"-",10,10,20,200,190,220,610]
[298,"New Forest East",null,90,90,100,290,50,80,80,210,"-",10,"-",10,140,180,180,500,90,100,100,280,50,70,110,230,"-","-","-","-",130,160,220,510,90,100,90,270,50,80,80,210,"-","-","-","-",140,180,160,480,100,80,110,280,60,90,60,210,"-","-",10,10,150,180,180,500,110,100,70,280,60,80,80,210,"-","-",10,20,160,190,160,510]
[299,"New Forest West",null,70,80,90,240,20,60,60,140,"-","-","-","-",90,130,150,380,30,60,100,190,20,40,90,150,"-","-","-","-",50,110,180,340,50,80,70,210,30,50,70,150,"-","-","-","-",80,140,140,350,70,70,60,200,30,70,50,150,"-","-","-",10,100,150,120,360,60,70,80,210,30,80,50,150,"-","-",10,10,90,150,140,380]
[300,"Newark",null,100,100,90,290,40,60,50,150,"-","-","-","-",140,160,140,440,80,110,110,290,30,50,90,170,"-","-","-","-",110,160,200,470,90,100,90,280,40,40,80,170,"-","-","-","-",140,140,170,450,90,100,130,320,30,60,80,170,"-","-",10,20,120,170,220,510,90,110,110,310,60,60,90,200,"-","-",10,10,150,180,200,530]
[301,"Newbury",null,110,90,90,290,50,70,50,170,"-","-","-","-",160,160,140,460,90,60,60,220,40,70,80,190,"-","-","-",10,130,130,150,410,100,90,90,290,40,60,70,160,"-",10,"-",10,140,160,160,450,120,90,80,290,30,80,30,140,"-",10,"-",10,150,180,110,440,100,80,80,250,50,70,50,180,"-","-",10,10,150,160,140,440]
[302,"Newcastle under Lyme",null,140,130,140,400,50,70,90,210,"-",10,"-",10,190,210,220,620,90,120,120,320,30,50,100,180,"-","-",10,10,120,170,230,510,90,100,100,290,50,70,110,240,"-","-","-",10,150,180,220,540,120,100,150,370,50,70,130,240,"-",10,10,20,160,180,290,630,110,90,150,350,50,80,100,230,"-","-",10,10,160,170,260,590]
[303,"Newcastle upon Tyne Central",null,120,70,120,310,50,40,80,180,"-","-","-","-",170,110,210,490,70,90,160,320,30,40,100,170,"-","-","-","-",100,130,260,490,70,80,130,280,30,40,80,150,"-","-","-","-",100,130,210,430,80,80,160,330,30,50,70,150,"-","-","-",10,110,140,230,480,80,90,140,310,20,50,70,140,"-","-",10,10,110,150,210,460]
[304,"Newcastle upon Tyne East",null,130,100,130,360,30,40,50,130,"-","-","-","-",170,140,180,490,50,70,140,270,40,50,90,180,"-","-","-","-",90,120,240,450,70,90,120,270,30,40,80,140,"-","-","-","-",90,130,200,420,110,80,130,320,30,60,60,150,"-","-",10,10,130,140,200,470,90,80,130,300,40,50,70,150,"-","-",10,10,130,130,200,460]
[305,"Newcastle upon Tyne North",null,130,90,140,360,60,40,90,200,"-","-","-","-",190,140,230,560,90,90,200,370,60,50,130,230,"-","-","-","-",140,130,330,610,90,90,130,300,40,50,100,180,"-","-","-",10,120,140,230,490,110,110,170,400,50,80,80,210,"-","-",10,10,160,190,260,610,110,100,160,360,60,70,70,190,"-","-",10,10,170,160,240,570]
[306,"Newton Abbot",null,100,120,130,340,30,80,80,190,"-","-","-",10,130,210,210,540,90,110,110,300,30,80,90,200,"-","-","-","-",120,190,200,500,100,100,110,300,30,100,100,230,"-","-","-",10,130,200,210,540,110,100,140,340,40,80,70,180,"-","-",10,10,140,170,210,530,100,110,110,310,30,80,100,210,"-","-",10,10,120,200,210,530]
[307,"Normanton Pontefract and Castleford",null,120,150,220,490,50,80,100,230,"-","-","-",10,170,230,320,720,90,140,260,490,70,60,120,250,"-","-","-","-",160,200,380,740,100,110,180,390,60,80,110,250,"-","-","-","-",160,190,300,650,120,150,210,480,50,90,120,260,"-","-",10,10,170,250,330,750,120,120,160,410,60,110,100,270,"-",10,10,10,180,240,270,690]
[308,"North Cornwall",null,100,140,130,370,20,80,60,160,"-",10,"-",10,120,220,190,540,80,90,140,320,20,60,120,190,"-","-","-",10,100,160,260,520,100,120,80,290,20,80,120,210,"-","-",10,10,120,190,210,520,90,100,120,310,30,80,80,180,"-","-","-",10,110,180,200,490,110,110,100,330,30,70,100,200,"-","-",10,10,140,180,210,530]
[309,"North Devon",null,90,100,90,280,40,60,40,140,"-","-","-","-",130,160,130,420,70,70,100,240,30,30,40,110,"-","-","-","-",100,100,140,340,100,80,70,250,30,50,80,150,"-","-","-","-",130,130,140,400,80,90,110,280,40,70,60,160,"-","-","-",10,120,150,170,440,90,90,80,250,40,60,60,170,"-","-","-",10,130,150,150,420]
[310,"North Dorset",null,120,130,110,360,60,300,110,480,"-","-","-","-",180,430,220,840,100,90,110,300,170,320,130,620,"-","-","-","-",270,410,240,920,110,140,80,320,80,370,210,660,"-","-","-","-",190,510,280,980,120,130,90,330,80,340,160,580,"-","-",10,10,200,460,250,920,140,130,90,360,70,320,170,560,"-","-",10,10,210,450,270,920]
[311,"North Durham",null,220,130,180,520,70,70,100,240,"-","-","-","-",290,200,290,770,90,110,260,450,60,70,190,320,"-","-","-",10,140,180,450,780,120,120,150,390,60,110,120,290,"-","-",10,10,180,240,280,700,80,120,200,400,50,80,110,250,"-","-",10,20,140,200,330,660,100,150,250,490,50,90,100,250,"-",10,20,20,160,240,370,760]
[312,"North East Bedfordshire",null,80,50,60,180,50,60,40,150,"-","-","-","-",130,110,100,330,60,80,70,210,30,50,70,140,"-","-","-",10,90,130,140,360,70,80,80,220,30,60,60,150,"-","-","-",10,100,140,140,380,90,90,120,290,50,60,50,150,"-","-","-","-",140,150,160,450,80,70,80,220,50,80,70,190,"-",10,10,20,130,150,150,430]
[313,"North East Cambridgeshire",null,90,100,90,280,30,50,80,160,"-","-","-","-",120,160,170,450,80,100,140,320,30,60,100,190,"-","-","-","-",110,160,240,510,100,120,110,320,20,60,100,180,"-","-","-",10,120,180,210,510,80,100,100,280,50,80,80,200,"-","-",10,10,130,170,190,490,110,90,110,300,60,80,80,220,"-","-",10,10,170,160,200,530]
[314,"North East Derbyshire",null,150,110,130,380,60,70,70,200,"-","-","-","-",210,180,190,580,110,120,160,390,50,70,90,200,"-","-","-","-",170,190,240,590,130,120,110,360,70,70,110,250,"-","-","-","-",210,190,210,610,130,130,90,360,70,100,60,220,"-","-","-","-",200,230,150,580,150,100,120,380,80,100,90,270,"-","-",10,20,230,200,230,660]
[315,"North East Hampshire",null,60,90,50,200,40,40,50,130,"-","-","-","-",100,120,100,320,60,60,70,180,20,40,70,130,"-","-","-","-",80,90,130,310,60,70,40,180,40,50,60,150,"-","-","-","-",100,120,100,330,80,40,50,170,30,50,40,120,"-",10,"-",10,110,100,90,290,50,60,60,170,50,60,30,140,"-","-","-",10,100,130,90,320]
[316,"North East Hertfordshire",null,60,70,110,230,40,50,30,120,"-","-","-","-",100,110,140,350,70,50,70,190,20,40,20,80,"-","-","-","-",80,90,90,270,60,70,70,200,30,40,60,120,"-","-","-","-",90,110,120,320,70,90,60,210,30,40,30,100,"-","-",10,10,100,120,90,320,70,70,50,190,20,50,30,110,"-","-","-",10,90,130,90,310]
[317,"North East Somerset",null,90,60,40,190,30,40,30,100,"-","-","-","-",120,110,80,300,90,60,90,240,40,60,50,140,"-","-","-","-",130,110,140,380,60,60,80,200,50,60,40,150,"-","-","-","-",110,120,120,350,80,70,70,220,40,60,40,130,"-","-","-","-",120,120,110,350,80,50,60,190,40,50,40,140,"-","-","-",10,110,110,110,330]
[318,"North Herefordshire",null,90,90,70,260,40,40,50,130,"-","-","-","-",140,140,120,390,70,90,100,250,40,70,80,190,"-","-","-","-",100,160,180,450,80,80,80,250,40,70,70,180,"-","-",10,10,130,150,160,440,110,100,100,310,40,70,60,170,"-","-","-",10,140,170,170,480,70,70,70,210,50,80,70,200,"-",10,10,20,120,150,150,420]
[319,"North Norfolk",null,70,100,60,230,30,50,20,100,"-","-","-","-",100,150,80,330,80,80,70,230,20,50,60,120,"-","-","-","-",100,130,120,350,80,100,70,250,20,60,50,130,"-",10,"-",10,100,160,120,390,80,80,60,220,20,50,50,120,"-","-","-","-",100,130,110,340,70,100,70,240,30,60,60,140,"-","-",10,10,100,150,140,400]
[320,"North Shropshire",null,110,200,150,460,30,70,100,200,"-","-","-","-",140,270,250,660,110,160,130,400,30,70,140,240,"-","-","-","-",140,230,270,640,90,130,100,320,30,70,140,240,"-","-","-","-",120,200,240,570,100,160,120,380,50,90,110,240,"-","-","-",10,150,250,230,630,110,140,120,360,40,80,100,220,"-","-",10,10,150,220,230,590]
[321,"North Somerset",null,110,100,90,290,50,60,70,180,"-","-","-","-",160,150,160,470,80,70,90,240,50,50,60,170,"-","-","-","-",130,130,150,410,100,80,70,250,50,70,60,170,"-","-","-",10,140,140,140,430,80,80,90,250,40,70,40,150,"-","-","-",10,120,150,130,400,80,90,70,240,50,50,40,150,"-","-","-",10,140,140,120,390]
[322,"North Swindon",null,100,120,150,370,40,60,70,170,"-","-","-","-",140,180,220,540,70,90,130,280,50,70,100,210,"-","-","-","-",120,160,230,500,90,100,80,260,30,60,110,200,"-","-",10,10,120,160,190,470,120,100,100,310,40,90,70,190,"-","-","-","-",160,180,170,510,80,80,120,280,60,60,80,200,"-","-","-",10,140,150,200,490]
[323,"North Thanet",null,100,170,130,400,20,40,60,120,"-","-","-","-",110,210,190,510,70,90,110,270,20,70,100,190,"-","-","-","-",90,160,210,460,90,130,100,320,30,70,80,180,"-","-",10,10,130,200,180,510,80,180,100,370,20,60,70,150,"-","-",10,10,100,250,180,530,70,140,140,350,30,50,90,170,"-","-",20,20,90,190,250,530]
[324,"North Tyneside",null,340,150,260,740,80,60,100,240,"-","-","-","-",420,210,360,990,130,130,250,500,60,80,180,320,"-","-","-","-",190,210,430,820,110,140,220,470,70,110,130,310,"-","-","-",10,180,260,350,790,140,130,200,470,60,60,110,240,"-","-",10,10,200,190,330,720,140,110,260,500,70,80,110,260,"-","-",10,10,210,180,380,770]
[325,"North Warwickshire",null,110,90,110,310,50,40,60,150,"-","-","-","-",160,140,170,460,60,100,130,300,40,60,90,190,"-","-","-","-",100,170,220,490,90,120,140,340,40,50,100,190,"-","-","-",10,130,170,240,540,130,90,120,330,40,60,60,160,"-",10,10,20,170,150,180,500,110,120,150,370,50,60,60,180,"-","-",20,30,170,180,230,580]
[326,"North West Cambridgeshire",null,120,120,120,370,40,60,80,170,"-","-","-","-",160,180,200,540,110,90,150,350,30,70,120,220,"-","-","-","-",140,170,270,570,100,110,130,330,40,90,130,250,"-","-","-",10,140,200,260,590,120,130,130,380,50,80,100,230,"-","-",10,10,170,210,240,620,90,100,150,340,60,70,90,220,"-","-",10,10,150,170,250,570]
[327,"North West Durham",null,120,90,180,390,50,70,110,220,"-","-","-","-",170,160,290,610,70,120,280,480,70,80,180,320,"-","-","-","-",140,200,460,800,100,110,160,370,70,110,160,340,"-","-",10,10,170,220,330,710,90,100,170,370,50,100,110,250,"-","-",30,30,140,200,300,640,120,120,270,510,60,100,140,290,"-","-",20,20,180,230,420,830]
[328,"North West Hampshire",null,90,190,190,470,30,30,40,100,"-","-","-","-",120,220,230,570,90,130,110,320,30,40,70,140,"-","-","-","-",110,170,180,460,70,160,130,360,30,50,50,130,"-",10,"-",10,110,210,180,500,90,180,230,500,50,110,70,230,"-","-","-","-",130,290,300,730,90,180,380,650,50,90,50,190,"-","-",10,10,150,260,440,850]
[329,"North West Leicestershire",null,120,90,200,400,50,60,40,150,"-","-","-","-",170,150,240,560,80,80,110,280,40,60,80,170,"-","-","-","-",120,140,190,450,120,110,120,350,40,60,80,180,"-","-","-","-",160,180,200,540,100,120,110,330,50,90,60,200,"-","-",10,10,150,210,180,530,130,110,120,360,60,80,50,190,"-","-",10,10,180,190,190,560]
[330,"North West Norfolk",null,80,100,130,320,40,60,70,170,"-","-","-","-",120,170,200,490,80,100,120,310,20,50,70,140,"-","-","-","-",110,150,200,450,80,70,90,240,30,60,80,160,"-","-","-","-",100,130,170,400,100,70,90,260,30,60,70,150,"-","-","-",10,120,140,160,420,110,60,70,240,40,60,40,140,"-",10,10,20,150,130,120,390]
[331,"North Wiltshire",null,70,60,70,200,20,40,40,100,"-","-","-","-",90,100,110,300,50,50,60,160,30,40,40,110,"-","-","-","-",80,90,100,280,60,60,50,170,40,40,50,130,"-","-","-","-",90,110,100,300,70,80,60,200,20,50,30,100,"-","-","-",10,90,130,90,310,60,60,70,190,30,160,110,300,"-","-","-",10,90,220,180,500]
[332,"Northampton North",null,100,100,180,370,30,50,50,130,"-","-","-","-",120,150,230,500,70,100,200,380,40,60,60,150,"-","-","-","-",110,160,260,530,60,90,170,310,20,60,100,180,"-","-","-",10,80,140,270,500,70,80,180,320,20,50,50,130,"-","-","-",10,100,130,230,460,60,80,180,330,30,60,50,140,"-","-","-",10,90,140,240,480]
[333,"Northampton South",null,90,100,180,380,30,60,70,160,"-","-","-","-",120,170,250,540,70,120,270,450,20,50,70,140,"-","-","-","-",90,170,330,590,70,120,240,430,20,60,120,210,"-","-",10,10,100,180,360,640,90,100,220,410,30,80,60,160,"-","-",10,10,110,180,290,580,80,100,220,400,40,60,70,160,"-","-","-",10,120,160,290,560]
[334,"Norwich North",null,90,100,90,290,40,50,40,140,"-","-","-","-",130,160,140,420,80,80,290,450,30,40,90,150,"-","-","-","-",100,120,390,610,100,70,70,240,30,50,60,140,"-","-","-","-",130,120,140,390,110,100,110,310,30,50,60,140,"-","-","-","-",130,150,170,460,90,100,90,280,20,60,70,150,"-","-",10,10,110,160,170,440]
[335,"Norwich South",null,50,100,60,210,10,40,50,100,"-","-","-","-",60,140,120,320,50,70,190,310,20,30,70,120,"-","-","-","-",70,100,270,430,40,70,80,200,20,40,60,110,"-","-","-",10,60,110,150,310,70,80,70,220,20,40,50,110,"-","-",10,10,80,130,130,340,40,50,70,170,20,40,60,110,"-","-",10,10,60,90,140,290]
[336,"Nottingham East",null,60,100,140,300,20,40,50,110,"-","-","-","-",80,130,190,410,50,70,110,240,20,40,60,120,"-","-","-","-",70,120,180,360,40,100,100,250,20,50,110,180,"-","-","-","-",70,160,210,440,40,110,110,250,20,50,60,130,"-","-","-",10,60,160,170,390,70,110,140,320,20,50,60,130,"-","-",10,20,90,160,220,470]
[337,"Nottingham North",null,150,150,210,510,50,60,40,150,"-","-","-","-",200,220,250,660,120,130,220,470,40,50,80,170,"-","-","-","-",160,180,300,640,170,140,160,460,50,70,100,220,"-","-","-","-",220,200,260,680,130,150,150,440,50,90,80,220,"-","-",10,10,190,240,240,670,130,180,180,490,40,90,100,240,"-","-",20,20,170,270,300,750]
[338,"Nottingham South",null,90,100,140,330,20,40,40,100,"-","-","-","-",110,140,190,440,60,80,110,250,40,30,40,110,"-","-","-","-",90,110,160,360,80,90,80,250,30,40,60,140,"-","-","-",10,110,130,150,390,70,90,110,270,40,60,50,150,"-","-","-","-",110,160,160,420,70,110,100,270,40,50,60,140,"-","-",10,10,110,160,160,420]
[339,"Nuneaton",null,80,100,120,300,60,60,60,170,"-","-","-",10,140,160,180,480,90,90,150,330,50,70,100,220,"-","-","-","-",140,160,250,550,100,120,150,360,50,60,80,190,"-",10,10,20,150,180,230,560,130,90,130,350,40,90,80,210,"-",10,10,20,170,190,220,580,110,110,150,370,50,70,70,190,"-","-",10,20,160,190,230,570]
[340,"Old Bexley and Sidcup",null,120,60,50,240,60,60,30,160,"-","-","-","-",190,130,80,400,70,70,70,210,50,50,40,130,"-","-","-","-",120,110,110,340,100,70,30,200,50,50,60,150,"-","-","-","-",140,120,90,350,80,70,40,180,60,50,30,140,"-","-","-",10,140,120,70,330,80,60,50,190,50,60,40,150,"-",10,10,10,140,130,90,350]
[341,"Oldham East and Saddleworth",null,140,120,130,390,50,80,70,200,"-","-","-","-",190,200,200,590,100,100,160,350,40,70,120,230,"-","-","-","-",140,170,280,580,100,130,130,360,40,90,120,250,"-","-","-","-",130,220,250,610,90,130,110,320,50,80,90,220,"-","-",10,20,140,210,210,560,100,140,120,370,50,100,100,240,"-","-",10,10,150,240,230,620]
[342,"Oldham West and Royton",null,160,110,160,430,50,100,70,210,"-","-","-","-",210,210,230,650,100,120,180,400,40,80,120,230,"-","-","-","-",130,200,300,630,90,120,160,370,30,70,130,230,"-","-","-",10,120,190,290,610,100,170,150,420,40,70,70,180,"-","-",10,20,140,240,230,610,120,190,230,540,40,100,90,230,"-","-",10,10,160,290,330,780]
[343,"Orpington",null,80,50,40,170,30,40,30,100,"-","-","-","-",100,100,80,280,50,60,40,150,30,30,40,100,"-","-","-","-",80,90,90,260,60,60,40,160,40,50,40,130,"-","-","-","-",100,110,80,290,90,60,40,180,50,40,30,120,"-","-","-","-",130,100,70,300,70,40,50,160,40,50,20,100,"-",10,"-",10,110,90,80,270]
[344,"Oxford East",null,50,80,120,240,30,30,40,100,"-","-","-","-",80,110,160,340,40,50,110,210,30,50,60,140,"-","-","-","-",70,100,170,340,60,70,80,210,50,40,50,140,"-","-","-","-",100,110,140,350,40,50,110,200,30,30,30,90,"-","-","-","-",70,80,140,280,50,60,150,250,20,50,60,130,"-","-",10,10,70,110,210,380]
[345,"Oxford West and Abingdon",null,60,70,70,200,40,50,40,130,"-","-","-","-",100,110,110,320,60,70,70,200,30,50,50,140,"-","-","-","-",100,120,120,330,80,60,50,180,50,40,60,150,"-","-","-","-",120,110,110,340,50,50,50,150,60,50,40,150,"-","-","-","-",110,100,90,300,70,50,70,190,50,60,40,150,"-","-",10,10,120,110,120,350]
[346,"Pendle",null,100,100,70,270,50,40,60,160,"-","-","-","-",150,150,130,430,110,100,140,340,60,70,120,240,"-","-","-","-",160,170,250,580,90,140,120,350,60,80,120,260,"-","-","-","-",150,220,240,610,110,80,90,280,50,80,100,230,"-","-","-",10,160,160,200,520,100,90,90,270,60,80,70,220,"-","-",10,10,160,170,170,500]
[347,"Penistone and Stocksbridge",null,150,110,100,360,80,80,80,250,"-",10,"-",10,230,200,190,610,110,70,90,270,50,60,90,200,"-","-","-","-",160,140,180,480,160,100,90,350,60,80,90,220,"-","-","-","-",220,180,180,580,180,70,80,330,70,80,70,220,"-","-",10,10,250,150,160,560,130,100,90,320,70,100,80,260,"-",10,10,20,210,210,180,600]
[348,"Penrith and The Border",null,120,110,80,320,50,70,40,160,"-","-","-","-",170,180,130,480,120,90,90,300,30,50,60,150,"-",10,"-",10,150,150,160,450,120,90,70,280,50,70,70,180,"-","-","-","-",160,160,140,460,130,80,100,310,50,60,50,160,"-","-","-","-",180,140,150,470,170,80,60,310,50,90,40,180,"-","-",10,10,220,170,100,490]
[349,"Peterborough",null,90,110,120,320,20,70,50,130,"-","-","-","-",110,180,170,450,70,70,140,290,20,60,100,180,"-","-","-",10,100,130,240,470,70,80,110,260,30,50,100,180,"-","-","-",10,100,140,210,450,80,90,140,310,40,60,80,180,"-","-","-","-",120,160,220,490,60,90,170,320,50,50,80,180,"-","-",10,10,110,140,250,510]
[350,"Plymouth Moor View",null,190,120,160,470,60,90,100,250,"-",10,"-",10,250,220,270,730,180,140,270,590,60,100,120,280,"-","-","-","-",240,240,380,870,160,140,160,460,50,100,130,280,"-",10,"-",10,200,250,290,740,210,140,210,570,70,110,80,260,"-","-","-",10,280,250,300,830,210,160,200,560,60,100,100,260,"-","-",10,10,260,260,310,830]
[351,"Plymouth Sutton and Devonport",null,150,170,200,510,40,80,110,230,"-","-","-","-",190,250,310,750,100,170,230,500,50,90,120,260,"-","-","-","-",150,260,360,770,140,170,150,460,30,100,130,260,"-","-","-",10,170,260,290,720,170,180,190,540,40,100,80,230,"-","-",10,10,220,280,280,770,160,160,190,520,50,110,120,280,"-","-",10,10,210,270,320,810]
[352,"Poole",null,80,80,80,240,30,60,40,130,"-","-","-","-",100,140,130,370,60,90,110,260,30,60,80,160,"-","-","-","-",90,150,190,430,80,90,90,260,40,60,100,200,"-","-","-","-",120,150,200,470,80,100,90,270,40,70,70,170,"-","-","-","-",120,170,160,440,100,90,90,270,30,60,50,140,"-","-",10,10,130,150,140,410]
[353,"Poplar and Limehouse",null,130,100,130,350,30,60,70,160,"-","-","-","-",160,150,200,510,60,50,80,180,20,40,50,110,"-","-","-","-",80,90,130,300,60,90,90,240,30,60,60,150,"-","-","-","-",90,150,150,390,70,140,100,310,50,60,50,160,"-","-","-","-",130,200,150,480,100,120,100,330,20,60,50,120,"-","-","-","-",120,180,150,450]
[354,"Portsmouth North",null,110,130,140,380,50,60,50,160,"-","-","-","-",160,190,190,550,80,120,150,350,40,70,80,190,"-","-","-","-",120,190,230,540,100,120,140,370,50,70,90,210,"-","-","-","-",150,200,230,580,120,120,100,340,70,90,70,230,"-","-","-","-",190,220,180,580,170,110,110,390,60,80,90,240,"-","-",10,10,230,200,210,640]
[355,"Portsmouth South",null,50,100,130,290,20,40,60,110,"-","-","-","-",70,140,190,400,50,80,110,240,10,40,90,140,"-","-","-","-",60,120,200,380,60,90,110,260,30,70,90,180,"-","-","-","-",80,160,200,450,70,90,100,250,30,60,40,130,"-","-","-","-",100,140,140,380,60,100,110,270,30,80,90,190,"-","-",10,10,100,170,200,470]
[356,"Preston",null,120,100,150,370,40,60,80,180,"-","-","-","-",160,170,230,560,100,100,160,360,30,60,140,230,"-","-","-",10,130,170,300,600,70,110,160,340,30,70,130,230,"-","-","-","-",100,180,290,570,100,130,160,380,30,70,80,180,"-","-",10,10,130,200,250,570,100,120,170,380,50,80,90,210,"-","-",20,20,150,200,270,610]
[357,"Pudsey",null,100,100,90,290,50,70,70,180,"-",10,"-",10,150,170,160,480,70,80,90,230,30,50,80,170,"-","-","-","-",100,130,160,400,100,80,70,240,50,60,80,180,"-",10,"-",10,150,140,140,430,110,80,80,270,50,60,80,190,"-","-","-",10,160,150,160,470,120,80,100,300,50,70,70,180,"-","-",10,10,170,150,170,490]
[358,"Putney",null,20,20,40,90,"-",20,20,40,"-","-","-","-",30,40,60,120,10,20,50,80,10,10,30,50,"-","-","-","-",20,30,80,130,10,30,30,70,10,20,30,60,"-","-","-","-",20,50,60,130,20,20,30,70,10,30,20,60,"-","-","-","-",20,50,50,130,20,20,40,70,10,10,30,50,"-","-","-","-",20,30,70,120]
[359,"Rayleigh and Wickford",null,170,90,40,310,50,40,40,130,"-","-","-","-",220,140,80,440,100,80,60,230,30,40,50,130,"-","-","-","-",130,120,110,360,130,80,50,250,50,60,70,190,"-","-",10,10,180,140,130,440,120,90,50,260,60,60,40,160,"-","-","-",10,170,150,90,420,130,80,60,280,60,90,50,190,"-","-","-",10,190,170,120,480]
[360,"Reading East",null,70,80,80,220,40,40,40,110,"-","-","-","-",100,120,120,340,80,60,60,200,40,50,60,150,"-","-","-",10,120,110,130,360,50,80,90,220,70,60,50,180,"-","-","-","-",130,140,140,400,50,70,100,220,50,50,40,140,"-","-","-","-",100,120,140,360,60,60,90,210,50,50,70,170,"-",10,"-",10,110,120,160,390]
[361,"Reading West",null,120,90,130,340,50,60,50,160,"-","-","-","-",170,150,180,500,110,80,120,300,50,70,90,210,"-","-","-","-",160,150,210,520,90,100,90,290,60,80,70,220,"-","-","-",10,160,180,170,510,100,90,100,280,70,90,50,210,"-","-","-",10,160,190,150,500,90,70,90,250,70,70,60,190,"-",10,10,20,150,150,160,450]
[362,"Redcar",null,190,170,180,550,70,70,90,240,"-","-","-","-",270,250,270,790,120,160,170,450,60,80,100,240,"-","-","-","-",180,240,270,690,130,150,170,450,70,70,90,230,"-","-","-",10,200,230,250,680,130,150,160,440,110,90,90,280,"-","-",10,10,240,240,260,740,120,150,150,420,80,100,110,280,"-","-",10,10,200,250,260,710]
[363,"Redditch",null,70,100,110,280,30,60,70,160,"-","-","-","-",100,160,190,450,50,100,180,330,30,60,110,200,"-","-","-",10,80,170,290,530,60,100,160,320,30,90,110,220,"-","-",10,10,90,190,270,550,70,90,180,340,30,60,60,160,"-","-",10,20,110,160,250,520,80,110,120,300,40,70,100,210,"-",10,30,30,120,180,250,550]
[364,"Reigate",null,50,40,40,130,20,40,20,70,"-","-","-","-",60,80,70,210,30,40,70,140,20,30,60,100,"-","-","-","-",50,60,130,250,40,50,40,130,10,30,40,80,"-","-",10,10,50,70,90,220,40,40,50,140,20,50,30,100,"-","-",10,10,60,90,90,240,50,40,70,160,10,50,60,120,"-","-",10,10,60,90,130,290]
[365,"Ribble Valley",null,140,110,130,370,80,90,70,240,"-",10,"-",10,220,200,200,610,110,110,120,350,60,90,120,270,"-","-","-",10,180,200,240,620,130,130,110,370,60,90,130,290,"-",10,"-",10,200,220,250,670,120,90,70,280,60,100,60,230,"-",10,10,20,190,200,140,530,140,100,100,330,70,100,70,230,"-",10,10,20,210,200,180,580]
[366,"Richmond (Yorks)",null,100,200,180,480,60,70,110,240,"-","-","-","-",160,270,290,720,80,130,190,390,40,60,110,210,"-","-","-","-",120,190,300,600,340,900,370,1600,40,80,100,210,"-","-","-","-",370,970,470,1810,490,1270,540,2300,50,80,110,230,"-",10,10,20,530,1360,660,2550,710,1610,560,2890,50,90,120,260,"-","-",10,10,760,1710,690,3160]
[367,"Richmond Park",null,30,20,30,80,10,10,20,50,"-","-","-","-",40,30,60,120,20,30,30,80,10,10,20,40,"-","-","-","-",30,40,50,120,30,30,20,70,20,20,20,60,"-","-","-","-",40,50,50,140,20,20,30,70,10,20,20,50,"-","-","-","-",40,40,50,130,20,30,20,60,10,30,10,50,"-","-","-","-",30,50,30,110]
[368,"Rochdale",null,130,130,120,380,40,80,80,200,"-","-","-","-",170,200,210,580,80,110,150,340,30,60,140,230,"-","-","-","-",110,170,300,580,100,120,110,320,40,100,120,260,"-","-","-",10,140,210,230,590,90,110,120,320,50,110,70,230,"-","-",10,20,140,220,210,570,110,120,160,390,50,90,130,270,"-",10,10,10,150,220,300,670]
[369,"Rochester and Strood",null,180,210,140,530,40,80,70,190,"-","-","-","-",220,280,210,720,170,170,150,490,40,70,110,220,"-","-","-","-",210,240,260,710,150,180,120,450,40,100,120,250,"-","-",10,10,180,280,250,710,130,310,180,620,30,70,100,200,"-","-",10,10,160,380,280,830,160,260,200,620,40,90,140,270,"-","-",10,10,200,350,350,900]
[370,"Rochford and Southend East",null,110,90,70,270,20,30,40,90,"-","-","-","-",140,120,110,360,50,70,80,200,30,30,70,130,"-","-","-","-",70,110,150,330,70,90,90,240,30,40,90,160,"-","-","-","-",100,120,180,400,90,80,100,270,20,60,60,140,"-",10,10,10,110,140,170,430,100,80,90,260,30,70,60,160,"-","-",10,10,130,150,160,430]
[371,"Romford",null,80,60,60,200,40,50,40,130,"-","-","-","-",120,110,100,330,90,60,70,210,40,40,50,130,"-","-","-","-",120,100,120,340,100,60,60,210,40,60,60,160,"-","-","-","-",140,120,120,380,100,80,90,260,40,80,50,180,"-",10,10,20,140,160,150,450,100,70,90,260,70,80,60,200,"-",10,10,20,160,160,160,480]
[372,"Romsey and Southampton North",null,50,70,90,210,50,50,50,150,"-","-","-","-",90,120,140,360,40,60,60,160,20,70,60,150,"-","-","-","-",60,140,110,310,50,100,70,210,20,70,80,170,"-","-","-",10,70,170,150,390,50,90,70,210,30,70,60,160,"-","-","-","-",90,150,130,370,60,60,60,180,30,100,60,180,"-","-","-",10,90,160,120,360]
[373,"Rossendale and Darwen",null,170,100,120,390,60,60,80,200,"-","-","-","-",230,160,200,590,120,120,130,370,60,90,120,270,"-","-","-","-",180,210,250,640,130,130,150,400,60,100,160,310,"-","-",10,10,180,230,310,720,130,100,120,360,50,80,110,230,"-","-",10,10,180,180,240,600,170,140,120,430,60,90,90,240,"-","-",20,20,230,230,230,690]
[374,"Rother Valley",null,160,90,150,400,50,60,60,170,"-","-","-","-",210,160,210,580,90,100,120,310,50,80,120,250,"-","-","-",10,140,180,240,570,130,120,130,380,50,90,110,250,"-","-","-","-",180,210,240,630,120,130,140,390,70,90,70,230,"-",10,"-",10,190,220,210,620,130,120,140,380,70,90,80,240,"-","-",10,10,200,220,220,640]
[375,"Rotherham",null,170,130,140,430,70,70,60,200,"-","-","-","-",250,190,190,630,80,110,120,320,60,70,90,220,"-","-","-",10,140,180,220,540,140,90,110,330,50,70,90,210,"-","-","-","-",190,160,200,550,150,120,140,400,60,90,70,220,"-","-","-",10,210,210,210,620,120,100,140,360,70,70,80,220,"-",10,10,10,200,170,230,590]
[376,"Rugby",null,100,90,110,300,60,70,100,230,"-","-","-","-",160,160,210,530,80,90,150,320,40,70,110,210,"-","-","-","-",120,160,260,540,100,100,120,320,60,70,130,250,"-","-",10,10,160,160,250,580,60,80,160,300,40,70,60,170,"-","-",10,10,110,140,230,480,80,100,160,350,60,70,70,200,"-","-",10,10,150,170,240,560]
[377,"Ruislip Northwood and Pinner",null,40,60,50,150,20,30,30,80,"-","-","-","-",60,90,80,230,40,30,50,130,30,30,50,110,"-","-","-","-",70,70,100,240,40,40,30,110,30,30,30,90,"-","-","-","-",70,70,70,200,40,40,40,110,30,40,20,90,"-","-","-","-",70,70,60,200,30,50,40,130,30,40,20,90,"-","-","-",10,70,90,60,220]
[378,"Runnymede and Weybridge",null,40,50,40,130,10,40,20,60,"-","-","-","-",50,90,50,190,50,60,70,180,30,40,40,110,"-","-","-","-",70,100,110,280,60,50,40,150,30,50,30,110,"-","-","-","-",90,90,70,260,60,60,60,180,40,50,30,110,"-","-","-","-",100,110,90,290,50,40,60,150,30,50,40,120,"-","-","-",10,80,90,100,270]
[379,"Rushcliffe",null,80,80,80,240,30,50,40,120,"-","-","-","-",110,130,120,360,60,80,70,210,30,50,40,120,"-","-","-",10,90,130,120,340,80,70,50,200,40,50,70,160,"-","-",10,10,130,120,120,360,80,70,50,200,40,50,40,130,"-","-","-",10,120,120,90,340,70,60,60,190,50,50,50,150,"-","-","-",10,120,120,110,350]
[380,"Rutland and Melton",null,70,90,90,250,20,50,40,120,"-","-","-","-",90,140,130,360,60,80,120,250,20,60,80,170,"-","-","-","-",80,140,200,420,70,100,90,260,30,40,90,160,"-","-","-","-",100,150,180,420,100,90,80,270,40,70,70,180,"-","-","-",10,140,160,150,450,100,90,90,280,40,80,60,180,"-","-",10,10,150,170,160,470]
[381,"Saffron Walden",null,110,70,60,240,30,50,30,110,"-","-","-","-",140,120,90,350,50,90,50,190,30,40,60,120,"-","-","-","-",80,130,110,310,80,70,60,210,30,60,50,140,"-","-","-","-",110,130,120,350,80,70,60,210,20,60,40,130,"-","-","-",10,100,130,110,340,80,60,60,190,40,40,40,120,"-","-","-",10,110,100,90,310]
[382,"Salford and Eccles",null,170,130,160,470,50,70,90,210,"-","-","-","-",220,200,260,680,130,130,160,420,30,70,120,220,"-","-","-",10,160,200,290,650,80,110,150,340,40,80,120,230,"-","-","-","-",110,190,280,580,90,140,160,380,60,80,100,240,"-","-",10,10,150,220,260,630,120,140,160,420,50,70,110,230,"-","-",10,10,170,220,280,660]
[383,"Salisbury",null,60,60,70,190,30,60,50,140,"-","-","-","-",100,120,110,330,40,70,70,180,30,60,70,150,"-","-","-","-",70,120,140,330,60,70,60,180,20,50,80,140,"-","-","-","-",70,110,150,330,70,80,70,210,30,70,50,150,"-","-","-","-",100,140,120,360,60,60,90,220,30,50,50,130,"-","-","-",10,90,110,140,350]
[384,"Scarborough and Whitby",null,70,110,80,270,50,70,50,170,"-","-","-","-",120,190,140,440,70,120,170,370,30,70,80,190,"-","-","-","-",110,200,250,560,90,150,130,370,40,80,90,210,"-","-","-",10,130,230,220,580,100,140,100,340,30,100,90,220,"-",10,10,20,140,250,190,570,110,150,120,370,40,80,90,210,"-","-","-","-",150,230,210,590]
[385,"Scunthorpe",null,80,110,110,310,70,60,80,200,"-","-","-",10,150,170,200,520,70,90,120,290,50,40,70,170,"-","-","-",10,120,140,200,460,90,80,80,250,50,60,70,180,"-","-","-","-",140,140,150,420,110,90,90,300,50,70,70,190,"-","-","-","-",160,160,160,490,150,110,140,400,60,90,80,220,"-","-",10,10,200,200,230,640]
[386,"Sedgefield",null,180,120,250,550,70,70,120,260,"-","-","-",10,250,200,370,820,90,110,260,450,50,80,140,270,"-","-","-","-",130,190,410,720,110,130,150,390,50,90,100,240,"-","-","-","-",170,210,260,640,100,120,150,370,80,100,90,270,"-","-",20,20,180,220,250,660,120,100,190,410,80,90,110,280,"-","-",30,30,200,200,320,710]
[387,"Sefton Central",null,100,100,120,330,40,50,90,180,"-","-","-","-",150,150,220,520,80,100,110,290,60,50,90,200,"-","-","-","-",140,150,210,490,80,90,160,330,40,80,100,210,"-","-",10,10,120,170,260,550,90,80,90,260,40,80,100,210,"-","-",10,20,130,150,200,490,80,70,80,240,50,70,70,190,"-","-",10,10,130,150,160,440]
[388,"Selby and Ainsty",null,100,120,110,330,70,80,60,210,"-","-","-","-",170,200,180,540,90,120,150,360,50,50,70,170,"-","-","-","-",140,170,210,530,90,100,120,300,50,70,90,200,"-",10,"-",10,130,170,210,510,90,80,110,280,60,80,70,200,"-","-","-",10,140,160,180,490,100,90,110,300,80,60,80,210,"-","-",10,10,170,160,200,530]
[389,"Sevenoaks",null,60,70,50,180,30,30,20,80,"-","-","-","-",90,100,70,250,60,60,70,180,20,30,50,90,"-","-","-","-",80,90,110,270,50,50,50,150,20,20,50,90,"-","-","-","-",70,80,100,240,50,50,60,150,20,40,30,90,"-","-","-","-",70,90,90,250,50,50,50,160,40,50,50,140,"-","-",10,10,100,100,110,300]
[390,"Sheffield Brightside and Hillsborough",null,170,140,210,520,60,70,100,220,"-","-","-","-",230,210,310,740,110,100,170,370,50,50,110,210,"-","-","-","-",160,150,280,580,120,120,170,410,50,90,90,230,"-","-","-","-",170,210,260,640,160,110,160,420,70,70,80,220,"-","-","-",10,230,180,240,650,130,130,160,420,70,70,90,230,"-","-",10,10,200,210,260,670]
[391,"Sheffield Central",null,60,80,80,210,30,40,70,130,"-","-","-",10,80,120,140,340,40,80,80,200,20,40,50,110,"-","-","-",10,60,120,130,310,40,60,70,170,10,40,60,120,"-","-","-",10,50,110,140,290,60,70,70,200,10,40,40,100,"-","-","-","-",80,110,110,300,50,60,60,160,30,50,50,130,"-","-","-","-",70,110,110,290]
[392,"Sheffield Hallam",null,50,60,40,140,40,40,40,120,"-","-","-","-",80,100,80,260,50,50,40,140,40,40,40,110,"-","-","-","-",90,90,80,260,70,40,40,140,40,40,40,120,"-","-","-",10,100,80,80,260,50,50,30,130,30,40,20,100,"-","-","-","-",80,90,60,230,70,50,40,160,40,40,40,120,"-","-","-",10,110,90,90,280]
[393,"Sheffield Heeley",null,120,140,150,410,60,70,100,220,"-",10,"-",10,180,210,250,630,80,90,150,320,50,60,110,220,"-","-","-",10,130,160,260,540,100,90,130,310,50,80,90,210,"-",10,"-",10,140,170,210,530,110,90,120,320,60,70,80,200,"-","-","-","-",160,160,190,520,100,110,130,340,50,70,90,200,"-",10,"-",10,150,180,220,540]
[394,"Sheffield South East",null,180,110,150,440,90,70,110,280,"-","-","-",10,280,180,270,720,120,90,160,360,60,70,110,240,"-","-","-",10,180,170,270,610,130,100,120,350,60,100,100,250,"-","-","-",10,190,200,220,610,150,90,110,350,80,70,70,230,"-","-","-",10,230,170,190,590,140,110,130,390,80,90,80,250,"-",10,10,10,220,200,220,650]
[395,"Sherwood",null,150,140,120,400,60,70,70,200,"-","-","-","-",200,210,190,600,120,120,140,380,50,70,90,210,"-","-","-",10,170,200,230,590,130,130,120,380,50,90,100,240,"-","-",10,10,180,220,230,630,120,130,120,370,50,100,80,230,"-",10,10,20,170,230,220,620,130,120,150,400,50,100,80,220,"-",10,20,20,180,220,240,650]
[396,"Shipley",null,100,70,90,260,60,50,60,170,"-","-","-","-",150,130,160,430,90,80,90,250,30,40,70,130,"-","-","-",10,110,120,160,390,80,70,70,220,50,60,80,190,"-","-","-",10,130,140,150,420,80,90,70,250,50,60,70,180,"-","-",10,10,130,160,140,440,90,70,80,240,40,60,60,160,"-","-",10,10,130,130,140,400]
[397,"Shrewsbury and Atcham",null,80,130,130,350,40,60,70,180,"-","-","-","-",120,190,210,520,100,130,130,360,30,80,150,250,"-","-","-","-",120,210,280,610,100,100,90,300,40,80,130,250,"-",10,"-",10,140,190,230,560,100,100,100,300,40,110,90,240,"-","-",10,10,140,210,200,550,100,100,80,290,30,80,130,240,"-",10,10,20,140,190,220,540]
[398,"Sittingbourne and Sheppey",null,150,90,100,330,40,50,70,160,"-","-","-","-",180,140,170,500,110,110,120,330,30,40,110,180,"-","-","-","-",140,150,230,510,110,80,70,250,50,60,80,180,"-","-","-",10,150,140,150,440,130,110,160,400,30,70,100,190,"-","-",10,10,160,170,260,600,120,80,120,330,30,70,120,220,"-","-",10,10,150,160,250,570]
[399,"Skipton and Ripon",null,120,110,90,320,60,80,50,180,"-","-","-","-",180,190,130,500,120,90,120,320,40,50,70,160,"-","-","-","-",160,140,180,480,100,100,60,260,40,60,70,180,"-","-","-","-",140,150,140,440,110,90,70,270,50,60,70,190,"-","-","-",10,170,150,140,460,90,60,80,230,60,90,60,200,"-","-",10,10,150,140,140,440]
[400,"Sleaford and North Hykeham",null,130,110,100,340,40,90,90,220,"-","-","-",10,170,210,190,570,120,110,90,310,30,60,130,210,"-","-","-","-",150,160,210,530,120,90,90,300,40,90,130,270,"-","-",10,10,170,190,230,580,130,100,100,330,60,90,80,230,"-","-",10,10,200,190,190,580,130,100,100,330,70,90,110,270,"-","-","-",10,200,190,210,600]
[401,"Slough",null,70,90,110,270,30,60,40,120,"-","-","-","-",90,150,150,400,50,70,140,250,30,60,90,180,"-","-","-","-",80,130,230,440,70,70,120,260,30,80,70,180,"-","-",10,10,100,150,190,440,70,70,140,280,20,60,50,140,"-",10,10,10,100,140,190,430,70,80,140,290,50,50,90,190,"-",10,"-",10,120,130,240,490]
[402,"Solihull",null,90,90,90,280,60,50,50,150,"-","-","-","-",150,140,140,430,70,100,120,290,40,60,70,170,"-","-","-",10,100,160,200,460,90,120,120,330,50,60,80,180,"-","-","-","-",140,180,200,510,80,120,80,280,60,60,50,170,"-","-","-","-",140,180,130,460,80,110,130,320,70,80,50,200,"-","-",10,10,150,190,190,530]
[403,"Somerton and Frome",null,100,80,70,250,40,60,50,150,"-","-","-","-",140,130,130,400,100,90,120,300,40,60,60,150,"-","-","-","-",140,140,170,450,110,80,90,280,50,50,80,180,"-","-","-","-",160,140,170,460,110,80,60,250,60,80,60,190,"-","-","-",10,160,160,120,440,120,90,80,280,40,60,50,140,"-","-",10,10,160,140,130,430]
[404,"South Basildon and East Thurrock",null,140,80,60,280,30,50,40,120,"-","-","-","-",170,120,100,400,120,70,80,270,30,60,50,150,"-","-","-","-",150,140,130,420,100,60,80,240,40,60,70,160,"-","-","-","-",140,130,150,410,120,110,70,290,40,70,60,170,"-","-",10,10,160,170,140,480,120,90,100,310,40,60,70,170,"-","-",10,10,160,160,170,490]
[405,"South Cambridgeshire",null,90,80,70,240,30,50,40,120,"-","-","-","-",120,130,110,360,50,70,70,190,20,50,40,100,"-","-","-",10,70,120,120,300,70,80,50,190,30,50,50,120,"-","-",10,10,100,130,100,320,70,50,50,170,40,50,50,140,"-","-",10,10,110,110,100,320,70,60,60,180,30,60,30,110,"-",10,"-",10,90,120,100,310]
[406,"South Derbyshire",null,110,100,160,370,50,50,70,170,"-","-","-","-",160,160,230,540,100,100,160,360,50,70,80,190,"-","-","-","-",150,170,240,550,120,110,140,370,50,70,80,210,"-",10,10,10,170,190,230,590,140,110,120,370,60,80,70,210,"-","-",10,20,200,190,210,590,150,100,160,400,70,80,70,220,"-",10,"-",10,220,190,230,630]
[407,"South Dorset",null,150,390,200,740,30,90,80,200,"-","-","-","-",180,480,280,940,180,210,170,550,40,130,120,290,"-","-","-","-",220,330,290,840,130,290,180,600,40,150,190,370,"-","-","-","-",170,430,370,970,160,350,190,700,30,130,140,300,"-","-",10,10,190,480,330,1000,170,380,170,720,30,120,170,330,"-","-",10,10,210,500,350,1060]
[408,"South East Cambridgeshire",null,90,100,60,250,40,60,30,130,"-",10,"-",10,130,170,90,390,70,90,100,260,30,40,60,130,"-","-","-","-",90,140,160,390,80,80,90,260,40,70,70,170,"-",10,"-",10,120,150,160,440,90,80,90,260,40,60,50,150,"-",10,"-",10,130,140,150,420,90,70,100,260,30,70,70,170,"-","-","-",10,120,150,170,440]
[409,"South East Cornwall",null,110,210,170,490,40,50,70,170,"-","-","-",10,160,270,240,660,80,180,190,450,30,50,80,160,"-","-",10,10,110,230,280,620,140,190,130,450,30,80,100,210,"-",10,"-",10,170,280,230,680,170,210,130,510,30,90,60,180,"-","-",10,10,200,300,190,690,160,220,190,570,40,80,80,190,"-","-",10,10,200,300,280,770]
[410,"South Holland and The Deepings",null,120,110,100,330,50,60,70,180,"-","-","-","-",160,180,170,510,90,90,100,280,40,50,90,190,"-","-","-","-",140,140,190,470,80,90,80,250,40,90,90,220,"-","-","-","-",120,180,170,470,100,90,90,280,60,90,70,220,"-","-",10,10,150,190,160,500,110,90,80,280,50,80,60,190,"-","-","-",10,160,170,140,470]
[411,"South Leicestershire",null,130,90,140,350,60,60,40,170,"-","-","-","-",190,160,180,520,130,90,130,340,50,60,80,190,"-","-","-",10,170,160,210,540,140,110,110,360,50,80,100,220,"-","-","-","-",180,190,210,580,120,110,110,340,50,100,60,210,"-","-",10,10,170,210,180,560,140,120,90,350,60,70,60,200,"-",10,10,10,200,200,160,560]
[412,"South Norfolk",null,80,80,70,230,30,40,40,120,"-",10,"-",10,120,130,110,350,80,70,100,250,30,30,50,120,"-","-","-","-",110,100,160,370,100,60,60,210,40,60,50,150,"-",10,"-",10,140,120,110,370,120,80,80,280,40,60,40,150,"-","-","-","-",160,150,120,430,110,80,50,250,50,60,60,160,"-",10,10,20,160,150,120,430]
[413,"South Northamptonshire",null,110,90,100,290,40,70,60,160,"-","-","-","-",150,160,150,460,100,90,110,300,30,60,50,130,"-","-","-","-",130,150,160,430,110,90,110,300,40,70,70,180,"-","-","-",10,150,160,180,490,100,100,110,300,50,80,50,180,"-","-","-",10,140,180,170,490,100,80,80,250,50,60,70,180,"-","-",10,10,150,140,150,440]
[414,"South Ribble",null,120,110,110,340,60,90,70,220,"-",10,"-",10,180,210,180,570,120,100,130,350,60,60,130,240,"-","-","-","-",180,160,250,600,110,100,100,310,50,90,130,270,"-","-",10,10,160,190,240,590,120,120,80,320,60,90,70,220,"-",10,10,10,180,210,160,550,110,90,130,320,60,90,80,220,"-",10,10,20,170,180,220,560]
[415,"South Shields",null,150,120,210,480,80,50,100,230,"-","-","-","-",220,170,320,710,70,110,190,370,50,60,130,250,"-","-","-","-",130,170,330,620,100,130,150,370,50,70,130,250,"-","-","-","-",150,190,270,620,110,100,170,390,60,100,110,260,"-","-",10,10,170,200,290,650,100,120,180,400,80,90,90,270,"-","-",10,10,190,210,280,680]
[416,"South Staffordshire",null,130,90,100,310,60,60,70,180,"-","-","-","-",190,140,170,500,110,100,100,310,50,60,80,180,"-","-","-",10,160,160,180,500,100,120,90,300,50,80,100,220,"-",10,10,10,140,200,190,530,120,100,90,310,60,70,70,200,"-",10,10,30,180,180,170,530,140,90,90,320,50,60,90,200,"-",10,10,20,190,160,190,540]
[417,"South Suffolk",null,100,70,80,240,20,50,40,120,"-","-","-","-",120,120,120,360,70,60,80,220,20,30,60,110,"-","-","-",10,90,100,140,330,90,80,50,220,30,50,60,140,"-","-","-","-",120,130,110,360,100,90,80,270,40,60,40,140,"-","-",10,10,150,140,140,430,90,70,70,230,40,50,80,160,"-","-",10,20,130,120,150,410]
[418,"South Swindon",null,70,110,120,290,30,50,40,130,"-","-","-","-",100,160,160,420,60,80,120,270,30,50,80,150,"-","-","-","-",90,140,200,420,70,100,90,260,30,60,80,170,"-","-","-",10,90,170,170,430,60,90,90,240,50,60,50,160,"-","-","-",10,110,150,140,400,80,90,90,260,70,70,70,200,"-","-","-","-",140,160,160,460]
[419,"South Thanet",null,90,70,70,230,20,40,40,110,"-","-","-","-",110,110,110,330,50,80,60,200,20,50,70,140,"-","-","-","-",70,130,130,330,70,70,80,220,30,50,100,170,"-","-","-","-",100,120,170,400,80,100,80,250,30,60,50,140,"-","-","-","-",110,160,130,400,70,90,110,260,30,50,80,160,"-","-",10,20,100,150,190,440]
[420,"South West Bedfordshire",null,80,90,110,280,30,50,40,120,"-","-","-","-",100,140,150,390,80,70,120,260,30,50,70,150,"-","-","-","-",100,120,190,420,50,70,80,200,20,60,80,170,"-","-","-","-",80,140,160,370,70,70,90,230,50,70,50,170,"-","-","-",10,130,140,140,400,60,70,120,240,40,60,50,150,"-",10,10,20,100,130,180,410]
[421,"South West Devon",null,190,110,120,420,60,100,100,250,"-","-",10,10,250,210,230,690,180,120,170,470,60,80,100,240,"-","-","-","-",240,200,280,720,200,90,100,390,60,100,90,240,"-","-","-",10,260,190,190,630,210,130,120,460,90,100,80,260,"-","-",10,10,300,230,200,730,220,120,130,470,80,120,90,300,"-","-",10,10,300,240,230,770]
[422,"South West Hertfordshire",null,50,40,60,160,20,30,40,90,"-","-","-","-",80,70,100,250,50,50,70,170,10,40,40,90,"-","-","-","-",60,100,110,260,50,60,50,160,20,40,50,100,"-","-","-","-",60,100,100,270,40,50,50,150,10,50,30,90,"-","-","-",10,60,100,90,250,60,40,50,140,30,40,40,110,"-","-","-",10,80,80,90,250]
[423,"South West Norfolk",null,100,110,130,340,40,50,60,160,"-","-","-","-",140,160,190,490,80,100,120,300,30,60,130,220,"-","-","-","-",110,170,250,530,90,80,70,240,40,90,150,280,"-","-","-","-",120,170,220,520,100,80,100,290,40,70,80,190,"-","-","-","-",150,150,190,480,100,90,90,280,30,60,70,160,"-","-",20,20,140,150,180,470]
[424,"South West Surrey",null,40,40,50,130,10,20,40,70,"-","-","-","-",50,60,90,200,40,40,40,120,10,30,50,100,"-","-","-","-",60,80,90,220,30,60,60,150,20,50,50,110,"-","-","-","-",50,110,100,260,40,60,40,140,20,40,30,80,"-","-","-",10,60,100,70,230,40,50,60,150,20,40,40,100,"-","-","-","-",60,90,100,250]
[425,"South West Wiltshire",null,90,190,150,430,20,60,50,120,"-","-","-","-",100,250,200,550,50,140,140,340,20,50,80,160,"-","-","-","-",80,200,220,500,70,140,160,370,30,50,100,170,"-","-","-","-",100,190,260,550,70,150,170,390,20,50,60,130,"-","-","-","-",100,190,230,520,80,160,180,420,40,70,130,230,"-","-","-","-",120,220,320,660]
[426,"Southampton Itchen",null,90,100,120,320,40,70,70,170,"-","-","-","-",130,170,190,500,70,90,140,290,40,60,80,180,"-","-","-","-",100,150,220,470,80,90,100,270,40,70,90,200,"-","-","-","-",120,160,190,470,80,100,120,300,40,70,80,190,"-","-",10,10,120,170,210,500,100,100,140,350,50,60,100,210,"-",10,10,20,150,170,240,570]
[427,"Southampton Test",null,70,90,160,320,40,50,70,160,"-","-","-","-",110,150,220,480,60,70,130,250,20,50,80,160,"-","-","-",10,80,120,210,410,60,70,130,250,20,50,80,140,"-","-","-","-",80,120,210,400,70,80,120,270,30,50,70,150,"-","-","-","-",100,130,190,420,80,90,140,320,30,60,90,180,"-","-","-",10,110,160,230,500]
[428,"Southend West",null,100,70,50,220,20,30,20,60,"-","-","-","-",120,90,70,280,50,60,60,170,20,30,30,80,"-","-","-","-",70,90,100,250,50,60,60,170,20,40,60,120,"-","-","-","-",70,110,120,290,60,70,70,200,20,60,50,130,"-",10,"-",10,80,140,120,350,60,60,60,190,20,30,50,90,"-","-",10,10,80,90,120,290]
[429,"Southport",null,80,130,150,360,20,70,90,180,"-","-","-","-",100,200,240,540,60,80,160,300,20,70,130,220,"-","-","-","-",80,150,300,530,60,80,130,280,20,70,120,220,"-","-","-","-",90,150,260,500,80,130,140,350,30,70,120,220,"-","-",10,10,110,200,280,590,80,120,140,340,40,60,90,190,"-","-",20,30,110,180,260,560]
[430,"Spelthorne",null,80,70,70,210,30,50,50,140,"-","-","-","-",110,120,120,350,50,60,70,180,40,50,50,150,"-","-","-","-",100,110,120,330,70,70,60,210,40,70,40,150,"-","-","-","-",120,140,100,360,90,80,60,220,60,60,50,160,"-","-","-",10,150,130,110,390,80,60,70,220,50,60,40,150,"-","-",10,10,130,130,120,380]
[431,"St Albans",null,40,60,50,150,30,40,20,80,"-","-","-","-",70,90,70,230,50,50,60,160,20,30,40,100,"-","-","-","-",70,80,100,260,30,40,60,140,20,40,50,100,"-","-","-",10,50,80,110,240,40,50,50,140,20,50,20,90,"-","-","-","-",60,100,80,230,40,50,40,140,20,40,30,90,"-","-",10,10,70,100,80,240]
[432,"St Austell and Newquay",null,100,150,180,430,30,80,90,210,"-",10,"-",10,140,240,280,650,80,110,170,350,30,80,130,240,"-",10,10,10,100,200,300,600,80,120,130,340,30,90,160,280,"-","-","-",10,110,210,290,620,100,120,120,340,30,90,110,230,"-","-",10,10,130,220,240,580,100,130,160,390,30,80,140,260,"-","-",20,20,130,220,320,670]
[433,"St Helens North",null,150,140,170,460,50,70,120,230,"-","-","-","-",200,210,290,700,130,100,220,450,50,90,160,290,"-","-",10,10,170,190,390,750,130,100,170,410,60,80,160,300,"-","-",10,10,190,190,340,710,120,120,150,380,50,100,110,260,"-",10,10,20,170,220,270,660,140,130,190,450,60,100,130,290,"-","-",20,20,200,230,330,750]
[434,"St Helens South and Whiston",null,130,180,200,510,70,70,90,220,"-","-","-","-",200,250,290,730,120,130,270,520,50,80,140,270,"-","-","-","-",170,210,410,790,110,130,220,460,50,80,160,290,"-","-",10,10,160,220,390,760,120,150,190,460,40,90,130,260,"-","-",10,10,170,240,330,740,140,140,190,460,60,100,140,300,"-","-",10,10,190,240,340,770]
[435,"St Ives",null,60,100,130,290,20,60,90,170,"-","-","-","-",80,160,220,460,60,80,110,240,10,40,60,110,"-","-","-",10,70,120,170,360,60,110,90,260,20,50,100,170,"-",10,10,10,80,160,190,440,40,110,80,230,10,70,70,150,"-","-","-",10,60,180,150,380,60,110,80,250,20,50,70,140,"-","-",10,10,80,160,170,410]
[436,"Stafford",null,80,100,150,320,30,40,70,140,"-","-","-","-",110,140,220,470,60,90,100,250,30,60,90,180,"-","-","-","-",90,150,190,430,80,100,100,270,30,60,80,170,"-","-","-","-",110,150,180,440,70,100,120,290,30,80,90,200,"-","-",10,20,100,170,230,500,80,80,100,250,40,50,70,160,"-",10,20,30,120,130,190,440]
[437,"Staffordshire Moorlands",null,90,100,80,270,50,60,60,170,"-","-","-","-",140,160,150,440,80,70,110,260,40,70,70,180,"-","-","-",10,120,140,180,440,80,70,80,230,50,60,90,200,"-",10,10,10,130,130,170,440,110,70,80,260,40,50,80,170,"-","-",10,10,150,130,160,440,90,60,100,240,50,60,60,170,"-",10,10,20,140,130,170,430]
[438,"Stalybridge and Hyde",null,130,130,130,390,60,70,70,190,"-","-","-","-",180,210,210,590,90,110,140,340,40,60,80,180,"-","-","-","-",130,170,220,520,110,120,120,350,60,70,120,250,"-",10,"-",10,160,200,240,610,100,130,140,370,60,90,60,210,"-","-","-",10,160,220,210,580,120,130,120,370,60,100,80,230,"-","-",10,10,180,230,210,610]
[439,"Stevenage",null,80,90,60,230,50,40,20,110,"-","-","-","-",120,130,80,340,50,80,100,230,30,50,60,130,"-","-","-","-",80,130,150,360,70,100,110,280,30,70,70,170,"-","-","-",10,100,170,180,450,70,90,100,270,30,60,30,120,"-","-","-",10,100,150,140,390,70,90,100,250,30,60,60,140,"-","-","-",10,100,140,160,400]
[440,"Stockport",null,140,110,140,380,50,50,80,180,"-","-","-","-",180,160,210,560,80,110,140,330,30,70,110,210,"-","-","-","-",110,190,250,540,100,80,100,270,50,60,90,200,"-",10,"-",10,150,150,190,480,110,100,100,310,50,90,70,200,"-","-",10,10,170,190,170,530,100,90,120,300,50,70,90,210,"-",10,10,20,150,170,220,530]
[441,"Stockton North",null,180,120,160,460,50,80,80,210,"-","-","-","-",230,210,230,670,130,110,210,440,70,80,140,290,"-","-","-","-",200,190,350,730,130,150,230,510,70,70,100,230,"-","-","-",10,190,220,330,750,140,140,180,460,50,90,90,220,"-","-","-",10,190,230,270,690,120,140,160,410,70,110,120,300,"-","-",10,10,180,240,280,710]
[442,"Stockton South",null,120,150,140,410,70,90,110,280,"-","-","-","-",190,240,260,690,90,100,160,350,90,80,140,310,"-","-","-","-",180,180,300,660,130,120,170,420,80,80,100,260,"-","-","-",10,210,210,270,680,130,110,120,350,70,100,100,270,"-","-",10,10,210,200,230,640,130,120,140,380,100,90,90,280,"-","-",20,20,230,200,240,680]
[443,"Stoke on Trent Central",null,120,100,90,310,40,60,70,160,"-","-","-",10,160,160,160,480,70,80,120,270,20,60,90,180,"-","-","-",10,90,150,220,450,90,90,140,320,30,50,100,180,"-","-",10,10,110,150,250,510,70,100,150,320,20,60,100,180,"-","-",10,10,100,160,250,510,90,100,200,400,30,60,100,190,"-","-",20,20,130,160,320,600]
[444,"Stoke on Trent North",null,160,140,130,430,40,100,80,220,"-","-","-",10,200,230,210,650,100,110,150,360,30,80,120,230,"-",10,"-",10,130,200,270,600,120,110,170,400,30,80,150,260,"-","-",10,10,150,200,320,670,130,150,220,500,40,60,130,240,"-","-",10,10,180,210,360,740,150,140,220,510,50,80,140,270,"-","-",10,20,200,230,370,790]
[445,"Stoke on Trent South",null,150,110,120,380,40,80,90,200,"-","-","-",10,190,190,210,590,110,100,150,370,50,60,110,220,"-","-","-",10,160,170,270,590,110,120,160,390,30,70,130,230,"-","-",10,10,150,190,300,630,110,120,170,390,40,100,120,260,"-","-",10,20,150,220,300,670,170,140,230,540,40,90,120,250,"-",10,10,10,210,240,350,800]
[446,"Stone",null,80,90,100,270,50,50,50,150,"-","-","-","-",130,150,150,430,60,70,90,220,20,60,90,170,"-","-","-","-",90,130,170,390,70,90,100,250,40,50,70,160,"-","-",10,10,110,140,170,420,70,70,110,250,40,60,60,160,"-","-","-",10,110,140,170,420,90,70,120,270,50,60,60,170,"-","-",20,20,140,130,190,460]
[447,"Stourbridge",null,120,90,90,290,30,50,70,160,"-","-","-","-",150,140,160,450,50,70,90,220,10,60,90,160,"-","-",10,10,70,130,190,380,80,70,90,240,30,70,110,210,"-","-","-",10,110,140,200,450,80,110,80,270,30,70,70,160,"-","-",10,20,110,170,170,450,90,90,90,270,50,50,60,160,"-","-",20,30,140,150,170,450]
[448,"Stratford on Avon",null,70,70,90,230,20,40,40,100,"-","-","-","-",90,110,130,330,60,70,90,210,20,40,50,100,"-","-","-","-",70,110,130,310,70,70,70,220,20,50,50,120,"-","-","-","-",100,120,120,340,50,60,90,200,40,50,40,130,"-","-",10,10,90,110,130,330,50,60,80,190,30,40,40,110,"-","-",10,10,90,100,120,310]
[449,"Streatham",null,40,40,80,150,10,30,50,90,"-","-","-","-",50,70,130,240,20,40,100,150,10,30,50,100,"-","-",10,10,30,70,150,250,20,40,60,130,10,30,70,110,"-","-","-","-",30,70,130,230,20,40,90,160,20,20,30,70,"-","-","-","-",40,70,120,230,20,50,110,180,20,30,50,100,"-","-",10,10,40,80,170,280]
[450,"Stretford and Urmston",null,130,100,130,350,50,50,60,160,"-","-","-","-",180,140,190,520,80,100,120,290,50,70,100,220,"-","-","-",10,130,170,220,520,100,100,100,290,40,80,120,240,"-","-","-",10,140,180,220,540,110,110,110,320,80,80,90,250,"-","-","-",10,190,190,200,580,110,110,160,370,50,80,90,220,"-","-",10,20,160,190,260,610]
[451,"Stroud",null,90,80,70,230,40,60,40,140,"-","-","-","-",130,140,110,370,60,80,80,220,30,60,50,140,"-","-","-",10,90,140,130,360,70,90,60,230,40,50,50,140,"-",10,10,10,110,150,120,380,90,90,90,270,50,50,30,140,"-","-","-",10,140,150,130,410,80,80,70,230,60,70,40,170,"-","-",10,10,140,160,110,410]
[452,"Suffolk Coastal",null,100,120,110,330,20,60,50,130,"-","-","-","-",120,180,170,460,100,110,70,280,30,70,70,180,"-","-","-",10,130,180,150,460,110,100,60,270,50,70,60,170,"-","-","-","-",150,170,120,440,100,100,90,280,30,80,50,160,10,"-","-",10,130,180,150,450,90,100,80,270,30,70,60,160,"-",10,10,10,120,180,140,450]
[453,"Sunderland Central",null,220,130,230,580,70,60,100,230,"-","-","-","-",300,190,330,820,100,120,210,430,60,80,120,260,"-","-","-",10,170,200,330,700,110,110,200,420,70,60,120,250,"-","-","-",10,180,170,320,680,110,110,190,410,90,70,110,280,"-",10,10,20,210,190,310,710,180,180,230,590,70,90,120,280,"-","-","-","-",250,270,350,870]
[454,"Surrey Heath",null,140,260,140,540,40,70,60,180,"-","-","-","-",180,340,200,720,70,170,90,320,30,70,70,160,"-","-","-","-",90,240,160,490,90,220,120,420,40,80,60,180,"-","-","-",10,130,300,180,610,90,80,100,260,40,70,50,150,"-",10,"-",10,120,150,150,420,70,50,80,200,60,50,60,170,"-","-",10,20,130,110,160,390]
[455,"Sutton and Cheam",null,60,70,60,190,20,50,50,110,"-","-","-","-",80,110,110,300,40,50,70,150,30,50,50,130,"-","-","-","-",70,100,120,290,50,40,40,130,30,50,60,140,"-","-","-","-",80,90,100,270,40,40,60,140,40,50,40,130,"-","-",10,10,90,90,110,280,50,40,50,140,40,40,50,130,"-","-",10,10,90,80,100,270]
[456,"Sutton Coldfield",null,80,70,50,200,40,50,50,140,"-","-","-","-",130,120,100,340,60,60,90,220,40,60,60,160,"-","-",10,10,100,120,160,380,90,80,80,240,50,50,60,160,"-","-",10,10,140,130,140,410,90,70,70,230,40,50,40,140,"-","-",10,10,130,120,120,370,70,80,80,230,60,60,60,180,"-",10,20,30,130,150,160,430]
[457,"Tamworth",null,100,150,140,390,60,50,70,180,"-","-","-","-",160,200,220,570,60,110,170,330,30,40,70,140,"-","-","-","-",90,150,240,470,70,140,130,340,30,70,90,190,"-","-",10,10,100,210,230,540,70,90,190,350,60,70,70,200,"-","-",10,20,140,150,280,560,60,120,140,320,50,80,80,210,"-","-",10,20,110,200,230,540]
[458,"Tatton",null,70,60,60,180,20,50,50,120,"-","-","-","-",90,110,100,300,50,70,60,170,30,50,50,130,"-","-","-","-",70,120,110,300,40,50,70,170,30,40,60,140,"-","-",10,10,80,100,140,310,40,70,70,180,30,50,40,120,"-","-","-","-",70,120,110,300,50,60,50,160,40,50,60,150,"-","-",10,10,90,120,110,320]
[459,"Taunton Deane",null,120,130,120,370,50,70,80,200,"-","-","-",10,170,200,210,580,100,100,130,330,50,60,70,180,"-","-","-","-",150,170,200,510,90,120,120,330,50,70,110,230,"-","-","-",10,140,190,230,560,140,110,100,350,50,70,80,200,"-","-","-",10,190,190,190,560,100,110,190,400,60,80,60,210,"-","-",10,10,160,200,260,620]
[460,"Telford",null,110,90,130,340,30,80,90,200,"-","-","-","-",140,180,220,540,100,120,170,380,20,60,90,170,"-","-",10,10,120,180,270,560,100,140,180,410,30,80,160,260,"-","-",10,10,130,210,340,680,100,100,170,370,30,90,110,230,"-",10,10,10,130,190,290,610,120,110,160,390,30,70,110,220,"-",10,20,30,150,190,290,630]
[461,"Tewkesbury",null,80,120,110,310,40,60,80,180,"-","-","-","-",120,180,190,490,70,90,100,260,30,60,80,170,"-","-","-",10,100,160,180,440,70,100,90,260,40,70,60,170,"-","-","-",10,110,170,150,440,90,80,80,250,50,70,50,180,"-","-","-",10,140,160,140,430,100,90,100,290,40,70,70,170,"-","-",10,10,140,160,170,470]
[462,"The Cotswolds",null,70,70,60,200,30,40,40,110,"-","-","-","-",100,110,100,310,50,60,80,180,20,40,50,120,"-","-","-","-",70,100,130,300,60,60,60,170,20,40,60,110,"-","-","-","-",80,100,120,290,80,60,60,190,40,60,40,140,"-","-","-",10,110,120,100,340,70,60,40,170,30,40,40,110,"-","-","-",10,100,100,80,280]
[463,"The Wrekin",null,110,120,100,320,150,420,180,740,"-","-","-","-",250,550,270,1070,140,220,150,520,90,480,170,730,"-","-","-",10,240,700,330,1260,140,230,140,500,50,460,230,740,"-","-","-","-",190,690,380,1250,130,210,150,490,50,370,200,620,"-","-",10,10,180,590,350,1120,140,290,140,570,50,280,180,510,"-","-",10,20,200,580,330,1100]
[464,"Thirsk and Malton",null,120,110,110,340,40,80,40,150,"-","-",10,10,160,190,160,500,100,90,140,330,40,50,90,180,"-","-","-","-",140,140,230,510,110,80,80,280,50,80,80,210,"-","-","-","-",160,160,160,490,120,90,100,320,50,80,100,230,"-",10,"-",10,180,180,200,560,120,80,130,330,60,80,90,230,"-","-","-","-",180,170,220,570]
[465,"Thornbury and Yate",null,110,70,100,280,50,60,40,150,"-","-","-","-",160,130,140,430,80,80,90,250,40,70,60,170,"-","-","-","-",120,140,160,420,90,70,60,220,60,60,60,180,"-","-","-","-",150,130,130,400,120,80,70,270,50,70,40,150,"-","-","-","-",170,150,110,420,90,70,60,220,70,80,50,190,"-","-",10,10,160,140,120,420]
[466,"Thurrock",null,90,70,100,260,30,40,50,120,"-","-","-","-",120,120,150,380,80,90,100,270,40,40,70,140,"-","-","-","-",120,130,170,410,100,80,110,290,30,50,70,150,"-","-","-","-",130,130,180,440,110,120,130,360,50,70,70,190,"-","-","-",10,150,190,200,550,110,110,110,330,40,80,90,210,"-","-",20,20,150,200,210,560]
[467,"Tiverton and Honiton",null,100,100,100,290,50,70,90,210,"-","-","-",10,150,170,190,500,100,90,90,280,40,40,50,130,"-","-","-","-",140,130,140,410,100,100,70,270,40,70,60,170,"-","-","-",10,140,170,130,440,140,100,130,360,60,70,40,170,"-","-","-",10,190,170,170,540,120,90,100,310,50,70,60,190,"-","-",10,20,170,170,170,510]
[468,"Tonbridge and Malling",null,60,40,40,140,20,30,30,80,"-","-","-","-",70,70,70,220,40,40,70,140,30,30,50,110,"-","-","-","-",60,70,120,250,40,50,60,140,20,40,40,100,"-","-","-","-",60,90,90,240,50,60,50,160,20,30,30,80,"-","-","-","-",70,90,90,240,50,50,60,160,20,30,30,70,"-","-","-",10,70,80,90,240]
[469,"Tooting",null,20,40,40,100,10,20,40,60,"-","-","-","-",30,50,70,150,10,20,70,90,20,20,40,70,"-","-","-","-",20,40,110,170,10,20,40,80,20,20,50,80,"-","-","-","-",30,40,90,160,20,30,50,90,20,20,30,60,"-","-","-","-",30,40,80,150,10,20,50,80,10,20,40,70,"-","-","-","-",20,40,90,150]
[470,"Torbay",null,120,140,200,460,30,90,110,240,"-",10,"-",10,150,240,310,710,90,120,180,380,20,80,110,210,"-",10,"-",10,110,200,290,590,100,130,150,380,30,100,150,280,"-","-","-","-",130,240,300,670,100,130,180,420,30,100,110,230,"-","-",10,10,140,230,290,660,90,160,180,430,40,80,110,230,"-","-",20,20,140,230,300,670]
[471,"Torridge and West Devon",null,130,100,160,390,40,60,90,180,"-","-","-","-",170,160,240,570,90,100,140,330,30,50,80,160,"-","-","-",10,120,150,230,490,110,90,80,280,50,70,110,230,"-","-","-","-",160,160,190,510,150,100,110,350,40,80,70,190,"-",10,"-",10,190,180,180,550,140,90,100,330,40,80,100,230,"-","-",10,10,190,170,210,570]
[472,"Totnes",null,90,100,120,310,20,60,50,130,"-","-","-","-",110,160,180,450,70,90,120,270,20,40,70,130,"-","-","-","-",90,120,200,410,90,100,70,260,30,70,80,180,"-","-",10,10,120,170,160,450,90,80,90,260,30,70,50,150,"-","-","-","-",120,150,140,410,70,90,100,260,30,50,60,140,"-","-",10,10,100,140,170,410]
[473,"Tottenham",null,40,60,150,250,20,30,50,100,"-","-","-","-",60,90,200,340,20,70,140,240,10,30,100,130,"-","-","-","-",30,100,240,370,30,50,110,190,10,40,90,140,"-","-","-","-",40,90,200,330,30,70,160,260,10,30,60,100,"-","-","-",10,40,100,220,370,30,60,200,290,30,50,100,180,"-","-",10,20,60,110,310,480]
[474,"Truro and Falmouth",null,80,120,90,290,30,70,80,180,"-","-",10,10,100,190,180,470,70,80,90,240,20,60,70,160,"-","-",10,10,90,140,170,400,70,90,60,210,30,70,100,190,"-","-",10,10,100,160,160,420,70,80,80,230,30,40,50,120,"-","-",10,10,100,130,130,360,80,70,60,210,30,60,50,140,"-","-",10,10,110,130,120,360]
[475,"Tunbridge Wells",null,40,70,50,150,10,30,40,70,"-","-","-","-",50,100,80,220,40,40,50,130,20,40,40,90,"-","-","-","-",50,80,90,220,30,60,50,140,10,40,40,90,"-","-","-","-",50,90,90,230,60,50,40,150,20,30,60,100,"-","-","-",10,70,80,100,250,50,60,70,180,20,40,40,100,"-","-",10,10,70,100,120,290]
[476,"Twickenham",null,30,30,50,110,20,30,20,70,"-","-","-","-",50,60,70,180,40,50,40,130,20,40,30,80,"-","-","-","-",60,80,70,210,30,40,30,100,20,40,30,80,"-","-","-","-",40,80,60,180,30,20,50,100,30,40,20,90,"-","-","-","-",60,70,70,190,40,20,30,90,30,30,20,70,"-","-","-","-",70,50,50,160]
[477,"Tynemouth",null,190,110,170,470,70,50,70,190,"-","-","-","-",260,160,240,660,60,100,190,350,50,50,110,220,"-","-","-","-",110,150,300,570,80,120,140,340,50,60,120,230,"-","-","-",10,130,190,260,580,100,130,160,390,50,70,70,200,"-","-","-",10,160,200,240,600,100,90,200,390,60,70,80,210,"-","-",10,10,160,160,300,610]
[478,"Uxbridge and South Ruislip",null,110,90,80,280,40,50,60,150,"-","-","-","-",160,140,140,430,70,80,90,230,40,70,50,160,"-","-","-","-",100,150,140,390,90,50,70,210,30,60,50,140,"-","-","-",10,120,110,130,360,80,60,70,210,40,60,40,140,"-","-","-","-",130,120,110,350,70,70,90,220,50,50,40,130,"-",10,10,10,120,120,130,370]
[479,"Vauxhall",null,40,50,80,170,20,30,40,90,"-","-","-","-",60,80,120,260,40,50,90,180,10,30,70,110,"-","-","-","-",50,80,160,290,20,50,80,150,10,30,50,90,"-","-","-","-",40,70,130,240,30,50,110,180,10,30,40,80,"-","-","-",10,40,80,150,270,20,60,100,190,20,40,40,100,"-","-","-",10,40,100,150,290]
[480,"Wakefield",null,120,130,160,410,40,60,50,150,"-","-","-",10,170,200,200,570,100,100,140,340,40,60,80,180,"-","-","-","-",140,170,220,520,100,90,90,270,50,70,80,200,"-","-","-",10,150,160,170,480,120,90,110,320,50,80,70,200,"-","-","-",10,170,180,190,530,100,120,120,340,60,80,80,220,"-","-",10,10,160,200,210,570]
[481,"Wallasey",null,210,160,200,570,50,100,100,250,"-","-","-","-",270,260,300,820,110,170,260,540,30,90,190,310,"-","-","-","-",150,260,450,850,90,120,190,400,40,100,170,310,"-","-","-",10,130,220,370,720,90,130,180,400,40,90,180,310,"-","-",20,20,130,220,380,730,80,130,150,360,50,80,140,260,"-","-",10,20,130,210,300,640]
[482,"Walsall North",null,140,100,130,370,40,50,70,170,"-","-","-","-",190,150,200,530,110,80,190,380,40,50,100,190,"-","-","-","-",150,130,290,580,110,100,130,350,30,70,120,220,"-",10,10,10,140,180,260,580,110,110,120,350,30,80,60,160,"-","-",10,10,140,190,190,520,120,140,140,400,50,80,100,220,"-","-",30,30,160,220,260,640]
[483,"Walsall South",null,110,90,190,390,30,40,80,160,"-","-","-","-",150,130,270,550,90,90,150,330,20,50,90,160,"-","-","-",10,110,140,250,500,90,120,130,330,20,70,90,180,"-","-",10,10,110,190,230,520,90,120,110,310,30,60,70,160,"-","-",10,10,120,170,190,480,70,130,110,310,40,80,80,190,"-","-",20,20,110,200,210,530]
[484,"Walthamstow",null,50,80,100,230,20,30,50,100,"-","-","-","-",70,100,150,320,30,50,100,180,20,30,70,120,"-","-","-","-",50,80,160,300,50,70,80,200,30,40,70,140,"-","-","-","-",90,110,150,340,40,70,110,230,30,50,70,150,"-","-","-",10,70,120,190,380,40,80,140,260,30,50,80,160,"-","-",10,10,60,130,230,430]
[485,"Wansbeck",null,120,110,170,400,60,100,90,250,"-","-","-","-",180,210,250,650,120,120,210,450,40,50,140,240,"-","-","-","-",160,170,350,680,110,120,180,420,50,90,110,250,"-","-","-",10,160,220,300,670,100,110,200,410,60,100,90,240,"-","-",20,20,150,210,310,670,110,140,170,420,70,90,110,270,"-",10,10,10,180,230,290,700]
[486,"Wantage",null,70,90,70,230,50,50,40,130,"-","-","-","-",110,140,110,360,80,90,90,260,50,60,70,170,"-","-","-",10,140,150,150,440,110,60,70,240,50,60,60,170,"-","-",10,10,170,130,130,420,110,80,90,270,40,60,60,160,"-","-","-","-",150,130,150,430,100,60,80,240,70,70,60,190,"-","-",10,10,160,140,150,440]
[487,"Warley",null,130,90,120,340,50,50,70,160,"-","-","-","-",170,140,190,500,60,70,150,270,30,60,110,200,"-","-","-","-",90,130,250,470,90,90,130,300,30,70,110,210,"-","-",10,10,120,160,240,520,70,110,120,300,30,70,70,170,"-",10,20,20,110,180,210,490,100,120,150,380,30,60,90,180,"-","-",20,20,130,190,260,580]
[488,"Warrington North",null,110,130,140,380,50,60,60,160,"-","-","-",10,160,190,200,550,70,110,170,340,50,80,170,300,"-","-","-","-",120,190,340,640,90,100,140,320,40,80,140,260,"-","-",10,10,130,180,280,590,100,160,130,390,60,80,90,230,"-","-",10,10,160,240,230,620,110,120,180,420,50,80,100,240,"-","-",10,20,170,210,300,670]
[489,"Warrington South",null,130,120,150,390,60,60,60,180,"-",10,"-",10,190,180,210,580,80,110,150,330,50,80,170,300,"-",10,10,10,130,190,320,640,90,120,110,310,50,90,110,250,"-",10,10,10,140,210,230,580,110,110,110,320,60,110,90,250,"-","-",10,20,170,220,210,590,90,100,130,320,60,100,100,250,"-",10,10,20,160,200,240,590]
[490,"Warwick and Leamington",null,50,80,60,200,30,50,50,130,"-","-","-","-",80,130,120,330,50,60,70,170,20,40,80,140,"-","-","-","-",70,100,150,320,50,60,100,210,30,60,70,160,"-","-","-","-",80,120,180,370,60,80,140,280,30,50,70,150,"-","-",10,10,90,130,220,440,70,70,110,250,30,60,80,160,"-","-",10,10,100,130,190,420]
[491,"Washington and Sunderland West",null,190,110,240,550,80,70,100,250,"-","-","-",10,270,190,340,800,110,130,240,480,60,70,180,310,"-","-","-","-",170,200,420,790,130,140,200,470,80,70,120,270,"-","-","-",10,210,210,320,740,130,120,210,460,90,70,80,240,"-","-",10,10,220,200,300,710,150,120,260,530,100,60,100,260,"-","-",10,10,250,190,360,800]
[492,"Watford",null,90,70,80,240,30,50,50,130,"-","-","-","-",120,120,140,380,50,60,100,220,30,40,60,120,"-","-","-","-",80,110,160,340,50,70,130,250,20,50,70,150,"-","-","-",10,80,120,200,400,40,80,160,270,30,50,60,130,"-","-","-",10,70,120,210,410,60,50,110,220,30,40,60,130,"-","-",10,10,90,90,170,350]
[493,"Waveney",null,110,110,120,340,40,60,40,140,"-","-","-","-",150,170,160,480,70,90,130,280,40,50,80,160,"-","-","-","-",110,140,200,450,110,120,80,310,70,70,90,230,"-","-","-","-",180,190,170,540,110,110,90,310,50,70,60,180,"-","-",10,10,160,190,160,510,110,110,80,300,70,90,50,210,"-",10,10,20,180,200,140,520]
[494,"Wealden",null,80,80,100,260,30,40,20,90,"-","-","-","-",110,130,120,360,60,70,100,240,30,40,40,110,"-","-","-","-",90,110,150,350,70,70,60,200,30,50,70,160,"-","-","-","-",100,130,140,360,90,70,50,210,40,40,60,140,"-","-","-",10,130,120,110,350,70,80,60,210,30,40,50,120,"-","-",10,10,100,120,120,340]
[495,"Weaver Vale",null,100,110,120,330,50,80,90,220,"-","-","-","-",150,200,210,560,60,90,140,300,30,60,100,190,"-","-","-","-",100,150,240,490,80,80,100,270,50,80,100,220,"-","-",10,10,130,160,210,500,60,100,110,260,60,80,80,220,"-","-","-",10,110,180,190,490,80,90,100,270,40,60,70,170,"-","-",10,20,120,160,170,450]
[496,"Wellingborough",null,130,100,160,390,40,50,50,140,"-","-","-","-",180,150,210,540,100,100,160,360,30,70,100,200,"-","-","-","-",130,170,260,560,80,90,160,330,40,50,90,180,"-","-","-",10,120,140,260,520,100,120,150,380,30,60,80,170,"-","-","-",10,140,190,240,560,120,120,120,360,40,70,70,170,"-","-",10,20,160,190,200,550]
[497,"Wells",null,100,120,100,330,50,60,60,170,"-","-","-","-",150,190,160,500,90,110,140,340,40,70,70,180,"-","-","-","-",140,180,210,520,120,100,90,310,60,70,80,210,"-","-","-","-",170,160,180,520,100,110,100,310,60,60,50,170,"-","-",10,10,160,180,160,490,90,100,80,270,40,70,60,160,"-","-",10,10,120,170,150,440]
[498,"Welwyn Hatfield",null,70,80,110,260,40,50,30,110,"-","-","-","-",110,130,130,370,50,50,70,170,30,40,70,140,"-","-","-","-",80,90,150,320,50,80,70,190,30,30,60,120,"-","-","-","-",80,110,130,310,60,60,80,200,30,60,40,130,"-","-","-",10,90,120,130,330,60,50,60,170,30,40,50,120,"-",10,10,20,90,110,120,320]
[499,"Wentworth and Dearne",null,150,130,170,450,70,80,70,210,"-","-","-","-",210,210,240,660,90,110,180,390,60,80,130,270,"-","-","-","-",150,190,310,660,130,110,140,380,60,70,110,240,"-","-","-","-",180,190,250,620,170,120,130,420,60,70,100,230,"-",10,"-",10,230,200,230,650,140,160,190,490,50,80,90,230,"-","-",10,10,200,250,290,730]
[500,"West Bromwich East",null,130,100,150,380,60,50,50,160,"-","-","-","-",190,150,200,540,80,90,170,340,20,60,80,160,"-","-","-","-",100,150,250,500,100,100,110,300,40,60,90,190,"-","-",10,10,140,160,200,510,90,110,120,330,30,60,70,150,"-","-",20,20,120,180,200,490,100,100,140,340,60,80,90,230,"-",10,30,30,150,190,260,590]
[501,"West Bromwich West",null,160,120,160,440,50,60,80,180,"-","-","-","-",210,180,230,620,100,90,150,340,40,60,110,210,"-","-","-",10,140,150,270,550,110,130,170,410,40,60,120,220,"-","-",10,20,150,190,300,640,110,110,160,380,60,80,90,220,"-","-",10,20,170,200,260,620,120,130,150,390,50,70,110,230,"-",10,40,50,170,200,290,660]
[502,"West Dorset",null,110,80,80,260,40,50,40,130,"-","-","-","-",150,130,120,400,90,60,100,260,50,50,70,160,"-","-","-","-",140,110,170,420,100,90,80,270,50,60,60,170,"-","-","-","-",150,150,140,440,100,110,70,280,50,80,50,190,"-","-","-","-",160,190,120,470,120,80,70,260,50,60,50,160,"-","-","-","-",160,140,120,420]
[503,"West Ham",null,100,90,190,390,20,50,80,150,"-","-","-","-",130,140,280,540,90,90,150,330,30,50,90,160,"-","-","-","-",120,140,240,490,70,110,160,330,30,60,140,240,"-","-","-","-",100,170,300,570,100,130,200,430,50,60,80,190,"-","-","-",10,150,190,280,620,110,120,240,460,70,80,120,270,"-","-",10,20,170,210,370,750]
[504,"West Lancashire",null,100,110,160,370,30,70,80,180,"-","-","-","-",130,180,240,550,90,90,140,320,30,50,110,190,"-","-","-","-",120,140,250,510,80,100,140,320,50,80,130,250,"-","-",10,10,120,180,280,580,110,90,110,300,50,70,70,180,"-","-","-","-",150,160,180,490,80,80,130,300,30,50,90,170,"-","-",10,10,110,130,230,470]
[505,"West Suffolk",null,110,90,100,290,30,60,50,140,"-","-","-","-",140,150,150,430,90,70,110,270,30,50,90,170,"-","-","-","-",110,120,210,440,70,80,100,260,50,70,90,210,"-","-","-",10,120,160,190,470,80,80,110,280,40,70,80,190,"-","-","-",10,120,150,200,470,100,100,110,310,50,70,110,220,"-","-",10,10,150,170,220,540]
[506,"West Worcestershire",null,80,80,90,260,20,50,40,120,"-","-","-","-",100,140,130,370,40,80,70,200,20,40,80,150,"-","-","-",10,60,130,160,350,60,100,60,220,30,80,100,210,"-","-",10,20,90,170,180,440,60,70,80,210,40,60,50,150,"-","-","-",10,100,130,140,370,60,90,90,240,60,70,50,180,"-","-",10,20,120,160,150,430]
[507,"Westminster North",null,20,40,30,90,"-",10,20,40,"-","-","-","-",30,50,50,130,10,30,30,70,10,20,20,50,"-","-","-","-",20,50,50,110,10,30,40,80,10,20,20,50,"-","-","-","-",20,50,60,130,10,30,40,80,10,10,20,40,"-","-","-","-",20,40,60,120,20,30,40,90,10,10,30,50,"-","-","-",10,30,40,70,140]
[508,"Westmorland and Lonsdale",null,70,100,110,270,40,60,30,130,"-","-","-","-",110,150,140,400,80,100,100,280,30,60,80,160,"-","-","-","-",110,160,180,450,80,110,80,260,40,70,90,200,"-","-","-","-",120,180,170,470,70,100,100,270,60,50,60,170,"-","-","-","-",130,150,160,440,80,90,110,270,50,70,80,200,"-","-","-",10,120,170,190,480]
[509,"Weston Super Mare",null,130,100,200,430,60,60,100,210,"-","-","-","-",190,160,300,640,100,120,150,370,40,60,100,200,"-","-","-","-",140,180,250,570,90,120,120,330,50,70,100,220,"-","-","-",10,140,180,230,550,110,100,110,320,50,80,90,220,"-","-",10,10,160,180,220,550,110,130,150,390,50,80,100,230,"-","-",10,20,160,210,270,640]
[510,"Wigan",null,190,130,190,500,60,90,130,280,"-","-","-","-",250,220,320,780,140,110,190,440,60,80,140,290,"-","-","-","-",200,200,330,720,110,130,150,390,60,90,140,290,"-","-",10,20,170,220,310,700,140,140,140,420,60,100,90,250,"-","-","-",10,210,240,240,680,130,130,190,450,60,90,110,260,"-",10,10,20,190,230,310,720]
[511,"Wimbledon",null,20,20,30,80,10,10,20,40,"-","-","-","-",30,40,60,120,10,10,30,60,10,20,30,60,"-","-","-","-",20,30,60,120,10,20,30,60,10,10,30,50,"-","-","-","-",10,30,60,100,10,20,30,70,10,10,10,40,"-","-","-","-",20,30,50,110,10,20,20,60,10,20,20,50,"-","-","-",10,30,40,50,110]
[512,"Winchester",null,110,210,140,460,20,50,70,150,"-","-","-","-",140,260,220,620,70,120,140,340,20,50,100,170,"-","-","-","-",90,180,240,510,80,130,90,300,30,80,140,250,"-","-","-","-",110,210,230,550,70,100,90,260,40,100,100,230,"-","-","-","-",110,190,190,490,90,130,90,300,40,100,70,210,"-","-",10,10,130,230,170,520]
[513,"Windsor",null,60,50,50,170,20,40,40,100,"-","-","-","-",80,90,100,270,40,50,60,150,20,40,50,100,"-","-","-","-",50,90,110,250,50,90,80,210,40,50,50,140,"-","-","-","-",90,140,130,360,50,60,70,180,30,40,30,110,"-","-","-","-",90,100,100,290,40,50,60,140,30,40,40,110,"-",10,"-",10,70,90,100,260]
[514,"Wirral South",null,120,60,100,280,50,50,60,160,"-","-","-",10,170,110,170,450,70,60,120,240,20,60,90,180,"-","-","-","-",90,120,210,420,60,60,80,200,40,50,90,180,"-","-","-","-",100,110,170,380,50,60,80,190,40,60,80,170,"-","-",10,20,90,110,180,380,70,70,80,220,50,50,90,180,"-","-",10,20,110,120,180,420]
[515,"Wirral West",null,100,90,100,290,20,40,40,110,"-","-","-","-",130,130,150,400,70,60,100,230,40,40,80,160,"-","-","-","-",110,110,180,400,70,80,70,210,30,50,60,140,"-","-",10,10,100,130,130,360,50,70,70,190,30,50,80,170,"-","-",10,10,80,120,160,370,60,50,60,170,30,60,80,170,"-","-",10,10,90,120,150,350]
[516,"Witham",null,120,100,100,320,20,50,40,120,"-","-","-","-",150,150,140,430,80,50,80,210,30,60,50,130,"-","-","-",10,110,110,130,350,70,80,60,210,40,60,60,160,"-","-",10,10,110,140,130,380,80,70,80,230,30,50,50,130,"-","-",10,10,100,130,140,370,100,60,60,210,30,50,50,140,"-","-",10,10,130,110,120,360]
[517,"Witney",null,80,140,80,300,30,40,40,110,"-","-","-","-",110,180,120,410,80,120,100,290,40,50,60,150,"-","-","-","-",120,170,160,440,70,120,90,280,40,60,70,180,"-","-","-","-",120,180,170,460,110,110,50,270,50,50,60,160,"-","-","-","-",160,160,120,430,100,120,100,330,50,60,60,160,"-","-",10,10,150,180,170,500]
[518,"Woking",null,70,90,100,260,20,20,40,90,"-","-","-","-",100,120,140,350,60,80,90,230,20,40,60,110,"-","-","-","-",80,110,150,330,40,80,70,190,20,60,70,160,"-","-","-",10,70,140,150,350,50,60,70,180,30,70,50,150,"-","-","-",10,80,130,130,340,30,50,70,150,40,70,60,170,"-","-","-",10,70,120,130,330]
[519,"Wokingham",null,80,140,80,300,70,330,230,620,"-","-","-","-",150,470,310,930,90,130,80,290,160,310,190,670,"-","-","-","-",250,440,270,960,90,100,70,260,100,440,310,850,"-","-","-",10,180,540,390,1110,60,60,50,180,110,580,410,1100,"-","-","-","-",170,650,470,1280,60,50,60,160,130,350,160,640,"-","-","-",10,190,400,220,810]
[520,"Wolverhampton North East",null,80,100,150,320,40,50,60,160,"-","-","-","-",120,150,210,480,80,110,160,350,30,60,100,180,"-","-","-",10,110,170,260,540,80,100,120,310,40,60,90,180,"-","-",10,10,120,160,220,500,120,90,140,350,40,50,70,160,"-","-",20,20,160,140,230,530,120,100,160,380,40,70,80,190,"-","-",20,20,150,180,260,590]
[521,"Wolverhampton South East",null,100,80,190,370,40,40,60,140,"-","-","-","-",140,120,250,510,90,70,160,320,40,50,90,180,"-","-","-",10,120,130,250,500,100,100,150,350,20,50,100,160,"-","-","-",10,120,160,240,520,100,110,140,350,30,60,80,180,"-","-",10,20,140,170,230,540,100,90,140,330,30,60,90,180,"-","-",20,20,130,160,250,540]
[522,"Wolverhampton South West",null,90,70,90,240,20,30,60,120,"-","-","-","-",110,100,150,350,50,70,90,210,10,50,80,140,"-","-","-",10,70,120,170,350,50,80,70,190,30,50,60,140,"-","-",10,10,70,130,140,340,50,70,90,210,20,60,50,130,"-","-",10,10,70,130,150,350,60,60,130,250,30,50,60,150,"-","-",10,20,90,120,200,410]
[523,"Worcester",null,60,110,130,310,40,40,50,140,"-","-","-","-",110,160,180,450,60,100,140,290,20,70,130,210,"-","-","-","-",70,170,260,500,100,110,120,330,30,80,120,230,"-",10,10,20,130,200,250,580,110,100,120,330,40,70,70,180,"-","-",10,10,140,170,200,510,80,100,150,320,50,80,70,190,"-","-",10,10,130,180,230,530]
[524,"Workington",null,140,90,90,310,70,60,40,170,"-","-","-","-",210,140,120,480,110,80,110,300,70,70,60,200,"-","-","-","-",180,150,170,500,140,100,90,330,80,100,120,290,"-",10,"-",10,220,200,210,630,150,110,120,370,120,100,70,280,"-","-","-",10,270,210,190,660,130,110,130,370,120,100,50,270,"-","-","-",10,250,210,190,650]
[525,"Worsley and Eccles South",null,200,120,150,470,70,70,100,230,"-","-","-","-",270,190,250,710,110,120,190,420,40,70,110,220,"-","-","-","-",160,190,300,640,110,120,160,390,50,90,130,270,"-","-",10,10,160,210,300,670,100,140,190,420,60,100,120,280,"-","-","-",10,170,230,310,710,110,140,180,430,50,100,110,250,"-",10,10,20,160,250,300,700]
[526,"Worthing West",null,40,70,50,170,20,40,40,100,"-","-","-","-",60,110,100,270,60,80,80,220,30,70,70,170,"-","-","-","-",90,150,150,390,50,80,80,200,20,70,80,180,"-","-","-","-",70,150,160,380,60,90,70,220,20,70,50,140,"-","-",10,10,80,160,130,370,60,80,90,220,30,50,60,150,"-",10,10,20,90,130,160,380]
[527,"Wycombe",null,40,50,70,170,30,40,30,100,"-","-","-","-",70,100,100,270,40,60,100,190,40,60,70,160,"-","-","-","-",80,110,160,350,40,60,60,160,20,60,70,150,"-","-","-","-",60,120,130,310,40,80,60,180,30,60,60,150,"-","-","-","-",70,140,130,340,60,50,80,190,40,60,50,140,"-","-",10,10,90,110,140,340]
[528,"Wyre and Preston North",null,80,80,50,200,70,60,40,170,"-","-","-","-",150,140,90,380,90,90,80,260,50,60,90,200,"-",10,"-",10,140,150,170,460,80,80,70,240,40,80,90,200,"-","-","-",10,120,160,160,440,80,80,60,220,50,80,60,190,"-","-",10,20,130,160,140,430,90,70,70,230,40,70,60,170,"-","-",20,20,130,140,140,420]
[529,"Wyre Forest",null,110,100,150,360,20,70,70,160,"-","-","-","-",130,170,220,520,70,100,110,280,30,50,100,180,"-","-","-",10,100,150,220,470,100,110,130,340,30,70,120,230,"-","-","-",10,130,190,260,570,110,110,140,360,40,70,70,180,"-",10,10,20,150,190,220,560,90,110,110,300,60,80,80,210,"-","-",20,30,150,180,210,540]
[530,"Wythenshawe and Sale East",null,160,130,150,450,40,60,80,180,"-","-","-","-",210,190,230,630,80,110,190,370,40,60,120,220,"-","-","-","-",110,170,310,590,90,130,150,370,30,60,130,220,"-","-","-",10,120,190,280,590,90,130,180,400,60,70,130,250,"-","-",10,10,150,200,310,660,110,110,240,450,50,80,100,220,"-","-",10,20,160,190,350,690]
[531,"Yeovil",null,150,110,120,380,70,70,80,220,"-","-","-","-",230,180,200,600,120,90,190,400,70,70,80,210,"-","-","-","-",190,160,260,610,130,110,100,330,80,100,120,300,"-",10,"-",10,200,210,210,630,140,110,150,400,70,90,90,240,"-",10,10,10,210,200,240,650,140,120,140,400,90,100,80,270,"-","-",10,10,230,210,230,680]
[532,"York Central",null,80,150,120,350,30,70,80,180,"-",10,"-",10,110,230,200,530,70,110,140,310,20,50,70,140,"-","-","-","-",90,150,210,450,80,90,100,270,30,60,100,190,"-",10,"-",10,110,160,200,470,70,80,110,260,20,70,60,150,"-","-","-",10,100,150,170,420,80,110,140,330,30,60,70,160,"-",10,10,10,100,180,220,500]
[533,"York Outer",null,80,110,110,290,50,50,50,150,"-","-","-",10,130,170,160,450,80,70,70,230,20,50,70,150,"-","-","-","-",110,120,140,370,90,70,60,230,50,60,80,190,"-","-","-","-",140,130,150,420,90,60,60,210,50,50,50,150,"-","-","-",10,140,120,110,370,70,80,110,260,50,70,60,180,"-","-","-",10,130,150,170,450]
[]
[]
[null,null,"Year","2011/12\nFull Year",null,null,null,null,null,null,null,null,null,null,null,null,null,null,null,"2012/13\nFull Year",null,null,null,null,null,null,null,null,null,null,null,null,null,null,null,"2013/14\nFull Year",null,null,null,null,null,null,null,null,null,null,null,null,null,null,null,"2014/15\nFull Year",null,null,null,null,null,null,null,null,null,null,null,null,null,null,null,"2015/16\nFull year"]
[null,"Region","Level","Intermediate Level Apprenticeship",null,null,null,"Advanced Level Apprenticeship",null,null,null,"Higher Apprenticeship",null,null,null,"All Apprenticeships",null,null,null,"Intermediate Level Apprenticeship",null,null,null,"Advanced Level Apprenticeship",null,null,null,"Higher Apprenticeship",null,null,null,"All Apprenticeships",null,null,null,"Intermediate Level Apprenticeship",null,null,null,"Advanced Level Apprenticeship",null,null,null,"Higher Apprenticeship",null,null,null,"All Apprenticeships",null,null,null,"Intermediate Level Apprenticeship",null,null,null,"Advanced Level Apprenticeship",null,null,null,"Higher Apprenticeship",null,null,null,"All Apprenticeships",null,null,null,"Intermediate Level Apprenticeship",null,null,null,"Advanced Level Apprenticeship",null,null,null,"Higher Apprenticeship",null,null,null,"All Apprenticeships"]
[null,null,"Age","Under 19","19-24","25+","All Ages","Under 19","19-24","25+","All Ages","Under 19","19-24","25+","All Ages","Under 19","19-24","25+","All Ages","Under 19","19-24","25+","All Ages","Under 19","19-24","25+","All Ages","Under 19","19-24","25+","All Ages","Under 19","19-24","25+","All Ages","Under 19","19-24","25+","All Ages","Under 19","19-24","25+","All Ages","Under 19","19-24","25+","All Ages","Under 19","19-24","25+","All Ages","Under 19","19-24","25+","All Ages","Under 19","19-24","25+","All Ages","Under 19","19-24","25+","All Ages","Under 19","19-24","25+","All Ages","Under 19","19-24","25+","All Ages","Under 19","19-24","25+","All Ages","Under 19","19-24","25+","All Ages","Under 19","19-24","25+","All Ages"]
[1,"North East",null,4710,3290,5340,13350,1840,1920,2650,6420,10,60,10,80,6560,5270,8010,19840,2580,3150,5920,11650,1580,1920,3780,7280,10,40,30,70,4170,5110,9730,19000,3010,3400,4650,11050,1610,2120,3110,6830,10,70,80,160,4620,5590,7840,18040,3190,3320,4990,11510,1770,2310,2670,6740,10,60,290,360,4970,5690,7950,18620,3460,3360,5420,12240,1900,2350,2800,7050,10,60,330,390,5360,5770,8550,19680]
[2,"North West",null,10420,8900,10150,29470,3740,5010,5730,14480,20,170,80,260,14170,14080,15960,44210,6840,7920,11490,26250,3230,5100,8550,16890,20,140,120,290,10090,13170,20160,43420,6970,7870,9540,24380,3400,5820,8850,18060,30,170,290,500,10400,13860,18680,42940,7490,8090,9260,24840,3920,6070,6830,16820,80,160,570,800,11490,14320,16650,42460,7690,7750,9720,25160,3890,5900,6880,16660,90,220,790,1090,11660,13860,17390,42910]
[3,"Yorkshire and The Humber",null,7780,6480,7230,21490,2840,3880,4170,10890,10,130,60,200,10630,10490,11460,32580,5870,5570,7650,19090,2310,3350,5360,11020,20,110,50,180,8200,9030,13070,30290,6340,6110,6370,18820,2450,3830,5150,11430,10,130,100,240,8790,10070,11620,30490,6490,7020,6760,20270,2680,4000,4260,10930,20,130,210,360,9190,11150,11230,31570,6700,7360,7640,21700,2850,4150,4550,11550,30,150,360,540,9580,11660,12560,33790]
[4,"East Midlands",null,5110,4800,6210,16110,2040,2720,2670,7430,10,100,30,140,7150,7630,8900,23680,4280,4510,6330,15120,1690,2850,3700,8230,20,100,50,160,5990,7460,10070,23520,4630,4800,5240,14670,1860,3220,4270,9350,30,110,150,290,6520,8130,9660,24320,4930,5040,5400,15370,2160,3530,2960,8650,50,120,240,410,7140,8680,8610,24430,5230,4690,5820,15740,2370,3380,3510,9260,50,160,420,630,7650,8230,9750,25630]
[5,"West Midlands",null,6260,5950,7220,19420,2590,3730,3930,10250,20,80,20,120,8870,9760,11170,29800,4640,5580,7930,18150,1900,3860,5440,11200,20,100,150,280,6560,9540,13520,29620,5200,6350,7380,18920,2110,4170,5810,12090,40,150,330,520,7350,10670,13520,31530,5500,6070,7660,19240,2460,4320,4600,11380,50,160,560,760,8010,10560,12810,31380,5590,6420,8220,20230,2620,4320,4840,11790,60,240,960,1250,8270,10990,14020,33270]
[6,"East of England",null,5230,4960,4850,15040,1870,2760,2320,6950,"-",70,20,90,7100,7780,7190,22070,4160,4340,5630,14130,1570,2640,3760,7970,10,100,60,160,5730,7070,9460,22260,4450,4590,4550,13600,1850,3200,4030,9080,30,130,110,270,6330,7930,8700,22950,4830,4860,5200,14890,2010,3430,3050,8490,40,140,310,490,6880,8430,8560,23870,4920,4470,5110,14500,2240,3510,3520,9270,50,200,570,820,7210,8190,9200,24590]
[7,"London",null,4390,4360,5710,14460,1520,2380,3070,6970,"-",30,10,50,5910,6780,8790,21480,3130,3640,6050,12820,1450,2460,4110,8020,"-",40,40,90,4580,6140,10210,20920,3250,3910,4840,12000,1580,2830,4200,8610,10,70,80,150,4830,6810,9120,20760,3500,4430,5970,13910,1960,2950,3070,7980,30,100,170,290,5490,7480,9210,22180,3310,4160,6650,14110,2080,3150,3910,9140,40,190,390,620,5430,7490,10950,23870]
[8,"South East",null,6660,8120,7790,22570,2520,4340,4230,11090,"-",80,20,100,9180,12540,12040,33760,5450,6870,7810,20130,2510,4680,6210,13400,10,100,40,150,7970,11650,14060,33680,5850,7390,6670,19910,2850,5470,6240,14560,20,140,140,300,8720,13000,13050,34770,6170,7680,7310,21150,3030,5810,5010,13840,30,150,310,490,9220,13640,12620,35480,6240,7130,7860,21230,3290,5420,5470,14180,50,210,700,960,9580,12760,14020,36370]
[9,"South West",null,5550,6600,6470,18610,2070,3620,3770,9460,10,110,70,190,7620,10330,10310,28260,4720,5620,6820,17170,2030,3580,4330,9940,20,90,70,170,6770,9290,11220,27280,5190,5910,5120,16210,2050,4070,5110,11230,10,140,120,280,7240,10120,10360,27720,5670,6080,5900,17660,2340,4330,3800,10470,30,110,190,340,8040,10520,9900,28460,5560,5960,6020,17540,2480,4310,4170,10960,40,120,420,580,8070,10390,10610,29070]
[10,"England",null,56100,53500,61000,170500,21000,30400,32500,83900,100,800,300,1200,77200,84700,93800,255700,41700,47200,65600,154500,18300,30400,45200,93900,100,800,600,1500,60100,78500,111500,250000,44900,50300,54400,149600,19700,34700,46800,101200,200,1100,1400,2700,64800,86200,102600,253500,47800,52600,58500,158800,22300,36800,36200,95300,300,1100,2800,4300,70400,90500,97500,258400,48700,51300,62500,162500,23700,36500,39700,99800,400,1500,4900,6900,72800,89300,107000,269200]
[12,"Other",null,460,660,800,1910,240,250,260,760,"-",10,"-",10,700,920,1060,2680,400,520,860,1780,300,330,450,1080,"-",10,"-",10,700,850,1320,2870,330,450,530,1300,250,260,410,920,"-",10,10,20,580,710,940,2230,420,480,590,1490,240,340,360,940,"-",10,20,40,660,840,970,2460,430,410,510,1360,290,380,360,1040,10,20,50,80,740,810,930,2470]
[14,"Grand Total",null,56500,54100,61800,172400,21300,30600,32800,84700,100,800,300,1200,77900,85600,94900,258400,42100,47700,66500,156300,18600,30800,45700,95000,100,800,600,1600,60800,79300,112800,252900,45200,50800,54900,150900,20000,35000,47200,102200,200,1100,1400,2700,65400,86900,103500,255800,48200,53100,59100,160300,22500,37100,36600,96200,300,1100,2900,4300,71100,91300,98500,260900,49100,51700,63000,163800,24000,36900,40000,100900,400,1600,5000,7000,73600,90100,108000,271700]

{"sheet":"Lists","index":6,"n_rows":561,"n_cols":14,"rows_kept":561,"cut":false,"hidden":true,"merged":[]}
["Age Categories",null,null,"Region","LA",null,null,"Region","PCON",null,null,"SSA",null,"Region"]
["All","19-24",null,null,"",null,null,null,null,null,null,null,null,"East Midlands"]
["Under 19","25+",null,"North East","Darlington",null,"","North East","Berwick upon Tweed",null,null,"Agriculture, Horticulture and Animal Care",null,"East of England"]
["19 and over",null,null,"North East","Durham",null,"","North East","Bishop Auckland",null,null,"Arts, Media and Publishing",null,"London"]
[null,null,null,"North East","Gateshead",null,"","North East","Blaydon",null,null,"Business, Administration and Law",null,"North East"]
[null,null,null,"North East","Hartlepool",null,"","North East","Blyth Valley",null,null,"Construction, Planning and the Built Environment",null,"North West"]
[null,null,null,"North East","Middlesbrough",null,"","North East","City of Durham",null,null,"Education and Training",null,"South East"]
[null,null,null,"North East","Newcastle upon Tyne",null,"","North East","Darlington",null,null,"Engineering and Manufacturing Technologies",null,"South West"]
[null,null,null,"North East","North Tyneside",null,"","North East","Easington",null,null,"Health, Public Services and Care",null,"West Midlands"]
[null,null,null,"North East","Northumberland",null,"","North East","Gateshead",null,null,"Information and Communication Technology",null,"Yorkshire and The Humber"]
[null,null,null,"North East","Redcar and Cleveland",null,"","North East","Hartlepool",null,null,"Languages, Literature and Culture",null,"Other"]
[null,null,null,"North East","South Tyneside",null,"","North East","Hexham",null,null,"Leisure, Travel and Tourism",null,"England"]
[null,null,null,"North East","Stockton-on-Tees",null,"","North East","Houghton and Sunderland South",null,null,"Preparation for Life and Work",null,"Grand Total"]
[null,null,null,"North East","Sunderland",null,"","North East","Jarrow",null,null,"Retail and Commercial Enterprise"]
[null,null,null,"North West","Blackburn with Darwen",null,"","North East","Middlesbrough",null,null,"Science and Mathematics"]
[null,null,null,"North West","Blackpool",null,"","North East","Middlesbrough South and East Cleveland",null,null,"Unknown"]
[null,null,null,"North West","Bolton",null,"","North East","Newcastle upon Tyne Central"]
[null,null,null,"North West","Bury",null,"","North East","Newcastle upon Tyne East"]
[null,null,null,"North West","Cheshire East",null,"","North East","Newcastle upon Tyne North"]
[null,null,null,"North West","Cheshire West and Chester",null,"","North East","North Durham"]
[null,null,null,"North West","Cumbria",null,"","North East","North Tyneside"]
[null,null,null,"North West","Allerdale",null,"","North East","North West Durham"]
[null,null,null,"North West","Barrow in Furness",null,"","North East","Redcar"]
[null,null,null,"North West","Carlisle",null,"","North East","Sedgefield"]
[null,null,null,"North West","Copeland",null,"","North East","South Shields"]
[null,null,null,"North West","Eden",null,"","North East","Stockton North"]
[null,null,null,"North West","South Lakeland",null,"","North East","Stockton South"]
[null,null,null,"North West","Halton",null,"","North East","Sunderland Central"]
[null,null,null,"North West","Knowsley",null,"","North East","Tynemouth"]
[null,null,null,"North West","Lancashire",null,"","North East","Wansbeck"]
[null,null,null,"North West","Burnley",null,"","North East","Washington and Sunderland West"]
[null,null,null,"North West","Chorley",null,"","North West","Altrincham and Sale West"]
[null,null,null,"North West","Fylde",null,"","North West","Ashton under Lyne"]
[null,null,null,"North West","Hyndburn",null,"","North West","Barrow and Furness"]
[null,null,null,"North West","Lancaster",null,"","North West","Birkenhead"]
[null,null,null,"North West","Pendle",null,"","North West","Blackburn"]
[null,null,null,"North West","Preston",null,"","North West","Blackley and Broughton"]
[null,null,null,"North West","Ribble Valley",null,"","North West","Blackpool North and Cleveleys"]
[null,null,null,"North West","Rossendale",null,"","North West","Blackpool South"]
[null,null,null,"North West","South Ribble",null,"","North West","Bolton North East"]
[null,null,null,"North West","West Lancashire",null,"","North West","Bolton South East"]
[null,null,null,"North West","Wyre",null,"","North West","Bolton West"]
[null,null,null,"North West","Liverpool",null,"","North West","Bootle"]
[null,null,null,"North West","Manchester",null,"","North West","Burnley"]
[null,null,null,"North West","Oldham",null,"","North West","Bury North"]
[null,null,null,"North West","Rochdale",null,"","North West","Bury South"]
[null,null,null,"North West","Salford",null,"","North West","Carlisle"]
[null,null,null,"North West","Sefton",null,"","North West","Cheadle"]
[null,null,null,"North West","St Helens",null,"","North West","Chorley"]
[null,null,null,"North West","Stockport",null,"","North West","City of Chester"]
[null,null,null,"North West","Tameside",null,"","North West","Congleton"]
[null,null,null,"North West","Trafford",null,"","North West","Copeland"]
[null,null,null,"North West","Warrington",null,"","North West","Crewe and Nantwich"]
[null,null,null,"North West","Wigan",null,"","North West","Denton and Reddish"]
[null,null,null,"North West","Wirral",null,"","North West","Eddisbury"]
[null,null,null,"Yorkshire and The Humber","Barnsley",null,"","North West","Ellesmere Port and Neston"]
[null,null,null,"Yorkshire and The Humber","Bradford",null,"","North West","Fylde"]
[null,null,null,"Yorkshire and The Humber","Calderdale",null,"","North West","Garston and Halewood"]
[null,null,null,"Yorkshire and The Humber","Doncaster",null,"","North West","Halton"]
[null,null,null,"Yorkshire and The Humber","East Riding of Yorkshire",null,"","North West","Hazel Grove"]
[null,null,null,"Yorkshire and The Humber","Kingston upon Hull",null,"","North West","Heywood and Middleton"]
[null,null,null,"Yorkshire and The Humber","Kirklees",null,"","North West","Hyndburn"]
[null,null,null,"Yorkshire and The Humber","Leeds",null,"","North West","Knowsley"]
[null,null,null,"Yorkshire and The Humber","North East Lincolnshire",null,"","North West","Lancaster and Fleetwood"]
[null,null,null,"Yorkshire and The Humber","North Lincolnshire",null,"","North West","Leigh"]
[null,null,null,"Yorkshire and The Humber","North Yorkshire",null,"","North West","Liverpool Riverside"]
[null,null,null,"Yorkshire and The Humber","Craven",null,"","North West","Liverpool Walton"]
[null,null,null,"Yorkshire and The Humber","Hambleton",null,"","North West","Liverpool Wavertree"]
[null,null,null,"Yorkshire and The Humber","Harrogate",null,"","North West","Liverpool West Derby"]
[null,null,null,"Yorkshire and The Humber","Richmondshire",null,"","North West","Macclesfield"]
[null,null,null,"Yorkshire and The Humber","Ryedale",null,"","North West","Makerfield"]
[null,null,null,"Yorkshire and The Humber","Scarborough",null,"","North West","Manchester Central"]
[null,null,null,"Yorkshire and The Humber","Selby",null,"","North West","Manchester Gorton"]
[null,null,null,"Yorkshire and The Humber","Rotherham",null,"","North West","Manchester Withington"]
[null,null,null,"Yorkshire and The Humber","Sheffield",null,"","North West","Morecambe and Lunesdale"]
[null,null,null,"Yorkshire and The Humber","Wakefield",null,"","North West","Oldham East and Saddleworth"]
[null,null,null,"Yorkshire and The Humber","York",null,"","North West","Oldham West and Royton"]
[null,null,null,"East Midlands","Derby",null,"","North West","Pendle"]
[null,null,null,"East Midlands","Derbyshire",null,"","North West","Penrith and The Border"]
[null,null,null,"East Midlands","Amber Valley",null,"","North West","Preston"]
[null,null,null,"East Midlands","Bolsover",null,"","North West","Ribble Valley"]
[null,null,null,"East Midlands","Chesterfield",null,"","North West","Rochdale"]
[null,null,null,"East Midlands","Derbyshire Dales",null,"","North West","Rossendale and Darwen"]
[null,null,null,"East Midlands","Erewash",null,"","North West","Salford and Eccles"]
[null,null,null,"East Midlands","High Peak",null,"","North West","Sefton Central"]
[null,null,null,"East Midlands","North East Derbyshire",null,"","North West","South Ribble"]
[null,null,null,"East Midlands","South Derbyshire",null,"","North West","Southport"]
[null,null,null,"East Midlands","Leicester",null,"","North West","St Helens North"]
[null,null,null,"East Midlands","Leicestershire",null,"","North West","St Helens South and Whiston"]
[null,null,null,"East Midlands","Blaby",null,"","North West","Stalybridge and Hyde"]
[null,null,null,"East Midlands","Charnwood",null,"","North West","Stockport"]
[null,null,null,"East Midlands","Harborough",null,"","North West","Stretford and Urmston"]
[null,null,null,"East Midlands","Hinckley and Bosworth",null,"","North West","Tatton"]
[null,null,null,"East Midlands","Melton",null,"","North West","Wallasey"]
[null,null,null,"East Midlands","North West Leicestershire",null,"","North West","Warrington North"]
[null,null,null,"East Midlands","Oadby and Wigston",null,"","North West","Warrington South"]
[null,null,null,"East Midlands","Lincolnshire",null,"","North West","Weaver Vale"]
[null,null,null,"East Midlands","Boston",null,"","North West","West Lancashire"]
[null,null,null,"East Midlands","East Lindsey",null,"","North West","Westmorland and Lonsdale"]
[null,null,null,"East Midlands","Lincoln",null,"","North West","Wigan"]
[null,null,null,"East Midlands","North Kesteven",null,"","North West","Wirral South"]
[null,null,null,"East Midlands","South Holland",null,"","North West","Wirral West"]
[null,null,null,"East Midlands","South Kesteven",null,"","North West","Workington"]
[null,null,null,"East Midlands","West Lindsey",null,"","North West","Worsley and Eccles South"]
[null,null,null,"East Midlands","Northamptonshire",null,"","North West","Wyre and Preston North"]
[null,null,null,"East Midlands","Corby",null,"","North West","Wythenshawe and Sale East"]
[null,null,null,"East Midlands","Daventry",null,"","Yorkshire and The Humber","Barnsley Central"]
[null,null,null,"East Midlands","East Northamptonshire",null,"","Yorkshire and The Humber","Barnsley East"]
[null,null,null,"East Midlands","Kettering",null,"","Yorkshire and The Humber","Batley and Spen"]
[null,null,null,"East Midlands","Northampton",null,"","Yorkshire and The Humber","Beverley and Holderness"]
[null,null,null,"East Midlands","South Northamptonshire",null,"","Yorkshire and The Humber","Bradford East"]
[null,null,null,"East Midlands","Wellingborough",null,"","Yorkshire and The Humber","Bradford South"]
[null,null,null,"East Midlands","Nottingham",null,"","Yorkshire and The Humber","Bradford West"]
[null,null,null,"East Midlands","Nottinghamshire",null,"","Yorkshire and The Humber","Brigg and Goole"]
[null,null,null,"East Midlands","Ashfield",null,"","Yorkshire and The Humber","Calder Valley"]
[null,null,null,"East Midlands","Bassetlaw",null,"","Yorkshire and The Humber","Cleethorpes"]
[null,null,null,"East Midlands","Broxtowe",null,"","Yorkshire and The Humber","Colne Valley"]
[null,null,null,"East Midlands","Gedling",null,"","Yorkshire and The Humber","Dewsbury"]
[null,null,null,"East Midlands","Mansfield",null,"","Yorkshire and The Humber","Don Valley"]
[null,null,null,"East Midlands","Newark and Sherwood",null,"","Yorkshire and The Humber","Doncaster Central"]
[null,null,null,"East Midlands","Rushcliffe",null,"","Yorkshire and The Humber","Doncaster North"]
[null,null,null,"East Midlands","Rutland",null,"","Yorkshire and The Humber","East Yorkshire"]
[null,null,null,"West Midlands","Birmingham",null,"","Yorkshire and The Humber","Elmet and Rothwell"]
[null,null,null,"West Midlands","Coventry",null,"","Yorkshire and The Humber","Great Grimsby"]
[null,null,null,"West Midlands","Dudley",null,"","Yorkshire and The Humber","Halifax"]
[null,null,null,"West Midlands","Herefordshire",null,"","Yorkshire and The Humber","Haltemprice and Howden"]
[null,null,null,"West Midlands","Sandwell",null,"","Yorkshire and The Humber","Harrogate and Knaresborough"]
[null,null,null,"West Midlands","Shropshire",null,"","Yorkshire and The Humber","Hemsworth"]
[null,null,null,"West Midlands","Solihull",null,"","Yorkshire and The Humber","Huddersfield"]
[null,null,null,"West Midlands","Staffordshire",null,"","Yorkshire and The Humber","Keighley"]
[null,null,null,"West Midlands","Cannock Chase",null,"","Yorkshire and The Humber","Kingston upon Hull East"]
[null,null,null,"West Midlands","East Staffordshire",null,"","Yorkshire and The Humber","Kingston upon Hull North"]
[null,null,null,"West Midlands","Lichfield",null,"","Yorkshire and The Humber","Kingston upon Hull West and Hessle"]
[null,null,null,"West Midlands","Newcastle under Lyme",null,"","Yorkshire and The Humber","Leeds Central"]
[null,null,null,"West Midlands","South Staffordshire",null,"","Yorkshire and The Humber","Leeds East"]
[null,null,null,"West Midlands","Stafford",null,"","Yorkshire and The Humber","Leeds North East"]
[null,null,null,"West Midlands","Staffordshire Moorlands",null,"","Yorkshire and The Humber","Leeds North West"]
[null,null,null,"West Midlands","Tamworth",null,"","Yorkshire and The Humber","Leeds West"]
[null,null,null,"West Midlands","Stoke-on-Trent",null,"","Yorkshire and The Humber","Morley and Outwood"]
[null,null,null,"West Midlands","Telford and Wrekin",null,"","Yorkshire and The Humber","Normanton Pontefract and Castleford"]
[null,null,null,"West Midlands","Walsall",null,"","Yorkshire and The Humber","Penistone and Stocksbridge"]
[null,null,null,"West Midlands","Warwickshire",null,"","Yorkshire and The Humber","Pudsey"]
[null,null,null,"West Midlands","North Warwickshire",null,"","Yorkshire and The Humber","Richmond (Yorks)"]
[null,null,null,"West Midlands","Nuneaton and Bedworth",null,"","Yorkshire and The Humber","Rother Valley"]
[null,null,null,"West Midlands","Rugby",null,"","Yorkshire and The Humber","Rotherham"]
[null,null,null,"West Midlands","Stratford on Avon",null,"","Yorkshire and The Humber","Scarborough and Whitby"]
[null,null,null,"West Midlands","Warwick",null,"","Yorkshire and The Humber","Scunthorpe"]
[null,null,null,"West Midlands","Wolverhampton",null,"","Yorkshire and The Humber","Selby and Ainsty"]
[null,null,null,"West Midlands","Worcestershire",null,"","Yorkshire and The Humber","Sheffield Central"]
[null,null,null,"West Midlands","Bromsgrove",null,"","Yorkshire and The Humber","Sheffield South East"]
[null,null,null,"West Midlands","Malvern Hills",null,"","Yorkshire and The Humber","Sheffield Brightside and Hillsborough"]
[null,null,null,"West Midlands","Redditch",null,"","Yorkshire and The Humber","Sheffield Hallam"]
[null,null,null,"West Midlands","Worcester",null,"","Yorkshire and The Humber","Sheffield Heeley"]
[null,null,null,"West Midlands","Wychavon",null,"","Yorkshire and The Humber","Shipley"]
[null,null,null,"West Midlands","Wyre Forest",null,"","Yorkshire and The Humber","Skipton and Ripon"]
[null,null,null,"East of England","Bedford Borough",null,"","Yorkshire and The Humber","Thirsk and Malton"]
[null,null,null,"East of England","Cambridgeshire",null,"","Yorkshire and The Humber","Wakefield"]
[null,null,null,"East of England","Cambridge",null,"","Yorkshire and The Humber","Wentworth and Dearne"]
[null,null,null,"East of England","East Cambridgeshire",null,"","Yorkshire and The Humber","York Central"]
[null,null,null,"East of England","Fenland",null,"","Yorkshire and The Humber","York Outer"]
[null,null,null,"East of England","Huntingdonshire",null,"","East Midlands","Amber Valley"]
[null,null,null,"East of England","South Cambridgeshire",null,"","East Midlands","Ashfield"]
[null,null,null,"East of England","Central Bedfordshire",null,"","East Midlands","Bassetlaw"]
[null,null,null,"East of England","Essex",null,"","East Midlands","Bolsover"]
[null,null,null,"East of England","Basildon",null,"","East Midlands","Boston and Skegness"]
[null,null,null,"East of England","Braintree",null,"","East Midlands","Bosworth"]
[null,null,null,"East of England","Brentwood",null,"","East Midlands","Broxtowe"]
[null,null,null,"East of England","Castle Point",null,"","East Midlands","Charnwood"]
[null,null,null,"East of England","Chelmsford",null,"","East Midlands","Chesterfield"]
[null,null,null,"East of England","Colchester",null,"","East Midlands","Corby"]
[null,null,null,"East of England","Epping Forest",null,"","East Midlands","Daventry"]
[null,null,null,"East of England","Harlow",null,"","East Midlands","Derby North"]
[null,null,null,"East of England","Maldon",null,"","East Midlands","Derby South"]
[null,null,null,"East of England","Rochford",null,"","East Midlands","Derbyshire Dales"]
[null,null,null,"East of England","Tendring",null,"","East Midlands","Erewash"]
[null,null,null,"East of England","Uttlesford",null,"","East Midlands","Gainsborough"]
[null,null,null,"East of England","Hertfordshire",null,"","East Midlands","Gedling"]
[null,null,null,"East of England","Broxbourne",null,"","East Midlands","Grantham and Stamford"]
[null,null,null,"East of England","Dacorum",null,"","East Midlands","Harborough"]
[null,null,null,"East of England","East Hertfordshire",null,"","East Midlands","High Peak"]
[null,null,null,"East of England","Hertsmere",null,"","East Midlands","Kettering"]
[null,null,null,"East of England","North Hertfordshire",null,"","East Midlands","Leicester East"]
[null,null,null,"East of England","St. Albans District",null,"","East Midlands","Leicester South"]
[null,null,null,"East of England","Stevenage",null,"","East Midlands","Leicester West"]
[null,null,null,"East of England","Three Rivers",null,"","East Midlands","Lincoln"]
[null,null,null,"East of England","Watford",null,"","East Midlands","Loughborough"]
[null,null,null,"East of England","Welwyn Hatfield District",null,"","East Midlands","Louth and Horncastle"]
[null,null,null,"East of England","Luton",null,"","East Midlands","Mansfield"]
[null,null,null,"East of England","Norfolk",null,"","East Midlands","Mid Derbyshire"]
[null,null,null,"East of England","Breckland",null,"","East Midlands","Newark"]
[null,null,null,"East of England","Broadland",null,"","East Midlands","North East Derbyshire"]
[null,null,null,"East of England","Great Yarmouth",null,"","East Midlands","North West Leicestershire"]
[null,null,null,"East of England","Kings Lynn and West Norfolk",null,"","East Midlands","Northampton North"]
[null,null,null,"East of England","North Norfolk",null,"","East Midlands","Northampton South"]
[null,null,null,"East of England","Norwich",null,"","East Midlands","Nottingham East"]
[null,null,null,"East of England","South Norfolk",null,"","East Midlands","Nottingham North"]
[null,null,null,"East of England","Peterborough",null,"","East Midlands","Nottingham South"]
[null,null,null,"East of England","Southend on Sea",null,"","East Midlands","Rushcliffe"]
[null,null,null,"East of England","Suffolk",null,"","East Midlands","Rutland and Melton"]
[null,null,null,"East of England","Babergh",null,"","East Midlands","Sherwood"]
[null,null,null,"East of England","Forest Heath",null,"","East Midlands","Sleaford and North Hykeham"]
[null,null,null,"East of England","Ipswich",null,"","East Midlands","South Derbyshire"]
[null,null,null,"East of England","Mid Suffolk",null,"","East Midlands","South Holland and The Deepings"]
[null,null,null,"East of England","St Edmundsbury",null,"","East Midlands","South Leicestershire"]
[null,null,null,"East of England","Suffolk Coastal",null,"","East Midlands","South Northamptonshire"]
[null,null,null,"East of England","Waveney",null,"","East Midlands","Wellingborough"]
[null,null,null,"East of England","Thurrock",null,"","West Midlands","Aldridge Brownhills"]
[null,null,null,"London","Camden",null,"","West Midlands","Birmingham Edgbaston"]
[null,null,null,"London","City of London",null,"","West Midlands","Birmingham Erdington"]
[null,null,null,"London","Hackney",null,"","West Midlands","Birmingham Hall Green"]
[null,null,null,"London","Hammersmith and Fulham",null,"","West Midlands","Birmingham Hodge Hill"]
[null,null,null,"London","Haringey",null,"","West Midlands","Birmingham Ladywood"]
[null,null,null,"London","Islington",null,"","West Midlands","Birmingham Northfield"]
[null,null,null,"London","Kensington and Chelsea",null,"","West Midlands","Birmingham Perry Barr"]
[null,null,null,"London","Lambeth",null,"","West Midlands","Birmingham Selly Oak"]
[null,null,null,"London","Lewisham",null,"","West Midlands","Birmingham Yardley"]
[null,null,null,"London","Newham",null,"","West Midlands","Bromsgrove"]
[null,null,null,"London","Southwark",null,"","West Midlands","Burton"]
[null,null,null,"London","Tower Hamlets",null,"","West Midlands","Cannock Chase"]
[null,null,null,"London","Wandsworth",null,"","West Midlands","Coventry North East"]
[null,null,null,"London","Westminster",null,"","West Midlands","Coventry North West"]
[null,null,null,"London","Barking and Dagenham",null,"","West Midlands","Coventry South"]
[null,null,null,"London","Barnet",null,"","West Midlands","Dudley North"]
[null,null,null,"London","Bexley",null,"","West Midlands","Dudley South"]
[null,null,null,"London","Brent",null,"","West Midlands","Halesowen and Rowley Regis"]
[null,null,null,"London","Bromley",null,"","West Midlands","Hereford and South Herefordshire"]
[null,null,null,"London","Croydon",null,"","West Midlands","Kenilworth and Southam"]
[null,null,null,"London","Ealing",null,"","West Midlands","Lichfield"]
[null,null,null,"London","Enfield",null,"","West Midlands","Ludlow"]
[null,null,null,"London","Greenwich",null,"","West Midlands","Meriden"]
[null,null,null,"London","Harrow",null,"","West Midlands","Mid Worcestershire"]
[null,null,null,"London","Havering",null,"","West Midlands","Newcastle under Lyme"]
[null,null,null,"London","Hillingdon",null,"","West Midlands","North Herefordshire"]
[null,null,null,"London","Hounslow",null,"","West Midlands","North Shropshire"]
[null,null,null,"London","Kingston upon Thames",null,"","West Midlands","North Warwickshire"]
[null,null,null,"London","Merton",null,"","West Midlands","Nuneaton"]
[null,null,null,"London","Redbridge",null,"","West Midlands","Redditch"]
[null,null,null,"London","Richmond upon Thames",null,"","West Midlands","Rugby"]
[null,null,null,"London","Sutton",null,"","West Midlands","Shrewsbury and Atcham"]
[null,null,null,"London","Waltham Forest",null,"","West Midlands","Solihull"]
[null,null,null,"South East","Bracknell Forest",null,"","West Midlands","South Staffordshire"]
[null,null,null,"South East","Brighton and Hove",null,"","West Midlands","Stafford"]
[null,null,null,"South East","Buckinghamshire",null,"","West Midlands","Staffordshire Moorlands"]
[null,null,null,"South East","Aylesbury Vale",null,"","West Midlands","Stoke on Trent Central"]
[null,null,null,"South East","Chiltern",null,"","West Midlands","Stoke on Trent North"]
[null,null,null,"South East","South Bucks",null,"","West Midlands","Stoke on Trent South"]
[null,null,null,"South East","Wycombe",null,"","West Midlands","Stone"]
[null,null,null,"South East","East Sussex",null,"","West Midlands","Stourbridge"]
[null,null,null,"South East","Eastbourne",null,"","West Midlands","Stratford on Avon"]
[null,null,null,"South East","Hastings",null,"","West Midlands","Sutton Coldfield"]
[null,null,null,"South East","Lewes",null,"","West Midlands","Tamworth"]
[null,null,null,"South East","Rother",null,"","West Midlands","Telford"]
[null,null,null,"South East","Wealden",null,"","West Midlands","The Wrekin"]
[null,null,null,"South East","Hampshire",null,"","West Midlands","Walsall North"]
[null,null,null,"South East","Basingstoke and Deane",null,"","West Midlands","Walsall South"]
[null,null,null,"South East","East Hampshire",null,"","West Midlands","Warley"]
[null,null,null,"South East","Eastleigh",null,"","West Midlands","Warwick and Leamington"]
[null,null,null,"South East","Fareham",null,"","West Midlands","West Bromwich East"]
[null,null,null,"South East","Gosport",null,"","West Midlands","West Bromwich West"]
[null,null,null,"South East","Hart",null,"","West Midlands","West Worcestershire"]
[null,null,null,"South East","Havant",null,"","West Midlands","Wolverhampton North East"]
[null,null,null,"South East","New Forest",null,"","West Midlands","Wolverhampton South East"]
[null,null,null,"South East","Rushmoor",null,"","West Midlands","Wolverhampton South West"]
[null,null,null,"South East","Test Valley",null,"","West Midlands","Worcester"]
[null,null,null,"South East","Winchester",null,"","West Midlands","Wyre Forest"]
[null,null,null,"South East","Isle of Wight",null,"","East of England","Basildon and Billericay"]
[null,null,null,"South East","Kent",null,"","East of England","Bedford"]
[null,null,null,"South East","Ashford",null,"","East of England","Braintree"]
[null,null,null,"South East","Canterbury",null,"","East of England","Brentwood and Ongar"]
[null,null,null,"South East","Dartford",null,"","East of England","Broadland"]
[null,null,null,"South East","Dover",null,"","East of England","Broxbourne"]
[null,null,null,"South East","Gravesham",null,"","East of England","Bury St Edmunds"]
[null,null,null,"South East","Maidstone",null,"","East of England","Cambridge"]
[null,null,null,"South East","Sevenoaks",null,"","East of England","Castle Point"]
[null,null,null,"South East","Shepway",null,"","East of England","Central Suffolk and North Ipswich"]
[null,null,null,"South East","Swale",null,"","East of England","Chelmsford"]
[null,null,null,"South East","Thanet",null,"","East of England","Clacton"]
[null,null,null,"South East","Tonbridge and Malling",null,"","East of England","Colchester"]
[null,null,null,"South East","Tunbridge Wells",null,"","East of England","Epping Forest"]
[null,null,null,"South East","Medway",null,"","East of England","Great Yarmouth"]
[null,null,null,"South East","Milton Keynes",null,"","East of England","Harlow"]
[null,null,null,"South East","Oxfordshire",null,"","East of England","Harwich and North Essex"]
[null,null,null,"South East","Cherwell",null,"","East of England","Hemel Hempstead"]
[null,null,null,"South East","Oxford",null,"","East of England","Hertford and Stortford"]
[null,null,null,"South East","South Oxfordshire",null,"","East of England","Hertsmere"]
[null,null,null,"South East","Vale of White Horse",null,"","East of England","Hitchin and Harpenden"]
[null,null,null,"South East","West Oxfordshire",null,"","East of England","Huntingdon"]
[null,null,null,"South East","Portsmouth",null,"","East of England","Ipswich"]
[null,null,null,"South East","Reading",null,"","East of England","Luton North"]
[null,null,null,"South East","Slough",null,"","East of England","Luton South"]
[null,null,null,"South East","Southampton",null,"","East of England","Maldon"]
[null,null,null,"South East","Surrey",null,"","East of England","Mid Bedfordshire"]
[null,null,null,"South East","Elmbridge",null,"","East of England","Mid Norfolk"]
[null,null,null,"South East","Epsom and Ewell",null,"","East of England","North East Bedfordshire"]
[null,null,null,"South East","Guildford",null,"","East of England","North East Cambridgeshire"]
[null,null,null,"South East","Mole Valley",null,"","East of England","North East Hertfordshire"]
[null,null,null,"South East","Reigate and Banstead",null,"","East of England","North Norfolk"]
[null,null,null,"South East","Runnymede",null,"","East of England","North West Cambridgeshire"]
[null,null,null,"South East","Spelthorne",null,"","East of England","North West Norfolk"]
[null,null,null,"South East","Surrey Heath",null,"","East of England","Norwich North"]
[null,null,null,"South East","Tandridge",null,"","East of England","Norwich South"]
[null,null,null,"South East","Waverley",null,"","East of England","Peterborough"]
[null,null,null,"South East","Woking",null,"","East of England","Rayleigh and Wickford"]
[null,null,null,"South East","West Berkshire",null,"","East of England","Rochford and Southend East"]
[null,null,null,"South East","West Sussex",null,"","East of England","Saffron Walden"]
[null,null,null,"South East","Adur",null,"","East of England","South Basildon and East Thurrock"]
[null,null,null,"South East","Arun",null,"","East of England","South Cambridgeshire"]
[null,null,null,"South East","Chichester",null,"","East of England","South East Cambridgeshire"]
[null,null,null,"South East","Crawley",null,"","East of England","South Norfolk"]
[null,null,null,"South East","Horsham",null,"","East of England","South Suffolk"]
[null,null,null,"South East","Mid Sussex",null,"","East of England","South West Bedfordshire"]
[null,null,null,"South East","Worthing",null,"","East of England","South West Hertfordshire"]
[null,null,null,"South East","Windsor and Maidenhead",null,"","East of England","South West Norfolk"]
[null,null,null,"South East","Wokingham",null,"","East of England","Southend West"]
[null,null,null,"South West","Bath and North East Somerset",null,"","East of England","St Albans"]
[null,null,null,"South West","Bournemouth",null,"","East of England","Stevenage"]
[null,null,null,"South West","Bristol",null,"","East of England","Suffolk Coastal"]
[null,null,null,"South West","Cornwall (Includes Isles of Scilly)",null,"","East of England","Thurrock"]
[null,null,null,"South West","Cornwall",null,"","East of England","Watford"]
[null,null,null,"South West","Isles of Scilly",null,"","East of England","Waveney"]
[null,null,null,"South West","Devon",null,"","East of England","Welwyn Hatfield"]
[null,null,null,"South West","East Devon",null,"","East of England","West Suffolk"]
[null,null,null,"South West","Exeter",null,"","East of England","Witham"]
[null,null,null,"South West","Mid Devon",null,"","London","Barking"]
[null,null,null,"South West","North Devon",null,"","London","Battersea"]
[null,null,null,"South West","South Hams",null,"","London","Beckenham"]
[null,null,null,"South West","Teignbridge",null,"","London","Bermondsey and Old Southwark"]
[null,null,null,"South West","Torridge",null,"","London","Bethnal Green and Bow"]
[null,null,null,"South West","West Devon",null,"","London","Bexleyheath and Crayford"]
[null,null,null,"South West","Dorset",null,"","London","Brent Central"]
[null,null,null,"South West","Christchurch",null,"","London","Brent North"]
[null,null,null,"South West","East Dorset",null,"","London","Brentford and Isleworth"]
[null,null,null,"South West","North Dorset",null,"","London","Bromley and Chislehurst"]
[null,null,null,"South West","Purbeck",null,"","London","Camberwell and Peckham"]
[null,null,null,"South West","West Dorset",null,"","London","Carshalton and Wallington"]
[null,null,null,"South West","Weymouth and Portland",null,"","London","Chelsea and Fulham"]
[null,null,null,"South West","Gloucestershire",null,"","London","Chingford and Woodford Green"]
[null,null,null,"South West","Cheltenham",null,"","London","Chipping Barnet"]
[null,null,null,"South West","Cotswold",null,"","London","Cities of London and Westminster"]
[null,null,null,"South West","Forest of Dean",null,"","London","Croydon Central"]
[null,null,null,"South West","Gloucester",null,"","London","Croydon North"]
[null,null,null,"South West","Stroud",null,"","London","Croydon South"]
[null,null,null,"South West","Tewkesbury",null,"","London","Dagenham and Rainham"]
[null,null,null,"South West","North Somerset",null,"","London","Dulwich and West Norwood"]
[null,null,null,"South West","Plymouth",null,"","London","Ealing Central and Acton"]
[null,null,null,"South West","Poole",null,"","London","Ealing North"]
[null,null,null,"South West","Somerset",null,"","London","Ealing Southall"]
[null,null,null,"South West","Mendip",null,"","London","East Ham"]
[null,null,null,"South West","Sedgemoor",null,"","London","Edmonton"]
[null,null,null,"South West","South Somerset",null,"","London","Eltham"]
[null,null,null,"South West","Taunton Deane",null,"","London","Enfield North"]
[null,null,null,"South West","West Somerset",null,"","London","Enfield Southgate"]
[null,null,null,"South West","South Gloucestershire",null,"","London","Erith and Thamesmead"]
[null,null,null,"South West","Swindon",null,"","London","Feltham and Heston"]
[null,null,null,"South West","Torbay",null,"","London","Finchley and Golders Green"]
[null,null,null,"South West","Wiltshire",null,"","London","Greenwich and Woolwich"]
[null,null,null,null,null,null,"","London","Hackney North and Stoke Newington"]
[null,null,null,null,null,null,"","London","Hackney South and Shoreditch"]
[null,null,null,null,null,null,"","London","Hammersmith"]
[null,null,null,null,null,null,"","London","Hampstead and Kilburn"]
[null,null,null,null,null,null,"","London","Harrow East"]
[null,null,null,null,null,null,"","London","Harrow West"]
[null,null,null,null,null,null,"","London","Hayes and Harlington"]
[null,null,null,null,null,null,"","London","Hendon"]
[null,null,null,null,null,null,"","London","Holborn and St Pancras"]
[null,null,null,null,null,null,"","London","Hornchurch and Upminster"]
[null,null,null,null,null,null,"","London","Hornsey and Wood Green"]
[null,null,null,null,null,null,"","London","Ilford North"]
[null,null,null,null,null,null,"","London","Ilford South"]
[null,null,null,null,null,null,"","London","Islington North"]
[null,null,null,null,null,null,"","London","Islington South and Finsbury"]
[null,null,null,null,null,null,"","London","Kensington"]
[null,null,null,null,null,null,"","London","Kingston and Surbiton"]
[null,null,null,null,null,null,"","London","Lewisham East"]
[null,null,null,null,null,null,"","London","Lewisham West and Penge"]
[null,null,null,null,null,null,"","London","Lewisham Deptford"]
[null,null,null,null,null,null,"","London","Leyton and Wanstead"]
[null,null,null,null,null,null,"","London","Mitcham and Morden"]
[null,null,null,null,null,null,"","London","Old Bexley and Sidcup"]
[null,null,null,null,null,null,"","London","Orpington"]
[null,null,null,null,null,null,"","London","Poplar and Limehouse"]
[null,null,null,null,null,null,"","London","Putney"]
[null,null,null,null,null,null,"","London","Richmond Park"]
[null,null,null,null,null,null,"","London","Romford"]
[null,null,null,null,null,null,"","London","Ruislip Northwood and Pinner"]
[null,null,null,null,null,null,"","London","Streatham"]
[null,null,null,null,null,null,"","London","Sutton and Cheam"]
[null,null,null,null,null,null,"","London","Tooting"]
[null,null,null,null,null,null,"","London","Tottenham"]
[null,null,null,null,null,null,"","London","Twickenham"]
[null,null,null,null,null,null,"","London","Uxbridge and South Ruislip"]
[null,null,null,null,null,null,"","London","Vauxhall"]
[null,null,null,null,null,null,"","London","Walthamstow"]
[null,null,null,null,null,null,"","London","West Ham"]
[null,null,null,null,null,null,"","London","Westminster North"]
[null,null,null,null,null,null,"","London","Wimbledon"]
[null,null,null,null,null,null,"","South East","Aldershot"]
[null,null,null,null,null,null,"","South East","Arundel and South Downs"]
[null,null,null,null,null,null,"","South East","Ashford"]
[null,null,null,null,null,null,"","South East","Aylesbury"]
[null,null,null,null,null,null,"","South East","Banbury"]
[null,null,null,null,null,null,"","South East","Basingstoke"]
[null,null,null,null,null,null,"","South East","Beaconsfield"]
[null,null,null,null,null,null,"","South East","Bexhill and Battle"]
[null,null,null,null,null,null,"","South East","Bognor Regis and Littlehampton"]
[null,null,null,null,null,null,"","South East","Bracknell"]
[null,null,null,null,null,null,"","South East","Brighton Kemptown"]
[null,null,null,null,null,null,"","South East","Brighton Pavilion"]
[null,null,null,null,null,null,"","South East","Buckingham"]
[null,null,null,null,null,null,"","South East","Canterbury"]
[null,null,null,null,null,null,"","South East","Chatham and Aylesford"]
[null,null,null,null,null,null,"","South East","Chesham and Amersham"]
[null,null,null,null,null,null,"","South East","Chichester"]
[null,null,null,null,null,null,"","South East","Crawley"]
[null,null,null,null,null,null,"","South East","Dartford"]
[null,null,null,null,null,null,"","South East","Dover"]
[null,null,null,null,null,null,"","South East","East Hampshire"]
[null,null,null,null,null,null,"","South East","East Surrey"]
[null,null,null,null,null,null,"","South East","East Worthing and Shoreham"]
[null,null,null,null,null,null,"","South East","Eastbourne"]
[null,null,null,null,null,null,"","South East","Eastleigh"]
[null,null,null,null,null,null,"","South East","Epsom and Ewell"]
[null,null,null,null,null,null,"","South East","Esher and Walton"]
[null,null,null,null,null,null,"","South East","Fareham"]
[null,null,null,null,null,null,"","South East","Faversham and Mid Kent"]
[null,null,null,null,null,null,"","South East","Folkestone and Hythe"]
[null,null,null,null,null,null,"","South East","Gillingham and Rainham"]
[null,null,null,null,null,null,"","South East","Gosport"]
[null,null,null,null,null,null,"","South East","Gravesham"]
[null,null,null,null,null,null,"","South East","Guildford"]
[null,null,null,null,null,null,"","South East","Hastings and Rye"]
[null,null,null,null,null,null,"","South East","Havant"]
[null,null,null,null,null,null,"","South East","Henley"]
[null,null,null,null,null,null,"","South East","Horsham"]
[null,null,null,null,null,null,"","South East","Hove"]
[null,null,null,null,null,null,"","South East","Isle of Wight"]
[null,null,null,null,null,null,"","South East","Lewes"]
[null,null,null,null,null,null,"","South East","Maidenhead"]
[null,null,null,null,null,null,"","South East","Maidstone and The Weald"]
[null,null,null,null,null,null,"","South East","Meon Valley"]
[null,null,null,null,null,null,"","South East","Mid Sussex"]
[null,null,null,null,null,null,"","South East","Milton Keynes North"]
[null,null,null,null,null,null,"","South East","Milton Keynes South"]
[null,null,null,null,null,null,"","South East","Mole Valley"]
[null,null,null,null,null,null,"","South East","New Forest East"]
[null,null,null,null,null,null,"","South East","New Forest West"]
[null,null,null,null,null,null,"","South East","Newbury"]
[null,null,null,null,null,null,"","South East","North East Hampshire"]
[null,null,null,null,null,null,"","South East","North Thanet"]
[null,null,null,null,null,null,"","South East","North West Hampshire"]
[null,null,null,null,null,null,"","South East","Oxford East"]
[null,null,null,null,null,null,"","South East","Oxford West and Abingdon"]
[null,null,null,null,null,null,"","South East","Portsmouth North"]
[null,null,null,null,null,null,"","South East","Portsmouth South"]
[null,null,null,null,null,null,"","South East","Reading East"]
[null,null,null,null,null,null,"","South East","Reading West"]
[null,null,null,null,null,null,"","South East","Reigate"]
[null,null,null,null,null,null,"","South East","Rochester and Strood"]
[null,null,null,null,null,null,"","South East","Romsey and Southampton North"]
[null,null,null,null,null,null,"","South East","Runnymede and Weybridge"]
[null,null,null,null,null,null,"","South East","Sevenoaks"]
[null,null,null,null,null,null,"","South East","Sittingbourne and Sheppey"]
[null,null,null,null,null,null,"","South East","Slough"]
[null,null,null,null,null,null,"","South East","South Thanet"]
[null,null,null,null,null,null,"","South East","South West Surrey"]
[null,null,null,null,null,null,"","South East","Southampton Itchen"]
[null,null,null,null,null,null,"","South East","Southampton Test"]
[null,null,null,null,null,null,"","South East","Spelthorne"]
[null,null,null,null,null,null,"","South East","Surrey Heath"]
[null,null,null,null,null,null,"","South East","Tonbridge and Malling"]
[null,null,null,null,null,null,"","South East","Tunbridge Wells"]
[null,null,null,null,null,null,"","South East","Wantage"]
[null,null,null,null,null,null,"","South East","Wealden"]
[null,null,null,null,null,null,"","South East","Winchester"]
[null,null,null,null,null,null,"","South East","Windsor"]
[null,null,null,null,null,null,"","South East","Witney"]
[null,null,null,null,null,null,"","South East","Woking"]
[null,null,null,null,null,null,"","South East","Wokingham"]
[null,null,null,null,null,null,"","South East","Worthing West"]
[null,null,null,null,null,null,"","South East","Wycombe"]
[null,null,null,null,null,null,"","South West","Bath"]
[null,null,null,null,null,null,"","South West","Bournemouth East"]
[null,null,null,null,null,null,"","South West","Bournemouth West"]
[null,null,null,null,null,null,"","South West","Bridgwater and West Somerset"]
[null,null,null,null,null,null,"","South West","Bristol East"]
[null,null,null,null,null,null,"","South West","Bristol North West"]
[null,null,null,null,null,null,"","South West","Bristol South"]
[null,null,null,null,null,null,"","South West","Bristol West"]
[null,null,null,null,null,null,"","South West","Camborne and Redruth"]
[null,null,null,null,null,null,"","South West","Central Devon"]
[null,null,null,null,null,null,"","South West","Cheltenham"]
[null,null,null,null,null,null,"","South West","Chippenham"]
[null,null,null,null,null,null,"","South West","Christchurch"]
[null,null,null,null,null,null,"","South West","Devizes"]
[null,null,null,null,null,null,"","South West","East Devon"]
[null,null,null,null,null,null,"","South West","Exeter"]
[null,null,null,null,null,null,"","South West","Filton and Bradley Stoke"]
[null,null,null,null,null,null,"","South West","Forest of Dean"]
[null,null,null,null,null,null,"","South West","Gloucester"]
[null,null,null,null,null,null,"","South West","Kingswood"]
[null,null,null,null,null,null,"","South West","Mid Dorset and North Poole"]
[null,null,null,null,null,null,"","South West","Newton Abbot"]
[null,null,null,null,null,null,"","South West","North Cornwall"]
[null,null,null,null,null,null,"","South West","North Devon"]
[null,null,null,null,null,null,"","South West","North Dorset"]
[null,null,null,null,null,null,"","South West","North East Somerset"]
[null,null,null,null,null,null,"","South West","North Somerset"]
[null,null,null,null,null,null,"","South West","North Swindon"]
[null,null,null,null,null,null,"","South West","North Wiltshire"]
[null,null,null,null,null,null,"","South West","Plymouth Moor View"]
[null,null,null,null,null,null,"","South West","Plymouth Sutton and Devonport"]
[null,null,null,null,null,null,"","South West","Poole"]
[null,null,null,null,null,null,"","South West","Salisbury"]
[null,null,null,null,null,null,"","South West","Somerton and Frome"]
[null,null,null,null,null,null,"","South West","South Dorset"]
[null,null,null,null,null,null,"","South West","South East Cornwall"]
[null,null,null,null,null,null,"","South West","South Swindon"]
[null,null,null,null,null,null,"","South West","South West Devon"]
[null,null,null,null,null,null,"","South West","South West Wiltshire"]
[null,null,null,null,null,null,"","South West","St Austell and Newquay"]
[null,null,null,null,null,null,"","South West","St Ives"]
[null,null,null,null,null,null,"","South West","Stroud"]
[null,null,null,null,null,null,"","South West","Taunton Deane"]
[null,null,null,null,null,null,"","South West","Tewkesbury"]
[null,null,null,null,null,null,"","South West","The Cotswolds"]
[null,null,null,null,null,null,"","South West","Thornbury and Yate"]
[null,null,null,null,null,null,"","South West","Tiverton and Honiton"]
[null,null,null,null,null,null,"","South West","Torbay"]
[null,null,null,null,null,null,"","South West","Torridge and West Devon"]
[null,null,null,null,null,null,"","South West","Totnes"]
[null,null,null,null,null,null,"","South West","Truro and Falmouth"]
[null,null,null,null,null,null,"","South West","Wells"]
[null,null,null,null,null,null,"","South West","West Dorset"]
[null,null,null,null,null,null,"","South West","Weston Super Mare"]
[null,null,null,null,null,null,"","South West","Yeovil"]
[null,null,null,null,null,null,""]
[null,null,null,null,null,null,""]
[null,null,null,null,null,null,""]
[null,null,null,null,null,null,""]
[null,null,null,null,null,null,""]
[null,null,null,null,null,null,""]
[null,null,null,null,null,null,""]
[null,null,null,null,null,null,""]
[null,null,null,null,null,null,""]
[null,null,null,null,null,null,""]
[null,null,null,null,null,null,""]
[null,null,null,null,null,null,""]
[null,null,null,null,null,null,""]
[null,null,null,null,null,null,""]
[null,null,null,null,null,null,""]
[null,null,null,null,null,null,""]
[null,null,null,null,null,null,""]
[null,null,null,null,null,null,""]
[null,null,null,null,null,null,""]
[null,null,null,null,null,null,""]
[null,null,null,null,null,null,""]
[null,null,null,null,null,null,""]
[null,null,null,null,null,null,""]
[null,null,null,null,null,null,""]
[null,null,null,null,null,null,""]
[null,null,null,null,null,null,""]