{"text_format":"1","workbook":"xlsx","n_sheets":7,"sheets":["User Guide","Notes","LEALA Dashboard","PCON Dashboard","Apps Ach - LEALA (R)","Apps-Ach-PCON (R)","Lists"],"not_rendered":{"charts":0,"images":6,"macros":0,"external_links":0,"defined_names":2,"comments":0,"pivot_tables":0},"unopened":[],"bounds":{"document_bytes":16777216,"sheet_cells":100000,"rows_first":2000,"rows_last":500,"rows_between":2000,"halvings":0,"cell_chars":16384,"cell_head_chars":4096},"cells_cut":0,"cells_raw":0,"read":"whole","date_system":"1900"}

{"sheet":"User Guide","index":0,"n_rows":30,"n_cols":3,"rows_kept":30,"cut":false,"hidden":false,"merged":[[3,2,3,6],[10,0,10,16],[11,0,11,16],[12,0,12,16],[15,0,15,16],[22,0,22,13],[24,0,24,9],[29,0,29,9],[16,0,16,16],[17,0,17,9],[20,0,20,16],[21,0,21,13],[25,0,25,9],[26,0,26,9]]}
[]
[]
[]
[null,null,"User Guide"]
[]
[]
[]
["General information"]
["This tool is in development.  It will be updated on an adhoc basis and will evolve over time."]
["This datapack contains the following:\n\n\n\n"]
{"$rows_left_out":21}
{"sheet":"Notes","index":1,"n_rows":55,"n_cols":10,"rows_kept":55,"cut":false,"hidden":false,"merged":[[19,11,19,12],[20,1,20,9],[20,11,20,12],[9,1,9,9],[10,1,10,9],[11,1,11,9],[12,1,12,9],[13,1,13,9],[14,1,14,9],[15,1,15,9],[16,1,16,9],[17,1,17,9],[19,1,19,9],[18,1,18,9],[34,1,34,9],[27,1,27,9],[32,1,32,9],[33,1,33,9],[47,1,47,9],[35,1,35,9],[36,1,36,9],[37,1,37,9],[44,1,44,9],[45,1,45,9],[46,1,46,9],[21,1,21,9],[25,1,25,9],[26,1,26,9],[24,1,24,9],[22,1,22,9],[23,1,23,9]]}
[]
[]
[]
[]
[]
[]
[]
[]
[]
[null,"Table Notes"]
{"$rows_left_out":46}
{"sheet":"LEALA Dashboard","index":2,"n_rows":73,"n_cols":10,"rows_kept":73,"cut":false,"hidden":false,"merged":[[7,1,7,9],[1,3,1,8]]}
[]
[null,null,null,"Local Education Authority/ Local Authority data on Apprenticeship Achievements"]
[]
[null,null,null,"Local Education Authority/ Local Authority",1]
[]
[]
[]
[null,"Apprenticeship - Achievements"]
[null,"Level","Age","Geography","LEA/LA/Region/England","2011/12","2012/13","2013/14","2014/15","2015/16"]
[null,"All","All","LEA/LA",{"$f":"INDEX('Apps Ach - LEALA (R)'!$B:$B,MATCH('LEALA Dashboard'!$E$4,'Apps Ach - LEALA (R)'!$A:$A,0))","v":"Adur"},{"$f":"INDEX('Apps Ach - LEALA (R)'!$C$7:$CD$360,MATCH('LEALA Dashboard'!$E$4,'Apps Ach - LEALA (R)'!$A$7:$A$360,0),MATCH(F$9&$B10&$C10,'Apps Ach - LEALA (R)'!$C$3:$CD$3,0))","v":0},{"$f":"INDEX('Apps Ach - LEALA (R)'!$C$7:$CD$360,MATCH('LEALA Dashboard'!$E$4,'Apps Ach - LEALA (R)'!$A$7:$A$360,0),MATCH(G$9&$B10&$C10,'Apps Ach - LEALA (R)'!$C$3:$CD$3,0))","v":230},{"$f":"INDEX('Apps Ach - LEALA (R)'!$C$7:$CD$360,MATCH('LEALA Dashboard'!$E$4,'Apps Ach - LEALA (R)'!$A$7:$A$360,0),MATCH(H$9&$B10&$C10,'Apps Ach - LEALA (R)'!$C$3:$CD$3,0))","v":260},{"$f":"INDEX('Apps Ach - LEALA (R)'!$C$7:$CD$360,MATCH('LEALA Dashboard'!$E$4,'Apps Ach - LEALA (R)'!$A$7:$A$360,0),MATCH(I$9&$B10&$C10,'Apps Ach - LEALA (R)'!$C$3:$CD$3,0))","v":250},{"$f":"INDEX('Apps Ach - LEALA (R)'!$C$7:$CD$360,MATCH('LEALA Dashboard'!$E$4,'Apps Ach - LEALA (R)'!$A$7:$A$360,0),MATCH(J$9&$B10&$C10,'Apps Ach - LEALA (R)'!$C$3:$CD$3,0))","v":240}]
{"$rows_left_out":64}
{"sheet":"PCON Dashboard","index":3,"n_rows":72,"n_cols":10,"rows_kept":72,"cut":false,"hidden":false,"merged":[[6,1,6,9],[1,3,1,8]]}
[]
[null,null,null,"Parliamentary Constituency data on Apprenticeship Achievements"]
[null,null,null,"Parliamentary Constituency",1]
[]
[]
[]
[null,"Apprenticeship - Achievements"]
[null,"Level","Age","Geography","PCON/Region/England","2011/12","2012/13","2013/14","2014/15","2015/16"]
[null,"All","All","PCON",{"$f":"INDEX('Apps-Ach-PCON (R)'!$B:$B,MATCH('PCON Dashboard'!$E$3,'Apps-Ach-PCON (R)'!$A:$A,0))","v":"Aldershot"},{"$f":"INDEX('Apps-Ach-PCON (R)'!$D$7:$CE$539,MATCH('PCON Dashboard'!$E$3,'Apps-Ach-PCON (R)'!$A$7:$A$539,0),MATCH(F$8&$B9&$C9,'Apps-Ach-PCON (R)'!$D$3:$CE$3,0))","v":510},{"$f":"INDEX('Apps-Ach-PCON (R)'!$D$7:$CE$539,MATCH('PCON Dashboard'!$E$3,'Apps-Ach-PCON (R)'!$A$7:$A$539,0),MATCH(G$8&$B9&$C9,'Apps-Ach-PCON (R)'!$D$3:$CE$3,0))","v":580},{"$f":"INDEX('Apps-Ach-PCON (R)'!$D$7:$CE$539,MATCH('PCON Dashboard'!$E$3,'Apps-Ach-PCON (R)'!$A$7:$A$539,0),MATCH(H$8&$B9&$C9,'Apps-Ach-PCON (R)'!$D$3:$CE$3,0))","v":580},{"$f":"INDEX('Apps-Ach-PCON (R)'!$D$7:$CE$539,MATCH('PCON Dashboard'!$E$3,'Apps-Ach-PCON (R)'!$A$7:$A$539,0),MATCH(I$8&$B9&$C9,'Apps-Ach-PCON (R)'!$D$3:$CE$3,0))","v":480},{"$f":"INDEX('Apps-Ach-PCON (R)'!$D$7:$CE$539,MATCH('PCON Dashboard'!$E$3,'Apps-Ach-PCON (R)'!$A$7:$A$539,0),MATCH(J$8&$B9&$C9,'Apps-Ach-PCON (R)'!$D$3:$CE$3,0))","v":500}]
[null,"All","All","Region",{"$f":"INDEX(Lists!$H:$H,MATCH('PCON Dashboard'!E9,Lists!$I:$I,0))","v":"South East"},{"$f":"INDEX('Apps-Ach-PCON (R)'!$D$545:$CE$556,MATCH($E10,'Apps-Ach-PCON (R)'!$B$545:$B$556,0),MATCH('PCON Dashboard'!F$8&'PCON Dashboard'!$B10&'PCON Dashboard'!$C10,'Apps-Ach-PCON (R)'!$D$3:$CE$3,0))","v":33760},{"$f":"INDEX('Apps-Ach-PCON (R)'!$D$545:$CE$556,MATCH($E10,'Apps-Ach-PCON (R)'!$B$545:$B$556,0),MATCH('PCON Dashboard'!G$8&'PCON Dashboard'!$B10&'PCON Dashboard'!$C10,'Apps-Ach-PCON (R)'!$D$3:$CE$3,0))","v":33680},{"$f":"INDEX('Apps-Ach-PCON (R)'!$D$545:$CE$556,MATCH($E10,'Apps-Ach-PCON (R)'!$B$545:$B$556,0),MATCH('PCON Dashboard'!H$8&'PCON Dashboard'!$B10&'PCON Dashboard'!$C10,'Apps-Ach-PCON (R)'!$D$3:$CE$3,0))","v":34770},{"$f":"INDEX('Apps-Ach-PCON (R)'!$D$545:$CE$556,MATCH($E10,'Apps-Ach-PCON (R)'!$B$545:$B$556,0),MATCH('PCON Dashboard'!I$8&'PCON Dashboard'!$B10&'PCON Dashboard'!$C10,'Apps-Ach-PCON (R)'!$D$3:$CE$3,0))","v":35480},{"$f":"INDEX('Apps-Ach-PCON (R)'!$D$545:$CE$556,MATCH($E10,'Apps-Ach-PCON (R)'!$B$545:$B$556,0),MATCH('PCON Dashboard'!J$8&'PCON Dashboard'!$B10&'PCON Dashboard'!$C10,'Apps-Ach-PCON (R)'!$D$3:$CE$3,0))","v":36370}]
{"$rows_left_out":63}
{"sheet":"Apps Ach - LEALA (R)","index":4,"n_rows":374,"n_cols":82,"rows_kept":374,"cut":false,"hidden":true,"merged":[]}
["Apprenticeship Framework Achievements by Local Education Authority, Local Authority, Level and Age (2011/12 to 2015/16)"]
[null,null,1,2,3,4,5,6,7,8,9,10,11,12,13,14,15,16,1,2,3,4,5,6,7,8,9,10,11,12,13,14,15,16,1,2,3,4,5,6,7,8,9,10,11,12,13,14,15,16,1,2,3,4,5,6,7,8,9,10,11,12,13,14,15,16,1,2,3,4,5,6,7,8,9,10,11,12,13,14,15,16]
[null,null,{"$f":"C4&C5&C6","v":"2011/12IntermediateUnder 19"},{"$f":"D4&D5&D6","v":"2011/12Intermediate19-24"},"2011/12Intermediate25+","2011/12IntermediateAll","2011/12AdvancedUnder 19","2011/12Advanced19-24","2011/12Advanced25+","2011/12AdvancedAll","2011/12HigherUnder 19","2011/12Higher19-24","2011/12Higher25+","2011/12HigherAll","2011/12AllUnder 19","2011/12All19-24","2011/12All25+","2011/12AllAll","2012/13IntermediateUnder 19","2012/13Intermediate19-24","2012/13Intermediate25+","2012/13IntermediateAll","2012/13AdvancedUnder 19","2012/13Advanced19-24","2012/13Advanced25+","2012/13AdvancedAll","2012/13HigherUnder 19","2012/13Higher19-24","2012/13Higher25+","2012/13HigherAll","2012/13AllUnder 19","2012/13All19-24","2012/13All25+","2012/13AllAll","2013/14IntermediateUnder 19","2013/14Intermediate19-24","2013/14Intermediate25+","2013/14IntermediateAll","2013/14AdvancedUnder 19","2013/14Advanced19-24","2013/14Advanced25+","2013/14AdvancedAll","2013/14HigherUnder 19","2013/14Higher19-24","2013/14Higher25+","2013/14HigherAll","2013/14AllUnder 19","2013/14All19-24","2013/14All25+","2013/14AllAll","2014/15IntermediateUnder 19","2014/15Intermediate19-24","2014/15Intermediate25+","2014/15IntermediateAll","2014/15AdvancedUnder 19","2014/15Advanced19-24","2014/15Advanced25+","2014/15AdvancedAll","2014/15HigherUnder 19","2014/15Higher19-24","2014/15Higher25+","2014/15HigherAll","2014/15AllUnder 19","2014/15All19-24","2014/15All25+","2014/15AllAll","2015/16IntermediateUnder 19",{"$f":"BP4&BP5&BP6","v":"2015/16Intermediate19-24"},"2015/16Intermediate25+","2015/16IntermediateAll","2015/16AdvancedUnder 19","2015/16Advanced19-24","2015/16Advanced25+","2015/16AdvancedAll","2015/16HigherUnder 19","2015/16Higher19-24","2015/16Higher25+","2015/16HigherAll","2015/16AllUnder 19","2015/16All19-24","2015/16All25+","2015/16AllAll"]
["Local Education Authority /\nLocal Authority                                         Year",null,"2011/12",{"$f":"C4","v":"2011/12"},{"$f":"D4","v":"2011/12"},"2011/12","2011/12","2011/12","2011/12","2011/12","2011/12","2011/12","2011/12","2011/12","2011/12","2011/12","2011/12","2011/12","2012/13",{"$f":"S4","v":"2012/13"},{"$f":"T4","v":"2012/13"},"2012/13","2012/13","2012/13","2012/13","2012/13","2012/13","2012/13","2012/13","2012/13","2012/13","2012/13","2012/13","2012/13","2013/14",{"$f":"AI4","v":"2013/14"},{"$f":"AJ4","v":"2013/14"},"2013/14","2013/14","2013/14","2013/14","2013/14","2013/14","2013/14","2013/14","2013/14","2013/14","2013/14","2013/14","2013/14","2014/15",{"$f":"AY4","v":"2014/15"},{"$f":"AZ4","v":"2014/15"},"2014/15","2014/15","2014/15","2014/15","2014/15","2014/15","2014/15","2014/15","2014/15","2014/15","2014/15","2014/15",{"$f":"BM4","v":"2014/15"},"2015/16",{"$f":"BO4","v":"2015/16"},{"$f":"BP4","v":"2015/16"},"2015/16","2015/16","2015/16","2015/16","2015/16","2015/16","2015/16","2015/16","2015/16","2015/16","2015/16","2015/16","2015/16"]
[null,"Level","Intermediate","Intermediate","Intermediate","Intermediate","Advanced","Advanced","Advanced","Advanced","Higher","Higher","Higher","Higher","All","All","All","All","Intermediate","Intermediate","Intermediate","Intermediate","Advanced","Advanced","Advanced","Advanced","Higher","Higher","Higher","Higher","All","All","All","All","Intermediate","Intermediate","Intermediate","Intermediate","Advanced","Advanced","Advanced","Advanced","Higher","Higher","Higher","Higher","All","All","All","All","Intermediate","Intermediate","Intermediate","Intermediate","Advanced","Advanced","Advanced","Advanced","Higher","Higher","Higher","Higher","All","All","All","All","Intermediate","Intermediate","Intermediate","Intermediate","Advanced","Advanced","Advanced","Advanced","Higher","Higher","Higher","Higher","All","All","All","All"]
[null,"                                                        Age","Under 19","19-24","25+","All","Under 19","19-24","25+","All","Under 19","19-24","25+","All","Under 19","19-24","25+","All","Under 19","19-24","25+","All","Under 19","19-24","25+","All","Under 19","19-24","25+","All","Under 19","19-24","25+","All","Under 19","19-24","25+","All","Under 19","19-24","25+","All","Under 19","19-24","25+","All","Under 19","19-24","25+","All","Under 19","19-24","25+","All","Under 19","19-24","25+","All","Under 19","19-24","25+","All","Under 19","19-24","25+","All","Under 19","19-24","25+","All","Under 19","19-24","25+","All","Under 19","19-24","25+","All","Under 19","19-24","25+","All"]
[1,"Adur",null,null,null,null,null,null,null,null,null,null,null,null,null,null,null,null,50,40,40,120,20,40,60,110,"-","-","-","-",70,70,100,230,50,50,50,150,20,50,50,110,"-","-","-","-",60,100,100,260,60,60,50,160,30,30,30,80,"-","-","-","-",80,90,80,250,40,60,50,150,20,30,20,80,"-","-",10,10,60,100,80,240]
[2,"Allerdale",null,null,null,null,null,null,null,null,null,null,null,null,null,null,null,null,140,100,130,370,80,70,70,230,"-","-","-","-",220,180,200,600,160,120,120,400,90,120,130,330,"-",10,"-",10,250,240,250,750,170,130,140,440,130,110,80,320,"-","-","-",10,310,250,220,770,160,130,150,440,130,120,60,310,"-","-","-",10,290,250,220,760]
[3,"Amber Valley",null,null,null,null,null,null,null,null,null,null,null,null,null,null,null,null,170,140,180,490,80,80,130,290,"-",10,"-",10,250,230,310,780,150,160,140,460,60,110,130,300,"-",10,10,10,210,280,280,770,180,140,140,460,90,120,80,290,10,10,10,20,270,270,230,780,210,150,170,530,90,110,120,320,"-",10,20,30,310,260,300,870]
[4,"Arun",null,null,null,null,null,null,null,null,null,null,null,null,null,null,null,null,80,140,170,390,40,100,140,270,"-","-","-","-",120,240,310,660,90,130,150,370,30,100,140,270,"-","-","-","-",120,220,290,630,100,160,160,420,40,90,110,240,"-","-",10,10,140,250,290,670,80,130,170,380,30,90,110,220,"-","-",30,30,110,220,300,630]
{"$rows_left_out":365}
{"sheet":"Apps-Ach-PCON (R)","index":5,"n_rows":556,"n_cols":83,"rows_kept":556,"cut":false,"hidden":true,"merged":[]}
["Apprenticeship Framework Achievements by Parliamentary Constituency, Level and Age (2011/12 to 2015/16)"]
[]
[null,null,null,{"$f":"D4&D5&D6","v":"2011/12IntermediateUnder 19"},{"$f":"E4&E5&E6","v":"2011/12Intermediate19-24"},"2011/12Intermediate25+","2011/12IntermediateAll","2011/12AdvancedUnder 19","2011/12Advanced19-24","2011/12Advanced25+","2011/12AdvancedAll","2011/12HigherUnder 19","2011/12Higher19-24","2011/12Higher25+","2011/12HigherAll","2011/12AllUnder 19","2011/12All19-24","2011/12All25+","2011/12AllAll","2012/13IntermediateUnder 19","2012/13Intermediate19-24","2012/13Intermediate25+","2012/13IntermediateAll","2012/13AdvancedUnder 19","2012/13Advanced19-24","2012/13Advanced25+","2012/13AdvancedAll","2012/13HigherUnder 19","2012/13Higher19-24","2012/13Higher25+","2012/13HigherAll","2012/13AllUnder 19","2012/13All19-24","2012/13All25+","2012/13AllAll","2013/14IntermediateUnder 19","2013/14Intermediate19-24","2013/14Intermediate25+","2013/14IntermediateAll","2013/14AdvancedUnder 19","2013/14Advanced19-24","2013/14Advanced25+","2013/14AdvancedAll","2013/14HigherUnder 19","2013/14Higher19-24","2013/14Higher25+","2013/14HigherAll","2013/14AllUnder 19","2013/14All19-24","2013/14All25+","2013/14AllAll","2014/15IntermediateUnder 19","2014/15Intermediate19-24","2014/15Intermediate25+","2014/15IntermediateAll","2014/15AdvancedUnder 19","2014/15Advanced19-24","2014/15Advanced25+","2014/15AdvancedAll","2014/15HigherUnder 19","2014/15Higher19-24","2014/15Higher25+","2014/15HigherAll","2014/15AllUnder 19","2014/15All19-24","2014/15All25+","2014/15AllAll","2015/16IntermediateUnder 19",{"$f":"BQ4&BQ5&BQ6","v":"2015/16Intermediate19-24"},"2015/16Intermediate25+","2015/16IntermediateAll","2015/16AdvancedUnder 19","2015/16Advanced19-24","2015/16Advanced25+","2015/16AdvancedAll","2015/16HigherUnder 19","2015/16Higher19-24","2015/16Higher25+","2015/16HigherAll","2015/16AllUnder 19","2015/16All19-24","2015/16All25+","2015/16AllAll"]
[null,"Parliamentary Constituency","Year","2011/12",{"$f":"D4","v":"2011/12"},{"$f":"E4","v":"2011/12"},"2011/12","2011/12","2011/12","2011/12","2011/12","2011/12","2011/12","2011/12","2011/12","2011/12","2011/12","2011/12","2011/12","2012/13",{"$f":"T4","v":"2012/13"},{"$f":"U4","v":"2012/13"},"2012/13","2012/13","2012/13","2012/13","2012/13","2012/13","2012/13","2012/13","2012/13","2012/13","2012/13","2012/13","2012/13","2013/14",{"$f":"AJ4","v":"2013/14"},{"$f":"AK4","v":"2013/14"},"2013/14","2013/14","2013/14","2013/14","2013/14","2013/14","2013/14","2013/14","2013/14","2013/14","2013/14","2013/14","2013/14","2014/15",{"$f":"AZ4","v":"2014/15"},{"$f":"BA4","v":"2014/15"},"2014/15","2014/15","2014/15","2014/15","2014/15","2014/15","2014/15","2014/15","2014/15","2014/15","2014/15","2014/15",{"$f":"BN4","v":"2014/15"},"2015/16",{"$f":"BP4","v":"2015/16"},{"$f":"BQ4","v":"2015/16"},"2015/16","2015/16","2015/16","2015/16","2015/16","2015/16","2015/16","2015/16","2015/16","2015/16","2015/16","2015/16","2015/16"]
[null,null,"Level","Intermediate","Intermediate","Intermediate","Intermediate","Advanced","Advanced","Advanced","Advanced","Higher","Higher","Higher","Higher","All","All","All","All","Intermediate","Intermediate","Intermediate","Intermediate","Advanced","Advanced","Advanced","Advanced","Higher","Higher","Higher","Higher","All","All","All","All","Intermediate","Intermediate","Intermediate","Intermediate","Advanced","Advanced","Advanced","Advanced","Higher","Higher","Higher","Higher","All","All","All","All","Intermediate","Intermediate","Intermediate","Intermediate","Advanced","Advanced","Advanced","Advanced","Higher","Higher","Higher","Higher","All","All","All","All","Intermediate","Intermediate","Intermediate","Intermediate","Advanced","Advanced","Advanced","Advanced","Higher","Higher","Higher","Higher","All","All","All","All"]
[null,"PCON","Age","Under 19","19-24","25+","All","Under 19","19-24","25+","All","Under 19","19-24","25+","All","Under 19","19-24","25+","All","Under 19","19-24","25+","All","Under 19","19-24","25+","All","Under 19","19-24","25+","All","Under 19","19-24","25+","All","Under 19","19-24","25+","All","Under 19","19-24","25+","All","Under 19","19-24","25+","All","Under 19","19-24","25+","All","Under 19","19-24","25+","All","Under 19","19-24","25+","All","Under 19","19-24","25+","All","Under 19","19-24","25+","All","Under 19","19-24","25+","All","Under 19","19-24","25+","All","Under 19","19-24","25+","All","Under 19","19-24","25+","All"]
[1,"Aldershot",null,100,140,120,350,40,60,60,160,"-","-","-","-",140,200,170,510,150,100,160,410,30,60,90,170,"-","-","-","-",180,160,240,580,90,110,130,320,100,60,90,250,"-","-","-",10,190,180,210,580,60,100,160,330,30,70,50,150,"-","-",10,10,100,170,210,480,80,90,110,280,80,60,70,210,"-",10,10,20,160,150,190,500]
[2,"Aldridge Brownhills",null,140,90,110,330,40,50,70,160,"-","-","-","-",180,140,180,490,70,80,120,270,50,50,60,150,"-","-","-",10,110,130,180,420,100,70,90,260,40,70,80,180,"-","-",10,10,140,140,170,450,110,90,90,290,50,70,60,180,"-","-",10,10,160,160,160,480,110,90,100,300,50,70,60,180,"-","-",20,30,160,160,170,500]
[3,"Altrincham and Sale West",null,70,60,40,170,30,40,40,100,"-","-","-","-",100,100,80,270,40,60,70,170,40,50,90,170,"-","-","-","-",80,110,160,340,70,60,50,180,30,50,80,160,"-","-","-","-",100,110,130,340,50,70,80,200,50,60,50,170,"-","-",10,10,110,140,140,380,50,60,100,200,40,50,50,140,"-","-",10,10,90,110,150,350]
[4,"Amber Valley",null,130,90,120,340,80,70,60,210,"-","-","-",10,210,160,180,550,130,100,140,360,60,60,90,210,"-",10,"-",10,180,170,230,570,120,130,120,370,50,80,100,230,"-","-",10,10,160,220,220,600,130,120,110,350,60,80,70,210,10,10,10,20,190,200,180,570,160,110,130,400,70,80,90,240,"-",10,10,20,230,200,230,660]
{"$rows_left_out":547}
{"sheet":"Lists","index":6,"n_rows":561,"n_cols":14,"rows_kept":561,"cut":false,"hidden":true,"merged":[]}
["Age Categories",null,null,"Region","LA",null,null,"Region","PCON",null,null,"SSA",null,"Region"]
["All","19-24",null,null,"",null,null,null,null,null,null,null,null,"East Midlands"]
["Under 19","25+",null,"North East","Darlington",null,"","North East","Berwick upon Tweed",null,null,"Agriculture, Horticulture and Animal Care",null,"East of England"]
["19 and over",null,null,"North East","Durham",null,"","North East","Bishop Auckland",null,null,"Arts, Media and Publishing",null,"London"]
[null,null,null,"North East","Gateshead",null,"","North East","Blaydon",null,null,"Business, Administration and Law",null,"North East"]
[null,null,null,"North East","Hartlepool",null,"","North East","Blyth Valley",null,null,"Construction, Planning and the Built Environment",null,"North West"]
[null,null,null,"North East","Middlesbrough",null,"","North East","City of Durham",null,null,"Education and Training",null,"South East"]
[null,null,null,"North East","Newcastle upon Tyne",null,"","North East","Darlington",null,null,"Engineering and Manufacturing Technologies",null,"South West"]
[null,null,null,"North East","North Tyneside",null,"","North East","Easington",null,null,"Health, Public Services and Care",null,"West Midlands"]
[null,null,null,"North East","Northumberland",null,"","North East","Gateshead",null,null,"Information and Communication Technology",null,"Yorkshire and The Humber"]
{"$rows_left_out":551}