{"text_format":"1","workbook":"xlsx","n_sheets":5,"sheets":["Change request form","learner-employer list ","How to complete this form","Provider list","Reasons"],"not_rendered":{"charts":0,"images":1,"macros":1,"external_links":2,"defined_names":9,"comments":0,"pivot_tables":0},"unopened":[],"bounds":{"document_bytes":16777216,"sheet_cells":100000,"rows_first":2000,"rows_last":500,"rows_between":2000,"halvings":0,"cell_chars":16384,"cell_head_chars":4096},"cells_cut":0,"cells_raw":0,"read":"whole","date_system":"1900"}

{"sheet":"Change request form","index":0,"n_rows":45,"n_cols":9,"rows_kept":45,"cut":false,"hidden":false,"merged":[[1,6,1,8],[10,3,10,5],[7,0,7,8],[38,3,38,6],[25,1,25,2],[2,6,3,8],[8,1,8,9],[43,0,43,7],[44,0,44,7],[16,3,16,4],[35,3,35,6],[36,3,36,6],[31,2,31,5],[32,2,32,5],[37,3,37,6]]}
[]
[null,null,null,null,null,null,"Completion status"]
[null,null,null,null,null,null,{"$f":"IF(AND(H11=\"✔\",H17=\"✔\",H25=\"✔\",H26=\"✔\",H30=\"✔\",H31=\"✔\",H32=\"✔\",H33=\"✔\",H36=\"✔\",H37=\"✔\",H38=\"✔\",H39=\"✔\",H41=\"✔\"),\"Complete\",\"Incomplete\")","v":"Incomplete"},{"$f":"IF(AND(I8=\"✔\",I15=\"✔\",I23=\"✔\",#REF!=\"✔\",I34=\"✔\",I35=\"✔\",I36=\"✔\",I37=\"✔\",I39=\"✔\",I42=\"✔\",OR(#REF!=\"Complete\",#REF!=\"Not required\")),\"Complete\",\"Incomplete\")","v":{"$error":"#REF!"}},{"$f":"IF(AND(J8=\"✔\",J15=\"✔\",J23=\"✔\",#REF!=\"✔\",J34=\"✔\",J35=\"✔\",J36=\"✔\",J37=\"✔\",J39=\"✔\",J42=\"✔\",OR(#REF!=\"Complete\",#REF!=\"Not required\")),\"Complete\",\"Incomplete\")","v":{"$error":"#REF!"}}]
[null,null,null,null,null,null,{"$f":"IF(AND(H10=\"✔\",H16=\"✔\",H24=\"✔\",#REF!=\"✔\",H36=\"✔\",H37=\"✔\",H38=\"✔\",H39=\"✔\",H41=\"✔\",#REF!=\"✔\",OR(#REF!=\"Complete\",#REF!=\"Not required\")),\"Complete\",\"Incomplete\")","v":{"$error":"#REF!"}},{"$f":"IF(AND(I10=\"✔\",I16=\"✔\",I24=\"✔\",#REF!=\"✔\",I35=\"✔\",I36=\"✔\",I37=\"✔\",I38=\"✔\",I40=\"✔\",#REF!=\"✔\",OR(#REF!=\"Complete\",#REF!=\"Not required\")),\"Complete\",\"Incomplete\")","v":{"$error":"#REF!"}},{"$f":"IF(AND(J10=\"✔\",J16=\"✔\",J24=\"✔\",#REF!=\"✔\",J35=\"✔\",J36=\"✔\",J37=\"✔\",J38=\"✔\",J40=\"✔\",#REF!=\"✔\",OR(#REF!=\"Complete\",#REF!=\"Not required\")),\"Complete\",\"Incomplete\")","v":{"$error":"#REF!"}}]
[]
["Apprenticeship Grant for Employers: change request form for 2016 to 2017 financial year"]
[]
["Please read the notes on How to complete this form and then complete the appropriate yellow cells."]
["Hidden tabs","If you would like to see the lists in the drop downs , then right click on any of the tabs below, click 'unhide' and each table will appear in a list."]
[]
[null,null,"Provider name",null,null,null,null,{"$f":"IF(ISBLANK(D11), \"✖\", \"✔\")","v":"✖"}]
[]
[null,null,"UK Provider Registration Number (UKPRN)",{"$f":"IFERROR(VLOOKUP(D11,'Provider list'!A:B,2,FALSE),\"\")","v":""},{"$f":"IFERROR(VLOOKUP(D11,'Provider list'!A2:B854,3,FALSE),\"\")","v":""}]
[]
["Reason for your request"]
[]
[null,null,"Please use the drop down box  ",null,null,null,null,{"$f":"IF(ISBLANK(D17), \"✖\", \"✔\")","v":"✖"}]
[]
["Total requested AGE allocation for 2016 to 2017 financial year"]
["To request an increase, please input the total allocation you would like (that is, your current allocation plus growth)."]
["To request a decrease, please input a value lower than your current allocation."]
["To request your allocation be removed, please input £0."]
[]
[null,null,null,null,"Value (£)"]
[null,null,null,"16-18 year olds",null,{"$f":"IF(E25=\"\",\"\",IF(AND(ISNUMBER(SEARCH(\"16-18\",D17)),D25<>\"\"),\"\",\"You did not select this age group\"))","v":""},null,{"$f":"IF(AND(ISNUMBER(SEARCH(\"16-18\",D17)),E25<>\"\"),\"✔\",IF(AND(D17=\"Change 19-24 age group only\",F25=\"\"),\"✔\",\"✖\"))","v":"✖"}]
[null,null,null,"19-24 year olds",null,{"$f":"IF(E26=\"\",\"\",IF(AND(ISNUMBER(SEARCH(\"19-24\",D17)),D26<>\"\"),\"\",\"You did not select this age group\"))","v":""},null,{"$f":"IF(AND(ISNUMBER(SEARCH(\"19-24\",D17)),E26<>\"\"),\"✔\",IF(AND(D17=\"Change 16-18 age group only\",F26=\"\"),\"✔\",\"✖\"))","v":"✖"}]
[]
[]
["Eligibility declaration"]
[null,"Please tick to confirm:","Only apprentices who started between 1 January 2016 and 31 December 2016  have been included in this request … … …",null,null,null,false,{"$f":"IF(G30=FALSE,\"✖\",\"✔\")","v":"✖"}]
[null,null,"This growth request does not include apprentices from areas where AGE has been devolved … … …",null,null,null,false,{"$f":"IF(G31=FALSE,\"✖\",\"✔\")","v":"✖"}]
[null,null,"If the request for growth is bigger than our current delivery and pipeline I have enclosed a list of ULN and ERN numbers on the attached \"Learner-Employer list\"  that are due to be input at our next ILR return.",null,null,null,false,{"$f":"IF(G32=FALSE,\"✖\",\"✔\")","v":"✖"}]
[null,null,"I understand the amount of growth funding we may be given depends on our current delivery … … …",null,null,null,false,{"$f":"IF(G33=FALSE,\"✖\",\"✔\")","v":"✖"}]
[]
["Request completed by"]
[null,null,"Name",null,null,null,null,{"$f":"IF(ISBLANK(D36), \"✖\", \"✔\")","v":"✖"}]
[null,null,"Position in organisation",null,null,null,null,{"$f":"IF(ISBLANK(D37), \"✖\", \"✔\")","v":"✖"}]
[null,null,"Email address",null,null,null,null,{"$f":"IF(ISBLANK(D38), \"✖\", \"✔\")","v":"✖"}]
[null,null,"Date of request",null,null,null,null,{"$f":"IF(ISBLANK(D39), \"✖\", \"✔\")","v":"✖"}]
[]
[null,null,null,null,null,"Please tick to confirm that you have the authority to act on behalf of the applicant organisation named in this form",false,{"$f":"IF(G41=FALSE,\"✖\",\"✔\")","v":"✖"}]
[null,null,null,null,null,"Please note that the Skills Funding Agency will send the outcome of the request to the Head of the Organisation"]
[]
["Please click this button to create an email and automatically attach the form."]
["If the button does not work, please just attach the form manually to an email and send the email to providerAGEfacilitymanagement@sfa.bis.gov.uk. "]

{"sheet":"learner-employer list ","index":1,"n_rows":2,"n_cols":6,"rows_kept":2,"cut":false,"hidden":false,"merged":[]}
[]
["UKPRN","Prv_Name","Employer_ID","Employer_Name","Learner_ULN","LearningStartDate"]

{"sheet":"How to complete this form","index":2,"n_rows":18,"n_cols":2,"rows_kept":18,"cut":false,"hidden":false,"merged":[[0,0,0,1],[8,0,8,1],[1,0,1,1]]}
["Please read the Apprenticeship frameworks and AGE funding and Performance-management Rules 2016 to 2017 for information \nabout this process."]
["For information about areas where AGE has been devolved, please see www.gov.uk/sfa"]
["HOW TO COMPLETE THIS FORM"]
[]
["Who can use this form and what for","You can use this form to request a change to your AGE allocation, if you already have one.\n\nYou can use this form to request an AGE allocation for the first time if you don’t already have one. You must currently have an apprenticeships funding agreement for the appropriate age group(s) with the Skills Funding Agency.  Employers who hold a Conditions of Funding (Grant) – Employer funding agreement with us for apprenticeships cannot have an AGE funding agreement and cannot claim AGE."]
["Macro security","This form contains macros.  You must enable macros every time you open the spreadsheet for it to work properly.  In Excel 2013, you enable macros by clicking 'enable content' on a yellow security warning banner.\n"]
["Deadline","The deadline for a change to your AGE allocation or for requesting an AGE allocation for the first time is 16 December 2016."]
[]
["CHANGE REQUEST FORM"]
["Field","Description"]
["Completion status","This box stays INCOMPLETE until all the required yellow boxes are complete.  Once all the required yellow boxes are complete, it changes to COMPLETE.  The macro to send the email automatically will not work unless the Completion Status is COMPLETE.\n\nThe ticks and crosses down the righthand side help you to see which boxes have not been completed (or have been completed incorrectly).  The COMPLETE box turns green when these are all ticks."]
["Provider name","Use the drop-down box to select your provider name from a list.  If your provider name is not listed, please email providerAGEfacilitymanagement@sfa.bis.gov.uk for advice (and quote your UKPRN).  Please note: to request an AGE allocation for the first time, you must currently have an apprenticeships funding agreement for the appropriate age group(s) with the Skills Funding Agency.\n"]
["UK Provider Registration Number (UKPRN)","This box is filled in automatically with your UK Provider Registration Number as it appears on the UK Register of Learning Providers (UKRLP) once you select your provider name.\n"]
["Reason for your request\n","Please select an option from the drop-down menu.  The yellow cells (for you to complete) will change, depending on which option you select."]
["Total requested AGE allocation for 2016 to 2017 financial year","Please enter the value of the total AGE allocation you wish to request for the full financial year. This must be in multiples of £1,500 (as AGE is £1,500 per eligible apprentice).\n\nIf you are requesting growth, input the total of your existing AGE allocation PLUS the increase you require.\nIf you want to reduce your AGE allocation, input a value which is less than your existing AGE allocation.\nIf you want us to remove your AGE allocation completely, input 0 (zero).\n"]
["Eligibility declaration","Please tick each of the boxes to confirm you have only included eligible apprentices who started on or after 1 January 2016, that you have not included apprentices from areas where AGE has been devolved, and that you understand the performance-management rules for growth requests."]
["Request completed by","Please ensure you enter your:\n  Name\n  Position in organisation\n  Email address\n  Date of request\nand tick the box to confirm that you have authority to request additional funding for your provider.\n"]
["Email the completed form button","If you have enabled the macros, clicking this button will automatically create an email to providerAGEfacilitymanagement@sfa.bis.gov.uk and add this form to the email as an attachment.\n\nIf the macro does not work for some reason, please just attach the form to an email manually and send it to providerAGEfacilitymanagement@sfa.bis.gov.uk.\n"]

{"sheet":"Provider list","index":3,"n_rows":735,"n_cols":2,"rows_kept":735,"cut":false,"hidden":true,"merged":[]}
["Provider Name","UKPRN"]
["5 E LTD.",10000020]
["ABINGDON AND WITNEY COLLEGE",10000055]
["ACACIA TRAINING AND DEVELOPMENT LTD",10000060]
["ACACIA TRAINING LIMITED",10000061]
["ACADEMY EDUCATION LIMITED",10000191]
["ACADEMY TRANSFORMATION TRUST",10039859]
["ACCESS TO MUSIC LIMITED",10000080]
["ACCESS TRAINING (EAST MIDLANDS) LTD",10010584]
["ACCESS TRAINING LIMITED",10009059]
["ACCRINGTON AND ROSSENDALE COLLEGE",10000093]
["ACHIEVE THROUGH LEARNING LIMITED",10019431]
["ACHIEVEMENT TRAINING LIMITED",10000099]
["ACTIVATE LEARNING",10004927]
["ADVANCED PERSONNEL MANAGEMENT GROUP (UK) LIMITED",10019155]
["ALDER TRAINING LIMITED",10000201]
["ALL TRADES TRAINING LIMITED",10027693]
["ALLIANCE LEARNING",10000238]
["ALT VALLEY COMMUNITY TRUST LIMITED",10001777]
["AMERSHAM & WYCOMBE COLLEGE",10000275]
["ANDERSON STOCKLEY ACCREDITED TRAINING LTD",10023918]
["ANDREW COLLINGE TRAINING LIMITED",10000285]
["ANGLIA RUSKIN UNIVERSITY",10000291]
["ANNE CLARKE ASSOCIATES LIMITED",10022210]
["APPRENTICE FUNDING ASSISTANT LIMITED",10030249]
["APPRENTICESHIPS & TRAINING SERVICES CONSORTIUM LIMITED",10032404]
["APPRIS CHARITY LIMITED",10000848]
["ASHTON SIXTH FORM COLLEGE",10000409]
["ASKHAM BRYAN COLLEGE",10000415]
["ASPIRATION TRAINING LIMITED",10000421]
["ASPIRE ACHIEVE ADVANCE LIMITED",10031241]
["ASPIRE TRAINING TEAM LIMITED",10006942]
["ASSET TRAINING & CONSULTANCY LIMITED",10000427]
["ASTON UNIVERSITY",10007759]
["ASTUTE MINDS LTD",10020307]
["ATG TRAINING",10000476]
["AURELIA TRAINING LIMITED",10000452]
["AVANT PARTNERSHIP LIMITED",10022513]
["AWE PLC",10008081]
["AXIA SOLUTIONS LIMITED",10000470]
["AYLESBURY COLLEGE",10000473]
["B L TRAINING LIMITED",10000486]
["BABCOCK SKILLS DEVELOPMENT AND TRAINING LIMITED",10037348]
["BABCOCK TRAINING LIMITED",10003161]
["BABINGTON BUSINESS COLLEGE LIMITED",10000494]
["BALTIC TRAINING SERVICES LIMITED",10019026]
["BARKING & DAGENHAM LONDON BOROUGH COUNCIL",10000143]
["BARKING AND DAGENHAM COLLEGE",10000528]
["BARNARDO'S",10000532]
["BARNET & SOUTHGATE COLLEGE",10000533]
["BARNFIELD COLLEGE",10000534]
["BARNSLEY COLLEGE",10000536]
["BASINGSTOKE COLLEGE OF TECHNOLOGY",10000560]
["BASINGSTOKE YOUTH ACTION TRUST LIMITED",10000561]
["BATH COLLEGE",10001465]
["BC ARCH LIMITED ",10046797]
["BCTG LIMITED",10006600]
["BE TOTALLY YOU",10019227]
["BEDFORD COLLEGE",10000610]
["BERKSHIRE COLLEGE OF AGRICULTURE, THE (BCA)",10000654]
["BESTLAND SOLUTIONS LIMITED",10018344]
["BEXHILL COLLEGE",10000670]
["BEXLEY LONDON BOROUGH COUNCIL",10000146]
["BEXLEY YOUTH TRAINING GROUP",10000673]
["BIRMINGHAM ELECTRICAL TRAINING LTD",10000715]
["BIRMINGHAM METROPOLITAN COLLEGE",10006442]
["BISHOP AUCKLAND COLLEGE",10000720]
["BISHOP BURTON COLLEGE",10000721]
["BLACKBURN COLLEGE",10000747]
["BLACKPOOL AND THE FYLDE COLLEGE",10000754]
["BLUE ARROW LTD. ",10048290]
["BMC (BROOKSBY MELTON COLLEGE)",10000952]
["BOLTON COLLEGE",10000794]
["BOROUGH OF POOLE",10005143]
["BOSCH AUTOMOTIVE SERVICE SOLUTIONS LTD",10042884]
["BOSTON COLLEGE",10000812]
["BOURNEMOUTH AND POOLE COLLEGE, THE",10000820]
["BOURNVILLE COLLEGE",10000825]
["BOWLING COLLEGE",10009975]
["BPP HOLDINGS LIMITED",10000831]
["BRACKNELL AND WOKINGHAM COLLEGE",10000833]
["BRADFORD CITY COUNCIL",10000850]
["BRADFORD COLLEGE",10000840]
["BRIDGWATER COLLEGE",10000878]
["BRINSWORTH TRAINING LIMITED",10022320]
["BRISTOL CITY COUNCIL",10000896]
["BRITISH PRINTING INDUSTRIES FEDERATION LTD",10000929]
["BROADLAND DISTRICT COUNCIL",10000941]
["BROCKENHURST COLLEGE",10000944]
["BROMLEY COLLEGE OF FURTHER AND HIGHER EDUCATION",10000948]
["BROOKLANDS COLLEGE",10000950]
["BRS EDUCATION LIMITED ",10048409]
["B-SKILL LIMITED",10000488]
["BUCKINGHAMSHIRE COUNTY COUNCIL",10000976]
["BUILDING CRAFTS COLLEGE",10009063]
["BURNLEY COLLEGE",10001000]
["BURTON AND SOUTH DERBYSHIRE COLLEGE",10001004]
["BURY COLLEGE",10001005]
["BURY METROPOLITAN BOROUGH COUNCIL",10001008]
["BUSINESS MANAGEMENT RESOURCES (UK) LTD",10001055]
["BUSY BEES NURSERIES LIMITED",10030637]
["CABLECOM TRAINING LIMITED",10001078]
["CALDERDALE COLLEGE",10001093]
["CAMBRIDGE REGIONAL COLLEGE",10001116]
["CAMBRIDGESHIRE COUNTY COUNCIL",10001123]
["CANTERBURY COLLEGE",10001144]
["CAPEL MANOR COLLEGE",10001148]
["CAPITA PLC",10001149]
["CAPITAL ENGINEERING GROUP HOLDINGS LTD",10022461]
["CARE UK COMMUNITY PARTNERSHIPS LTD ",10052994]
["CARILLION CONSTRUCTION LIMITED",10001193]
["CARLISLE COLLEGE",10001196]
["CARSHALTON COLLEGE",10001207]
["CATCH 22 CHARITY LIMITED",10025727]
["CENTRAL BEDFORDSHIRE COLLEGE",10002061]
["CENTRAL BEDFORDSHIRE COUNCIL",10024292]
["CENTRAL MANCHESTER UNIVERSITY HOSPITALS NHS FOUNDATION TRUST",10001263]
["CENTRAL SUSSEX COLLEGE",10001744]
["CENTRAL TRAINING ACADEMY LIMITED",10001259]
["CHAMBER TRAINING (HUMBER) LIMITED",10001310]
["CHAPMAN BENNETT ASSOCIATES LIMITED",10024603]
["CHEADLE AND MARPLE SIXTH FORM COLLEGE",10001346]
["CHELMSFORD COLLEGE",10001353]
["CHESHIRE WEST AND CHESTER COUNCIL",10024294]
["CHESTERFIELD COLLEGE",10001378]
["CHEYNE'S (MANAGEMENT) LIMITED",10008159]
["CHICHESTER COLLEGE",10007817]
["CHILDREN'S LINKS",10001392]
["CHILTERN TRAINING LIMITED",10001394]
["CIRENCESTER COLLEGE",10001446]
["CITB",10001436]
["CITY COLLEGE BRIGHTON AND HOVE",10001457]
["CITY COLLEGE COVENTRY",10001458]
["CITY COLLEGE NORWICH",10004772]
["CITY COLLEGE PLYMOUTH",10005128]
["CITY GATEWAY",10019383]
["CITY OF BRISTOL COLLEGE",10001467]
["CITY OF WESTMINSTER COLLEGE",10001476]
["CITY OF WOLVERHAMPTON COLLEGE",10007578]
["CITY OF YORK COUNCIL",10001477]
["CLARKSON EVANS TRAINING LIMITED",10025390]
["CLEVELAND YOUTH ASSOCIATION",10005775]
["COLCHESTER INSTITUTE",10001535]
["COLLEGE OF HARINGEY, ENFIELD AND NORTH-EAST LONDON, THE",10001548]
["COLLEGE OF NORTH WEST LONDON, THE",10001549]
["COMMON COUNCIL OF THE CITY OF LONDON",10008915]
["COMMUNITY TRAINING SERVICES LIMITED",10001602]
["CONSORTIA TRAINING LIMITED",10033482]
["CONSORTIUM OF VOCATIONAL AND EDUCATIONAL TRAINERS LIMITED",10033547]
["CORNWALL COLLEGE",10001696]
["COUNTY DURHAM COUNCIL",10002064]
["COVENTRY AND WARWICKSHIRE CHAMBERS OF COMMERCE TRAINING LIMITED",10001309]
["CRACKERJACK TRAINING LIMITED",10001736]
["CRAVEN COLLEGE",10001743]
["CREATIVE AND CULTURAL INDUSTRIES TRADING LIMITED",10026573]
["CREATIVE PROCESS",10023901]
["CREATIVE SUPPORT LIMITED",10024921]
["CROYDON COLLEGE",10001778]
["CSM CONSULTING LIMITED",10001786]
["CT SKILLS LIMITED",10001174]
["CUMBRIA COUNTY COUNCIL",10001800]
["D M T BUSINESS SERVICES LTD",10001997]
["D MANTLE LIMITED",10031146]
["DAMAR LIMITED",10001831]
["DARLINGTON BOROUGH COUNCIL",10001848]
["DARLINGTON COLLEGE",10001850]
["DART LIMITED",10001828]
["DAVIDSON TRAINING UK LIMITED",10001869]
["DAWN HODGE ASSOCIATES LIMITED",10022117]
["DEARNE VALLEY COLLEGE",10001897]
["DEFENCE, MINISTRY OF",10011058]
["DERBY BUSINESS COLLEGE LIMITED",10005109]
["DERBY CITY COUNCIL",10001918]
["DERBY COLLEGE",10001919]
["DERBYSHIRE AND NOTTINGHAMSHIRE CHAMBER OF COMMERCE AND INDUSTRY",10001927]
["DERBYSHIRE COUNTY COUNCIL",10001928]
["DERWEN COLLEGE",10001929]
["DERWENTSIDE COLLEGE",10001934]
["DEVON COUNTY COUNCIL",10001951]
["DIDAC LIMITED",10001967]
["DIMENSIONS TRAINING SOLUTIONS LIMITED",10001971]
["DONCASTER COLLEGE",10002005]
["DONCASTER METROPOLITAN BOROUGH COUNCIL",10002008]
["DONCASTER ROTHERHAM AND DISTRICT MOTOR TRADES GROUP TRAINING ASSOCIATION LIMITED",10002009]
["DOOSAN BABCOCK LIMITED",10004399]
["DUDLEY COLLEGE",10007924]
["E.ON UK PLC",10023793]
["EALING, HAMMERSMITH & WEST LONDON COLLEGE",10002094]
["EAST BERKSHIRE COLLEGE",10002107]
["EAST DURHAM COLLEGE",10002111]
["EAST KENT COLLEGE",10006570]
["EAST LINDSEY INFORMATION TECHNOLOGY CENTRE",10002471]
["EAST LONDON ADVANCED TECHNOLOGY TRAINING",10002118]
["EAST RIDING COLLEGE",10002126]
["EAST RIDING OF YORKSHIRE COUNCIL",10008919]
["EAST SURREY COLLEGE",10002130]
["EASTLEIGH COLLEGE",10002143]
["EASTON AND OTLEY COLLEGE",10037344]
["ECONOMIC SOLUTIONS LIMITED",10004177]
["EDEN TRAINING SOLUTIONS LIMITED",10027766]
{"$rows_left_out":536}
{"sheet":"Reasons","index":4,"n_rows":3,"n_cols":1,"rows_kept":3,"cut":false,"hidden":false,"merged":[]}
["Change 16-18 age group only"]
["Change 19-24 age group only"]
["Change both 16-18 and 19-24 age groups"]