{"text_format":"1","workbook":"xlsx","n_sheets":6,"sheets":["Lookups","Guide to tool","Output","Data_lookup","All_data","Baseline"],"not_rendered":{"charts":1,"images":1,"macros":1,"external_links":0,"defined_names":4,"comments":0,"pivot_tables":0},"unopened":[],"bounds":{"document_bytes":16777216,"sheet_cells":100000,"rows_first":2000,"rows_last":500,"rows_between":2000,"halvings":0,"cell_chars":16384,"cell_head_chars":4096},"cells_cut":0,"cells_raw":0,"read":"whole","date_system":"1900"}

{"sheet":"Lookups","index":0,"n_rows":214,"n_cols":11,"rows_kept":214,"cut":false,"hidden":true,"merged":[]}
[]
[]
[]
[1,"ENG",{"$f":"VLOOKUP(B4,$B$5:$C215,2,0)","v":"England"},{"$f":"VLOOKUP(B4,B5:D214,3,FALSE)","v":"ENG"}]
[{"$f":"A4+1","v":2},"02N","NHS Airedale, Wharfdale and Craven CCG","E38000001","NHS Airedale, Wharfdale and Craven CCG",null,1,"the current level of obesity increases by 1% every 5 years",33,"Obesity levels increase by 1% every 5 years","obesity levels were to rise by 1% every 5 years"]
[{"$f":"A5+1","v":3},"09C","NHS Ashford CCG","E38000002","NHS Ashford CCG",null,{"$f":"G5+1","v":2},"the current level of obesity increases by 2% every 5 years",23,"Obesity levels increase by 2% every 5 years","obesity levels were to rise by 2% every 5 years"]
[4,"10Y","NHS Aylesbury Vale CCG","E38000003","NHS Aylesbury Vale CCG",null,{"$f":"G6+1","v":3},"the current level of obesity increases by 3% every 5 years",13,"Obesity levels increase by 3% every 5 years","obesity levels were to rise by 3% every 5 years"]
[5,"07L","NHS Barking and Dagenham CCG","E38000004","NHS Barking and Dagenham CCG",null,4,"the current level of obesity increases by 5% every 5 years",3,"Obesity levels increase by 5% every 5 years","obesity levels were to rise by 5% every 5 years"]
[6,"07M","NHS Barnet CCG","E38000005","NHS Barnet CCG",null,5,"the current level of obesity decreases by 1% every 5 years",73,"Obesity levels decrease by 1% every 5 years","obesity levels were to decline by 1% every 5 years"]
[7,"02P","NHS Barnsley CCG","E38000006","NHS Barnsley CCG",null,6,"the current level of obesity decreases by 2% every 5 years",63,"Obesity levels decrease by 2% every 5 years","obesity levels were to decline by 2% every 5 years"]
[8,"99E","NHS Basildon and Brentwood CCG","E38000007","NHS Basildon and Brentwood CCG",null,7,"the current level of obesity decreases by 3% every 5 years",53,"Obesity levels decrease by 3% every 5 years","obesity levels were to decline by 3% every 5 years"]
[9,"02Q","NHS Bassetlaw CCG","E38000008","NHS Bassetlaw CCG",null,8,"the current level of obesity decreases by 5% every 5 years",43,"Obesity levels decrease by 5% every 5 years","obesity levels were to decline by 5% every 5 years"]
[10,"11E","NHS Bath and North East Somerset CCG","E38000009","NHS Bath and North East Somerset CCG"]
[11,"06F","NHS Bedfordshire CCG","E38000010","NHS Bedfordshire CCG"]
[12,"07N","NHS Bexley CCG","E38000011","NHS Bexley CCG"]
[13,"13P","NHS Birmingham Crosscity CCG","E38000012","NHS Birmingham Crosscity CCG"]
[14,"04X","NHS Birmingham South and Central CCG","E38000013","NHS Birmingham South and Central CCG"]
[15,"00Q","NHS Blackburn with Darwen CCG","E38000014","NHS Blackburn with Darwen CCG"]
[16,"00R","NHS Blackpool CCG","E38000015","NHS Blackpool CCG"]
[17,"00T","NHS Bolton CCG","E38000016","NHS Bolton CCG"]
[18,"10G","NHS Bracknell and Ascot CCG","E38000017","NHS Bracknell and Ascot CCG"]
[19,"02W","NHS Bradford City CCG","E38000018","NHS Bradford City CCG"]
[20,"02R","NHS Bradford Districts CCG","E38000019","NHS Bradford Districts CCG"]
[21,"07P","NHS Brent CCG","E38000020","NHS Brent CCG"]
[22,"09D","NHS Brighton and Hove CCG","E38000021","NHS Brighton and Hove CCG"]
[23,"11H","NHS Bristol CCG","E38000022","NHS Bristol CCG"]
[24,"07Q","NHS Bromley CCG","E38000023","NHS Bromley CCG"]
[25,"00V","NHS Bury CCG","E38000024","NHS Bury CCG"]
[26,"02T","NHS Calderdale CCG","E38000025","NHS Calderdale CCG"]
[27,"06H","NHS Cambridgeshire and Peterborough CCG","E38000026","NHS Cambridgeshire and Peterborough CCG"]
[28,"07R","NHS Camden CCG","E38000027","NHS Camden CCG"]
[29,"04Y","NHS Cannock Chase CCG","E38000028","NHS Cannock Chase CCG"]
[30,"09E","NHS Canterbury and Coastal CCG","E38000029","NHS Canterbury and Coastal CCG"]
[31,"99F","NHS Castle Point and Rochford CCG","E38000030","NHS Castle Point and Rochford CCG"]
[32,"09A","NHS Central London (Westminster) CCG","E38000031","NHS Central London (Westminster) CCG"]
[33,"00W","NHS Central Manchester CCG","E38000032","NHS Central Manchester CCG"]
[34,"10H","NHS Chiltern CCG","E38000033","NHS Chiltern CCG"]
[35,"00X","NHS Chorley and South Ribble CCG","E38000034","NHS Chorley and South Ribble CCG"]
[36,"07T","NHS City and Hackney CCG","E38000035","NHS City and Hackney CCG"]
[37,"09G","NHS Coastal West Sussex CCG","E38000213","NHS Coastal West Sussex CCG"]
[38,"03V","NHS Corby CCG","E38000037","NHS Corby CCG"]
[39,"05A","NHS Coventry and Rugby CCG","E38000038","NHS Coventry and Rugby CCG"]
[40,"09H","NHS Crawley CCG","E38000039","NHS Crawley CCG"]
[41,"07V","NHS Croydon CCG","E38000040","NHS Croydon CCG"]
[42,"01H","NHS Cumbria CCG","E38000041","NHS Cumbria CCG"]
[43,"00C","NHS Darlington CCG","E38000042","NHS Darlington CCG"]
[44,"09J","NHS Dartford, Gravesham and Swanley CCG","E38000043","NHS Dartford, Gravesham and Swanley CCG"]
[45,"02X","NHS Doncaster CCG","E38000044","NHS Doncaster CCG"]
[46,"11J","NHS Dorset CCG","E38000045","NHS Dorset CCG"]
[47,"05C","NHS Dudley CCG","E38000046","NHS Dudley CCG"]
[48,"00D","NHS Durham Dales, Easington and Sedgefield CCG","E38000047","NHS Durham Dales, Easington and Sedgefield CCG"]
[49,"07W","NHS Ealing CCG","E38000048","NHS Ealing CCG"]
[50,"06K","NHS East and North Hertfordshire CCG","E38000049","NHS East and North Hertfordshire CCG"]
[51,"01A","NHS East Lancashire CCG","E38000050","NHS East Lancashire CCG"]
[52,"03W","NHS East Leicestershire and Rutland CCG","E38000051","NHS East Leicestershire and Rutland CCG"]
[53,"02Y","NHS East Riding of Yorkshire CCG","E38000052","NHS East Riding of Yorkshire CCG"]
[54,"05D","NHS East Staffordshire CCG","E38000053","NHS East Staffordshire CCG"]
[55,"09L","NHS East Surrey CCG","E38000054","NHS East Surrey CCG"]
[56,"09F","NHS Eastbourne, Hailsham and Seaford CCG","E38000055","NHS Eastbourne, Hailsham and Seaford CCG"]
[57,"01C","NHS Eastern Cheshire CCG","E38000056","NHS Eastern Cheshire CCG"]
[58,"07X","NHS Enfield CCG","E38000057","NHS Enfield CCG"]
[59,"03X","NHS Erewash CCG","E38000058","NHS Erewash CCG"]
[60,"10K","NHS Fareham and Gosport CCG","E38000059","NHS Fareham and Gosport CCG"]
[61,"02M","NHS Fylde & Wyre CCG","E38000060","NHS Fylde & Wyre CCG"]
[62,"11M","NHS Gloucestershire CCG","E38000062","NHS Gloucestershire CCG"]
[63,"06M","NHS Great Yarmouth and Waveney CCG","E38000063","NHS Great Yarmouth and Waveney CCG"]
[64,"03A","NHS Greater Huddersfield CCG","E38000064","NHS Greater Huddersfield CCG"]
[65,"01E","NHS Greater Preston CCG","E38000065","NHS Greater Preston CCG"]
[66,"08A","NHS Greenwich CCG","E38000066","NHS Greenwich CCG"]
[{"$f":"A69+1","v":67},"09N","NHS Guildford and Waverley CCG","E38000214","NHS Guildford and Waverley CCG"]
[68,"01F","NHS Halton CCG","E38000068","NHS Halton CCG"]
[69,"03D","NHS Hambleton, Richmondshire and Whitby CCG","E38000069","NHS Hambleton, Richmondshire and Whitby CCG"]
[70,"08C","NHS Hammersmith and Fulham CCG","E38000070","NHS Hammersmith and Fulham CCG"]
[71,"03Y","NHS Hardwick CCG","E38000071","NHS Hardwick CCG"]
[72,"08D","NHS Haringey CCG","E38000072","NHS Haringey CCG"]
[73,"03E","NHS Harrogate and Rural District CCG","E38000073","NHS Harrogate and Rural District CCG"]
[74,"08E","NHS Harrow CCG","E38000074","NHS Harrow CCG"]
[75,"00K","NHS Hartlepool and Stockton-On-Tees CCG","E38000075","NHS Hartlepool and Stockton-On-Tees CCG"]
[76,"09P","NHS Hastings and Rother CCG","E38000076","NHS Hastings and Rother CCG"]
[77,"08F","NHS Havering CCG","E38000077","NHS Havering CCG"]
[78,"05F","NHS Herefordshire CCG","E38000078","NHS Herefordshire CCG"]
[79,"06N","NHS Herts Valleys CCG","E38000079","NHS Herts Valleys CCG"]
[80,"01D","NHS Heywood, Middleton and Rochdale CCG","E38000080","NHS Heywood, Middleton and Rochdale CCG"]
[81,"99K","NHS High Weald Lewes Havens CCG","E38000081","NHS High Weald Lewes Havens CCG"]
[82,"08G","NHS Hillingdon CCG","E38000082","NHS Hillingdon CCG"]
[83,"09X","NHS Horsham and Mid Sussex CCG","E38000083","NHS Horsham and Mid Sussex CCG"]
[84,"07Y","NHS Hounslow CCG","E38000084","NHS Hounslow CCG"]
[85,"03F","NHS Hull CCG","E38000085","NHS Hull CCG"]
[86,"06L","NHS Ipswich and East Suffolk CCG","E38000086","NHS Ipswich and East Suffolk CCG"]
[87,"10L","NHS Isle of Wight CCG","E38000087","NHS Isle of Wight CCG"]
[88,"08H","NHS Islington CCG","E38000088","NHS Islington CCG"]
[89,"11N","NHS Kernow CCG","E38000089","NHS Kernow CCG"]
[90,"08J","NHS Kingston CCG","E38000090","NHS Kingston CCG"]
[91,"01J","NHS Knowsley CCG","E38000091","NHS Knowsley CCG"]
[92,"08K","NHS Lambeth CCG","E38000092","NHS Lambeth CCG"]
[93,"01K","NHS Lancashire North CCG","E38000093","NHS Lancashire North CCG"]
[94,"02V","NHS Leeds North CCG","E38000094","NHS Leeds North CCG"]
[95,"03G","NHS Leeds South and East CCG","E38000095","NHS Leeds South and East CCG"]
[96,"03C","NHS Leeds West CCG","E38000096","NHS Leeds West CCG"]
[97,"04C","NHS Leicester City CCG","E38000097","NHS Leicester City CCG"]
[98,"08L","NHS Lewisham CCG","E38000098","NHS Lewisham CCG"]
[99,"03T","NHS Lincolnshire East CCG","E38000099","NHS Lincolnshire East CCG"]
[100,"04D","NHS Lincolnshire West CCG","E38000100","NHS Lincolnshire West CCG"]
[101,"99A","NHS Liverpool CCG","E38000101","NHS Liverpool CCG"]
[102,"06P","NHS Luton CCG","E38000102","NHS Luton CCG"]
[103,"04E","NHS Mansfield and Ashfield CCG","E38000103","NHS Mansfield and Ashfield CCG"]
[104,"09W","NHS Medway CCG","E38000104","NHS Medway CCG"]
[105,"08R","NHS Merton CCG","E38000105","NHS Merton CCG"]
[106,"06Q","NHS Mid Essex CCG","E38000106","NHS Mid Essex CCG"]
[107,"04F","NHS Milton Keynes CCG","E38000107","NHS Milton Keynes CCG"]
[108,"04G","NHS Nene CCG","E38000108","NHS Nene CCG"]
[109,"04H","NHS Newark & Sherwood CCG","E38000109","NHS Newark & Sherwood CCG"]
[110,"10M","NHS Newbury and District CCG","E38000110","NHS Newbury and District CCG"]
[111,"13T","NHS Newcastle Gateshead CCG","E38000212","NHS Newcastle Gateshead CCG"]
[112,"08M","NHS Newham CCG","E38000113","NHS Newham CCG"]
[113,"10N","NHS North & West Reading CCG","E38000114","NHS North & West Reading CCG"]
[114,"04J","NHS North Derbyshire CCG","E38000115","NHS North Derbyshire CCG"]
[115,"00J","NHS North Durham CCG","E38000116","NHS North Durham CCG"]
[116,"06T","NHS North East Essex CCG","E38000117","NHS North East Essex CCG"]
[117,"99M","NHS North East Hampshire and Farnham CCG","E38000118","NHS North East Hampshire and Farnham CCG"]
[118,"03H","NHS North East Lincolnshire CCG","E38000119","NHS North East Lincolnshire CCG"]
[119,"10J","NHS North Hampshire CCG","E38000120","NHS North Hampshire CCG"]
[120,"03J","NHS North Kirklees CCG","E38000121","NHS North Kirklees CCG"]
[121,"03K","NHS North Lincolnshire CCG","E38000122","NHS North Lincolnshire CCG"]
[122,"01M","NHS North Manchester CCG","E38000123","NHS North Manchester CCG"]
[123,"06V","NHS North Norfolk CCG","E38000124","NHS North Norfolk CCG"]
[124,"11T","NHS North Somerset CCG","E38000125","NHS North Somerset CCG"]
[125,"05G","NHS North Staffordshire CCG","E38000126","NHS North Staffordshire CCG"]
[126,"99C","NHS North Tyneside CCG","E38000127","NHS North Tyneside CCG"]
[127,"09Y","NHS North West Surrey CCG","E38000128","NHS North West Surrey CCG"]
[128,"99P","NHS North, East, West Devon CCG","E38000129","NHS North, East, West Devon CCG"]
[129,"00L","NHS Northumberland CCG","E38000130","NHS Northumberland CCG"]
[130,"06W","NHS Norwich CCG","E38000131","NHS Norwich CCG"]
[{"$f":"A133+1","v":131},"04K","NHS Nottingham City CCG","E38000132","NHS Nottingham City CCG"]
[132,"04L","NHS Nottingham North and East CCG","E38000133","NHS Nottingham North and East CCG"]
[133,"04M","NHS Nottingham West CCG","E38000134","NHS Nottingham West CCG"]
[134,"00Y","NHS Oldham CCG","E38000135","NHS Oldham CCG"]
[135,"10Q","NHS Oxfordshire CCG","E38000136","NHS Oxfordshire CCG"]
[136,"10R","NHS Portsmouth CCG","E38000137","NHS Portsmouth CCG"]
[137,"08N","NHS Redbridge CCG","E38000138","NHS Redbridge CCG"]
[138,"05J","NHS Redditch and Bromsgrove CCG","E38000139","NHS Redditch and Bromsgrove CCG"]
[139,"08P","NHS Richmond CCG","E38000140","NHS Richmond CCG"]
[140,"03L","NHS Rotherham CCG","E38000141","NHS Rotherham CCG"]
[141,"04N","NHS Rushcliffe CCG","E38000142","NHS Rushcliffe CCG"]
[142,"01G","NHS Salford CCG","E38000143","NHS Salford CCG"]
[143,"05L","NHS Sandwell and West Birmingham CCG","E38000144","NHS Sandwell and West Birmingham CCG"]
[144,"03M","NHS Scarborough and Ryedale CCG","E38000145","NHS Scarborough and Ryedale CCG"]
[145,"03N","NHS Sheffield CCG","E38000146","NHS Sheffield CCG"]
[146,"05N","NHS Shropshire CCG","E38000147","NHS Shropshire CCG"]
[147,"10T","NHS Slough CCG","E38000148","NHS Slough CCG"]
[148,"05P","NHS Solihull CCG","E38000149","NHS Solihull CCG"]
[149,"11X","NHS Somerset CCG","E38000150","NHS Somerset CCG"]
[150,"01R","NHS South Cheshire CCG","E38000151","NHS South Cheshire CCG"]
[151,"99Q","NHS South Devon and Torbay CCG","E38000152","NHS South Devon and Torbay CCG"]
[152,"05Q","NHS South East Staffs and Seisdon Peninsular CCG","E38000153","NHS South East Staffs and Seisdon Peninsular CCG"]
[153,"10V","NHS South Eastern Hampshire CCG","E38000154","NHS South Eastern Hampshire CCG"]
[154,"12A","NHS South Gloucestershire CCG","E38000155","NHS South Gloucestershire CCG"]
[155,"10A","NHS South Kent Coast CCG","E38000156","NHS South Kent Coast CCG"]
[156,"99D","NHS South Lincolnshire CCG","E38000157","NHS South Lincolnshire CCG"]
[157,"01N","NHS South Manchester CCG","E38000158","NHS South Manchester CCG"]
[158,"06Y","NHS South Norfolk CCG","E38000159","NHS South Norfolk CCG"]
[159,"10W","NHS South Reading CCG","E38000160","NHS South Reading CCG"]
[160,"01T","NHS South Sefton CCG","E38000161","NHS South Sefton CCG"]
[161,"00M","NHS South Tees CCG","E38000162","NHS South Tees CCG"]
[162,"00N","NHS South Tyneside CCG","E38000163","NHS South Tyneside CCG"]
[163,"05R","NHS South Warwickshire CCG","E38000164","NHS South Warwickshire CCG"]
[164,"04Q","NHS South West Lincolnshire CCG","E38000165","NHS South West Lincolnshire CCG"]
[165,"05T","NHS South Worcestershire CCG","E38000166","NHS South Worcestershire CCG"]
[166,"10X","NHS Southampton CCG","E38000167","NHS Southampton CCG"]
[167,"99G","NHS Southend CCG","E38000168","NHS Southend CCG"]
[168,"04R","NHS Southern Derbyshire CCG","E38000169","NHS Southern Derbyshire CCG"]
[169,"01V","NHS Southport and Formby CCG","E38000170","NHS Southport and Formby CCG"]
[170,"08Q","NHS Southwark CCG","E38000171","NHS Southwark CCG"]
[171,"01X","NHS St Helens CCG","E38000172","NHS St Helens CCG"]
[172,"05V","NHS Stafford and Surrounds CCG","E38000173","NHS Stafford and Surrounds CCG"]
[173,"01W","NHS Stockport CCG","E38000174","NHS Stockport CCG"]
[174,"05W","NHS Stoke on Trent CCG","E38000175","NHS Stoke on Trent CCG"]
[175,"00P","NHS Sunderland CCG","E38000176","NHS Sunderland CCG"]
[176,"99H","NHS Surrey Downs CCG","E38000177","NHS Surrey Downs CCG"]
[177,"10C","NHS Surrey Heath CCG","E38000178","NHS Surrey Heath CCG"]
[178,"08T","NHS Sutton CCG","E38000179","NHS Sutton CCG"]
[179,"10D","NHS Swale CCG","E38000180","NHS Swale CCG"]
[180,"12D","NHS Swindon CCG","E38000181","NHS Swindon CCG"]
[181,"01Y","NHS Tameside and Glossop CCG","E38000182","NHS Tameside and Glossop CCG"]
[182,"05X","NHS Telford and Wrekin CCG","E38000183","NHS Telford and Wrekin CCG"]
[183,"10E","NHS Thanet CCG","E38000184","NHS Thanet CCG"]
[184,"07G","NHS Thurrock CCG","E38000185","NHS Thurrock CCG"]
[185,"08V","NHS Tower Hamlets CCG","E38000186","NHS Tower Hamlets CCG"]
[186,"02A","NHS Trafford CCG","E38000187","NHS Trafford CCG"]
[187,"03Q","NHS Vale of York CCG","E38000188","NHS Vale of York CCG"]
[188,"02D","NHS Vale Royal CCG","E38000189","NHS Vale Royal CCG"]
[189,"03R","NHS Wakefield CCG","E38000190","NHS Wakefield CCG"]
[190,"05Y","NHS Walsall CCG","E38000191","NHS Walsall CCG"]
[191,"08W","NHS Waltham Forest CCG","E38000192","NHS Waltham Forest CCG"]
[192,"08X","NHS Wandsworth CCG","E38000193","NHS Wandsworth CCG"]
[193,"02E","NHS Warrington CCG","E38000194","NHS Warrington CCG"]
[194,"05H","NHS Warwickshire North CCG","E38000195","NHS Warwickshire North CCG"]
[{"$f":"A197+1","v":195},"02F","NHS West Cheshire CCG","E38000196","NHS West Cheshire CCG"]
[196,"07H","NHS West Essex CCG","E38000197","NHS West Essex CCG"]
[197,"11A","NHS West Hampshire CCG","E38000198","NHS West Hampshire CCG"]
[198,"99J","NHS West Kent CCG","E38000199","NHS West Kent CCG"]
[199,"02G","NHS West Lancashire CCG","E38000200","NHS West Lancashire CCG"]
[200,"04V","NHS West Leicestershire CCG","E38000201","NHS West Leicestershire CCG"]
[201,"08Y","NHS West London (K&C & QPP) CCG","E38000202","NHS West London (K&C & QPP) CCG"]
[202,"07J","NHS West Norfolk CCG","E38000203","NHS West Norfolk CCG"]
[203,"07K","NHS West Suffolk CCG","E38000204","NHS West Suffolk CCG"]
[204,"02H","NHS Wigan Borough CCG","E38000205","NHS Wigan Borough CCG"]
[205,"99N","NHS Wiltshire CCG","E38000206","NHS Wiltshire CCG"]
[206,"11C","NHS Windsor, Ascot and Maidenhead CCG","E38000207","NHS Windsor, Ascot and Maidenhead CCG"]
[207,"12F","NHS Wirral CCG","E38000208","NHS Wirral CCG"]
[208,"11D","NHS Wokingham CCG","E38000209","NHS Wokingham CCG"]
[209,"06A","NHS Wolverhampton CCG","E38000210","NHS Wolverhampton CCG"]
[210,"06D","NHS Wyre Forest CCG","E38000211","NHS Wyre Forest CCG"]
[211,"ENG","England","ENG","England"]

{"sheet":"Guide to tool","index":1,"n_rows":19,"n_cols":15,"rows_kept":19,"cut":false,"hidden":false,"merged":[[6,1,6,16],[7,1,7,15],[10,1,10,16],[11,1,11,16],[12,1,13,16]]}
[null,null,null,null,null,null,null,null,null,null,null,null,null,null,"National Cardiovascular Intelligence Network"]
[]
[]
[]
[null,"Estimating the impact of obesity on diabetes prevalence"]
[]
[null,"The diabetes prevalence model estimates the number of people aged 16 years and over who have diabetes (diagnosed and undiagnosed).  The prevalence model adjusts for the age, sex, ethnic group and deprivation pattern of the local population.  Office for National Statistics population projections produced in 2014 were used as a basis to produce the population estimates.  Full details of the model methodology can be found on the National Cardiovascular (NCVIN) website: www.ncvin.org.uk"]
[null,"These estimates have assumed no change in the proportion of people who are overweight or obese in future years.  However, this is subject to uncertainty.  Different scenarios have been created assuming different levels of obesity in future years and the impact on diabetes prevalence. "]
[]
[null,"Methodology"]
[null,"The risk of developing type 2 diabetes is higher among people who are overweight or obese.1  Approximately 85% of people with diabetes are overweight or obese.2  The sex-specific relative risks of having diabetes for people who are overweight or obese for all adults aged 16 years and over were calculated from 3 years of Health Survey for England (HSE) data, 2012, 2013 and 2014.  A range of scenarios were constructed assuming different increases or decreases of obesity in future years.  These included: increasing obesity prevalence by 1%, 3% or 5% every 5 years; decreasing obesity level by 1%, 3%, or 5% every 5 years.  The scenarios do not represent actual forecasts in obesity prevalence.  The prevalence of people who are overweight was assumed to remain the same. "]
[null,"The sex-specific relative risks of having diabetes for people who are overweight or obese were combined with the estimated prevalence of obesity using the range of scenarios, to create obesity adjustment factors for each scenario.  These factors were applied to the estimated diabetes prevalence rates for men and women produced by the diabetes prevalence model.  This method assumes that sex-specific obesity prevalence is an independent factor from age and ethnicity and applies the adjustment uniformly for men and women at each new time point on the trend. "]
[null,"It is important to note that these scenarios were designed to assess the possible impacts of plausible changes in obesity rates. They do not provide a definitive forecast of future changes in the prevalence of obesity and its impact on diabetes."]
[]
[]
[]
[null,"References"]
[null,"1. McCulloch DK, Robertson RP. Risk factors for type 2 diabetes mellitus Available from: http://www.uptodate.com/contents/risk-factors-for-type-2-diabetes-mellitus"]
[null,"2. NHS Digital. National Diabetes Audit 2012-2013: report 1: care processes and treatment targets.  Available from: http://www.hscic.gov.uk/catalogue/PUB14970"]

{"sheet":"Output","index":2,"n_rows":35,"n_cols":15,"rows_kept":35,"cut":false,"hidden":false,"merged":[[10,1,10,14],[11,1,11,14],[15,1,21,6],[25,4,25,5],[25,2,25,3],[22,1,23,6]]}
[null,null,null,null,null,null,null,null,null,null,null,null,null,null,"National Cardiovascular Intelligence Network"]
[]
[]
[]
[null,"Estimating the impact of obesity on diabetes prevalence"]
[null,{"$f":"Data_lookup!C1","v":"England"}]
[]
[null,null,"CCG:",null,null,null,null,null,null,null,"Scenario:"]
[]
[]
[null,{"$f":"\"Using the diabetes prevalence model, it was estimated that in 2015 that there were \"&TEXT(Data_lookup!$G$7,\"#,##0\")&\" people aged 16 years and older living with diabetes (diagnosed and undiagnosed) in \"&Output!B6&\".  This equals \"&Data_lookup!E7&\"% of this age group.  By 2020, diabetes prevalence is expected to increase to \"&TEXT(Data_lookup!$G$8,\"#,##0\")&\" or \"&Data_lookup!E8&\"%. By 2035, it is expected to increase to \"&TEXT(Data_lookup!$G$11,\"#,##0\")&\" or \"&Data_lookup!E11&\"%.\"","v":"Using the diabetes prevalence model, it was estimated that in 2015 that there were 3,807,050 people aged 16 years and older living with diabetes (diagnosed and undiagnosed) in England.  This equals 8.6% of this age group.  By 2020, diabetes prevalence is expected to increase to 4,085,150 or 8.9%. By 2035, it is expected to increase to 4,936,100 or 9.7%."}]
[null,"These estimates have assumed no change in the proportion of people who are overweight or obese in future years.  However, this is subject to uncertainty.  Different scenarios have been constructed assuming different levels of obesity in future years.  "]
[]
[null,{"$f":"\"Scenario selected: \"&Data_lookup!D2&\"\"","v":"Scenario selected: Obesity levels increase by 3% every 5 years"}]
[]
[null,{"$f":"\"If \"&Data_lookup!E2&\", \"&Data_lookup!Q11&\"\"","v":"If obesity levels were to rise by 3% every 5 years, it is estimated there would be 4,137,250 (9%) people with diabetes in England in 2020.  This represents an additional 52,100 people with diabetes compared to if obesity levels remained as there are now.  By 2035, it is estimated that there would be 5,199,300 (10.2%) people with diabetes if obesity levels continued to increase at the same rate.  This represents an additional 263,200 people. "}]
[]
[]
[]
[]
[]
[]
[null,"Comparison of diabetes prevalence using different levels of obesity"]
[]
[]
[null,null,{"$f":"Data_lookup!K3","v":"Obesity levels maintained"},null,{"$f":"Data_lookup!L3","v":"Obesity levels increase by 3% every 5 years"},null,"Difference"]
[null,null,"Prevalence","Number","Prevalence","Number"]
[null,{"$f":"Data_lookup!J4","v":2015},{"$f":"Data_lookup!K4","v":8.5811804349166021E-2},{"$f":"Data_lookup!G7","v":3807050},{"$f":"Data_lookup!L4","v":8.5811804349166021E-2},{"$f":"Data_lookup!P10","v":3807050},{"$f":"Data_lookup!N10","v":0}]
[null,{"$f":"Data_lookup!J5","v":2020},{"$f":"Data_lookup!K5","v":8.897294392161384E-2},{"$f":"Data_lookup!G8","v":4085150},{"$f":"Data_lookup!L5","v":9.0107752681303152E-2},{"$f":"Data_lookup!P11","v":4137250},{"$f":"Data_lookup!N11","v":52100}]
[null,{"$f":"Data_lookup!J6","v":2025},{"$f":"Data_lookup!K6","v":9.2325885939244151E-2},{"$f":"Data_lookup!G9","v":4389900},{"$f":"Data_lookup!L6","v":9.4715391648865166E-2},{"$f":"Data_lookup!P12","v":4503500},{"$f":"Data_lookup!N12","v":113600}]
[null,{"$f":"Data_lookup!J7","v":2030},{"$f":"Data_lookup!K7","v":9.4937403097907255E-2},{"$f":"Data_lookup!G10","v":4675200},{"$f":"Data_lookup!L7","v":9.8677877816734857E-2},{"$f":"Data_lookup!P13","v":4859350},{"$f":"Data_lookup!N13","v":184200}]
[null,{"$f":"Data_lookup!J8","v":2035},{"$f":"Data_lookup!K8","v":9.7185299901400596E-2},{"$f":"Data_lookup!G11","v":4936100},{"$f":"Data_lookup!L8","v":0.10236722927152783},{"$f":"Data_lookup!P14","v":5199300},{"$f":"Data_lookup!N14","v":263200}]
[]
[null,"For any enquiries, contact ncvin@phe.gov.uk"]
[null,"Last updated: October 2016"]

{"sheet":"Data_lookup","index":3,"n_rows":30,"n_cols":20,"rows_kept":30,"cut":false,"hidden":true,"merged":[]}
["CCG:",1,{"$f":"VLOOKUP(B1,Lookups!A4:C214,3,FALSE)","v":"England"},{"$f":"IF(C1=\"ENGLAND\",\"England\",A3)","v":"England"}]
["Scenario",3,{"$f":"VLOOKUP(B2,Lookups!G5:I12,3,FALSE)","v":13},{"$f":"VLOOKUP(B2,Lookups!G5:J12,4,FALSE)","v":"Obesity levels increase by 3% every 5 years"},{"$f":"VLOOKUP(B2,Lookups!G5:K12,5,FALSE)","v":"obesity levels were to rise by 3% every 5 years"}]
[{"$f":"Output!B6","v":"England"},null,null,null,null,null,null,null,null,null,"Obesity levels maintained",{"$f":"D2","v":"Obesity levels increase by 3% every 5 years"}]
[null,null,null,null,null,null,null,null,{"$f":"C2+1","v":14},2015,{"$f":"D7","v":8.5811804349166021E-2},{"$f":"VLOOKUP($C$1,All_data!$A$4:$CD$214,$I4,FALSE)","v":8.5811804349166021E-2},{"$f":"L4-K4","v":0},null,null,{"$f":"SUM(L4-K4)/K4","v":0},null,{"$f":"ROUND(L4*100,1)","v":8.6}]
[null,null,null,null,null,null,null,null,{"$f":"I4+2","v":16},2020,{"$f":"D8","v":8.897294392161384E-2},{"$f":"VLOOKUP($C$1,All_data!$A$4:$CD$214,$I5,FALSE)","v":9.0107752681303152E-2},{"$f":"L5-K5","v":1.1348087596893125E-3},null,null,{"$f":"SUM(L5-K5)/K5","v":1.2754537611895721E-2},null,{"$f":"ROUND(L5*100,1)","v":9}]
[null,null,null,{"$f":"C1","v":"England"},null,null,null,null,{"$f":"I5+2","v":18},2025,{"$f":"D9","v":9.2325885939244151E-2},{"$f":"VLOOKUP($C$1,All_data!$A$4:$CD$214,$I6,FALSE)","v":9.4715391648865166E-2},2.3895057096210148E-3,null,null,{"$f":"SUM(L6-K6)/K6","v":2.5881210727763282E-2},null,9.5]
[null,null,2015,{"$f":"VLOOKUP($D$6,Baseline!$B$2:$L$211,3,FALSE)","v":8.5811804349166021E-2},{"$f":"ROUND(D7*100,1)","v":8.6},{"$f":"VLOOKUP($D$6,Baseline!$B$2:$L$211,2,FALSE)","v":3807042.4161868379},{"$f":"MROUND(F7,50)","v":3807050},null,20,2030,{"$f":"D10","v":9.4937403097907255E-2},{"$f":"VLOOKUP($C$1,All_data!$A$4:$CD$214,$I7,FALSE)","v":9.8677877816734857E-2},3.7404747188276022E-3,null,null,{"$f":"SUM(L7-K7)/K7","v":3.9399378925186287E-2},null,9.9]
[null,null,2020,{"$f":"VLOOKUP($D$6,Baseline!$B$2:$L$211,5,FALSE)","v":8.897294392161384E-2},{"$f":"ROUND(D8*100,1)","v":8.9},{"$f":"VLOOKUP($D$6,Baseline!$B$2:$L$211,4,FALSE)","v":4085166.0282777227},{"$f":"MROUND(F8,50)","v":4085150},null,22,2035,{"$f":"D11","v":9.7185299901400596E-2},{"$f":"VLOOKUP($C$1,All_data!$A$4:$CD$214,$I8,FALSE)","v":0.10236722927152783},5.1819293701272362E-3,{"$f":"IF(M8<0,\"fewer\",\"additional\")","v":"additional"},{"$f":"ROUND(L8*100,1)","v":10.199999999999999},{"$f":"SUM(L8-K8)/K8","v":5.3320094452397285E-2},null,10.199999999999999]
[null,null,2025,{"$f":"VLOOKUP($D$6,Baseline!$B$2:$L$211,7,FALSE)","v":9.2325885939244151E-2},{"$f":"ROUND(D9*100,1)","v":9.1999999999999993},{"$f":"VLOOKUP($D$6,Baseline!$B$2:$L$211,6,FALSE)","v":4389883.5268733986},{"$f":"MROUND(F9,50)","v":4389900},null,null,null,null,null,null,null,null,null,null,{"$f":"SUM(K8-K4)/K4","v":0.13253998839082926},{"$f":"SUM(L8-L4)/L4","v":0.19292712754294519},{"$f":"S9-R9","v":6.0387139152115937E-2}]
[null,null,2030,{"$f":"VLOOKUP($D$6,Baseline!$B$2:$L$211,9,FALSE)","v":9.4937403097907255E-2},{"$f":"ROUND(D10*100,1)","v":9.5},{"$f":"VLOOKUP($D$6,Baseline!$B$2:$L$211,8,FALSE)","v":4675175.3268238856},{"$f":"MROUND(F10,50)","v":4675200},null,{"$f":"C2","v":13},2015,{"$f":"F7","v":3807042.4161868379},{"$f":"VLOOKUP($C$1,All_data!$A$4:$CD$214,$I10,FALSE)","v":3807042.4161868379},{"$f":"L10-K10","v":0},null,null,{"$f":"MROUND(L10,50)","v":3807050}]
[null,null,2035,{"$f":"VLOOKUP($D$6,Baseline!$B$2:$L$211,11,FALSE)","v":9.7185299901400596E-2},{"$f":"ROUND(D11*100,1)","v":9.6999999999999993},{"$f":"VLOOKUP($D$6,Baseline!$B$2:$L$211,10,FALSE)","v":4936101.636878076},{"$f":"MROUND(F11,50)","v":4936100},null,{"$f":"I10+2","v":15},2020,{"$f":"F8","v":4085166.0282777227},{"$f":"VLOOKUP($C$1,All_data!$A$4:$CD$214,$I11,FALSE)","v":4137270.4320362299},{"$f":"L11-K11","v":52104.403758507222},{"$f":"IF(M11>0,O11,-O11)","v":52100},{"$f":"MROUND(ABS(M11),50)","v":52100},{"$f":"MROUND(L11,50)","v":4137250},{"$f":"IF(M8<0,Q13,Q12)","v":"it is estimated there would be 4,137,250 (9%) people with diabetes in England in 2020.  This represents an additional 52,100 people with diabetes compared to if obesity levels remained as there are now.  By 2035, it is estimated that there would be 5,199,300 (10.2%) people with diabetes if obesity levels continued to increase at the same rate.  This represents an additional 263,200 people. "}]
[null,null,null,null,null,null,null,null,{"$f":"I11+2","v":17},2025,4389883.5268733986,{"$f":"VLOOKUP($C$1,All_data!$A$4:$CD$214,$I12,FALSE)","v":4503499.0275027454},113615.50062934682,{"$f":"IF(M12>0,O12,-O12)","v":113600},{"$f":"MROUND(ABS(M12),50)","v":113600},{"$f":"MROUND(L12,50)","v":4503500},{"$f":"\"it is estimated there would be \"&TEXT(Data_lookup!$P$11,\"#,##0\")&\" (\"&R5&\"%) people with diabetes in \"&D1&\" in 2020.  This represents an additional \"&TEXT(Data_lookup!$O$11,\"#,##0\")&\" people with diabetes compared to if obesity levels remained as there are now.  By 2035, it is estimated that there would be \"&TEXT(Data_lookup!$P$14,\"#,##0\")&\" (\" &R8& \"%) people with diabetes if obesity levels continued to increase at the same rate.  This represents an additional \"&TEXT(Data_lookup!$O$14,\"#,##0\")&\" people. \"","v":"it is estimated there would be 4,137,250 (9%) people with diabetes in England in 2020.  This represents an additional 52,100 people with diabetes compared to if obesity levels remained as there are now.  By 2035, it is estimated that there would be 5,199,300 (10.2%) people with diabetes if obesity levels continued to increase at the same rate.  This represents an additional 263,200 people. "}]
[null,null,null,null,null,null,null,null,19,2030,4675175.3268238856,{"$f":"VLOOKUP($C$1,All_data!$A$4:$CD$214,$I13,FALSE)","v":4859374.331067102},184199.00424321648,{"$f":"IF(M13>0,O13,-O13)","v":184200},184200,{"$f":"MROUND(L13,50)","v":4859350},{"$f":"\"it is estimated there would be \"&TEXT(Data_lookup!$P$11,\"#,##0\")&\" (\"&R5&\"%) people with diabetes in \"&D1&\" in 2020.  This represents \"&TEXT(Data_lookup!$O$11,\"#,##0\")&\" fewer people with diabetes compared to if obesity levels remained as there are now.  By 2035, if obesity levels continued to decline at the same rate, it is estimated that there would be \"&TEXT(Data_lookup!$P$14,\"#,##0\")&\" (\" &R8& \"%) people with diabetes .  This represents \"&TEXT(Data_lookup!$O$14,\"#,##0\")&\" fewer people with diabetes. \"","v":"it is estimated there would be 4,137,250 (9%) people with diabetes in England in 2020.  This represents 52,100 fewer people with diabetes compared to if obesity levels remained as there are now.  By 2035, if obesity levels continued to decline at the same rate, it is estimated that there would be 5,199,300 (10.2%) people with diabetes .  This represents 263,200 fewer people with diabetes. "}]
[null,null,null,null,null,null,null,null,21,2035,4936101.636878076,{"$f":"VLOOKUP($C$1,All_data!$A$4:$CD$214,$I14,FALSE)","v":5199295.0423830478},{"$f":"L14-K14","v":263193.40550497174},{"$f":"IF(M14>0,O14,-O14)","v":263200},263200,{"$f":"MROUND(L14,50)","v":5199300}]
[]
[null,null,null,null,null,null,null,null,null,null,{"$f":"K14-K10","v":1129059.2206912381},{"$f":"M14/K16","v":0.23310859225244024}]
[]
[]
[]
[]
[]
[]
[]
[]
[]
[]
[]
[]
[]
[null,null,null,null,null,null,null,null,null,null,{"$f":"M26/K28","v":{"$error":"#DIV/0!"}}]

{"sheet":"All_data","index":4,"n_rows":214,"n_cols":82,"rows_kept":214,"cut":false,"hidden":true,"merged":[]}
[null,null,"+5%","+5%","+5%","+5%","+5%","+5%","+5%","+5%","+5%","+5%","+3%","+3%","+3%","+3%","+3%","+3%","+3%","+3%","+3%","+3%","+2%","+2%","+2%","+2%","+2%","+2%","+2%","+2%","+2%","+2%","+1%","+1%","+1%","+1%","+1%","+1%","+1%","+1%","+1%","+1%","-5%","-5%","-5%","-5%","-5%","-5%","-5%","-5%","-5%","-5%","-3%","-3%","-3%","-3%","-3%","-3%","-3%","-3%","-3%","-3%","-2%","-2%","-2%","-2%","-2%","-2%","-2%","-2%","-2%","-2%","-1%","-1%","-1%","-1%","-1%","-1%","-1%","-1%","-1%","-1%"]
[null,null,2015,2015,2020,2020,2025,2025,2030,2030,2035,2035,2015,2015,2020,2020,2025,2025,2030,2030,2035,2035,2015,2015,2020,2020,2025,2025,2030,2030,2035,2035,2015,2015,2020,2020,2025,2025,2030,2030,2035,2035,2015,2015,2020,2020,2025,2025,2030,2030,2035,2035,2015,2015,2020,2020,2025,2025,2030,2030,2035,2035,2015,2015,2020,2020,2025,2025,2030,2030,2035,2035,2015,2015,2020,2020,2025,2025,2030,2030,2035,2035]
["2015 residence population",null,"Number","Prevalence","Number","Prevalence","Number","Prevalence","Number","Prevalence","Number","Prevalence","Number","Prevalence","Number","Prevalence","Number","Prevalence","Number","Prevalence","Number","Prevalence","Number","Prevalence","Number","Prevalence","Number","Prevalence","Number","Prevalence","Number","Prevalence","Number","Prevalence","Number","Prevalence","Number","Prevalence","Number","Prevalence","Number","Prevalence","Number","Prevalence","Number","Prevalence","Number","Prevalence","Number","Prevalence","Number","Prevalence","Number","Prevalence","Number","Prevalence","Number","Prevalence","Number","Prevalence","Number","Prevalence","Number","Prevalence","Number","Prevalence","Number","Prevalence","Number","Prevalence","Number","Prevalence","Number","Prevalence","Number","Prevalence","Number","Prevalence","Number","Prevalence","Number","Prevalence"]
["England","ENG",3807042.4161868379,8.5811804349166021E-2,4172006.7012085691,9.0864291854429388E-2,4581108.3021526784,9.6347632002235215E-2,4988291.9815613069,0.10129577042948489,5388020.700130336,0.10608298737306879,3807042.4161868379,8.5811804349166021E-2,4137270.4320362299,9.0107752681303152E-2,4503499.0275027454,9.4715391648865166E-2,4859374.331067102,9.8677877816734857E-2,5199295.0423830478,0.10236722927152783,3807042.4161868379,8.5811804349166021E-2,4119902.297450061,8.9729483094740048E-2,4465254.0724468902,9.3911042436266967E-2,4796762.9189137705,9.7406446381848283E-2,5108962.816213062,0.10058870744663211,3807042.4161868379,8.5811804349166021E-2,4102534.162863892,8.9351213508176944E-2,4427382.2389037749,9.3114540533059967E-2,4735367.2237640824,9.6159702152715382E-2,5021248.7087773159,9.8861732910078964E-2,3807042.4161868379,8.5811804349166021E-2,3998325.3553468771,8.7081595988798291E-2,4207986.7894126205,8.8500322611033161E-2,4391855.6574698817,8.9184114338723974E-2,4547119.128300488,8.952674978766724E-2,3807042.4161868379,8.5811804349166021E-2,4033061.6245192154,8.7838135161924513E-2,4279626.119858711,9.0007006014143937E-2,4501703.2373187002,9.1414756665141622E-2,4695559.3516631518,9.2449341072488408E-2,3807042.4161868379,8.5811804349166021E-2,4050429.7591053853,8.8216404748487631E-2,4316005.4673508666,9.0772118679786143E-2,4558355.2523953468,9.2565172385549302E-2,4773306.7833118849,9.3980084970647818E-2,3807042.4161868379,8.5811804349166021E-2,4067797.8936915523,8.8594674335050694E-2,4352757.9363557631,9.1545078654819562E-2,4616175.3092990238,9.3739307185994852E-2,4853471.0206003515,9.5558412569099388E-2]
[]
["NHS Airedale, Wharfdale and Craven CCG","E38000001",12033.475277344636,9.3398597309411968E-2,13023.597568561494,9.8708485437028148E-2,14255.308316968363,0.1046184376703975,15570.772354794663,0.11107698926233887,16734.203543801661,0.11658216207190791,12033.475277344636,9.3398597309411968E-2,12914.933842041817,9.7884901031088503E-2,14013.467418550139,0.10284358886357067,15167.795549033794,0.1082022795622328,16147.112383258864,0.11249207456638473,12033.475277344636,9.3398597309411968E-2,12860.601978781982,9.7473108828118701E-2,13894.29101428154,0.10196896385059108,14972.081876181363,0.10680611981867144,15866.105274158914,0.11053438257042576,12033.475277344636,9.3398597309411968E-2,12806.270115522144,9.7061316625148886E-2,13776.277306639957,0.10110287176456742,14780.168348250594,0.10543706911293048,15593.242655768236,0.10863343079119574,12033.475277344636,9.3398597309411968E-2,12480.278935963122,9.4590563407330019E-2,13092.611689957677,9.608551071449932E-2,13706.403869946109,9.7777171279398695E-2,14118.311854241803,9.8358031588698644E-2,12033.475277344636,9.3398597309411968E-2,12588.942662482797,9.5414147813269651E-2,13315.84944234373,9.7723832690031778E-2,14049.770559288841,0.10022664117055816,14580.082363061085,0.10157504781288201,12033.475277344636,9.3398597309411968E-2,12643.274525742634,9.5825940016239453E-2,13429.212363477269,9.8555793068231826E-2,14226.856070760599,0.10148991347382365,14821.940467680843,0.10326000047151207,12033.475277344636,9.3398597309411968E-2,12697.606389002472,9.6237732219209282E-2,13543.73798123782,9.9396286373387793E-2,14407.59270186297,0.10277923171538715,15071.31681462533,0.1049973304627653]
["NHS Ashford CCG","E38000002",8276.5848729807567,8.3366084538484653E-2,9395.0958593893574,8.9205239834688158E-2,10603.103007911161,9.5231749666886648E-2,11765.863065844391,0.10066617955034558,12935.531091742852,0.10589007115048178,8276.5848729807567,8.3366084538484653E-2,9316.8967842827387,8.8462749565920415E-2,10423.47058754209,9.3618381422149163E-2,11461.844287532032,9.8065060639391119E-2,12482.573940253835,0.10218217043429793,8276.5848729807567,8.3366084538484653E-2,9277.797246729433,8.8091504431536585E-2,10334.94980346599,9.282333216693002E-2,11314.191542091077,9.6801775685241953E-2,12265.769143587511,0.10040740949236668,8276.5848729807567,8.3366084538484653E-2,9238.6977091761255,8.7720259297152728E-2,10247.292636795506,9.2036039489810539E-2,11169.405749288524,9.5563019757773149E-2,12055.248047920175,9.8684086836281729E-2,8276.5848729807567,8.3366084538484653E-2,9004.1004838562822,8.5492788490849625E-2,9739.4856022906479,8.7475171567187412E-2,10359.322984666464,8.8632126836639846E-2,10917.297931476329,8.9368843577900536E-2,8276.5848729807567,8.3366084538484653E-2,9082.299558962899,8.6235278759617354E-2,9905.300144169787,8.8964434562329678E-2,10618.369956886201,9.0848476701627337E-2,11273.566716247391,9.2285254717152848E-2,8276.5848729807567,8.3366084538484653E-2,9121.3990965162047,8.6606523894001183E-2,9989.5028412177853,8.9720700927050326E-2,10751.969012923211,9.1991521328911807E-2,11460.166967615191,9.3812761686437388E-2,8276.5848729807567,8.3366084538484653E-2,9160.4986340695104,8.6977769028385027E-2,10074.569155671403,9.0484723869870679E-2,10888.322592083401,9.3158133060261827E-2,11652.567751943605,9.5387751734967302E-2]
["NHS Aylesbury Vale CCG","E38000003",12549.168950372712,7.6379604080174759E-2,14250.308562346947,8.1551496865897605E-2,16063.277636773135,8.7082715151106674E-2,17788.588501343933,9.1921189031334921E-2,19592.648848526409,9.6954913145914534E-2,12549.168950372712,7.6379604080174759E-2,14131.697988915768,8.0872713682704406E-2,15791.086171666939,8.5607102741336552E-2,17328.330809380161,8.9542842131976857E-2,18905.465080920581,9.3554360059979122E-2,12549.168950372712,7.6379604080174759E-2,14072.392702200181,8.053332209110782E-2,15656.953358333363,8.4879937972098918E-2,17104.797538817023,8.8387750820674987E-2,18576.549340174646,9.1926708928021808E-2,12549.168950372712,7.6379604080174759E-2,14013.087415484595,8.0193930499511248E-2,15524.129157812793,8.4159867493292836E-2,16885.604582400429,8.7255087755272992E-2,18257.166636522394,9.0346232366005516E-2,12549.168950372712,7.6379604080174759E-2,13657.25569519107,7.8157580949931721E-2,14754.66482376259,7.9988424719519641E-2,15659.210523407433,8.0917788979988803E-2,16530.776301819118,8.1803128967830152E-2,12549.168950372712,7.6379604080174759E-2,13775.866268622241,7.8836364133124878E-2,15005.918483860618,8.135052848238436E-2,16051.384856209876,8.2944320257388779E-2,17071.273620372358,8.4477798992341438E-2,12549.168950372712,7.6379604080174759E-2,13835.171555337833,7.9175755724721492E-2,15133.508233129143,8.2042221799464091E-2,16253.642077035085,8.3989469186828675E-2,17354.365880533362,8.5878691016099379E-2,12549.168950372712,7.6379604080174759E-2,13894.476842053422,7.9515147316318077E-2,15262.406595210687,8.274100940697543E-2,16460.069403608933,8.5056166823113552E-2,17646.258160919009,8.7323130249995093E-2]
["NHS Barking and Dagenham CCG","E38000004",13631.498948757688,9.2179462731658696E-2,15250.018165662868,9.4603090357710098E-2,17231.832001211998,9.8366434531407684E-2,19437.7753469079,0.10321673400014815,21812.491152307895,0.10873624702047804,13631.498948757688,9.2179462731658696E-2,15122.765316625864,9.3813680624229928E-2,16939.354890047864,9.6696854036122062E-2,18934.791415875803,0.10054583377164296,21047.66520912102,0.1049235553794667,13631.498948757688,9.2179462731658696E-2,15059.13889210737,9.3418975757489892E-2,16795.225544402074,9.5874104032435625E-2,18690.507300460831,9.9248658137536278E-2,20681.586579933559,0.10309863698870168,13631.498948757688,9.2179462731658696E-2,14995.512467588875,9.3024270890749841E-2,16652.502338713806,9.505938085805346E-2,18450.966415434952,9.7976669580686876E-2,20326.11808799077,0.10132661060812946,13631.498948757688,9.2179462731658696E-2,14613.753920477888,9.0656041690309483E-2,15825.692043692121,9.0339605227149913E-2,17110.724816962618,9.0859838662715686E-2,18404.669738521734,9.1748104379470258E-2,13631.498948757688,9.2179462731658696E-2,14741.006769514879,9.144545142378957E-2,16095.67091553594,9.1880756453567414E-2,17539.305134048096,9.3135647483263043E-2,19006.235711031113,9.4746937741929771E-2,13631.498948757688,9.2179462731658696E-2,14804.633194033377,9.1840156290529634E-2,16232.769561394125,9.2663372310732531E-2,17760.338120104749,9.43093570523829E-2,19321.313445828157,9.6317614385982839E-2,13631.498948757688,9.2179462731658696E-2,14868.259618551876,9.2234861157269699E-2,16371.274347209834,9.3454014997201934E-2,17985.928327515627,9.550726597024016E-2,19646.185480324431,9.7937116053461767E-2]
["NHS Barnet CCG","E38000005",25808.208036002019,8.5650497929118607E-2,29339.882462116377,9.058874417103982E-2,33321.370035771688,9.6516539322707942E-2,37710.37861129579,0.10280910199371808,42228.87950958898,0.10910163672192678,25808.208036002019,8.5650497929118607E-2,29094.882486710736,8.9832291239689804E-2,32755.900558492078,9.487863677005004E-2,36735.17321176493,0.10015041769837767,40750.234243793951,0.10528144019995336,25808.208036002019,8.5650497929118607E-2,28972.382499007919,8.9454064774014824E-2,32477.243724736505,9.4071497290975858E-2,36261.545380586569,9.8859174974336342E-2,40042.490950331281,0.1034529296500059,25808.208036002019,8.5650497929118607E-2,28849.88251130511,8.9075838308339844E-2,32201.305494237084,9.3272232343404829E-2,35797.113914542926,9.7593004129070141E-2,39355.260336055326,0.10167741522258907,25808.208036002019,8.5650497929118607E-2,28114.882585088209,8.6806479514289894E-2,30602.766779619724,8.8642007819545024E-2,33198.599801330289,9.0508723558697629E-2,35640.50597825514,9.2080054715690432E-2,25808.208036002019,8.5650497929118607E-2,28359.882560493828,8.7562932445639827E-2,31124.738604800907,9.0153917868152314E-2,34029.548492865579,9.2774123481094817E-2,36803.519190918931,9.5084790965015584E-2,25808.208036002019,8.5650497929118607E-2,28482.382548196652,8.7941158911314848E-2,31389.802422275727,9.0921684689710708E-2,34458.096102795324,9.3942464838591394E-2,37412.661970482353,9.6658559320214832E-2,25808.208036002019,8.5650497929118607E-2,28604.882535899473,8.8319385376989856E-2,31657.584843006687,9.169732604277224E-2,34895.479436089794,9.513489486393073E-2,38040.740162751179,9.8281248805743765E-2]
["NHS Barnsley CCG","E38000006",17198.332429825146,8.8205623293800106E-2,18895.971326088093,9.3888359962675597E-2,20729.646017528819,9.9594724788742275E-2,22536.194149651346,0.10481950767279695,24314.272297589403,0.10985033115383301,17198.332429825146,8.8205623293800106E-2,18738.992619702651,9.3108380302606819E-2,20379.179454170662,9.7910922716299892E-2,21954.883804688972,0.10211573862646033,23464.191150195242,0.10600971875935321,17198.332429825146,8.8205623293800106E-2,18660.503266509935,9.2718390472572451E-2,20206.473575592721,9.7081164483485721E-2,21672.558913893121,0.10080259959950287,23057.305709254953,0.1041714362937334,17198.332429825146,8.8205623293800106E-2,18582.013913317223,9.2328400642538111E-2,20035.452632415545,9.625950145294293E-2,21395.715885883739,9.951495760876157E-2,22662.213118339307,0.10238643317222058,17198.332429825146,8.8205623293800106E-2,18111.077794160909,8.9988461662331834E-2,19044.71061676844,9.1499522517384635E-2,19846.767186186305,9.2310545052029319E-2,20526.580779863332,9.2737782505933536E-2,17198.332429825146,8.8205623293800106E-2,18268.056500546343,9.0768441322400584E-2,19368.218213714434,9.3053801353485302E-2,20342.087526654883,9.4614360589092464E-2,21195.203355626443,9.5758576649617969E-2,17198.332429825146,8.8205623293800106E-2,18346.545853739062,9.1158431152434952E-2,19532.499415288574,9.3843083574942684E-2,20597.540541046415,9.5802514144401926E-2,21545.402828723018,9.7340755528702513E-2,17198.332429825146,8.8205623293800106E-2,18425.035206931781,9.1548420982469333E-2,19698.465552263464,9.4640460998671377E-2,20858.260443213199,9.7015164852154404E-2,21906.48837282752,9.8972116982142935E-2]
["NHS Basildon and Brentwood CCG","E38000007",17185.619213311416,8.2702691113144461E-2,18619.087268778501,8.6608462502458378E-2,20443.34522104419,9.1460921711901358E-2,22331.443839785803,9.5687050474701357E-2,24353.997835720591,9.9975360573565653E-2,17185.619213311416,8.2702691113144461E-2,18463.659660905014,8.5885476141524864E-2,20096.195268133732,8.9907817055000588E-2,21752.901843748463,9.3208080571379137E-2,23498.870783011127,9.6464986793970156E-2,17185.619213311416,8.2702691113144461E-2,18385.945856968276,8.552398296105812E-2,19925.123776915836,8.9142465000518242E-2,21471.921456477656,9.2004119703820622E-2,23089.570154514397,9.4784770749238093E-2,17185.619213311416,8.2702691113144461E-2,18308.232053031534,8.5162489780591377E-2,19755.721275856165,8.8384579795347917E-2,21196.396825957047,9.0823535975477959E-2,22692.132375953261,9.3153252774849191E-2,17185.619213311416,8.2702691113144461E-2,17841.949229411093,8.2993530697790932E-2,18774.355062820832,8.3994072399878453E-2,19654.824617156275,8.4218119021151228E-2,20543.823367019111,8.433425027511951E-2,17185.619213311416,8.2702691113144461E-2,17997.376837284577,8.3716517058724432E-2,19094.801173199718,8.5427707467786856E-2,20147.786115151172,8.6330388701479008E-2,21216.414747665509,8.7095298635736909E-2,17185.619213311416,8.2702691113144461E-2,18075.090641221315,8.4078010239191162E-2,19257.527713626496,8.6155725275709097E-2,20402.022596783714,8.7419755749351763E-2,21568.692932174665,8.8541432398089773E-2,17185.619213311416,8.2702691113144461E-2,18152.804445158054,8.4439503419657891E-2,19421.923244211495,8.6891209932943345E-2,20661.500883921359,8.8531583185882931E-2,21931.921805150596,9.0032519725577173E-2]
["NHS Bassetlaw CCG","E38000008",8439.1344652843709,8.9340826437480106E-2,9315.0547615427786,9.6890521755177622E-2,10094.281208768187,0.10350985652961638,10893.80443632863,0.1095956180717166,11639.026465867271,0.11498741815715544,8439.1344652843709,8.9340826437480106E-2,9237.6839931515442,9.6085749876758303E-2,9923.6508043553204,0.10176016001184703,10612.953339068659,0.10677015431658611,11232.142664247489,0.11096762165824432,8439.1344652843709,8.9340826437480106E-2,9198.9986089559297,9.5683363937548657E-2,9839.5661098730216,0.1008979297566963,10476.552437121958,0.10539791184227322,11037.390556709268,0.10904357396472307,8439.1344652843709,8.9340826437480106E-2,9160.3132247603135,9.5280977998339011E-2,9756.3017538734748,0.10004411150403483,10342.800012347483,0.10405231400751995,10848.282992241633,0.10717529136773005,8439.1344652843709,8.9340826437480106E-2,8928.2009195866231,9.2866662363081151E-2,9273.9427260140328,9.5097854040340796E-2,9594.4494184188861,9.6523636000189997E-2,9826.0815148827587,9.7076482067602846E-2,8439.1344652843709,8.9340826437480106E-2,9005.571687977852,9.3671434241500429E-2,9431.4477147028301,9.6712958518281697E-2,9833.7557757223785,9.8931144624973627E-2,10146.111780592393,0.10023821162410981,8439.1344652843709,8.9340826437480106E-2,9044.2570721734664,9.407382018071006E-2,9511.4307167713614,9.7533128760986076E-2,9957.1739464326783,0.1001727761210531,10313.73165238412,0.10189420719604941,8439.1344652843709,8.9340826437480106E-2,9082.9424563690809,9.4476206119919692E-2,9592.2340573226465,9.8361711006179742E-2,10083.136732465317,0.10144000736886637,10486.562045512534,0.10360167995961801]
["NHS Bath and North East Somerset CCG","E38000009",11199.8787201417,7.3557590438340342E-2,12061.293361731065,7.7764625156228645E-2,13112.129572313701,8.2570085467970414E-2,14126.248467094971,8.5936540133197292E-2,15104.653367650493,8.9609951160717211E-2,11199.8787201417,7.3557590438340342E-2,11960.777918024263,7.7116556531426572E-2,12889.799850900974,8.1170024250006134E-2,13760.598288405919,8.3712120017069708E-2,14574.769844498955,8.6466361203719477E-2,11199.8787201417,7.3557590438340342E-2,11910.520196170861,7.6792522219025522E-2,12780.238329531721,8.048009023634585E-2,13583.013031817116,8.2631786298923926E-2,14321.144773968439,8.4961703689893447E-2,11199.8787201417,7.3557590438340342E-2,11860.262474317464,7.6468487906624513E-2,12671.745701053875,7.9796887286233464E-2,13408.875923235302,8.1572429268982255E-2,14074.870574514423,8.3500655994983533E-2,11199.8787201417,7.3557590438340342E-2,11558.716143197058,7.4524282032218281E-2,12043.236680906361,7.5839021920065239E-2,12434.571279024651,7.5645280928486741E-2,12743.660735151536,7.5603113046698714E-2,11199.8787201417,7.3557590438340342E-2,11659.231586903861,7.5172350657020368E-2,12248.464116056568,7.7131386121263024E-2,12746.13286152561,7.754065495513815E-2,13160.435165675091,7.8075671367317814E-2,11199.8787201417,7.3557590438340342E-2,11709.489308757258,7.5496384969421376E-2,12352.681172968787,7.7787664817183799E-2,12906.815431805633,7.8518161770322628E-2,13378.726009059928,7.9370704847294304E-2,11199.8787201417,7.3557590438340342E-2,11759.747030610659,7.5820419281822413E-2,12457.96712277241,7.845067457665246E-2,13070.810928602177,7.9515822658487514E-2,13603.802498352385,8.0705994888184529E-2]
["NHS Bedfordshire CCG","E38000010",28640.437379509167,8.118498038298419E-2,32394.06102604336,8.6067434576872728E-2,36548.578486554412,9.138972416121828E-2,40745.999087383985,9.6371804842440831E-2,44959.262364745337,0.10124591803978143,28640.437379509167,8.118498038298419E-2,32124.852662567253,8.5352177752716002E-2,35930.44262614724,8.9844075380444186E-2,39694.448114073959,9.3884692795822983E-2,43386.6099539278,9.7704386690825124E-2,28640.437379509167,8.118498038298419E-2,31990.248480829207,8.499454934063766E-2,35625.832406475442,8.9082397495687735E-2,39183.741541794996,9.2676777534992899E-2,42633.87079298676,9.6009257291777603E-2,28640.437379509167,8.118498038298419E-2,31855.644299091164,8.4636920928559331E-2,35324.193993824811,8.8328150614684964E-2,38682.951287363539,9.1492316195278006E-2,41902.94843633374,9.4363258200094002E-2,28640.437379509167,8.118498038298419E-2,31048.019208662852,8.249115045608918E-2,33576.771465366059,8.3958720407496648E-2,35881.008182635967,8.4865203837833414E-2,37952.022861734702,8.5465979511180262E-2,28640.437379509167,8.118498038298419E-2,31317.227572138952,8.3206407280245892E-2,34147.358413434209,8.5385473128211167E-2,36777.009072063964,8.6984411239507953E-2,39188.976426608104,8.8251534537242965E-2,28640.437379509167,8.118498038298419E-2,31451.83175387701,8.3564035692324262E-2,34437.109598000083,8.6109995994199051E-2,37239.106243129761,8.8077356298793194E-2,39836.846394458342,8.9710503973468331E-2,28640.437379509167,8.118498038298419E-2,31586.435935615056,8.3921664104402605E-2,34729.832589587139,8.6841949863940629E-2,37710.730856833354,8.9192835517581254E-2,40504.855622974959,9.1214825976163053E-2]
["NHS Bexley CCG","E38000011",15834.931290618288,8.2336373183331368E-2,17168.816144353033,8.5205042900015071E-2,18897.703231504303,8.9131700931536204E-2,20762.430045455651,9.2755673898568841E-2,22852.746655261879,9.6965150438144423E-2,15834.931290618288,8.2336373183331368E-2,17025.298245415092,8.4492795262605919E-2,18576.427486107958,8.7616392255956799E-2,20224.031453560241,9.0350390696748759E-2,22049.962800107376,9.3558905295771266E-2,15834.931290618288,8.2336373183331368E-2,16953.539295946124,8.413667144390137E-2,18418.106505804473,8.686966562496215E-2,19962.547506166611,8.9182217236269706E-2,21665.715879815627,9.1928529700507577E-2,15834.931290618288,8.2336373183331368E-2,16881.780346477157,8.3780547625196822E-2,18261.330120430779,8.6130224131830871E-2,19706.140755885994,8.8036726035945284E-2,21292.605672336605,9.0345407638902767E-2,15834.931290618288,8.2336373183331368E-2,16451.226649663353,8.1643804712969503E-2,17353.108301714208,8.1846563068173811E-2,18271.533912807536,8.1627653291670543E-2,19275.796845167766,8.1788004264968447E-2,15834.931290618288,8.2336373183331368E-2,16594.744548601291,8.2356052350378628E-2,17649.670528233903,8.3245309537939363E-2,18730.290197047918,8.3677136334202637E-2,19907.218222597232,8.446715131787691E-2,15834.931290618288,8.2336373183331368E-2,16666.503498070255,8.2712176169083163E-2,17800.268533888437,8.3955610479617207E-2,18966.885923299353,8.4734122244904189E-2,20237.933100756025,8.5870388241497037E-2,15834.931290618288,8.2336373183331368E-2,16738.262447539226,8.3068299987787739E-2,17952.411134472761,8.4673196559158392E-2,19208.359740894648,8.5812900915362075E-2,20578.928364590949,8.7317245267273191E-2]
["NHS Birmingham Crosscity CCG","E38000012",56451.720040294102,9.904505586408538E-2,60652.247171212715,0.10244965908451187,65582.734215896955,0.10678444414468047,71044.558831306989,0.11130625874429245,76736.227373464804,0.11603845058742598,56451.720040294102,9.904505586408538E-2,60146.315681936343,0.10159507395347513,64469.689069743552,0.10497213929553138,69205.714374072311,0.10842532176172262,74044.837169459759,0.11196860300840732,56451.720040294102,9.904505586408538E-2,59893.349937298153,0.10116778138795675,63921.193264547757,0.10407905637708049,68312.643116905951,0.10702613761500587,72756.621928766748,0.11002059871278806,56451.720040294102,9.904505586408538E-2,59640.384192659985,0.10074048882243841,63378.048637939261,0.1031946864627121,67436.912499017068,0.10565412123052119,71505.743313089974,0.10812905385315284,56451.720040294102,9.904505586408538E-2,58122.589724830897,9.8176733429328228E-2,60231.55562862099,9.8071440062232951E-2,62537.161865534275,9.797763029631866E-2,64744.247692642537,9.7904502786394274E-2,56451.720040294102,9.904505586408538E-2,58628.521214107277,9.9031318560364984E-2,61258.981917377954,9.9744336846062834E-2,64103.99629488746,0.10043240630270016,66861.132952481203,0.10110559950473492,56451.720040294102,9.904505586408538E-2,58881.486958745438,9.9458611125883306E-2,61780.721829637376,0.1005938547441015,64912.064418340837,0.10169841514435803,67969.878199013314,0.10278221412220372,56451.720040294102,9.904505586408538E-2,59134.452703383613,9.988590369140167E-2,62307.812920484059,0.10145208564622257,65736.79315600195,0.10299052634580741,69113.089172682943,0.10451094688141985]
["NHS Birmingham South and Central CCG","E38000013",15780.740860548101,9.9087911971292866E-2,16939.304292719575,0.10265000783371454,18305.584603806619,0.10740192797351925,19797.218601048033,0.11140809567275202,21398.528615711424,0.11630899345424189,15780.740860548101,9.9087911971292866E-2,16798.13286389381,0.10179452711122174,17995.468448508196,0.10558242459814712,19285.425731907624,0.10852800074230515,20649.044956674592,0.11223526990256871,15780.740860548101,9.9087911971292866E-2,16727.547149480935,0.10136678674997537,17842.646785440465,0.10468579432903348,19036.863381104253,0.10712922555489168,20290.309805307515,0.11028541039954079,15780.740860548101,9.9087911971292866E-2,16656.961435068057,0.10093904638872898,17691.316065427058,0.10379791167230144,18793.127330586172,0.10575761018900491,19941.971953555938,0.10839206410238035,15780.740860548101,9.9087911971292866E-2,16233.44714859078,9.8372604221250631E-2,16814.641549487289,9.8654315591922601E-2,17429.413599978514,9.8083362971179033E-2,18059.067545776874,9.8157775550477624E-2,15780.740860548101,9.9087911971292866E-2,16374.618577416533,9.9228084943743383E-2,17100.902615916602,0.10033385716918918,17865.499797977325,0.10053742148552237,18648.566202621227,0.1013619208752105,15780.740860548101,9.9087911971292866E-2,16445.204291829417,9.9655825304989801E-2,17246.26956371274,0.10118674937639487,18090.403814048936,0.10180306029290341,18957.323529252648,0.10304013223857293,15780.740860548101,9.9087911971292866E-2,16515.790006242292,0.10008356566623616,17393.127454563193,0.10204838919598212,18319.944863727975,0.10309479383077082,19275.67868352271,0.10477051137907767]
["NHS Blackburn with Darwen CCG","E38000014",10981.760368255631,9.7685112686849582E-2,11716.095369146937,0.10397670721642649,12421.216017894563,0.11003912134917225,13208.230789675325,0.11645415966915294,13814.898393927602,0.12148169533879355,10981.760368255631,9.7685112686849582E-2,11618.472580736903,0.10311033529230479,12210.671338245043,0.10817391334377253,12866.693784137246,0.11344290058311803,13330.517732391569,0.11722228044663707,10981.760368255631,9.7685112686849582E-2,11569.66118653189,0.10267714933024397,12106.91734947545,0.1072547603603424,12700.819568020344,0.11198042292382601,13098.672290746161,0.11518354107233697,10981.760368255631,9.7685112686849582E-2,11520.849792326881,0.10224396336818317,12004.175594742635,0.1063445747230921,12538.166108280975,0.11054634198801778,12873.546476413792,0.11320389092871784,10981.760368255631,9.7685112686849582E-2,11227.981427096791,9.9644847595818167E-2,11408.981981118042,0.10107177516936608,11628.112975369664,0.10252259720833773,11656.652056299008,0.10250309581691003,10981.760368255631,9.7685112686849582E-2,11325.604215506821,0.10051121951993984,11603.330916179135,0.10279350563588886,11919.128312240518,0.10508841749462634,12037.63667942451,0.10585329475399674,10981.760368255631,9.7685112686849582E-2,11374.415609711836,0.10094440548200068,11702.023734764844,0.10366782188841994,12069.214506898916,0.10641169552899768,12237.182161603558,0.10760800353151212,10981.760368255631,9.7685112686849582E-2,11423.227003916852,0.10137759144406153,11801.728787387328,0.10455110548713083,12222.39515376318,0.10776225668985348,12442.930583693122,0.10941725803458602]
["NHS Blackpool CCG","E38000015",11046.124412427307,9.6170332686986826E-2,11435.123402921414,0.10092783232940347,12055.743915631956,0.1066125213621503,12645.852255919308,0.11129952698397561,13289.561546876766,0.11608631679661748,11046.124412427307,9.6170332686986826E-2,11340.089139568789,0.10008904801031587,11852.023243821648,0.1048109590008989,12319.870305140284,0.10843047267329946,12825.316585501227,0.11203106730871094,11046.124412427307,9.6170332686986826E-2,11292.572007892479,9.9669655850772101E-2,11751.632047376668,0.10392316985653226,12161.550709673487,0.10703705958170645,12603.108956979377,0.11009005028807982,11046.124412427307,9.6170332686986826E-2,11245.054876216167,9.9250263691228302E-2,11652.220277238464,0.1030440420696716,12006.305183575188,0.10567070219657797,12387.341620917816,0.1082052901897084,11046.124412427307,9.6170332686986826E-2,10959.952086158295,9.6733910733965534E-2,11076.317608851637,9.7951163856134046E-2,11137.699759364674,9.8025873608208705E-2,11221.03349194998,9.8017413451694457E-2,11046.124412427307,9.6170332686986826E-2,11054.98634951092,9.7572695053053132E-2,11264.367459753455,9.9614144497289142E-2,11415.461014167266,0.10047052468022589,11586.180587390774,0.10120702819174332,11046.124412427307,9.6170332686986826E-2,11102.503481187228,9.799208721259689E-2,11359.861524664537,0.10045862685412572,11558.711642141423,0.10173131175973793,11777.430965498577,0.10287762897884851,11046.124412427307,9.6170332686986826E-2,11150.020612863542,9.8411479372140703E-2,11456.3350158824,0.10131177056846834,11704.915787744143,0.10301809353761787,11974.62642735527,0.10460016096571691]
["NHS Bolton CCG","E38000016",20427.518963212806,9.1553957346776654E-2,22108.793628090141,9.740414850687347E-2,23906.469262910894,0.10299185448436539,25620.72609157554,0.10774064798812255,27216.431271039004,0.1122049442242703,20427.518963212806,9.1553957346776654E-2,21924.856115203882,9.6593779695144433E-2,23501.629292143003,0.10124775672989403,24958.731017346057,0.10495681672559319,26263.234864416096,0.10827520969828536,20427.518963212806,9.1553957346776654E-2,21832.887358760749,9.618859528927988E-2,23302.128825779018,0.10038828548069541,24637.219988583398,0.10360479389648192,25806.99402035039,0.10639426954300128,20427.518963212806,9.1553957346776654E-2,21740.918602317626,9.5783410883415396E-2,23104.574705428353,9.9537199316854869E-2,24321.951694349205,0.10227902310491677,25363.976504789018,0.10456784508900485,20427.518963212806,9.1553957346776654E-2,21189.106063658855,9.3352304448228285E-2,21960.123249603741,9.4606769126330093E-2,22558.011970379161,9.4861278260635673E-2,22969.290918426905,9.4695295672934138E-2,20427.518963212806,9.1553957346776654E-2,21373.043576545111,9.4162673259957308E-2,22333.82168415872,9.6216705515072887E-2,23122.081797103285,9.7233312855774967E-2,23719.017739869792,9.7786187911732325E-2,20427.518963212806,9.1553957346776654E-2,21465.012332988237,9.456785766582182E-2,22523.590420456163,9.7034251337481309E-2,23412.991186020517,9.8456649226326826E-2,24111.696580448886,9.9405081548684396E-2,20427.518963212806,9.1553957346776654E-2,21556.981089431363,9.4973042071686331E-2,22715.305502766918,9.7860182245247798E-2,23709.898496347454,9.9705208142756338E-2,24516.581977777074,0.10107429905086195]
["NHS Bracknell and Ascot CCG","E38000017",7489.148292390194,6.8657391752752053E-2,8394.9530902400857,7.3808274048180827E-2,9415.730725011852,7.900428532481836E-2,10354.797463363731,8.3803799476883545E-2,11374.207349725481,8.8819360844334519E-2,7489.148292390194,6.8657391752752053E-2,8325.1639549059273,7.3194689246579292E-2,9256.3647276207103,7.7667097899150106E-2,10087.254289993567,8.1638509954625821E-2,10975.787212261666,8.5708161894906015E-2,7489.148292390194,6.8657391752752053E-2,8290.2693872388481,7.2887896845778524E-2,9177.8310029447857,7.7008147364866469E-2,9957.31664505144,8.0586894181381027E-2,10785.086178826934,8.4219008112032895E-2,7489.148292390194,6.8657391752752053E-2,8255.3748195717726,7.2581104444977784E-2,9100.0634609486278,7.6355625616283174E-2,9829.9019811272556,7.9555697484034113E-2,10599.912275293047,8.2773014800039402E-2,7489.148292390194,6.8657391752752053E-2,8046.0074135693039,7.0740350040173247E-2,8649.5480452467473,7.2575499624490239E-2,9117.011432909916,7.3786107420766564E-2,9598.9737972712319,7.4956846769258401E-2,7489.148292390194,6.8657391752752053E-2,8115.7965489034632,7.1353934841774783E-2,8796.6551197616463,7.3809826478953233E-2,9344.9784334495853,7.5631097713253367E-2,9912.3470550637903,7.7403928276306336E-2,7489.148292390194,6.8657391752752053E-2,8150.6911165705387,7.1660727242575523E-2,8871.3579310387449,7.4436633084735235E-2,9462.5485243821822,7.6582619977194746E-2,10076.480235335572,7.8685617955142673E-2,7489.148292390194,6.8657391752752053E-2,8185.5856842376152,7.1967519643376263E-2,8946.8269249956047,7.5069868476217522E-2,9582.5426559006464,7.7553760568959587E-2,10245.715551939533,8.0007149398247157E-2]
["NHS Bradford City CCG","E38000018",6664.5121047235134,0.11070618114158658,6998.7377932821655,0.11526248012651788,7495.7292095174162,0.12113330978534932,8131.3685446847458,0.12769108895547651,8560.0653728169837,0.13263193946106266,6664.5121047235134,0.11070618114158658,6940.7184250821838,0.11430695693481857,7369.4475881471444,0.1190925596016022,7922.4519571504088,0.12441036364871871,8261.6330281091286,0.1280079489945635,6664.5121047235134,0.11070618114158658,6911.7087409821925,0.11382919533896892,7307.2174622315051,0.11808690145816912,7820.9874756179306,0.12281701437842227,8118.7904576797964,0.12579470805205759,6664.5121047235134,0.11070618114158658,6882.6990568822011,0.11335143374311925,7245.5944594955308,0.11709105461369636,7721.4931156850525,0.12125460294731551,7980.0879248156216,0.12364561395747786,6664.5121047235134,0.11070618114158658,6708.6409522822623,0.11048486416802145,6888.6060298526399,0.1113220108250265,7164.8178742914397,0.11251284350332033,7230.3456582578929,0.1120289070074046,6664.5121047235134,0.11070618114158658,6766.6603204822422,0.11144038735972073,7005.1736803482763,0.11320578022540848,7342.8305935967146,0.11530826937180769,7465.0745469307585,0.11566585910955622,6664.5121047235134,0.11070618114158658,6795.6700045822308,0.11191814895557034,7064.3681903655925,0.11416238187403996,7434.6376163076102,0.11674996256764462,7588.0167509686116,0.11757075845938351,6664.5121047235134,0.11070618114158658,6824.6796886822221,0.11239591055141999,7124.1698235625745,0.11512879482163178,7528.3375009475349,0.1182213803540756,7714.7806556823462,0.11953487226034004]
["NHS Bradford Districts CCG","E38000019",26121.640910489819,0.10071576538591077,28207.585101118086,0.1058366542890518,30599.03360067328,0.1115613008628893,33085.482546796018,0.11753279767955957,35408.676387774794,0.12313491580113643,26121.640910489819,0.10071576538591077,27972.490164184263,0.10495456312540996,30080.32160854492,0.10967012399206985,32229.913582113371,0.11449347631301375,34167.612565866875,0.11881907277043705,26121.640910489819,0.10071576538591077,27854.942695717353,0.10451351754358905,29824.706323962444,0.10873817385140165,31814.389556753071,0.11301736965098781,33573.585981510812,0.11675332445928088,26121.640910489819,0.10071576538591077,27737.395227250443,0.10407247196176814,29571.584847034424,0.10781531590722775,31406.93370308352,0.11156992434487929,32996.776200006621,0.11474744818474969,26121.640910489819,0.10071576538591077,27032.110416448992,0.10142619847084268,28105.225946210056,0.10246910436856517,29127.200602114113,0.10347140533610698,29878.890289580548,0.10390489042140962,26121.640910489819,0.10071576538591077,27267.205353382811,0.1023082896344845,28584.037015866994,0.1042148060954754,29856.210010863553,0.1060611368059096,30855.036263213944,0.10729947232999702,26121.640910489819,0.10071576538591077,27384.752821849717,0.1027493352163054,28827.183262177154,0.105101295253672,30232.184174994716,0.10739674662520325,31366.304978963784,0.10907742724636176,26121.640910489819,0.10071576538591077,27502.300290316623,0.10319038079812631,29072.823316141788,0.10599687660836295,30615.910111926805,0.10875989382567249,31893.466658499579,0.11091065050250236]
["NHS Brent CCG","E38000020",29551.572193634503,0.11430174129200317,33463.984260783291,0.12233671222045511,37624.216004458693,0.13133278415407251,41988.268197618207,0.13988628797180905,46455.109072579151,0.14832410304144045,29551.572193634503,0.11430174129200317,33184.681376472145,0.12131564442667304,36985.811778106596,0.12910434158791748,40902.12275413976,0.13626773305616924,44827.572934514144,0.14312762750483443,29551.572193634503,0.11430174129200317,33045.029934316575,0.12080511052978203,36671.213541562887,0.12800619080411507,40374.614691749572,0.13451031014042367,44048.564058464137,0.14064037055703749,29551.572193634503,0.11430174129200317,32905.378492161013,0.12029457663289103,36359.684556107401,0.12691875368649611,39857.349179382647,0.13278701085881744,43292.133367619979,0.13822520232318,29551.572193634503,0.11430174129200317,32067.469839227582,0.11723137325154487,34554.964916227407,0.12061911797063463,36963.226294872264,0.12314507694187188,39203.325117790344,0.12517025899677633,29551.572193634503,0.11430174129200317,32346.772723538721,0.11825244104532691,35144.26112516781,0.12267614187785468,37888.704287005654,0.12622835916513078,40483.446913358159,0.12925749333766973,29551.572193634503,0.11430174129200317,32486.424165694294,0.11876297494221794,35443.513106270373,0.12372072433073993,38366.003770850475,0.12781850936450717,41153.926784301242,0.13139823366635134,29551.572193634503,0.11430174129200317,32626.075607849856,0.11927350883910892,35745.834338461151,0.12477602044980854,38853.144136090195,0.12944144501629196,41845.248752520871,0.13360551964406409]
["NHS Brighton and Hove CCG","E38000021",16418.793923923371,6.8963348134758795E-2,17867.620687619747,7.2320977445234941E-2,19617.782370768244,7.6860140929197004E-2,21517.825855736079,8.1119753659564503E-2,23417.630143094269,8.5384781386619521E-2,16418.793923923371,6.8963348134758795E-2,17719.366724268402,7.1720904736778113E-2,19286.694340264574,7.5562977355683181E-2,20964.109277783089,7.9032305201625158E-2,22600.808313407462,8.2406505919227963E-2,16418.793923923371,6.8963348134758795E-2,17645.239742592741,7.142086838254974E-2,19123.537979078865,7.4923750113927531E-2,20695.185846853008,7.8018494484102419E-2,22209.842214040884,8.0980975038433906E-2,16418.793923923371,6.8963348134758795E-2,17571.112760917076,7.1120832028321354E-2,18961.973387270584,7.4290759235506126E-2,20431.484064443805,7.7024368787015782E-2,21830.207570928658,7.9596760631986646E-2,16418.793923923371,6.8963348134758795E-2,17126.350870863058,6.9320613902950926E-2,18026.012993346747,7.0623777594995871E-2,18956.061201503544,7.1462192571452698E-2,19778.13157841947,7.2114532117040289E-2,16418.793923923371,6.8963348134758795E-2,17274.604834214402,6.9920686611407754E-2,18331.632713811676,7.1821159355162492E-2,19427.869567364494,7.3240856395101014E-2,20420.594380210663,7.4457064027603964E-2,16418.793923923371,6.8963348134758795E-2,17348.73181589006,7.0220722965636112E-2,18486.83022811027,7.24292047802471E-2,19671.196682015805,7.4158171914407767E-2,20757.092343078031,7.5683994541960301E-2,16418.793923923371,6.8963348134758795E-2,17422.858797565732,7.0520759319864526E-2,18643.619511786284,7.3043486568665897E-2,19919.540674657757,7.5094400492564869E-2,21104.050460797738,7.694906461313257E-2]
["NHS Bristol CCG","E38000022",26558.947723782283,7.3072546425417606E-2,28464.747830663338,7.4954570862290237E-2,30884.927303412307,7.8253084279447424E-2,33575.54427333847,8.1454498479714865E-2,36326.296650891825,8.4787360309242429E-2,26558.947723782283,7.3072546425417606E-2,28228.04630078932,7.433127844109258E-2,30362.492122988235,7.6929391210571199E-2,32708.988372720138,7.9352227978457382E-2,35055.676356990334,8.182167014515529E-2,26558.947723782283,7.3072546425417606E-2,28109.695535852301,7.4019632230493737E-2,30105.042094173503,7.6277090539610584E-2,32288.128324157948,7.833121864181937E-2,34447.502772460684,8.0402163132435547E-2,26558.947723782283,7.3072546425417606E-2,27991.344770915301,7.3707986019894936E-2,29850.103772956954,7.5631153777634935E-2,31875.440056100218,7.7330034100194595E-2,33856.956016393437,7.9023798002972268E-2,26558.947723782283,7.3072546425417606E-2,27281.240181293251,7.1838108756302005E-2,28373.219705219697,7.1889175294465646E-2,29566.431370619495,7.1728363344540247E-2,30664.816303734169,7.1573187152773249E-2,26558.947723782283,7.3072546425417606E-2,27517.941711167266,7.2461401177499649E-2,28855.467564072682,7.3111045819582152E-2,30304.802479011028,7.3519656669119415E-2,31664.209616160344,7.3905820222575733E-2,26558.947723782283,7.3072546425417606E-2,27636.29247610427,7.2773047388098464E-2,29100.359054896468,7.3731526945617895E-2,30685.604780002337,7.444348563804544E-2,32187.654417629157,7.5127566094737086E-2,26558.947723782283,7.3072546425417606E-2,27754.643241041282,7.3084693598697292E-2,29347.762253318433,7.4358371980638591E-2,31074.258399517537,7.5386361959043025E-2,32727.370680694217,7.6387290357329427E-2]
["NHS Bromley CCG","E38000023",21435.473569065573,8.2279569971846975E-2,23410.125879906453,8.5351195420396861E-2,25958.047733105152,8.9572283413061254E-2,28735.329154280818,9.3844967845463159E-2,31672.849663038509,9.8442374784106765E-2,21435.473569065573,8.2279569971846975E-2,23214.451641937991,8.463778489841764E-2,25516.792563669176,8.8049663780776999E-2,27990.689848315102,9.1413095520297527E-2,30560.563589489902,9.4985278763877357E-2,21435.473569065573,8.2279569971846975E-2,23116.614522953758,8.4281079637428022E-2,25299.347107576927,8.7299334394675382E-2,27629.041010373498,9.0232008525060414E-2,30028.175580562907,9.3330563748874579E-2,21435.473569065573,8.2279569971846975E-2,23018.77740396954,8.392437437643846E-2,25084.023070568499,8.6556325295267425E-2,27274.414257168733,8.9073854530270197E-2,29511.217890129687,9.172380770227416E-2,21435.473569065573,8.2279569971846975E-2,22431.754690064172,8.1784142810500851E-2,23836.628649278329,8.2251996719386919E-2,25290.262255205234,8.2593932904001424E-2,26716.856298193998,8.3038653254783365E-2,21435.473569065573,8.2279569971846975E-2,22627.42892803263,8.2497553332480059E-2,24243.941113373072,8.3657491764572364E-2,25924.751212357878,8.4666071888823899E-2,27591.713459491184,8.5757796542211676E-2,21435.473569065573,8.2279569971846975E-2,22725.266047016856,8.2854258593469648E-2,24450.779474046194,8.4371219717205639E-2,26251.978066295378,8.5734742215203719E-2,28049.930887419581,8.7181981996082486E-2,21435.473569065573,8.2279569971846975E-2,22823.103166001081,8.3210963854459238E-2,24659.739253803138,8.5092267956532575E-2,26585.951629097686,8.6825446208679574E-2,28522.392161614767,8.8650438744373616E-2]
["NHS Bury CCG","E38000024",13006.210135214189,8.6569556278049714E-2,14062.389581289422,9.155201550318634E-2,15301.35449075376,9.7052863698806016E-2,16419.895032015073,0.10144504529849915,17532.804137192161,0.10587442111831014,13006.210135214189,8.6569556278049714E-2,13945.23191916024,9.0789270307032807E-2,15041.949230505448,9.5407517636086805E-2,15995.037551941923,9.8820199876077611E-2,16918.017905470297,0.10216194387361288,13006.210135214189,8.6569556278049714E-2,13886.653088095652,9.0407897708956075E-2,14914.117311392703,9.4596710081141067E-2,15788.697095927477,9.7545391671367082E-2,16623.754742776993,0.10038499240807361,13006.210135214189,8.6569556278049714E-2,13828.074257031065,9.002652511087933E-2,14787.532532954232,9.3793812843804572E-2,15586.363123592106,9.6295336238676046E-2,16338.020273903248,9.8659542716807033E-2,13006.210135214189,8.6569556278049714E-2,13476.60127064353,8.7738289522418814E-2,14054.213816483052,8.9142546089579153E-2,14454.295808742199,8.9301222097752375E-2,14793.51200932203,8.9332801988659588E-2,13006.210135214189,8.6569556278049714E-2,13593.758932772707,8.8501034718572319E-2,14293.664825943035,9.066132707055076E-2,14816.30648600629,9.1537788743397311E-2,15277.065791284642,9.2252812749303373E-2,13006.210135214189,8.6569556278049714E-2,13652.337763837297,8.8882407316649065E-2,14415.261041684424,9.1432583037450346E-2,15003.007316142903,9.269125983036515E-2,15530.333158848307,9.3782205065509078E-2,13006.210135214189,8.6569556278049714E-2,13710.916594901886,8.9263779914725824E-2,14538.104398100089,9.2211749321959191E-2,15193.557512951573,9.3868512992410558E-2,15791.473429597436,9.5359139067617352E-2]
["NHS Calderdale CCG","E38000025",15116.21688808728,8.9891870171784474E-2,16485.315813719993,9.5622481518097394E-2,18098.092333803048,0.10209913310280407,19656.122194450483,0.10787027875343257,21120.405121443739,0.11320971870413669,15116.21688808728,8.9891870171784474E-2,16348.181153400908,9.4827036852673463E-2,17791.721790617637,0.10037076492506847,19148.861354669505,0.10508649629387282,20381.610428275224,0.10924962708123513,15116.21688808728,8.9891870171784474E-2,16279.61382324137,9.4429314519961532E-2,17640.745921980601,9.9519045029790143E-2,18902.500073750871,0.10373449716689095,20027.99147623084,0.10735415671221507,15116.21688808728,8.9891870171784474E-2,16211.046493081829,9.4031592187249574E-2,17491.242988647333,9.8675634596904732E-2,18660.922355252442,0.10240874961723434,19684.621539874242,0.10551362317685595,15116.21688808728,8.9891870171784474E-2,15799.642512124583,9.1645258190977838E-2,16625.15703002705,9.3789670709844578E-2,17309.284585521993,9.4991134812435485E-2,17828.570687480129,9.5564808573542728E-2,15116.21688808728,8.9891870171784474E-2,15936.777172443664,9.2440702856401755E-2,16907.960608352038,9.538508748929278E-2,17741.509152044986,9.7363127823756918E-2,18409.66204825278,9.8679577874425287E-2,15116.21688808728,8.9891870171784474E-2,16005.344502603208,9.2838425189113713E-2,17051.571800470192,9.6195260072606301E-2,17964.421597570486,9.8586442748164235E-2,18714.01594795665,0.10031097742258069,15116.21688808728,8.9891870171784474E-2,16073.911832762746,9.3236147521825657E-2,17196.655927892134,9.7013742118312846E-2,18191.930014833037,9.9834979776276131E-2,19027.830793259378,0.1019930895865104]
["NHS Cambridgeshire and Peterborough CCG","E38000026",55218.422138416587,7.8117904731370549E-2,61487.703354520359,8.3336997308991842E-2,68676.622504380153,8.915568285652363E-2,75698.045622715465,9.4165852643075407E-2,82568.986697670174,9.9139095043188741E-2,55218.422138416587,7.8117904731370549E-2,60976.777166584441,8.2644516503462148E-2,67515.233251578145,8.764797254521374E-2,73744.818107900282,9.1736102537568129E-2,79681.685829901573,9.5672364899144602E-2,55218.422138416587,7.8117904731370549E-2,60721.314072616471,8.2298276100697287E-2,66942.914028442523,8.6904990300457646E-2,72796.194451709642,9.0556046240371238E-2,78299.699309778749,9.4013038577646604E-2,55218.422138416587,7.8117904731370549E-2,60465.850978648501,8.1952035697932427E-2,66376.17840748388,8.6169256662967514E-2,71865.990087932762,8.9398902930702032E-2,76957.767208241683,9.2401804875059057E-2,55218.422138416587,7.8117904731370549E-2,58933.07241484071,7.987459328134329E-2,63093.020327447441,8.1907075590610723E-2,66661.456493262245,8.2924636131340795E-2,69704.091340922183,8.3692446918956581E-2,55218.422138416587,7.8117904731370549E-2,59443.99860277665,8.0567074086873011E-2,64165.071945418531,8.3298808185666012E-2,68325.753930999155,8.4994966824649382E-2,71975.068116643262,8.6419167827297819E-2,55218.422138416587,7.8117904731370549E-2,59699.461696744591,8.0913314489637844E-2,64709.473157669454,8.4005547394092495E-2,69184.086938102788,8.6062704555534136E-2,73164.520730271222,8.7847322155309687E-2,55218.422138416587,7.8117904731370549E-2,59954.924790712568,8.1259554892402705E-2,65259.457972097342,8.4719535209784938E-2,70060.116912427504,8.7152456725416105E-2,74390.94788728733,8.9319871151558886E-2]
["NHS Camden CCG","E38000027",15681.912264973389,7.8034993356754526E-2,18018.873510671132,8.2105502190244831E-2,20402.332528522795,8.8108190225094141E-2,22890.972118160294,9.39463683746216E-2,25345.636174153296,9.9629073011608865E-2,15681.912264973389,7.8034993356754526E-2,17868.961554194142,8.1422407519339018E-2,20057.149955231762,8.6617507148176565E-2,22300.759481863446,9.1524088819927157E-2,24460.378951608865,9.6149288331795854E-2,15681.912264973389,7.8034993356754526E-2,17794.005575955649,8.1080860183886119E-2,19887.047965989797,8.5882915728060991E-2,22014.11101683462,9.0347660743801309E-2,24036.656726448702,9.448371354736125E-2,15681.912264973389,7.8034993356754526E-2,17719.049597717159,8.0739312848433248E-2,19718.605508350189,8.515549105350749E-2,21733.028364826445,8.9194075206543752E-2,23625.215335525005,9.2866412482409608E-2,15681.912264973389,7.8034993356754526E-2,17269.313728286204,7.8690028835715867E-2,18742.800926162105,8.0941444662990622E-2,20160.358785728942,8.2739714297500391E-2,21401.211241173911,8.4124258023482348E-2,15681.912264973389,7.8034993356754526E-2,17419.225684763191,7.9373123506621665E-2,19061.430993815356,8.2317459810914498E-2,20663.264551113756,8.480367951700632E-2,22097.50119674459,8.6861246842549492E-2,15681.912264973389,7.8034993356754526E-2,17494.181663001684,7.9714670842074564E-2,19223.235325045523,8.3016217503219594E-2,20922.629618982566,8.5868134363385751E-2,22462.191807564879,8.8294779117786479E-2,15681.912264973389,7.8034993356754526E-2,17569.137641240173,8.005621817752745E-2,19386.69918787805,8.3722141941086778E-2,21187.342232694733,8.695453596279544E-2,22838.218951390802,8.9772873236599063E-2]
["NHS Cannock Chase CCG","E38000028",9224.9887869508766,8.3152954632692233E-2,10114.907614404983,8.9830440625266295E-2,11041.065502934374,9.6681834526570698E-2,11955.290496755977,0.10270868124360806,12750.190561645268,0.10766923291374149,9224.9887869508766,8.3152954632692233E-2,10030.779857999862,8.9083302468915299E-2,10854.151673019771,9.5045110972152111E-2,11646.621838568773,0.10005688864749807,12303.869749955464,0.10390026811311825,9224.9887869508766,8.3152954632692233E-2,9988.7159797973018,8.8709733390739814E-2,10762.042694335893,9.4238552489806421E-2,11496.710786804426,9.8768993013783737E-2,12090.241391272402,0.10209627927100491,9224.9887869508766,8.3152954632692233E-2,9946.6521015947474,8.8336164312564372E-2,10670.832339834291,9.3439862870703078E-2,11349.710536895462,9.7506104268861374E-2,11882.804670189196,0.10034457583338284,9224.9887869508766,8.3152954632692233E-2,9694.2688323793955,8.6094749843511523E-2,10142.441320652624,8.8812971284173592E-2,10527.237789111548,9.0440187191679983E-2,10761.526823125483,9.0875923181265694E-2,9224.9887869508766,8.3152954632692233E-2,9778.3965887845116,8.6841887999862463E-2,10314.977163650721,9.0323793026713839E-2,10790.246810351588,9.2699714865563485E-2,11112.57586314183,9.3840363647541211E-2,9224.9887869508766,8.3152954632692233E-2,9820.4604669870714,8.7215457078037947E-2,10402.593021423188,9.1091007192847531E-2,10925.889225569943,9.3865027711082002E-2,11296.442207625445,9.5393026580184476E-2,9224.9887869508766,8.3152954632692233E-2,9862.5243451896276,8.7589026156213404E-2,10491.107503377943,9.1866090222223667E-2,11064.328293551313,9.5054366783086888E-2,11486.024100634355,9.699395457384187E-2]
["NHS Canterbury and Coastal CCG","E38000029",14082.346419529924,8.1750530706663882E-2,15554.304242076611,8.7051176640231764E-2,17347.578639546176,9.3046441962809354E-2,19159.58410353525,9.762347958593319E-2,21041.06594654376,0.10291042720602447,14082.346419529924,8.1750530706663882E-2,15424.614618929052,8.6325356049524585E-2,17053.524773062098,9.146923821638113E-2,18664.174255006703,9.5099226816502083E-2,20303.865062381486,9.9304827655196562E-2,14082.346419529924,8.1750530706663882E-2,15359.769807355278,8.5962445754171016E-2,16908.618420587976,9.0692010408646093E-2,18423.568642880422,9.3873273427496282E-2,19951.008975955603,9.7579032456009032E-2,14082.346419529924,8.1750530706663882E-2,15294.924995781505,8.5599535458817461E-2,16765.125788625795,8.9922365311230393E-2,18187.634836161087,9.2671124203409172E-2,19608.379794915876,9.5903256357800448E-2,14082.346419529924,8.1750530706663882E-2,14905.856126338851,8.342207368669606E-2,15933.8581276035,8.5463731643442925E-2,16867.574996618303,8.5945047368889735E-2,17756.333019150825,8.6845021124673905E-2,14082.346419529924,8.1750530706663882E-2,15035.545749486406,8.4147894277403212E-2,16205.292465896493,8.6919612024761284E-2,17289.701623077239,8.8095901472929977E-2,18336.170785856255,8.9680968335401831E-2,14082.346419529924,8.1750530706663882E-2,15100.39056106018,8.4510804572756767E-2,16343.13021581091,8.7658926280899538E-2,17507.406228306761,8.9205167779001115E-2,18639.868099920139,9.1166331311357443E-2,14082.346419529924,8.1750530706663882E-2,15165.235372633955,8.4873714868110336E-2,16482.381686237259,8.8405823247357102E-2,17729.599430888047,9.0337304753327449E-2,18953.005949392547,9.2697867306038101E-2]
["NHS Castle Point and Rochford CCG","E38000030",12503.666546926937,8.6446809644129818E-2,13650.863389607679,9.2560776984049895E-2,14969.431591663015,9.8755980945131383E-2,16051.848868014662,0.10320077708637432,17177.322922404237,0.10749263405759849,12503.666546926937,8.6446809644129818E-2,13537.099796578979,9.1789393792914148E-2,14715.53950336665,9.7081010049918523E-2,15636.368044375702,0.10052956181288222,16574.948905610308,0.10372308451570907,12503.666546926937,8.6446809644129818E-2,13480.218000064635,9.1403702197346323E-2,14590.424411778304,9.6255603719344926E-2,15434.581547406973,9.9232233170933354E-2,16286.626763441313,0.10191881579124726,12503.666546926937,8.6446809644129818E-2,13423.336203550287,9.1018010601778457E-2,14466.529955229838,9.5438250133459815E-2,15236.713110533583,9.7960094577173612E-2,16006.661125190287,0.10016684058316826,12503.666546926937,8.6446809644129818E-2,13082.045424464201,8.8703861028371314E-2,13748.796551776661,9.070323625660813E-2,14129.630659478209,9.084242419620811E-2,14493.335680829779,9.0696718903815893E-2,12503.666546926937,8.6446809644129818E-2,13195.809017492897,8.9475244219507033E-2,13983.158479434838,9.2249363236804577E-2,14483.651716915841,9.3118501458890585E-2,14967.12676291193,9.3661619292314952E-2,12503.666546926937,8.6446809644129818E-2,13252.690814007243,8.9860935815074872E-2,14102.170395823758,9.3034505843935592E-2,14666.232036946652,9.4292349472461442E-2,15215.280793777041,9.5214523115000255E-2,12503.666546926937,8.6446809644129818E-2,13309.572610521591,9.0246627410642738E-2,14222.402947252567,9.3827701195755162E-2,14852.576767657294,9.5490399689194386E-2,15471.148777998538,9.6815699486849427E-2]
["NHS Central London (Westminster) CCG","E38000031",11743.892955103765,8.0327585192228212E-2,13529.262345106532,8.5660772097673366E-2,15326.215133252115,9.2471431961217057E-2,17180.488739954879,9.8681727397787924E-2,19072.002796163091,0.10505675220977795,11743.892955103765,8.0327585192228212E-2,13417.001952369494,8.4949993366908283E-2,15067.36951713614,9.0909674895234341E-2,16737.952070623167,9.6139874041488604E-2,18406.542644623089,0.10139111294823777,11743.892955103765,8.0327585192228212E-2,13360.871756000985,8.4594604001525797E-2,14939.813384194371,9.0140059033391881E-2,16523.025365937872,9.490537257862075E-2,18088.024761927361,9.9636580158242588E-2,11743.892955103765,8.0327585192228212E-2,13304.741559632468,8.423921463614327E-2,14813.501701330079,8.9377951618982016E-2,16312.271862917203,9.3694841257422196E-2,17778.738552923671,9.7932899377127181E-2,11743.892955103765,8.0327585192228212E-2,12967.960381421371,8.2106878443848119E-2,14081.765055771444,8.4962984528607718E-2,15133.096910209011,8.692186622750725E-2,16106.923780942871,8.8723828252411957E-2,11743.892955103765,8.0327585192228212E-2,13080.220774158404,8.2817657174613174E-2,14320.699470647736,8.6404606435668732E-2,15510.171592644609,8.9087717361542834E-2,16630.334612902047,9.1606999079552956E-2,11743.892955103765,8.0327585192228212E-2,13136.350970526917,8.3173046539995674E-2,14442.033353202098,8.7136680060348123E-2,15704.641426424863,9.020471812995326E-2,16904.477611073977,9.3117096017814108E-2,11743.892955103765,8.0327585192228212E-2,13192.48116689543,8.3528435905378187E-2,14564.61168583395,8.7876262132460178E-2,15903.120806902507,9.1344749034477354E-2,17187.142438585164,9.4674134838521329E-2]
["NHS Central Manchester CCG","E38000032",11734.906137070057,7.9097506990226871E-2,12799.583205297946,8.2866652889407907E-2,13951.589652007087,8.7372179684413118E-2,15292.476776309293,9.1692509751224921E-2,16699.081809234835,9.7087684937411822E-2,11734.906137070057,7.9097506990226871E-2,12693.391992142328,8.2179153127944632E-2,13715.96211230163,8.5896556314514219E-2,14898.967534930751,8.9333058729648349E-2,16116.982106693184,9.370338434123944E-2,11734.906137070057,7.9097506990226871E-2,12640.296385564532,8.1835403247213084E-2,13599.847579514089,8.5169386144251555E-2,14707.851972370878,8.8187144575913645E-2,15838.364124320675,9.2083512350701599E-2,11734.906137070057,7.9097506990226871E-2,12587.200778986724,8.149165336648144E-2,13484.865871436667,8.4449310317113391E-2,14520.447273870361,8.7063480476498145E-2,15567.821388073207,9.0510589465541899E-2,11734.906137070057,7.9097506990226871E-2,12268.627139519902,7.9429154082091821E-2,12818.7649418847,8.0277836559899174E-2,13471.909890982966,8.0776531304610669E-2,14105.430470716739,8.2008316690213606E-2,11734.906137070057,7.9097506990226871E-2,12374.818352675511,8.0116653843555041E-2,13036.267286228194,8.163995043980582E-2,13807.209500057985,8.2786961866278833E-2,14563.27499962719,8.467020348620459E-2,11734.906137070057,7.9097506990226871E-2,12427.913959253314,8.046040372428663E-2,13146.717695465128,8.2331648894445941E-2,13980.134552523004,8.3823807126292144E-2,14803.076822952691,8.6064400133445879E-2,11734.906137070057,7.9097506990226871E-2,12481.009565831117,8.0804153605018234E-2,13258.300929412184,8.3030441692210577E-2,14156.62494496661,8.4882029889474825E-2,15050.33296839202,8.7501935862744309E-2]
["NHS Chiltern CCG","E38000033",21618.351472379705,8.3850560361413792E-2,23659.487015048911,8.9133088513595943E-2,25730.179756227473,9.4008694761517991E-2,27868.508680572122,9.8677532329764617E-2,29920.459588272781,0.1029609758715512,21618.351472379705,8.3850560361413792E-2,23462.299775256382,8.8390219165372125E-2,25293.587995216611,9.2413547662464776E-2,27147.143352299026,9.6123303421496442E-2,28870.386724813317,9.9347511097086436E-2,21618.351472379705,8.3850560361413792E-2,23363.706155360123,8.8018784491260244E-2,25078.440612987702,9.1627477577594818E-2,26796.797982921853,9.4882791526527344E-2,28367.776637084826,9.7617951263196237E-2,21618.351472379705,8.3850560361413792E-2,23265.112535463864,8.7647349817148348E-2,24865.392229609803,9.0849076469162598E-2,26453.255220418589,9.3666366476944221E-2,27879.733807825327,9.5938519641518671E-2,21618.351472379705,8.3850560361413792E-2,22673.550816086281,8.5418741772476922E-2,23631.180905213707,8.633971832376218E-2,24531.118625192947,8.686041578214343E-2,25241.668522135355,8.6860524852496054E-2,21618.351472379705,8.3850560361413792E-2,22870.738055878806,8.6161611120700726E-2,24034.188684608351,8.7812161799811286E-2,25145.776394659584,8.903681182161173E-2,26067.592523458552,8.9702658373911059E-2,21618.351472379705,8.3850560361413792E-2,22969.331675775065,8.6533045794812607E-2,24238.841072582196,8.8559887002492496E-2,25462.775651909735,9.0159250945080857E-2,26500.18059416657,9.1191261507799617E-2,21618.351472379705,8.3850560361413792E-2,23067.925295671328,8.6904480468924517E-2,24445.592459407049,8.9315281181611431E-2,25786.31074713678,9.1304832331763966E-2,26946.215813761679,9.2726138381836479E-2]
["NHS Chorley and South Ribble CCG","E38000034",11320.944274180072,8.0886998243641539E-2,12617.254137322378,8.7316637628528565E-2,13897.601097149902,9.322243826904951E-2,15108.324762346267,9.8464056063257741E-2,16162.44436165665,0.1031162712878439,11320.944274180072,8.0886998243641539E-2,12512.519924007242,8.6591833384133163E-2,13662.694656166384,9.1646730991188516E-2,14718.583175791773,9.5924030082063169E-2,15597.124720889899,9.9509536307834004E-2,11320.944274180072,8.0886998243641539E-2,12460.152817349675,8.6229431261935469E-2,13546.935472508641,9.0870240625896437E-2,14529.29744947337,9.4690416120134055E-2,15326.53839861857,9.7783197643349321E-2,11320.944274180072,8.0886998243641539E-2,12407.785710692107,8.5867029139737761E-2,13432.305646740242,9.0101325776363303E-2,14343.687057540799,9.3480755067393118E-2,15063.794539105033,9.6106893831217524E-2,11320.944274180072,8.0886998243641539E-2,12093.583070746705,8.3692616406551595E-2,12768.243207806066,8.5646922510102405E-2,13305.188897404538,8.6712649227089017E-2,13643.559647297376,8.7045806094789957E-2,11320.944274180072,8.0886998243641539E-2,12198.317284061839,8.4417420650946984E-2,12985.079922560084,8.7101421535820261E-2,13637.278179867648,8.8876943299450256E-2,14088.205991352432,8.9882646365652893E-2,11320.944274180072,8.0886998243641539E-2,12250.684390719407,8.4779822773144692E-2,13095.192316771107,8.7840034322317587E-2,13808.547561157478,8.9993141039868857E-2,14321.095099568192,9.1368477093072567E-2,11320.944274180072,8.0886998243641539E-2,12303.051497376973,8.5142224895342372E-2,13206.434068871476,8.8586222624573899E-2,13983.348146072914,9.1132352359703558E-2,14561.223645772228,9.2900495379432374E-2]
["NHS City and Hackney CCG","E38000035",19903.357918415222,9.0297422731218699E-2,22860.887030126167,9.5556290879978967E-2,26125.851679959247,0.10277675719889554,29770.710931754646,0.11105159255354613,33574.849983547771,0.11870615890096087,19903.357918415222,9.0297422731218699E-2,22670.546472670172,9.4760685807850589E-2,25683.256530068484,0.10103562757698065,29001.342125763393,0.10818167011997684,32398.627349207622,0.11454754401501775,19903.357918415222,9.0297422731218699E-2,22575.376193942182,9.4362883271786421E-2,25465.150747069434,0.10017761898925819,28627.682915987451,0.10678783540729428,31835.636549229894,0.11255705186405704,19903.357918415222,9.0297422731218699E-2,22480.205915214188,9.3965080735722253E-2,25249.172825367925,9.9327981217025657E-2,28261.278994652865,0.10542106458763378,31288.963035154669,0.11062425058391553,19903.357918415222,9.0297422731218699E-2,21909.184242846222,9.1578265519337176E-2,23997.990382407497,9.4405941708920124E-2,26211.233228298835,9.7773922815200073E-2,28333.975616783613,0.10017669218209452,19903.357918415222,9.0297422731218699E-2,22099.524800302217,9.2373870591465554E-2,24406.539751537442,9.6013138282995431E-2,26866.793588151271,0.1002193135935216,29259.121421809567,0.10344760791192747,19903.357918415222,9.0297422731218699E-2,22194.695079030203,9.2771673127529708E-2,24614.006228048736,9.6829292793268032E-2,27204.887658508836,0.10148048216393926,29743.678158602113,0.10516079111371134,19903.357918415222,9.0297422731218699E-2,22289.865357758201,9.316947566359389E-2,24823.600565857578,9.765381811903058E-2,27549.952496192403,0.10276765329824084,30243.297508132047,0.10692722920425698]
["NHS Coastal West Sussex CCG","E38000036",38235.091761320531,9.417510286039539E-2,42346.939203178161,9.9973887348737356E-2,47248.677123021698,0.10653591234052243,52066.795522289001,0.11221292138424353,57021.595492183973,0.11802292398100751,38235.091761320531,9.417510286039539E-2,41993.209899124224,9.9138792906001763E-2,46445.885041882953,0.10472578363445988,50717.356941211627,0.10930464858019748,55018.83417489627,0.11387762175538409,38235.091761320531,9.417510286039539E-2,41816.345247097262,9.8721245684634001E-2,46050.278367283339,0.10383377309421271,50061.975347988744,0.10789218824997573,54060.226371181634,0.11189350161688462,38235.091761320531,9.417510286039539E-2,41639.480595070287,9.8303698463266184E-2,45658.531269996878,0.10295046509582159,49419.319207193046,0.10650715346377812,53129.402107805858,0.10996688766776888,38235.091761320531,9.417510286039539E-2,40578.29268290849,9.5798415135059489E-2,43389.09980985467,9.7833370484452467E-2,45823.630340488548,9.8757824009673589E-2,48097.927349708356,9.9552774247026438E-2,38235.091761320531,9.417510286039539E-2,40932.02198696242,9.663350957779504E-2,44130.138653982736,9.9504258520817901E-2,46973.453981531682,0.1012358922015769,49673.178647432644,0.10281321904092529,38235.091761320531,9.417510286039539E-2,41108.886638989388,9.705105679916283E-2,44506.447442016513,0.1003527563517847,47566.455905993855,0.10251391359050399,50498.236302460406,0.10452091795848079,38235.091761320531,9.417510286039539E-2,41285.75129101635,9.7468604020530605E-2,44886.615807363487,0.10120995672460764,48171.684245533113,0.10381828501192482,51348.941158321584,0.10628170128393755]
["NHS Corby CCG","E38000037",4052.5287286030557,7.7279342650706628E-2,4592.8819201496008,8.2133081547739642E-2,5223.4912526600601,8.6625062233168487E-2,5900.5819759613041,9.1880753284978273E-2,6563.8286474777969,9.7098056915352032E-2,4052.5287286030557,7.7279342650706628E-2,4554.6634694174045,8.1449632857965026E-2,5135.0818306461088,8.5158902664114577E-2,5748.4002232077091,8.9511059221546396E-2,6334.3002846304698,9.3702666932403395E-2,4052.5287286030557,7.7279342650706628E-2,4535.5542440513073,8.1107908513077739E-2,5091.5146875863475,8.4436396145710566E-2,5674.4901386898446,8.8360170331514248E-2,6224.4381268685665,9.2077487083854534E-2,4052.5287286030557,7.7279342650706628E-2,4516.4450186852118,8.076618416819048E-2,5048.3725898247303,8.3720938471388562E-2,5602.0151559114011,8.7231628089557797E-2,6117.7601281340221,9.0499410179497364E-2,4052.5287286030557,7.7279342650706628E-2,4401.7896664886293,7.8715838098866758E-2,4798.445954516058,7.9576218151178407E-2,5196.5144967744818,8.0917385499446937E-2,5541.1231849471087,8.1969277883832972E-2,4052.5287286030557,7.7279342650706628E-2,4440.0081172208211,7.9399286788641291E-2,4880.0546517597068,8.0929596214920504E-2,5326.1848496939592,8.2936543906788535E-2,5721.6563559839078,8.4639886922838872E-2,4052.5287286030557,7.7279342650706628E-2,4459.1173425869192,7.9741011133528591E-2,4921.4965683287464,8.1616858512914531E-2,5393.0601217636631,8.3977890404292488E-2,5816.212872119163,8.6038651954425491E-2,4052.5287286030557,7.7279342650706628E-2,4478.2265679530165,8.0082735478415892E-2,4963.3635301959293,8.2311169654990538E-2,5461.3142170732062,8.5040707210731967E-2,5913.70871006381,8.7480898077867006E-2]
["NHS Coventry and Rugby CCG","E38000038",30575.754353417171,8.5378516568237389E-2,33615.052121678855,8.8446698209963828E-2,36880.730486685941,9.2206436538541783E-2,40441.724450517082,9.5897098668588338E-2,44116.989825300639,0.10007029402826438,30575.754353417171,8.5378516568237389E-2,33335.743191809095,8.7711790748326829E-2,36257.63733236312,9.0648625762195914E-2,39399.854057796474,9.3426572270218319E-2,42577.127042520697,9.6577432841538566E-2,30575.754353417171,8.5378516568237389E-2,33196.088726874208,8.7344337017508308E-2,35950.58421544922,8.9880954586352368E-2,38893.849051353107,9.2226712158192878E-2,41840.082409452938,9.4905599077831818E-2,30575.754353417171,8.5378516568237389E-2,33056.434261939336,8.6976883286689829E-2,35646.526738700348,8.9120772885395133E-2,38397.669073113175,9.1050149561588661E-2,41124.399702727758,9.3282220438977798E-2,30575.754353417171,8.5378516568237389E-2,32218.507472330049,8.4772160901778804E-2,33885.090321672353,8.4716961652263501E-2,35621.520662813869,8.4467231013027277E-2,37255.850487395488,8.4507214279806481E-2,30575.754353417171,8.5378516568237389E-2,32497.816402199809,8.5507068363415803E-2,34460.253233354953,8.6154940830428905E-2,36509.272966069213,8.6572306189104636E-2,38467.01370787176,8.7254488290776561E-2,30575.754353417171,8.5378516568237389E-2,32637.470867134689,8.5874522094234296E-2,34752.328149443791,8.6885164631841066E-2,36967.11606955465,8.7657962794163533E-2,39101.375658873265,8.8693407564472304E-2,30575.754353417171,8.5378516568237389E-2,32777.125332069569,8.6241975825052802E-2,35047.398705697626,8.7622877908139468E-2,37434.398906019866,8.876600328658793E-2,39755.456969193801,9.0177056138442582E-2]
["NHS Crawley CCG","E38000039",6825.5489432082513,7.784613302016713E-2,7530.016011968004,8.2062075108631255E-2,8477.7471895573563,8.7381438770947797E-2,9386.9541371239611,9.2628321858337873E-2,10363.932157030731,9.7736063344310925E-2,6825.5489432082513,7.784613302016713E-2,7467.4314941908533,8.138002936127782E-2,8334.5149340980261,8.5905121975860907E-2,9145.1510328355544,9.0242263990877772E-2,10001.784429409527,9.432086410231541E-2,6825.5489432082513,7.784613302016713E-2,7436.1392353022784,8.1039006487601109E-2,8263.9317312875392,8.5177610093666645E-2,9027.7145626197325,8.9083427695083192E-2,9828.4449331857013,9.2686202689416269E-2,6825.5489432082513,7.784613302016713E-2,7404.8469764137062,8.069798361392444E-2,8194.0371450898383,8.4457195888371847E-2,8912.5583398664621,8.7947092361026852E-2,9660.1293736198004,9.1098919026969066E-2,6825.5489432082513,7.784613302016713E-2,7217.0934230822613,7.8651846371864231E-2,7789.1305767721142,8.0283761871491582E-2,8268.254299492688,8.1589247084001254E-2,8750.3169389078303,8.2519020547980299E-2,6825.5489432082513,7.784613302016713E-2,7279.6779408594093,7.9333892119217625E-2,7921.3449664268819,8.1646515836187192E-2,8474.2888161332667,8.362234868890138E-2,9035.1605061262071,8.5205210355773359E-2,6825.5489432082513,7.784613302016713E-2,7310.9701997479833,7.9674914992894322E-2,7988.4850861734421,8.2338539333884159E-2,8580.5476027091408,8.4670886152645938E-2,9184.3509025781623,8.6612136010733323E-2,6825.5489432082513,7.784613302016713E-2,7342.2624586365573,8.0015937866571032E-2,8056.3138225327875,8.303766050848059E-2,8688.9972152784467,8.5741042187472319E-2,9338.1789337904283,8.8062796433331092E-2]
["NHS Croydon CCG","E38000040",30993.77009749764,0.10424381170959787,34750.340420988316,0.11050095529441718,38831.400478709897,0.1167791425439369,43209.777421624232,0.12337190903844288,47681.009797342675,0.12993516949352157,30993.77009749764,0.10424381170959787,34460.004482141958,0.10957772984654654,38171.406026010802,0.11479431620958379,42089.771285426796,0.12017408430055618,46006.480035146815,0.12537192074108028,30993.77009749764,0.10424381170959787,34314.836512718779,0.10911611712261123,37846.168375041299,0.11381621669385691,41545.81810648743,0.1186209973346489,45204.977987080856,0.12318775339841088,30993.77009749764,0.10424381170959787,34169.668543295607,0.10865450439867594,37524.103774325144,0.11284765961242976,41012.426790091631,0.11709806644041694,44426.706048761363,0.12106689025714346,30993.77009749764,0.10424381170959787,33298.660726756541,0.10588482805506405,35658.350225348848,0.1072367082441623,38028.079335500144,0.10857720230556231,40219.8371835379,0.10960278281975665,30993.77009749764,0.10424381170959787,33588.996665602906,0.10680805350293471,36267.575873994174,0.10906885562971903,38982.409196504275,0.11130199062501221,41536.921330414334,0.11319195915199023,30993.77009749764,0.10424381170959787,33734.164635026078,0.10726966622686999,36576.948273696864,0.10999924297394702,39474.588539445729,0.11270725371015798,42226.760697165526,0.11507183534217769,30993.77009749764,0.10424381170959787,33879.332604449257,0.10773127895080532,36889.493723652944,0.11093917275247488,39976.915554242769,0.11414149027593298,42938.04395777559,0.1170101481299749]
["NHS Cumbria CCG","E38000041",39116.630901242701,9.2984289486647095E-2,41836.102160294628,9.9657222868734213E-2,44739.115404820855,0.10655214681533022,47325.450968053592,0.11250820408913462,49443.872696481056,0.11775154250174102,39116.630901242701,9.2984289486647095E-2,41488.252355517725,9.8828614472410009E-2,43982.103773268936,0.10474922304770157,46103.537136202409,0.109603311944186,47712.888245503382,0.1136291694343972,39116.630901242701,9.2984289486647095E-2,41314.327453129292,9.8414310274247949E-2,43609.05717598975,0.10386076301798074,45510.090465024288,0.10819249349806077,46884.364552493818,0.11165602417836108,39116.630901242701,9.2984289486647095E-2,41140.402550740851,9.800000607608586E-2,43239.650057708408,0.10298097089098887,44928.16666458323,0.10680906871572657,46079.854143495941,0.10974006702428184,39116.630901242701,9.2984289486647095E-2,40096.853136410195,9.5514180887113359E-2,41099.6364069751,9.7884244086346342E-2,41672.277865441538,9.9068747302780369E-2,41731.15592540348,9.9383557812344564E-2,39116.630901242701,9.2984289486647095E-2,40444.702941187083,9.6342789283437535E-2,41798.416374561493,9.9548481410311265E-2,42713.440783770391,0.10154393491767398,43092.643926597724,0.10262596791283098,39116.630901242701,9.2984289486647095E-2,40618.627843575516,9.6757093481599596E-2,42153.26557685146,0.1003936019263872,43250.402794472786,0.10282047069815704,43805.740369836058,0.10432422093316518,39116.630901242701,9.2984289486647095E-2,40792.552745963956,9.717139767976167E-2,42511.754258139263,0.1012473903451921,43798.435798628416,0.10412332588110595,44541.003661150862,0.10607526473243835]
["NHS Darlington CCG","E38000042",7395.3992805948283,8.6597181271602208E-2,7926.8495768189305,9.2301462235898121E-2,8558.2752194293989,9.8393598751775113E-2,9128.4079371475436,0.10363769229277413,9675.7630172856298,0.10915797627804187,7395.3992805948283,8.6597181271602208E-2,7860.8086887129521,9.153247192260075E-2,8413.0833889232181,9.6724343399899035E-2,8891.8907885391327,0.10095243856197927,9335.9096586653231,0.1053238905535348,7395.3992805948283,8.6597181271602208E-2,7827.7882446599633,9.1147976765952071E-2,8341.5345301401248,9.590175362313319E-2,8777.0215474687029,9.9648291864994368E-2,9173.2412074225886,0.10348873203319708,7395.3992805948283,8.6597181271602208E-2,7794.7678006069727,9.0763481609303365E-2,8270.6837090036952,9.5087189112482123E-2,8664.3827063327626,9.8369467601416488E-2,9015.2874115993509,0.10170676231497465,7395.3992805948283,8.6597181271602208E-2,7596.6451362890348,8.8456510669411209E-2,7860.2375727650642,9.0368332636986251E-2,8034.1635248439889,9.1214390609037133E-2,8161.484424397413,9.2074508397985269E-2,7395.3992805948283,8.6597181271602208E-2,7662.6860243950159,8.9225500982708622E-2,7994.2608009246169,9.1909183731025718E-2,8235.6940078133903,9.3502429698153852E-2,8428.792585175961,9.5090169056588028E-2,7395.3992805948283,8.6597181271602208E-2,7695.7064684480019,8.9609996139357259E-2,8062.3194714743895,9.2691647177217631E-2,8339.6299158716229,9.4682446819614269E-2,8568.7985922304215,9.6669659208375711E-2,7395.3992805948283,8.6597181271602208E-2,7728.7269125009934,8.999449129600598E-2,8131.0761796708293,9.3482135889524365E-2,8445.7087572002474,9.5886793337877488E-2,8713.1567341434911,9.8298248354506915E-2]
["NHS Dartford, Gravesham and Swanley CCG","E38000043",17369.856299631534,8.4237906399764959E-2,19147.149854223004,8.8562210241549505E-2,21237.528003858126,9.3376398187909465E-2,23433.984689958328,9.7812775231481464E-2,25735.596828347305,0.10249142504319915,17369.856299631534,8.4237906399764959E-2,18987.87383237727,8.7825503387498935E-2,20878.097930135824,9.179606898582407E-2,22828.92063780758,9.5287255354401787E-2,24835.277952660694,9.8905925737398218E-2,17369.856299631534,8.4237906399764959E-2,18908.235821454404,8.7457149960473657E-2,20700.974937075567,9.1017300989604158E-2,22535.05928830929,9.4060686569451921E-2,24404.34657176425,9.7189751380980682E-2,17369.856299631534,8.4237906399764959E-2,18828.597810531533,8.7088796533448351E-2,20525.579973215885,9.0246130729932678E-2,22246.903803397217,9.2857933898477407E-2,23985.904969647007,9.5523317282544831E-2,17369.856299631534,8.4237906399764959E-2,18350.769744994323,8.4878675971296585E-2,19509.498803270162,8.5778661639422105E-2,20634.66141869783,8.6128480752557926E-2,21724.061954129465,8.6515579267739812E-2,17369.856299631534,8.4237906399764959E-2,18510.045766840052,8.5615382825347142E-2,19841.280409783045,8.7237427056731653E-2,21150.221712633429,8.82804145280634E-2,22432.198497934729,8.9335716837653248E-2,17369.856299631534,8.4237906399764959E-2,18589.683777762919,8.5983736252372434E-2,20009.763256840379,8.79782063702092E-2,21416.113137689477,8.9390237656271299E-2,22803.093908156257,9.0812799315636225E-2,17369.856299631534,8.4237906399764959E-2,18669.321788685789,8.6352089679397726E-2,20179.974133098291,8.8726583420235192E-2,21687.486667936199,9.0522942933200595E-2,23185.518729705807,9.2335797410218273E-2]
["NHS Doncaster CCG","E38000044",21789.797939386437,8.8432621507250148E-2,23376.809919229803,9.4253729212280479E-2,25199.684759032203,0.10015772956690065,27086.79903644383,0.10596510068243421,28732.946277316605,0.11133348681539292,21789.797939386437,8.8432621507250148E-2,23182.271394326133,9.3469362931723782E-2,24773.136456506214,9.8462386552091469E-2,26387.701499293678,0.10323019129682216,27728.093784089382,0.10743991701832525,21789.797939386437,8.8432621507250148E-2,23085.002131874298,9.3077179791445447E-2,24562.938374732596,9.7626941076043708E-2,26048.170924030412,0.10190192834688372,27247.128112706097,0.10557628685952455,21789.797939386437,8.8432621507250148E-2,22987.732869422463,9.2684996651167098E-2,24354.791005951887,9.6799646287567126E-2,25715.232966301359,0.10059945609225163,26780.102374923088,0.10376667070258482,21789.797939386437,8.8432621507250148E-2,22404.117294711446,9.0331897809497005E-2,23148.971766118812,9.2007041995702754E-2,23852.430711852419,9.3312067568470478E-2,24255.642814194591,9.3984976806395656E-2,21789.797939386437,8.8432621507250148E-2,22598.65581961512,9.1116264090053703E-2,23542.708660758184,9.3571974009372755E-2,24448.114640622633,9.5642417027707677E-2,25045.999198809284,9.7047424049942974E-2,21789.797939386437,8.8432621507250148E-2,22695.925082066955,9.1508447230332052E-2,23742.653177567234,9.4366666047564524E-2,24755.328463267164,9.6844255000653967E-2,25459.958283476273,9.8651419263314763E-2,21789.797939386437,8.8432621507250148E-2,22793.19434451879,9.1900630370610401E-2,23944.648407369208,9.5169508773327541E-2,25068.876369424979,9.8070872269090767E-2,25886.785428595245,0.10030527521929342]
["NHS Dorset CCG","E38000045",57473.27514477502,8.9793574266123513E-2,62902.402350917488,9.5254713112419703E-2,69344.441661267207,0.10131854951823036,75667.914503816835,0.10653551446486756,81844.773240096809,0.11162680474644956,57473.27514477502,8.9793574266123513E-2,62378.59068618012,9.4461491741141365E-2,68169.718427047497,9.960217180539363E-2,73712.687183831906,0.10378268124888337,78978.980582572854,0.1077181950116924,57473.27514477502,8.9793574266123513E-2,62116.684853811457,9.4064881055502217E-2,67590.828371722906,9.8756360672865959E-2,72763.092282623751,0.10244571323546835,77607.288817999026,0.10584736609110616,57473.27514477502,8.9793574266123513E-2,61854.779021442802,9.3668270369863096E-2,67017.586024255099,9.7918801356265323E-2,71831.935532357529,0.10113470494235566,76275.35309685173,0.1040307598156734,57473.27514477502,8.9793574266123513E-2,60283.344027230771,9.1288606256028165E-2,63696.733804441727,9.3066733591130796E-2,66622.073294141883,9.3799556914569149E-2,69075.711634932217,9.4211281553371828E-2,57473.27514477502,8.9793574266123513E-2,60807.155691968117,9.2081827627306476E-2,64781.093712952214,9.4651082249133905E-2,68288.074716998177,9.6145178831692865E-2,71329.771349290531,9.7285558305088032E-2,57473.27514477502,8.9793574266123513E-2,61069.061524336765,9.2478438312945596E-2,65331.745228992717,9.5455634302026138E-2,69147.286525353629,9.7354893314213986E-2,72510.363439522538,9.8895749371962022E-2,57473.27514477502,8.9793574266123513E-2,61330.967356705427,9.2875048998584731E-2,65888.044452890026,9.6268438170845447E-2,70024.213419908192,9.8589549488790285E-2,73727.654640727007,0.10055599378167897]
["NHS Dudley CCG","E38000046",23662.707421075029,9.2497488159936789E-2,25394.851070690635,9.8193685989833093E-2,27117.659086115935,0.1032974976615722,28761.912009219966,0.10773865751131242,30291.46365666396,0.1117766186592766,23662.707421075029,9.2497488159936789E-2,25183.57913113165,9.7376765645084101E-2,26658.420658675477,0.1015481512215278,28018.922903140392,0.10495550982596791,29230.910169882609,0.10786313715823841,23662.707421075029,9.2497488159936789E-2,25077.943161352163,9.6968305472709626E-2,26432.113260537757,0.10068609348064055,27658.075517481007,0.10360381898966514,28723.283604545206,0.10598997640053581,23662.707421075029,9.2497488159936789E-2,24972.30719157268,9.6559845300335165E-2,26208.013739455037,9.9832446059176586E-2,27304.234654871962,0.10227837374465074,28230.369691348198,0.10417110587213357,23662.707421075029,9.2497488159936789E-2,24338.491372895751,9.4109084266088286E-2,24909.782031113758,9.4887178238281883E-2,25324.479744737331,9.4862450347382873E-2,25565.97426275098,9.4339388423435352E-2,23662.707421075029,9.2497488159936789E-2,24549.763312454721,9.4926004610837222E-2,25333.694425674174,9.6501959567553613E-2,25957.562606890075,9.7233902483106358E-2,26400.141690460667,9.7417497012769985E-2,23662.707421075029,9.2497488159936789E-2,24655.399282234204,9.5334464783211684E-2,25548.962438536884,9.7321965711324412E-2,26284.064291322313,9.8456938460152507E-2,26837.047359290122,9.902969505273107E-2,23662.707421075029,9.2497488159936789E-2,24761.035252013698,9.5742924955586187E-2,25766.438328454609,9.8150382174518547E-2,26617.297733195071,9.9705190789612944E-2,27287.534391028523,0.10069200882298347]
["NHS Durham Dales, Easington and Sedgefield CCG","E38000047",21020.906354547937,9.3070514276755223E-2,22655.999492387604,9.8581496355354639E-2,24533.863762552584,0.10430177605030433,26282.18884818428,0.10947262932432639,27750.863636485275,0.11382634797573944,21020.906354547937,9.3070514276755223E-2,22467.577262861101,9.7761627634066234E-2,24118.685687946971,0.10253671323844474,25603.875955832551,0.10664726739350446,26779.697059055852,0.10984289195675083,21020.906354547937,9.3070514276755223E-2,22373.366148097848,9.7351693273422024E-2,23914.090723297566,0.10166691065086968,25274.439855274217,0.10527507437218518,26314.854917461329,0.10793623838171176,21020.906354547937,9.3070514276755223E-2,22279.155033334599,9.6941758912777815E-2,23711.491807083778,0.10080559394219785,24951.400369251307,0.10392952503020371,25863.485397664943,0.10608484576564783,21020.906354547937,9.3070514276755223E-2,21713.888344755083,9.4482152748912557E-2,22537.815326948679,9.5815897147133233E-2,23143.98049155375,9.6401118342026609E-2,23423.653911973146,9.6077333519167946E-2,21020.906354547937,9.3070514276755223E-2,21902.310574281586,9.5302021470200962E-2,22921.056626584628,9.744518589654208E-2,23721.954332369591,9.880854020480502E-2,24187.514986279286,9.9210479845280086E-2,21020.906354547937,9.3070514276755223E-2,21996.521689044839,9.5711955830845186E-2,23115.671349056011,9.8272559089601266E-2,24020.034479322949,0.10005012695486067,24587.596819345847,0.1008515045912463,21020.906354547937,9.3070514276755223E-2,22090.732803808085,9.6121890191489368E-2,23312.282119962998,9.9108418161563627E-2,24324.260393182885,0.10131731253408399,25000.11533372787,0.1025435411555696]
["NHS Ealing CCG","E38000048",29144.515676375697,0.10677993579678939,32353.491536029444,0.11423448745155512,36046.961378751592,0.12242549035033144,39843.2980304214,0.13014731178683414,43572.676532812024,0.1374185585114546,29144.515676375697,0.10677993579678939,32084.489780534514,0.11328468957183289,35437.50372045923,0.12035560290877337,38816.317085452858,0.12679269969769666,42051.319746778296,0.13262053660520468,29144.515676375697,0.10677993579678939,31949.988902787063,0.11280979063197183,35137.170018656514,0.11933558626089021,38317.543434424115,0.12516346584707688,41323.132880606332,0.13032399672198289,29144.515676375697,0.10677993579678939,31815.488025039595,0.11233489169211071,34839.766401749432,0.11832552099493762,37828.454401385468,0.12356586660150738,40616.051214175197,0.12809401795816575,29144.515676375697,0.10677993579678939,31008.482758554848,0.10948549805294418,33116.876483115302,0.11247410841976396,35091.980135774356,0.11462722981568679,36793.994036959644,0.11604009725293189,29144.515676375697,0.10677993579678939,31277.484514049764,0.11043529593266635,33679.452783077468,0.11438477375043292,35967.045504427784,0.11748561280599655,37990.601556195579,0.11981393199254314,29144.515676375697,0.10677993579678939,31411.985391797214,0.11091019487252742,33965.136060402001,0.11535503348866323,36418.345537858047,0.11895977506323266,38617.339775828004,0.12179052534321939,29144.515676375697,0.10677993579678939,31546.486269544679,0.11138509381238852,34253.749422622168,0.11633524460882411,36878.950400337621,0.120464331352772,39263.560368469065,0.12382856177768722]
["NHS East and North Hertfordshire CCG","E38000049",34535.384644793186,7.6953929864952059E-2,38262.417352875156,8.1509985413649094E-2,42579.098413493513,8.6479605194356796E-2,47031.916168094809,9.1076522401422944E-2,51707.347172598325,9.5889301929749884E-2,34535.384644793186,7.6953929864952059E-2,37943.648177701667,8.08309151244124E-2,41857.328463840546,8.5013665740191216E-2,45815.648764240905,8.8721240829281386E-2,49894.604163751661,9.2527639202862666E-2,34535.384644793186,7.6953929864952059E-2,37784.263590114926,8.0491379979794053E-2,41501.648560766378,8.4291267691864444E-2,45224.944392733742,8.7577351651304688E-2,49026.947304489498,9.0918602671332796E-2,34535.384644793186,7.6953929864952059E-2,37624.879002528192,8.0151844835175734E-2,41149.438705527071,8.3575917429374993E-2,44645.709645115734,8.6455673208977027E-2,48184.437934384216,8.9356201198694862E-2,34535.384644793186,7.6953929864952059E-2,36668.571477007747,7.8114633967465694E-2,39109.050578623523,7.9431819357022343E-2,41404.866212670328,8.0179833874264764E-2,43630.340242762199,8.0910800835921295E-2,34535.384644793186,7.6953929864952059E-2,36987.340652181221,7.879370425670236E-2,39775.29976291857,8.0784994237790578E-2,42441.217947674711,8.2186711749951027E-2,45056.134596027194,8.3554882048859871E-2,34535.384644793186,7.6953929864952059E-2,37146.725239767955,7.9133239401320679E-2,40113.629426818392,8.1472153356930685E-2,42975.698672666367,8.3221724772785374E-2,45802.912298960116,8.493975279830894E-2,34535.384644793186,7.6953929864952059E-2,37306.109827354703,7.947277454593904E-2,40455.429138553081,8.2166360261908114E-2,43521.199232375082,8.427807752202765E-2,46572.903843505585,8.6367672731076303E-2]
["NHS East Lancashire CCG","E38000050",27935.455627643958,9.3379648441115001E-2,29982.387683834251,9.9655612855927181E-2,32346.019887024027,0.10612907634038989,34398.109271722686,0.11171118885334726,36289.040607775147,0.11684281218293241,27935.455627643958,9.3379648441115001E-2,29732.784815291569,9.8825981570469887E-2,31798.044912956953,0.10433114020919008,33508.888006779904,0.10882335673804854,35017.154098895335,0.11274761445970551,27935.455627643958,9.3379648441115001E-2,29607.983381020233,9.8411165927741254E-2,31528.009168524859,0.10344513802915171,33077.020074798478,0.1074208238334583,34408.374449354895,0.1107874764935118,27935.455627643958,9.3379648441115001E-2,29483.181946748889,9.7996350285012593E-2,31260.607919160393,0.10256777977282103,32653.537661849117,0.10604552371346167,33817.239193992056,0.10888414963613902,27935.455627643958,9.3379648441115001E-2,28734.373341120856,9.5507456428640752E-2,29711.524819393864,9.7485152632698552E-2,30284.135269456507,9.8350660137232093E-2,30621.918408957008,9.8595912193177301E-2,27935.455627643958,9.3379648441115001E-2,28983.976209663535,9.6337087714098033E-2,30217.34787237885,9.9144785984575268E-2,31041.818980954649,0.1008113113177275,31622.307649739985,0.10181694780649103,27935.455627643958,9.3379648441115001E-2,29108.777643934875,9.675190335682668E-2,30474.211141472791,9.998756854607517E-2,31432.581427484638,0.10208035018019174,32146.274081196218,0.10350400567066849,27935.455627643958,9.3379648441115001E-2,29233.57907820621,9.7166718999555313E-2,30733.708905634368,0.10083899503128278,31831.400549163107,0.10337555387491267,32686.528189296201,0.10524350630850732]
["NHS East Leicestershire and Rutland CCG","E38000051",23057.335909201091,8.652557756379875E-2,25360.003545295025,9.2737524849319922E-2,27881.094268153054,9.8519767731989588E-2,30290.621472711227,0.10363562841354601,32553.621652096594,0.10814438127731245,23057.335909201091,8.652557756379875E-2,25148.756702071336,9.1965028530941767E-2,27408.577120876675,9.6850095833486485E-2,29507.243356767078,0.10095539673178827,31411.954387494421,0.10435171878112558,23057.335909201091,8.652557756379875E-2,25043.133280459493,9.1578780371752697E-2,27175.726122819797,9.6027300787349099E-2,29126.780247943334,9.9653689092457004E-2,30865.503275399173,0.10253638720151211,23057.335909201091,8.652557756379875E-2,24937.509858847654,9.119253221256364E-2,26945.14684181715,9.5212533009954595E-2,28753.704537913964,9.8377256527692497E-2,30334.890075802952,0.10077366977544001,23057.335909201091,8.652557756379875E-2,24303.769329176597,8.8875043257429232E-2,25609.377213939693,9.0492498989186196E-2,26666.329825630717,9.1235561193481307E-2,27466.715034469817,9.12454821422823E-2,23057.335909201091,8.652557756379875E-2,24515.016172400283,8.9647539575807372E-2,26045.546888348657,9.203373458780445E-2,27333.827176172792,9.3519321117328566E-2,28364.681669140729,9.4228561787059767E-2,23057.335909201091,8.652557756379875E-2,24620.639594012122,9.0033787734996429E-2,26267.039301134464,9.2816393290227783E-2,27678.077545808384,9.4697131332312792E-2,28835.002974043044,9.5790987223583299E-2,23057.335909201091,8.652557756379875E-2,24726.263015623968,9.0420035894185499E-2,26490.80343097448,9.3607079261393916E-2,28029.425612324871,9.5899225442469108E-2,29319.944378388787,9.7401981191910125E-2]
["NHS East Riding of Yorkshire CCG","E38000052",23929.689627255433,9.0416721934766991E-2,26160.809362776708,9.6978089274824694E-2,28518.617970654388,0.10357600773826682,30708.844746691033,0.10916759597117325,32538.975465512773,0.11413980449527419,23929.689627255433,9.0416721934766991E-2,25943.067173867817,9.6170919238833849E-2,28035.561982214342,0.10182160958166028,29915.41877639533,0.10634702728899868,31399.62338413973,0.11014319974792944,23929.689627255433,9.0416721934766991E-2,25834.196079413381,9.5767334220838454E-2,27797.517564834026,0.10095706241314022,29530.07572795391,0.10497716220388877,30854.280418427825,0.10823025262532558,23929.689627255433,9.0416721934766991E-2,25725.324984958941,9.5363749202843046E-2,27561.79553201353,0.10010094985114233,29152.214831409645,0.10363389559690596,30324.743247565144,0.1063727488689671,23929.689627255433,9.0416721934766991E-2,25072.098418232286,9.294223909487058E-2,26196.233410846482,9.5141401216120011E-2,27038.066793883718,9.6118260909647063E-2,27462.384568809568,9.6332203482564757E-2,23929.689627255433,9.0416721934766991E-2,25289.840607141166,9.3749409130861383E-2,26642.131246329602,9.6760845668372203E-2,27714.125675596759,9.8521598562377383E-2,28358.530219944078,9.9475691805612707E-2,23929.689627255433,9.0416721934766991E-2,25398.711701595606,9.4152994148856792E-2,26868.563740910871,9.7583219804281515E-2,28062.791508856073,9.9761078950785897E-2,28827.897761844531,0.10112213330238713,23929.689627255433,9.0416721934766991E-2,25507.58279605005,9.45565791668522E-2,27097.318620051945,9.8414028546712953E-2,28418.64607629109,0.10102611473974792,29311.855755137636,0.10281975499907967]
["NHS East Staffordshire CCG","E38000053",8679.5283382126163,8.5193642895687247E-2,9556.5210249188985,9.1345068102837879E-2,10497.255981193408,9.7558141089158057E-2,11465.719573567058,0.10342521715286901,12299.427867936491,0.10838410176186543,8679.5283382126163,8.5193642895687247E-2,9477.0624409482225,9.0585571027989129E-2,10319.654851013647,9.5907572964810839E-2,11169.928093337008,0.10075706380423065,11869.351408907472,0.10459421403690052,8679.5283382126163,8.5193642895687247E-2,9437.3331489628836,9.0205822490564747E-2,10232.13506330487,9.5094192038149339E-2,11026.271098277513,9.9461222246775352E-2,11663.498296876369,0.10278021058227324,8679.5283382126163,8.5193642895687247E-2,9397.6038569775446,8.9826073953140365E-2,10145.469127183496,9.4288746535162588E-2,10885.403470931984,9.8190541862998248E-2,11463.61147076515,0.1010187827878494,8679.5283382126163,8.5193642895687247E-2,9159.2281050655147,8.7547582728594101E-2,9643.4043937907027,8.9622717414411718E-2,10097.243011283594,9.1081030229871865E-2,10383.143803960484,9.1497566125841395E-2,8679.5283382126163,8.5193642895687247E-2,9238.6866890361907,8.8307079803442851E-2,9807.3438985720222,9.1146318759963013E-2,10349.279703843631,9.3354498501205418E-2,10721.416015610565,9.4478463302877722E-2,8679.5283382126163,8.5193642895687247E-2,9278.4159810215278,8.8686828340867219E-2,9890.5944283437875,9.1920022568250798E-2,10479.263327756244,9.4527000972002936E-2,10898.590335738574,9.6039745644506277E-2,8679.5283382126163,8.5193642895687247E-2,9318.1452730068686,8.9066576878291615E-2,9974.6988097029534,9.2701661800213303E-2,10611.926932413644,9.5723677903785359E-2,11081.272180514299,9.7649560984440414E-2]
["NHS East Surrey CCG","E38000054",11116.671416037574,7.6287890584940801E-2,12389.298448760032,8.1081796130628478E-2,13890.147111396125,8.6124424053795418E-2,15325.446867418632,9.0747553691488805E-2,16808.034687203166,9.5597967735201711E-2,11116.671416037574,7.6287890584940801E-2,12286.174356113175,8.0406900236342768E-2,13654.930443372261,8.4665987372099835E-2,14929.468694597976,8.8402822682366017E-2,16219.281947038786,9.224935699601175E-2,11116.671416037574,7.6287890584940801E-2,12234.612309789749,8.0069452289199927E-2,13539.018383408567,8.3947286603475738E-2,14737.15404654819,8.7264057594435035E-2,15937.479534385695,9.0646567707801703E-2,11116.671416037574,7.6287890584940801E-2,12183.050263466324,7.97320043420571E-2,13424.237172810383,8.3235597549667556E-2,14548.573545032456,8.6147403748415757E-2,15663.844662899277,8.9090232413259446E-2,11116.671416037574,7.6287890584940801E-2,11873.677985525763,7.7707316659200013E-2,12759.297745896743,7.9112709237951037E-2,13493.457493487165,7.9899677247081732E-2,14184.739526741761,8.0677622151869868E-2,11116.671416037574,7.6287890584940801E-2,11976.802078172615,7.8382212553485708E-2,12976.420824072628,8.0458958482593171E-2,13830.860818715017,8.1897565245825518E-2,14647.816933908121,8.3311437458242071E-2,11116.671416037574,7.6287890584940801E-2,12028.364124496042,7.8719660500628549E-2,13086.678637208814,8.114260067713798E-2,14004.870826892038,8.2927941893013002E-2,14890.359542954042,8.4690931310169734E-2,11116.671416037574,7.6287890584940801E-2,12079.926170819468,7.905710844777139E-2,13198.067299710508,8.1833254586498691E-2,14182.468544484125,8.3979562674586228E-2,15140.441672380086,8.6113307202707809E-2]
["NHS Eastbourne, Hailsham and Seaford CCG","E38000055",15193.590329922681,9.7133297084277467E-2,16898.050274988444,0.10327619041063711,18979.894650616843,0.11041241797915557,21109.709828684467,0.11682185848746246,23230.751234399333,0.12297909599999647,15193.590329922681,9.7133297084277467E-2,16756.863312846417,0.10241329490799668,18657.335149801365,0.10853598109250358,20562.644294170266,0.11379437904908836,22414.947665106502,0.11866038996880096,15193.590329922681,9.7133297084277467E-2,16686.269831775415,0.10198184715667653,18498.381549639893,0.10761129464595633,20296.951074312132,0.11232402365418999,22024.468949009937,0.11659327130232894,15193.590329922681,9.7133297084277467E-2,16615.676350704405,0.10155039940535635,18340.978716309259,0.10669562953059487,20036.416782419765,0.11088221794366222,21645.307563231458,0.11458606438979067,15193.590329922681,9.7133297084277467E-2,16192.115464278353,9.8961712897435231E-2,17429.127819773195,0.10139108679332866,18578.716165738162,0.10281525271576182,19595.78971453361,0.10373631399964854,15193.590329922681,9.7133297084277467E-2,16333.30242642037,9.9824608400075607E-2,17726.875051295174,0.10312318238100741,19044.857340004954,0.10539489396793002,20237.451614093876,0.10713314777180453,15193.590329922681,9.7133297084277467E-2,16403.89590749138,0.10025605615139579,17878.074817302429,0.10400276217162553,19285.261697285769,0.106725299929639,20573.530094357106,0.10891228213000057,15193.590329922681,9.7133297084277467E-2,16474.48938856239,0.10068750390271598,18030.825350140534,0.10489136329342952,19530.62267163174,0.10808313598025313,20920.055689711709,0.11074672149132721]
["NHS Eastern Cheshire CCG","E38000056",14039.146553892011,8.6150874778424202E-2,15517.901366423303,9.3032981813089347E-2,17013.865712541628,9.9426517721725269E-2,18462.078187212519,0.10543733973279565,19738.571677028707,0.11061741580939646,14039.146553892011,8.6150874778424202E-2,15388.585848218705,9.2257708922174497E-2,16725.333573953289,9.7740378529413793E-2,17984.300527002364,0.10270874087379991,19045.995931850808,0.10673613501373462,14039.146553892011,8.6150874778424202E-2,15323.928089116413,9.1870072476717107E-2,16583.148265273936,9.6909468590894901E-2,17752.258336608771,0.10138354275618944,18714.499358464753,0.10487838690016112,14039.146553892011,8.6150874778424202E-2,15259.270330014111,9.1482436031259662E-2,16442.350130337803,9.6086665090800633E-2,17524.72167686401,0.10008407582446607,18392.610623011133,0.1030744823078409,14039.146553892011,8.6150874778424202E-2,14871.32377540034,8.9156617358515225E-2,15626.69196932846,9.1320079297150886E-2,16251.644237351231,9.2813502212171509E-2,16652.674191318707,9.3323661686385923E-2,14039.146553892011,8.6150874778424202E-2,15000.639293604936,8.9931890249430074E-2,15893.029328025388,9.2876515474669172E-2,16658.746906991299,9.513847462587835E-2,17197.412514326337,9.6376443142380266E-2,14039.146553892011,8.6150874778424202E-2,15065.29705270723,9.0319526694887478E-2,16028.27876798867,9.3666893221065153E-2,16868.703162831738,9.6337539479336029E-2,17482.726053844592,9.7975375778102378E-2,14039.146553892011,8.6150874778424202E-2,15129.954811809524,9.0707163140344868E-2,16164.915381695171,9.4465377405885759E-2,17082.988261844603,9.7561326452567695E-2,17776.9086628199,9.9624011784464797E-2]
["NHS Enfield CCG","E38000057",24055.346580520942,9.4393920030297215E-2,27006.122758848425,9.9243432158049483E-2,30371.803611271018,0.10493298649554664,33999.143570794207,0.11088364611178073,38022.706132147781,0.11760812289560094,24055.346580520942,9.4393920030297215E-2,26780.530239803233,9.8414413640317625E-2,29856.031976456386,0.10315102258311355,33119.042347490788,0.10801331402873521,36689.980777375808,0.11348586692661865,24055.346580520942,9.4393920030297215E-2,26667.733980280638,9.7999904381451702E-2,29601.86566603091,0.10227289132818861,32691.603744493757,0.10661928036166511,36052.081036520533,0.1115127777189005,24055.346580520942,9.4393920030297215E-2,26554.93772075804,9.7585395122585766E-2,29350.179026926642,0.101403327207458,32272.464656869492,0.10525231445068649,35432.669683839784,0.10959687498867858,24055.346580520942,9.4393920030297215E-2,25878.160163622466,9.5098339569390219E-2,27892.132290046808,9.636585230115674E-2,29927.363357276772,9.7604081133901149E-2,32084.505364841978,9.9240659959300898E-2,24055.346580520942,9.4393920030297215E-2,26103.752682667662,9.5927358087122092E-2,28368.229183721847,9.801074206647957E-2,30677.276104144679,0.10004982096453161,33132.746773587467,0.10248297795727643,24055.346580520942,9.4393920030297215E-2,26216.548942190253,9.6341867345988E-2,28609.997137541217,9.8846037650432622E-2,31064.030808255582,0.10131116955272187,33681.776379118972,0.1041811827377636,24055.346580520942,9.4393920030297215E-2,26329.345201712851,9.6756376604853922E-2,28854.244762681792,9.9689900368579984E-2,31458.759556548179,0.10259852441637264,34247.872758676196,0.10593217679763747]
["NHS Erewash CCG","E38000058",6585.7855959506232,8.3554752549487715E-2,7202.0880186323029,8.922309240129217E-2,7886.5150134201285,9.5155827864625092E-2,8519.1459795882274,9.9685770882146349E-2,9105.5172187669195,0.10422982164339423,6585.7855959506232,8.3554752549487715E-2,7142.1264546890343,8.8480258358387451E-2,7752.9187553831489,9.3543903901823697E-2,8298.8501900317333,9.7108005968075506E-2,8786.2402648500629,0.10057509460680017,6585.7855959506232,8.3554752549487715E-2,7112.1456727174018,8.8108841336935126E-2,7687.0840609178103,9.2749566372077805E-2,8191.8591734976153,9.5856063345396855E-2,8633.4205669015137,9.8825784877535641E-2,6585.7855959506232,8.3554752549487715E-2,7082.1648907457675,8.7737424315482759E-2,7621.8916561545739,9.1962978476768487E-2,8086.9455865176997,9.4628429516940088E-2,8485.0300757944642,9.7127175776035538E-2,6585.7855959506232,8.3554752549487715E-2,6902.2801989159643,8.5508922186768657E-2,7244.2253113192673,8.7406193428079954E-2,7499.9495357172682,8.7759765220188024E-2,7682.9205480098472,8.7945519093519317E-2,6585.7855959506232,8.3554752549487715E-2,6962.2417628592329,8.6251756229673363E-2,7367.5449341226322,8.8894123239896608E-2,7687.658195011777,8.9956215715092172E-2,7934.0445494820306,9.0820107022459143E-2,6585.7855959506232,8.3554752549487715E-2,6992.2225448308664,8.6623173251125715E-2,7430.1681800774668,8.9649712597459769E-2,7784.4657333390242,9.1088997581781239E-2,8065.573899799123,9.2325708559971645E-2,6585.7855959506232,8.3554752549487715E-2,7022.2033268024989,8.6994590272578054E-2,7493.4337157344025,9.0413051589459476E-2,7883.269233394818,9.2245134956644256E-2,8201.1918851861556,9.3878112238852507E-2]
["NHS Fareham and Gosport CCG","E38000059",13324.185600370303,8.1254943288024781E-2,14680.680143538822,8.7115358079390123E-2,16219.616116226049,9.3398687758989116E-2,17654.899549184465,9.8763143595795841E-2,19051.849356081108,0.10405160762469201,13324.185600370303,8.1254943288024781E-2,14558.398296559668,8.638973591597239E-2,15944.69712084964,9.1815600143093631E-2,17198.234721340577,9.6208518244241314E-2,18383.912427651754,0.10040367246123295,13324.185600370303,8.1254943288024781E-2,14497.257373070086,8.602692483426351E-2,15809.220212070404,9.1035472832375924E-2,16976.446396449028,9.4967813808732537E-2,18064.209052888807,9.8657613614903369E-2,13324.185600370303,8.1254943288024781E-2,14436.11644958051,8.5664113752554644E-2,15675.065029230473,9.0262956519811546E-2,16758.964504338783,9.3751199957142442E-2,17753.771711194622,9.6962161175284667E-2,13324.185600370303,8.1254943288024781E-2,14069.270908643046,8.3487247262301487E-2,14897.8901769164,8.578768960564552E-2,15542.14392404767,8.6944192906957207E-2,16075.734609926447,8.7797567503694413E-2,13324.185600370303,8.1254943288024781E-2,14191.552755622199,8.4212869425719192E-2,15151.661557263849,8.7249001251087463E-2,15931.256865126154,8.9120926746062618E-2,16601.093525252039,9.0666813354735337E-2,13324.185600370303,8.1254943288024781E-2,14252.693679111777,8.4575680507428058E-2,15280.529836346544,8.7991073571038497E-2,16131.935225403511,9.0243540083931026E-2,16876.256856558386,9.2169616911842639E-2,13324.185600370303,8.1254943288024781E-2,14313.834602601355,8.4938491589136925E-2,15410.719841368544,8.8740756889142833E-2,16336.751138745243,9.1389299276936911E-2,17159.973734610227,9.3719135634135586E-2]
["NHS Fylde & Wyre CCG","E38000060",13627.795632869424,9.6664744168459549E-2,14737.663662019428,0.10277310782440326,15977.012622705752,0.10917734469526962,17153.175587037855,0.11501391703793654,18307.941189337391,0.12049454514504009,13627.795632869424,9.6664744168459549E-2,14614.786703254906,0.1019162252667706,15705.991127658501,0.10732534595912603,16709.514208656848,0.11203911900668398,17666.22866804152,0.1162710850864915,13627.795632869424,9.6664744168459549E-2,14553.348223872639,0.10148778398795424,15572.434862070311,0.10641270235117066,16494.041266729655,0.11059434938131725,17359.077423734125,0.11424955524374177,13627.795632869424,9.6664744168459549E-2,14491.909744490382,0.10105934270913795,15440.18158443908,0.1055089625832929,16282.752132678957,0.10917763264502452,17060.828411343977,0.11228661584404355,13627.795632869424,9.6664744168459549E-2,14123.278868196821,9.848869503624004E-2,14674.024665747816,0.10027350461765627,15100.580301221682,0.10125104131166476,15448.674069743269,0.10167614893868152,13627.795632869424,9.6664744168459549E-2,14246.155826961338,9.934557759387265E-2,14924.198353483738,0.10198304191255803,15478.613320755614,0.10378579402410898,15953.406447591589,0.10499806797151237,13627.795632869424,9.6664744168459549E-2,14307.594306343597,9.9774018872688955E-2,15051.239679287135,0.10285116632012531,15673.577400543096,0.1050930494873481,16217.766370789703,0.10673796479392986,13627.795632869424,9.6664744168459549E-2,14369.032785725858,0.10020246015150529,15179.583993047492,0.10372819456777023,15872.56121730996,0.10642725772636422,16490.344013078418,0.1085319469071898]
["NHS Gloucestershire CCG","E38000062",42305.337796159241,8.3656985952460447E-2,46879.29282611137,8.9501876410155737E-2,51888.288379110549,9.5491715519729362E-2,56745.22180241059,0.10080154510677973,61431.187921044373,0.10580274176060826,42305.337796159241,8.3656985952460447E-2,46488.96479596373,8.8756662713283682E-2,51008.833246351554,9.3873225452448639E-2,55277.550661215733,9.8194391340490503E-2,59277.033894627151,0.10209264905553916,42305.337796159241,8.3656985952460447E-2,46293.800780889898,8.8384055864847641E-2,50575.447904487155,9.3075652222178118E-2,54564.747081763024,9.6928175439235112E-2,58245.963021477161,0.10031683893334221,42305.337796159241,8.3656985952460447E-2,46098.636765816082,8.8011449016411628E-2,50146.290712299466,9.2285860194154107E-2,53865.783909386213,9.5686545474448784E-2,57244.775901709276,9.8592497505613441E-2,42305.337796159241,8.3656985952460447E-2,44927.652675373123,8.5775807925795422E-2,47660.138702384618,8.7710513273187476E-2,49955.054768853937,8.8739572190382504E-2,51832.961964913869,8.9271747381960434E-2,42305.337796159241,8.3656985952460447E-2,45317.980705520771,8.6521021622667477E-2,48471.94344031599,8.9204504104523505E-2,51205.621485328935,9.0961064208137501E-2,53527.289639570183,9.2189882607506088E-2,42305.337796159241,8.3656985952460447E-2,45513.144720594595,8.6893628471103504E-2,48884.188033796781,8.9963171323561353E-2,51850.579932056666,9.2106760812975905E-2,54414.715042818629,9.3718292588644253E-2,42305.337796159241,8.3656985952460447E-2,45708.308735668419,8.7266235319539531E-2,49300.66077695429,9.0729619744845738E-2,52508.836024798497,9.3276079199912043E-2,55329.72636979384,9.5294213719461673E-2]
["NHS Great Yarmouth and Waveney CCG","E38000063",17650.631409805177,9.9395379039335388E-2,19120.878499588398,0.10597981653690497,20756.374189626698,0.11261053705309623,22304.73066770452,0.118227131706268,23805.114228466238,0.1235345834378113,17650.631409805177,9.9395379039335388E-2,18961.721708293026,0.10509767048161525,20404.669985778721,0.11070241962770573,21728.28336194234,0.11517164932652571,22971.300929539273,0.11920758136761429,17650.631409805177,9.9395379039335388E-2,18882.143312645341,0.10465659745397039,20231.354212247872,0.10976212137721285,21448.320302521119,0.11368769374812424,22572.201981355614,0.11713649185965549,17650.631409805177,9.9395379039335388E-2,18802.564916997653,0.10421552442632552,20059.729324312444,0.10883099676818818,21173.793246538018,0.11223255192694805,22184.670205568309,0.11512542919340067,17650.631409805177,9.9395379039335388E-2,18325.094543111543,0.10156908626045638,19065.488594203758,0.10343689558487282,19637.802510363857,0.10409097058392801,20089.907075132644,0.10425483692336608,17650.631409805177,9.9395379039335388E-2,18484.251334406919,0.10245123231574613,19390.138628524961,0.1051982347467717,20128.979173959611,0.10669447245817668,20745.734342144809,0.10765819585959943,17650.631409805177,9.9395379039335388E-2,18563.8297300546,0.10289230534339096,19554.999974078695,0.10609266478992348,20382.295157703811,0.10803718412861131,21089.232111552163,0.10944074785444817,17650.631409805177,9.9395379039335388E-2,18643.408125702288,0.10333337837103583,19721.552205227861,0.10699626847454352,20640.833968280716,0.10940757960500751,21443.407627204433,0.11127871109083774]
["NHS Greater Huddersfield CCG","E38000064",17522.467055557641,8.9127502825827265E-2,19210.058990865386,9.4444734468364711E-2,21071.716290647761,0.10029374721869472,22772.036757765352,0.10511464529987699,24482.453038122585,0.11005328166017525,17522.467055557641,8.9127502825827265E-2,19050.263858104259,9.3659114346628602E-2,20715.13591176139,9.8596553601910469E-2,22184.328426072949,0.10240181142020378,23626.34977316709,0.10620493469912384,17522.467055557641,8.9127502825827265E-2,18970.366291723698,9.3266304285760548E-2,20539.41721543518,9.7760196170562488E-2,21898.896226211433,0.10108426987726843,23216.581887454508,0.10436295013689881,17522.467055557641,8.9127502825827265E-2,18890.468725343137,9.2873494224892494E-2,20365.412847853608,9.6931998323910556E-2,21619.006223320481,9.9792310853584199E-2,22818.690394295947,0.10257435221745909,17522.467055557641,8.9127502825827265E-2,18411.083327059776,9.051663385968424E-2,19357.38754600177,9.2134162522616705E-2,20053.009567549252,9.2563744311065607E-2,20667.928877800332,9.2906270240943681E-2,17522.467055557641,8.9127502825827265E-2,18570.878459820899,9.1302253981420334E-2,19686.538664973799,9.3700802784263681E-2,20553.781476173965,9.4875283771113206E-2,21341.288088139732,9.5933147928345466E-2,17522.467055557641,8.9127502825827265E-2,18650.776026201453,9.1695064042288346E-2,19853.68571757678,9.4496362292131264E-2,20812.046043826831,9.6067420807915582E-2,21693.968433095855,9.7518513139871685E-2,17522.467055557641,8.9127502825827265E-2,18730.673592582018,9.2087874103156414E-2,20022.54709892441,9.5300081384694951E-2,21075.635467392593,9.7284137127920015E-2,22057.611967814493,9.9153159973993044E-2]
["NHS Greater Preston CCG","E38000065",13926.610414216086,8.485626623334197E-2,14929.512536277101,9.0328609246594277E-2,16017.274331925959,9.5762730670369237E-2,16983.815930986071,0.10027049197653838,17960.501837365257,0.10482375299034233,13926.610414216086,8.485626623334197E-2,14805.527071719154,8.9578455177390812E-2,15746.582170846497,9.4144339177606701E-2,16545.979376713232,9.7685555418073167E-2,17332.958361130732,0.10116119038829653,13926.610414216086,8.485626623334197E-2,14743.534339440181,8.9203378142789086E-2,15613.188197237634,9.3346814523721358E-2,16333.335376064126,9.6430129744149995E-2,17032.58903189718,9.9408130220013866E-2,13926.610414216086,8.485626623334197E-2,14681.541607161211,8.8828301108187388E-2,15481.095628249341,9.2557070598166577E-2,16124.820254135704,9.5199080494365942E-2,16740.925372848003,9.7705879379292634E-2,13926.610414216086,8.485626623334197E-2,14309.585213487377,8.6577838900577062E-2,14715.869711351646,8.7982002339780263E-2,14958.169140323485,8.8311306767761749E-2,15164.367480987543,8.8504537650213266E-2,13926.610414216086,8.485626623334197E-2,14433.570678045327,8.7327992969780541E-2,14965.739398501913,8.9475902179253344E-2,15331.238969565986,9.051386804561333E-2,15657.955342298743,9.1385288562499944E-2,13926.610414216086,8.485626623334197E-2,14495.563410324296,8.7703070004382239E-2,15092.626349007909,9.0234523191485769E-2,15523.643368643108,9.1649801444344717E-2,15916.478184966398,9.2894118039957951E-2,13926.610414216086,8.485626623334197E-2,14557.556142603267,8.807814703898395E-2,15220.81470413448,9.1000924932048782E-2,15720.014729628336,9.2809155329013668E-2,16183.037299069774,9.4449850000407204E-2]
["NHS Greenwich CCG","E38000066",17595.54936085283,8.2191467492772924E-2,19931.650900644665,8.6569018852695731E-2,22641.918779882573,9.2310497308718903E-2,25496.310067302777,9.8032567161268749E-2,28416.691896978613,0.10379389253042082,17595.54936085283,8.2191467492772924E-2,19765.786430089218,8.5848620700526485E-2,22259.023428492364,9.0749443201615973E-2,24838.840790403887,9.550461700401372E-2,27423.749841078537,0.10016710439432587,17595.54936085283,8.2191467492772924E-2,19682.854194811498,8.5488421624441882E-2,22070.337017350557,8.9980173749798428E-2,24519.527804817641,9.4276867905327744E-2,26948.485017853713,9.8431167425866439E-2,17595.54936085283,8.2191467492772924E-2,19599.921959533774,8.5128222548357252E-2,21883.491449244269,8.9218409365803442E-2,24206.414874663958,9.3072957838603351E-2,26486.994899295929,9.6745543499510298E-2,17595.54936085283,8.2191467492772924E-2,19102.328547867441,8.2967028091849554E-2,20801.075744352711,8.4805429486108572E-2,22454.534505823362,8.6337029013470318E-2,23992.457558580452,8.7634076844840578E-2,17595.54936085283,8.2191467492772924E-2,19268.193018422891,8.3687426244018814E-2,21154.517607174446,8.6246402508049769E-2,23014.74801123115,8.8491033571328634E-2,24773.445911321305,9.0486689719195365E-2,17595.54936085283,8.2191467492772924E-2,19351.125253700608,8.4047625320103403E-2,21333.999803138613,8.6978146620754287E-2,23303.668568226421,8.9601924670203101E-2,25182.498371615893,9.198078154582473E-2,17595.54936085283,8.2191467492772924E-2,19434.057488978327,8.4407824396188005E-2,21515.322842138299,8.7717395801281392E-2,23598.546041225523,9.0735719937040618E-2,25604.266368257126,9.3521317730503054E-2]
["NHS Guildford and Waverley CCG","E38000067",12272.115924924539,7.1175710039000931E-2,13361.620744991718,7.4796354371874818E-2,14629.799986558384,7.9191295802524528E-2,15879.056414439709,8.2980018888167362E-2,17147.800843764959,8.6938759094326495E-2,12272.115924924539,7.1175710039000931E-2,13250.352940404113,7.4173493844626695E-2,14381.942147479358,7.7849638126444493E-2,15468.358481259813,8.0833813133673757E-2,16546.978916367938,8.3892612636219513E-2,12272.115924924539,7.1175710039000931E-2,13194.71903811031,7.3862063581002627E-2,14259.800664279361,7.718848470433777E-2,15268.894889841013,7.9791465770490233E-2,16259.399671015999,8.2434595776799832E-2,12272.115924924539,7.1175710039000931E-2,13139.085135816509,7.3550633317378572E-2,14138.850805305705,7.6533781559519884E-2,15073.304254986459,7.8769357519787087E-2,15980.155398040559,8.1018836939974442E-2,12272.115924924539,7.1175710039000931E-2,12805.2817220537,7.1682051735634231E-2,13438.175760216924,7.2741018513678257E-2,13978.96620461408,7.3050617708058513E-2,14470.729219436502,7.3366098253074941E-2,12272.115924924539,7.1175710039000931E-2,12916.549526641302,7.230491226288234E-2,13666.967611674483,7.3979471753136739E-2,14328.91187796275,7.4879347188350473E-2,14943.299521580706,7.5762013392723107E-2,12272.115924924539,7.1175710039000931E-2,12972.183428935103,7.2616342526506394E-2,13783.150973742779,7.4608373788799268E-2,14509.390388184287,7.5822483215845976E-2,15190.814153618227,7.7016904043896911E-2,12272.115924924539,7.1175710039000931E-2,13027.817331228904,7.2927772790130449E-2,13900.52596003741,7.5243726101750605E-2,14693.58997432049,7.6785064665136335E-2,15446.022863079783,7.8310803402351359E-2]
["NHS Halton CCG","E38000068",8529.5189736033371,8.4333784591688124E-2,9331.4243825923768,9.1020526556695056E-2,10201.052011755879,9.7786158088150693E-2,10981.798965847836,0.10385661968836617,11649.467536602937,0.10897537452388155,8529.5189736033371,8.4333784591688124E-2,9253.7196750869789,9.0262579741386836E-2,10028.260771994635,9.6129800345040609E-2,10697.810459197677,0.10117089520708983,11240.911369334457,0.10515352076084618,8529.5189736033371,8.4333784591688124E-2,9214.8673213342809,8.9883606333732741E-2,9943.1112427853695,9.531356636105609E-2,10559.885812196129,9.9866519880803209E-2,11045.358795586075,0.10332421698396703,8529.5189736033371,8.4333784591688124E-2,9176.0149675815828,8.9504632926078645E-2,9858.7924406903403,9.4505295635451889E-2,10424.639228710714,9.8587471427186643E-2,10855.473964996103,0.10154793231988871,8529.5189736033371,8.4333784591688124E-2,8942.900845065391,8.7230792480154029E-2,9370.3248975191382,8.9822899707813833E-2,9667.9287522555696,9.1431140081857112E-2,9829.0710556068025,9.1946408377986927E-2,8529.5189736033371,8.4333784591688124E-2,9020.6055525707925,8.7988739295462276E-2,9529.8245034525917,9.1351845316838501E-2,9909.9084194370043,9.3719580285956172E-2,10150.416703302119,9.4952448113209714E-2,8529.5189736033371,8.4333784591688124E-2,9059.4579063234887,8.8367712703116358E-2,9610.8203970906743,9.2128263008921352E-2,10034.705304104573,9.4899804275624874E-2,10318.725522932295,9.652689918552193E-2,8529.5189736033371,8.4333784591688124E-2,9098.3102600761868,8.8746686110770454E-2,9692.6470178429918,9.2912643959384519E-2,10162.075230189603,9.6104361927270704E-2,10492.266280079546,9.8150292610659925E-2]
["NHS Hambleton, Richmondshire and Whitby CCG","E38000069",11204.374871076403,8.8057017220028302E-2,12104.666559341418,9.4671254179113234E-2,13090.308159747769,0.10163282732723423,14006.34046638962,0.1077410805106894,14685.946519007835,0.11243260235038918,11204.374871076403,8.8057017220028302E-2,12004.000136074425,9.3883936618758213E-2,12868.670320040334,9.991203664627589E-2,13644.56510010782,0.10495819307775248,14171.533446485932,0.10849436109696778,11204.374871076403,8.8057017220028302E-2,11953.66692444093,9.3490277838580715E-2,12759.449749992198,9.906405085397671E-2,13468.86172296467,0.10360662863818978,13925.31319977169,0.10660934925563995,11204.374871076403,8.8057017220028302E-2,11903.333712807434,9.3096619058403204E-2,12651.294746481119,9.822433809379752E-2,13296.569953639395,0.10228130733568766,13686.229208500308,0.10477897112616986,11204.374871076403,8.8057017220028302E-2,11601.334443006463,9.0734666377338208E-2,12024.741622692794,9.3359795207242205E-2,12332.590062276848,9.4866077402129614E-2,12393.885299474468,9.4885050524226522E-2,11204.374871076403,8.8057017220028302E-2,11702.000866273453,9.1521983937693202E-2,12229.330397807351,9.4948217374280691E-2,12640.850011807668,9.7237307783135926E-2,12798.491606307816,9.7982633641921724E-2,11204.374871076403,8.8057017220028302E-2,11752.334077906948,9.1915642717870699E-2,12333.223135170208,9.5754838005979892E-2,12799.829821216132,9.8460229393970256E-2,13010.409242057505,9.9605031710744946E-2,11204.374871076403,8.8057017220028302E-2,11802.667289540441,9.2309301498048182E-2,12438.181439070124,9.6569731669799111E-2,12962.087449900597,9.9708364999235369E-2,13228.914410364581,0.10127786258126306]
["NHS Hammersmith and Fulham CCG","E38000070",11266.913693131706,7.5505385961209662E-2,12574.972327025374,8.1296692054728309E-2,13853.772877356951,8.7273358179141683E-2,15146.18357084221,9.2796125296178242E-2,16494.993787448839,9.7730736979789318E-2,11266.913693131706,7.5505385961209662E-2,12469.942762324163,8.0617680128808919E-2,13618.214086729946,8.5789429801750944E-2,14753.54783290637,9.0390563858022133E-2,15915.676272576688,9.4298354500395129E-2,11266.913693131706,7.5505385961209662E-2,12417.42797997356,8.0278174165849231E-2,13502.133432695009,8.5058167019623335E-2,14562.856504606571,8.9222255266551725E-2,15638.389965021528,9.2655468450180897E-2,11266.913693131706,7.5505385961209662E-2,12364.913197622953,7.9938668202889529E-2,13387.185272845778,8.4334038508540876E-2,14375.867803069033,8.8076631559055485E-2,15369.140307367939,9.1060198526886724E-2,11266.913693131706,7.5505385961209662E-2,12049.824503519321,7.7901632425131373E-2,12721.278691650217,8.0139087133994064E-2,13329.657941158119,8.1666817431430713E-2,13913.738993271014,8.2437131136811337E-2,11266.913693131706,7.5505385961209662E-2,12154.854068220533,7.8580644351050763E-2,12938.717575305913,8.1508867174662422E-2,13664.213259293914,8.371653755234601E-2,14369.395221109804,8.513683624309637E-2,11266.913693131706,7.5505385961209662E-2,12207.368850571134,7.8920150314010437E-2,13049.13575841232,8.220445860156432E-2,13836.75445640619,8.4773645732178604E-2,14608.050894260232,8.6550840705416729E-2,11266.913693131706,7.5505385961209662E-2,12259.883632921745,7.9259656276970167E-2,13160.686435704432,8.2907184299511355E-2,14012.853079231218,8.5852549192692196E-2,14854.125261052281,8.8008799982535149E-2]
["NHS Hardwick CCG","E38000071",8264.498131321292,9.0738890330712474E-2,8972.4183093249758,9.6685542126346724E-2,9725.3283662850172,0.1026094995387742,10436.271890206417,0.10819274196772152,11048.949500162136,0.11299805175048205,8264.498131321292,9.0738890330712474E-2,8897.8320536344945,9.5881810922785499E-2,9560.7114524133485,0.10087266778237339,10166.769069601452,0.10539880851753529,10662.047922352078,0.10904119372419796,8264.498131321292,9.0738890330712474E-2,8860.5389257892548,9.54799453210049E-2,9479.5901366833205,0.10001677713318551,10035.879683138883,0.10404187936075973,10476.860167547364,0.10714727109375498,8264.498131321292,9.0738890330712474E-2,8823.2457979440151,9.5078079719224301E-2,9399.2602484238305,9.9169236636672625E-2,9907.5317575258014,0.10271129750700604,10297.039750079093,0.1053082404385262,8264.498131321292,9.0738890330712474E-2,8599.4870308725694,9.2666886108540625E-2,8933.9008957481674,9.4259346863770507E-2,9189.4195698476833,9.5266634561970612E-2,9325.0389900205846,9.5367549499085533E-2,8264.498131321292,9.0738890330712474E-2,8674.0732865630525,9.3470617312101864E-2,9085.854970091239,9.5862576177371178E-2,9419.0563379116211,9.7647276984362666E-2,9629.3524432893264,9.8479775447835191E-2,8264.498131321292,9.0738890330712474E-2,8711.3664144082923,9.3872482913882463E-2,9163.019148468582,9.6676716063184037E-2,9537.4875829551202,9.8875052694952531E-2,9788.7404371351513,0.10010984288336214,8264.498131321292,9.0738890330712474E-2,8748.6595422535302,9.4274348515663034E-2,9240.9747543164631,9.7499206101671926E-2,9658.3606237167587,0.10012814248099482,9953.0830615618725,0.10179058152548447]
["NHS Haringey CCG","E38000072",19742.711869960647,9.0347390948016873E-2,22419.338926107939,9.5981415044558357E-2,25528.239751762976,0.10353763689066749,28735.174184296869,0.11120423445935321,32082.849884691022,0.11871105559346934,19742.711869960647,9.0347390948016873E-2,22232.497221216865,9.5181510494121366E-2,25095.781881069357,0.10178367083496657,27993.457755855568,0.10833381484464229,30961.782079226377,0.11456294708512683,19742.711869960647,9.0347390948016873E-2,22139.07636877133,9.478155821890287E-2,24882.671632290061,0.10091933660078707,27633.228471316103,0.10693973866608399,30425.190755270185,0.11257748373888177,19742.711869960647,9.0347390948016873E-2,22045.655516325791,9.438160594368436E-2,24671.640507889089,0.10006343489572149,27279.993708244278,0.1055727310690568,29904.151575409665,0.11064956551250524,19742.711869960647,9.0347390948016873E-2,21485.130401652576,9.1981892292373399E-2,23449.115373428303,9.510510777672089E-2,25303.629951200277,9.7924264517028931E-2,27087.727912429131,0.10022840195526209,19742.711869960647,9.0347390948016873E-2,21671.972106543642,9.2781796842810363E-2,23848.307254068557,9.672415336659862E-2,25935.628395835676,0.10037007893125262,27969.492254565877,0.10349105400194582,19742.711869960647,9.0347390948016873E-2,21765.392958989181,9.3181749118028873E-2,24051.021880956192,9.754632495520843E-2,26261.570810435773,0.10163146598465857,28431.32740522498,0.10519990899587427,19742.711869960647,9.0347390948016873E-2,21858.813811434717,9.3581701393247368E-2,24255.815632222158,9.8376929072932176E-2,26594.233451543987,0.10291886010659437,28907.518860305609,0.10696188433473547]
["NHS Harrogate and Rural District CCG","E38000073",10663.714287016015,8.2895788922699123E-2,11674.28664205978,8.9802204938921382E-2,12857.771714510125,9.7113079414729048E-2,13864.746355846657,0.10351460621059173,14747.197660020662,0.10909304379361341,10663.714287016015,8.2895788922699123E-2,11576.824410362035,8.9052495464323339E-2,12639.326614263853,9.5463191950633325E-2,13505.353090385819,0.10083136546502777,14228.870846809614,0.10525869837852947,10663.714287016015,8.2895788922699123E-2,11528.093294513161,8.8677640727024304E-2,12531.679389382876,9.4650146445489997E-2,13330.806627720402,9.9528196414218312E-2,13980.777315279087,0.10342341555909962,10663.714287016015,8.2895788922699123E-2,11479.362178664293,8.830278598972531E-2,12425.082381330012,9.3845033091616403E-2,13159.649309226794,9.8250330813997269E-2,13739.874333016327,0.10164132514437289,10663.714287016015,8.2895788922699123E-2,11186.97548357105,8.6053657565931141E-2,11807.554886403042,8.9180928145038085E-2,12202.016719268991,9.1100617584507923E-2,12437.698055391596,9.2008418814851278E-2,10663.714287016015,8.2895788922699123E-2,11284.437715268796,8.6803367040529184E-2,12009.196517399601,9.0703901188818742E-2,12508.246938897544,9.3386941458097242E-2,12845.382674676017,9.502428373040403E-2,10663.714287016015,8.2895788922699123E-2,11333.168831117666,8.7178221777828191E-2,12111.592658140042,9.1477285937613603E-2,12666.179949740363,9.4566073986414534E-2,13058.912615240815,9.6603880864335079E-2,10663.714287016015,8.2895788922699123E-2,11381.89994696654,8.7553076515127212E-2,12215.039015708591,9.2258602837678186E-2,12827.369197140422,9.5769517673140375E-2,13279.080207412435,9.823258031818638E-2]
["NHS Harrow CCG","E38000074",21408.159355296139,0.10802381347914088,23740.426081843558,0.11434556440537308,26287.512401201442,0.1209065973746732,28996.311070949123,0.12742270641127226,31813.505978683832,0.13398545307734092,21408.159355296139,0.10802381347914088,23542.40223320447,0.11339178418844269,25841.578320398439,0.11885557133841616,28246.590834114508,0.12412810174949246,30699.336556398415,0.12929302794979117,21408.159355296139,0.10802381347914088,23443.390308884937,0.11291489407997754,25621.827150771966,0.11784484937343376,27882.474341390687,0.1225280116953361,30166.047095670518,0.12704703123176597,21408.159355296139,0.10802381347914088,23344.3783845654,0.11243800397151238,25404.219894995491,0.11684398811054868,27525.427847510335,0.12095899036522381,29648.21408041177,0.124866130729497,21408.159355296139,0.10802381347914088,22750.306838648172,0.10957666332072137,24143.598551186999,0.1110458952772836,25527.737291948335,0.11218024825078367,26849.121010217477,0.11307749751607764,21408.159355296139,0.10802381347914088,22948.330687287249,0.11053044353765172,24555.230010389769,0.1129391500799824,26166.555586140468,0.11498750037853957,27725.459500076435,0.11676827619641354,21408.159355296139,0.10802381347914088,23047.342611606786,0.11100733364611688,24764.261610766174,0.11390056853447787,26496.015221788501,0.11643529276581339,28184.452792447082,0.1187013678927185,21408.159355296139,0.10802381347914088,23146.354535926319,0.11148422375458202,24975.437124992604,0.11487184769107077,26832.267601423388,0.11791293549579621,28657.714049097416,0.12069455040893452]
["NHS Hartlepool and Stockton-On-Tees CCG","E38000075",19243.212055934724,8.2916287728088262E-2,20873.738511868516,8.8403093816146514E-2,22653.555558547843,9.3889073104061027E-2,24384.996459016962,9.9061571575467022E-2,26084.959735466549,0.10400701648910107,19243.212055934724,8.2916287728088262E-2,20699.903595554981,8.7666879533944517E-2,22269.582502266345,9.2297672837642342E-2,23754.351414971188,9.6499640132317141E-2,25170.087581248787,0.10035920088217219,19243.212055934724,8.2916287728088262E-2,20612.986137398217,8.7298772392843546E-2,22080.365010589165,9.1513449148661982E-2,23448.066149735296,9.5255387348615925E-2,24732.19037459508,9.8613199260745937E-2,19243.212055934724,8.2916287728088262E-2,20526.068679241445,8.693066525174252E-2,21892.993543221033,9.0736876422500973E-2,23147.727982514076,9.4035294046612261E-2,24306.984838777134,9.6917802387468638E-2,19243.212055934724,8.2916287728088262E-2,20004.563930300832,8.4722022405136502E-2,20807.531249502183,8.6238110284740474E-2,21467.322964074981,8.7208819321071579E-2,22008.580075763763,8.7753509074018188E-2,19243.212055934724,8.2916287728088262E-2,20178.398846614371,8.5458236687338512E-2,21161.967916838945,8.7707095146050004E-2,22004.680196125944,8.9391778502299096E-2,22728.163350986535,9.0622660889101023E-2,19243.212055934724,8.2916287728088262E-2,20265.316304771139,8.5826343828439511E-2,21341.9552869709,8.8453064020933767E-2,22281.813020113452,9.051760245414954E-2,23105.054130578457,9.2125415193694007E-2,19243.212055934724,8.2916287728088262E-2,20352.233762927906,8.6194450969540509E-2,21523.788681411901,8.9206683858636851E-2,22564.659722585646,9.1666638457042759E-2,23493.660689616288,9.3674883132441336E-2]
["NHS Hastings and Rother CCG","E38000076",15385.819608385835,0.10066618429982879,16881.249882525721,0.10741441767959863,18711.311596201769,0.11476515944677239,20576.556604195743,0.12120968781924921,22419.642250008899,0.12748574007738483,15385.819608385835,0.10066618429982879,16740.487839502322,0.10651875693244033,18393.890735557463,0.11281826996784508,20044.255228299018,0.11807407650977275,21633.45963576336,0.12301523732379939,15385.819608385835,0.10066618429982879,16670.106817990621,0.10607092655886118,18237.469397980345,0.11185886529673911,19785.732514704006,0.11655120472846377,21257.158784206473,0.12087546220974908,15385.819608385835,0.10066618429982879,16599.725796478921,0.10562309618528201,18082.574122233244,0.11090882067120487,19532.229500360889,0.11505790233483089,20891.764342808423,0.11879770466739692,15385.819608385835,0.10066618429982879,16177.439667408704,0.10293611394380697,17185.249766181081,0.10540511387500663,18113.869185276955,0.10670281094060413,18916.662295107304,0.10756660010865066,15385.819608385835,0.10066618429982879,16318.201710432111,0.10383177469096533,17478.253637545051,0.10720224262478564,18567.43018075197,0.10937458871790748,19535.026137392688,0.11108282803020976,15385.819608385835,0.10066618429982879,16388.582731943803,0.10427960506454444,17627.044665972066,0.10811484706803279,18801.346525465186,0.11075251252041228,19858.901967494832,0.11292449657394991,15385.819608385835,0.10066618429982879,16458.963753455511,0.10472743543812364,17777.361756229104,0.10903681155685171,19040.08571847924,0.11215884612676275,20192.845589113254,0.11482341401747558]
["NHS Havering CCG","E38000077",17292.003967446672,8.6124135707972269E-2,18705.744039823163,8.8998687029323259E-2,20598.407552039891,9.2953102671660154E-2,22665.988687462082,9.6426396185918833E-2,24962.742987238656,0.10038905729606153,17292.003967446672,8.6124135707972269E-2,18549.179390546851,8.8253779572494293E-2,20247.826383443295,9.1371057687018475E-2,22077.645918797116,9.3923448986629438E-2,24084.44978294762,9.685695239663647E-2,17292.003967446672,8.6124135707972269E-2,18470.897065908695,8.7881325844079816E-2,20075.064028726225,9.0591444172952285E-2,21791.90559204511,9.2707843070046411E-2,23664.060836788452,9.5166334902229768E-2,17292.003967446672,8.6124135707972269E-2,18392.61474127054,8.7508872115665326E-2,19903.987160396635,8.9819436644389142E-2,21511.713445120266,9.1515840402962081E-2,23255.856115708993,9.3524716945664749E-2,17292.003967446672,8.6124135707972269E-2,17922.920793441608,8.5274149745178454E-2,18912.921164556261,8.5347117168575182E-2,19944.026280428607,8.4846533993144763E-2,21049.347507092749,8.4651120031741134E-2,17292.003967446672,8.6124135707972269E-2,18079.48544271792,8.6019057202007421E-2,19236.534550953114,8.6807466385167481E-2,20445.338777295012,8.6979234141474571E-2,21740.159985793693,8.7429260780960735E-2,17292.003967446672,8.6124135707972269E-2,18157.767767356072,8.6391510930421883E-2,19400.869473732771,8.7549049971718279E-2,20703.882144109954,8.8079137854632658E-2,22101.981699297001,8.8884346896553543E-2,17292.003967446672,8.6124135707972269E-2,18236.050091994224,8.6763964658836346E-2,19566.889882899915,8.8298239543772181E-2,20967.756115072563,8.9201719199662063E-2,22475.050765146611,9.0384664864258876E-2]
["NHS Herefordshire CCG","E38000078",14662.70282371702,9.3775280274475681E-2,16084.026304653396,0.10012466574111925,17684.542090948587,0.10699747150864344,19145.110862441994,0.1128173887003064,20455.319082510821,0.11802053474792767,14662.70282371702,9.3775280274475681E-2,15950.230657071981,9.929177450866522E-2,17385.152355849477,0.10518606217237099,18650.654992643143,0.10990368292659486,19739.091985075636,0.11388813746293353,14662.70282371702,9.3775280274475681E-2,15883.33283328128,9.8875328892438247E-2,17237.616548889589,0.10429342055233294,18410.512699195115,0.10848858396697182,19396.274856091404,0.1119101941846954,14662.70282371702,9.3775280274475681E-2,15816.435009490575,9.8458883276211245E-2,17091.520115656127,0.10340948763102691,18175.033214960265,0.1071009617852697,19063.393671186772,0.10998957807054452,14662.70282371702,9.3775280274475681E-2,15415.04806674634,9.5960209578849223E-2,16245.168364510571,9.8288772776564448E-2,16857.51532934227,9.9337155741557298E-2,17264.038685296102,9.9607885329425952E-2,14662.70282371702,9.3775280274475681E-2,15548.84371432775,9.6793100811303226E-2,16521.528119986673,9.9960842933123628E-2,17278.829093836353,0.10181985323415649,17827.379735955117,0.10285817987511608,14662.70282371702,9.3775280274475681E-2,15615.741538118456,9.7209546427530227E-2,16661.867058314379,0.10080994105950132,17496.114479376636,0.10310026210593187,18122.436687762787,0.10456056247266785,14662.70282371702,9.3775280274475681E-2,15682.639361909163,9.7625992043757243E-2,16803.645370368522,0.1016677478846111,17717.879818866844,0.10440707023492544,18426.665586347983,0.10631586421848596]
["NHS Herts Valleys CCG","E38000079",36641.162744308509,7.8632479386043397E-2,40415.712328594076,8.2846245343953087E-2,44825.777793297922,8.7376277325051516E-2,49436.95257830753,9.1996264427979327E-2,54239.931439073967,9.6598275047326751E-2,36641.162744308509,7.8632479386043397E-2,40078.722639628599,8.2155466217670961E-2,44065.061813266482,8.5893457980715154E-2,48156.51224618221,8.9613517894566619E-2,52335.955565307537,9.3207400828686615E-2,36641.162744308509,7.8632479386043397E-2,39910.227795145845,8.1810076654529856E-2,43690.189755799067,8.5162741717280166E-2,47534.641020131203,8.8456289813783923E-2,51424.630728482429,9.1584382419380994E-2,36641.162744308509,7.8632479386043397E-2,39741.732950663121,8.1464687091388821E-2,43318.974986697191,8.4439154393000648E-2,46924.844580410441,8.7321531468254193E-2,50539.719019390657,9.0008404308799028E-2,36641.162744308509,7.8632479386043397E-2,38730.763883766682,7.9392349712542401E-2,41168.489427762164,8.0247338169588261E-2,43513.007160565423,8.0972509510151891E-2,45756.419848296151,8.1489616826885394E-2,36641.162744308509,7.8632479386043397E-2,39067.753572732159,8.0083128838824527E-2,41870.688793945032,8.1616094487437202E-2,44604.039079667185,8.3002789608223576E-2,47253.972472314323,8.4156674037959608E-2,36641.162744308509,7.8632479386043397E-2,39236.248417214891,8.042851840196559E-2,42227.274409584767,8.2311166055094878E-2,45166.720176648319,8.4049871927962191E-2,48038.334470960588,8.5553578755050028E-2,36641.162744308509,7.8632479386043397E-2,39404.743261697629,8.0773907965106653E-2,42587.517313590048,8.3013366561908025E-2,45741.002538927147,8.5118542816865428E-2,48847.078631971825,8.6993906735479645E-2]
["NHS Heywood, Middleton and Rochdale CCG","E38000080",16075.718604146834,9.5666023590495336E-2,17312.50842738877,0.10180235462418423,18702.612207147642,0.10807010405147141,20065.459163300122,0.11381428907146977,21402.449222361938,0.11936669951122107,16075.718604146834,9.5666023590495336E-2,17168.474468984485,0.10095539497227146,18385.970911743152,0.10624044211107796,19547.379730799374,0.11087566495064874,20653.317936137832,0.11518861090985963,16075.718604146834,9.5666023590495336E-2,17096.45748978234,0.10053191514631507,18229.933734921233,0.10533880581833603,19295.764185898282,0.10944846390186207,20294.751445571812,0.11318879780017742,16075.718604146834,9.5666023590495336E-2,17024.440510580203,0.10010843532035872,18075.418872019523,0.10444596597723058,19049.034224723819,0.10804897461556336,19946.577366288278,0.11124694571270652,16075.718604146834,9.5666023590495336E-2,16592.338635367356,9.7567556364620459E-2,17180.298286933768,9.9273652414964567E-2,17668.569434674442,0.10021877160904391,18064.558213730281,0.10075046410334791,16075.718604146834,9.5666023590495336E-2,16736.372593771637,9.8414516016533213E-2,17472.582559614839,0.10096257112917392,18110.012259698738,0.10272270141632864,18653.779715366105,0.10403669668358118,16075.718604146834,9.5666023590495336E-2,16808.389572973778,9.8837995842489576E-2,17621.008166835687,0.10182022516373332,18337.678864763431,0.10401406049213517,18962.391878475511,0.10575790227816793,16075.718604146834,9.5666023590495336E-2,16880.406552175922,9.9261475668445967E-2,17770.956087976752,0.10268667564992923,18570.03946203606,0.10533204459464583,19280.597356765582,0.10753261214035462]
["NHS High Weald Lewes Havens CCG","E38000081",12123.111951821891,8.5833417953992436E-2,13463.806708193822,9.0983962077266001E-2,14946.213688270265,9.6501896231083836E-2,16482.468466188933,0.10179390110047515,17928.276404815817,0.10653836703598656,12123.111951821891,8.5833417953992436E-2,13351.486640261224,9.0224940128809467E-2,14692.508277008468,9.486381893729641E-2,16055.631690777787,9.9157804414388526E-2,17299.189847691145,0.10280003474976911,12123.111951821891,8.5833417953992436E-2,13295.326606294921,8.9845429154581158E-2,14567.485177708786,9.405659334780983E-2,15848.329950752146,9.7877531810475232E-2,16998.081933499758,0.10101070794806132,12123.111951821891,8.5833417953992436E-2,13239.166572328626,8.9465918180352932E-2,14443.681815963244,9.3257243129927975E-2,15645.053359522335,9.662211808005397E-2,16705.701096062665,9.9273241597710157E-2,12123.111951821891,8.5833417953992436E-2,12902.206368530826,8.7188852334983274E-2,13726.476134127004,8.862652462633655E-2,14507.712051242443,8.9598024031882689E-2,15125.266570236154,8.9881546055598727E-2,12123.111951821891,8.5833417953992436E-2,13014.526436463424,8.7947874283439822E-2,13960.665744522512,9.0138595974448038E-2,14871.40923769943,9.1844177604369026E-2,15620.068125937063,9.2821892832998951E-2,12123.111951821891,8.5833417953992436E-2,13070.686470429724,8.832738525766809E-2,14079.590156051479,9.0906444705910888E-2,15058.979856176897,9.300259298528224E-2,15879.226656287394,9.4361936393435902E-2,12123.111951821891,8.5833417953992436E-2,13126.846504396022,8.8706896231896357E-2,14199.734305134589,9.168216880897849E-2,15250.417774477803,9.4184892381903446E-2,16146.441218643591,9.5949852737363867E-2]
["NHS Hillingdon CCG","E38000082",20546.835935324645,8.7440786174672935E-2,23024.014854730551,9.1292683801469252E-2,25937.100718994818,9.6564038417702225E-2,28960.484421751269,0.10142356385007799,31974.811963046101,0.10662535668616147,20546.835935324645,8.7440786174672935E-2,22832.729176238867,9.0534215607608493E-2,25498.870519565116,9.4932503795849277E-2,28214.351856512178,9.8810505906395521E-2,30858.850306672997,0.10290399595395824,20546.835935324645,8.7440786174672935E-2,22737.086336993034,9.0154981510678148E-2,25282.915733788461,9.4128502359599631E-2,27851.977787607568,9.7541422524366345E-2,30324.703005538613,0.10112279246878289,20546.835935324645,8.7440786174672935E-2,22641.443497747201,8.9775747413747803E-2,25069.067823970603,9.3332344839801198E-2,27496.63988514763,9.6296980756278031E-2,29806.037012850124,9.9393213995098456E-2,20546.835935324645,8.7440786174672935E-2,22067.586462272182,8.7500342832165651E-2,23830.224760198184,8.8720121966486168E-2,25508.508972383959,8.933427531128374E-2,27002.441368886823,9.004415555851282E-2,20546.835935324645,8.7440786174672935E-2,22258.872140763859,8.8258811026026382E-2,24234.744944287133,9.0226153925119637E-2,26144.27029927526,9.1560798134325355E-2,27880.189522018227,9.2971153534808018E-2,20546.835935324645,8.7440786174672935E-2,22354.514980009688,8.8638045122956713E-2,24440.165350269814,9.0990935779113227E-2,26472.153356196181,9.2709089291154234E-2,28339.921143235591,9.4504205492982496E-2,20546.835935324645,8.7440786174672935E-2,22450.157819255524,8.9017279219887072E-2,24647.692632211281,9.1763561549558004E-2,26806.796651465906,9.3881055724122378E-2,28813.94367993866,9.6084912898288188E-2]
["NHS Horsham and Mid Sussex CCG","E38000083",14131.743984265351,7.6157275190048238E-2,15689.773440697003,8.1564636310547958E-2,17486.576711644448,8.7162679252539357E-2,19171.505807606954,9.2055631458786882E-2,20894.564174313673,9.685067291329226E-2,14131.743984265351,7.6157275190048238E-2,15559.052879121096,8.0885074231238821E-2,17189.984214131589,8.5684299741459413E-2,18675.566639930599,8.9674285220064348E-2,20161.779271747197,9.3454061702731045E-2,14131.743984265351,7.6157275190048238E-2,15493.692598333148,8.0545293191584266E-2,17043.826853578375,8.4955771376624328E-2,18434.703953468903,8.8517737220152243E-2,19811.036864261612,9.1828297322061797E-2,14131.743984265351,7.6157275190048238E-2,15428.332317545199,8.0205512151929725E-2,16899.095418493976,8.4234350605592534E-2,18198.518063990439,8.7383645750458289E-2,19470.4601009416,9.0249652827206817E-2,14131.743984265351,7.6157275190048238E-2,15036.170632817491,7.8166825914002355E-2,16060.65124283261,8.00550854492703E-2,16877.047810521904,8.1038354991462141E-2,17629.507457932003,8.1716452479521653E-2,14131.743984265351,7.6157275190048238E-2,15166.891194393393,7.8846387993311479E-2,16334.428932844479,8.1419743459497942E-2,17299.625456892623,8.3067441932644898E-2,18205.871879771294,8.438802206253497E-2,14131.743984265351,7.6157275190048238E-2,15232.251475181347,7.9186169032966047E-2,16473.45666605364,8.2112733855316714E-2,17517.562667946309,8.4113908902075832E-2,18507.749985830396,8.5787290191111504E-2,14131.743984265351,7.6157275190048238E-2,15297.611755969298,7.9525950072620602E-2,16613.910324731605,8.2812831844938706E-2,17739.99327217996,8.5181951753481047E-2,18819.012076591818,8.7230055050485852E-2]
["NHS Hounslow CCG","E38000084",20413.357607842598,9.5514493766809844E-2,23232.888387885181,0.10179148434930416,26204.619831160639,0.10863369468186981,29413.520266779953,0.11570104738722348,32618.753146370727,0.12263611228803191,20413.357607842598,9.5514493766809844E-2,23040.021011653731,0.10094646429921894,25762.330295764987,0.10680014217629129,28657.057452827259,0.11272542464332963,31482.947699398501,0.11836584592600384,20413.357607842598,9.5514493766809844E-2,22943.587323538017,0.10052395427417637,25544.375116062802,0.10589658865791725,28289.666293885919,0.11128025447992258,30939.302305626006,0.11632191257096776,20413.357607842598,9.5514493766809844E-2,22847.153635422295,0.10010144424913378,25328.546328357712,0.10500185029582003,27929.408717522456,0.10986314498278049,30411.413505602683,0.11433721898489617,20413.357607842598,9.5514493766809844E-2,22268.551506727956,9.7566384098878176E-2,24078.227834066147,9.9818538405049936E-2,25913.752016767685,0.10193435613550345,27557.96492577398,0.10360916206396714,20413.357607842598,9.5514493766809844E-2,22461.418882959406,9.8411404148963391E-2,24486.495097508294,0.10151104841019937,26558.315496165447,0.10446981156543721,28451.321008129493,0.10696789611297651,20413.357607842598,9.5514493766809844E-2,22557.85257107512,9.8833914174005957E-2,24693.818317225006,0.10237052614718931,26890.738113058367,0.10577742944323172,28919.227478340232,0.10872707526257701,20413.357607842598,9.5514493766809844E-2,22654.286259190852,9.9256424199048593E-2,24903.267928938814,0.10323881904045606,27230.014564192777,0.10711200756900628,29401.678982027854,0.11054093910078898]
["NHS Hull CCG","E38000085",16470.750713359957,7.9186301506538256E-2,17509.474073742396,8.3769371704824416E-2,18798.952261501807,8.9001762434910564E-2,20087.565738916652,9.350882477849666E-2,21259.679329297429,9.7826612043518446E-2,16470.750713359957,7.9186301506538256E-2,17364.095836871886,8.3073848611960044E-2,18481.467871467492,8.7498664290632966E-2,19569.951662053598,9.1099300167831659E-2,20517.231740484596,9.4410232562509647E-2,16470.750713359957,7.9186301506538256E-2,17291.406718436629,8.2726087065527851E-2,18325.015227340013,8.6757954868573128E-2,19318.56212634145,8.9929066783080949E-2,20161.864355294158,9.2775006236398658E-2,16470.750713359957,7.9186301506538256E-2,17218.717600001379,8.2378325519095685E-2,18170.088950472305,8.60244718798992E-2,19072.053785967222,8.8781555655745373E-2,19816.796661013057,9.1187174033743129E-2,16470.750713359957,7.9186301506538256E-2,16782.582889389854,8.029175624050261E-2,17272.585001721465,8.1775329048960649E-2,17692.828973867905,8.2361181332594291E-2,17951.568752886102,8.2604310477112558E-2,16470.750713359957,7.9186301506538256E-2,16927.961126260365,8.0987279333366982E-2,17565.647515599285,8.3162804259063E-2,18133.875280724413,8.4414278375963187E-2,18535.53326112494,8.5291428589752166E-2,16470.750713359957,7.9186301506538256E-2,17000.650244695611,8.133504087979912E-2,17714.468323427871,8.3867381514193137E-2,18361.337388309512,8.5473128145933858E-2,18841.392007905873,8.6698840456036597E-2,16470.750713359957,7.9186301506538256E-2,17073.339363130868,8.1682802426231327E-2,17864.815498516236,8.4579185202709212E-2,18593.489271807506,8.6553809104401386E-2,19156.758478974356,8.8150002204004957E-2]
["NHS Ipswich and East Suffolk CCG","E38000086",29147.383578032157,8.9064913457288258E-2,32070.12621081977,9.5851892554306192E-2,35447.496512745987,0.10304504800216857,38659.879965964428,0.10931987322125448,41624.571967698677,0.11495325039408638,29147.383578032157,8.9064913457288258E-2,31803.158264780835,9.5053972935563488E-2,34846.89769244763,0.10129912119897568,37660.208312268158,0.1064930672782156,40165.068083608778,0.11092258515219215,29147.383578032157,8.9064913457288258E-2,31669.674291761363,9.4655013126192108E-2,34550.92952379099,0.10043874861567148,37174.69795982504,0.10512017294374236,39466.486679642367,0.10899333521027994,29147.383578032157,8.9064913457288258E-2,31536.190318741908,9.4256053316820798E-2,34257.848849462709,9.9586769911228806E-2,36698.614693764583,0.10377393590590597,38788.152413808857,0.10712000114280269,29147.383578032157,8.9064913457288258E-2,30735.286480625131,9.1862294460592755E-2,32560.002184388504,9.4651169140664251E-2,34034.908256168921,9.6241681529716447E-2,35121.486351929445,9.6993886638855137E-2,29147.383578032157,8.9064913457288258E-2,31002.254426664047,9.2660214079335404E-2,33114.401095433153,9.6262793882073122E-2,34886.704045039107,9.8650333800020112E-2,36269.444107854099,0.10016416489327284,29147.383578032157,8.9064913457288258E-2,31135.738399683509,9.3059173888706742E-2,33395.931792448006,9.7081197071069783E-2,35326.003189724055,9.9892555111763551E-2,36870.701402828185,0.10182463795312947,29147.383578032157,8.9064913457288258E-2,31269.222372702974,9.3458133698078094E-2,33680.349983791217,9.7907994138927951E-2,35774.359731129611,0.10116038833596204,37490.648987508459,0.10353672738886623]
["NHS Isle of Wight CCG","E38000087",11969.976225293387,0.10235998140322719,13161.511833110853,0.10971583722166432,14431.746076931659,0.11756065556314482,15669.476033416604,0.12388896294605159,16826.156484806968,0.12965138299281068,11969.976225293387,0.10235998140322719,13051.901980309973,0.1088021172083192,14187.311457546404,0.11556949704746175,15264.656726483669,0.12068830428908657,16236.884506332801,0.12511083762007089,11969.976225293387,0.10235998140322719,12997.097053909538,0.10834525720164669,14066.856897512809,0.1145882771058391,15068.048206418038,0.11913384097420968,15954.833563866663,0.12293753709251551,11969.976225293387,0.10235998140322719,12942.292127509101,0.10788839719497416,13947.577503918561,0.11361663004169567,14875.257206396833,0.11760956045538294,15680.957365761311,0.12082722581107498,11969.976225293387,0.10235998140322719,12613.462569106478,0.10514723715493894,13256.579637579487,0.10798777808389938,13796.583233844742,0.10908114511262447,14200.547763401759,0.10942015536601755,11969.976225293387,0.10235998140322719,12723.072421907351,0.10606095716828401,13482.211593935102,0.10982577055991449,14141.519873414189,0.11180834814527349,14664.033572115661,0.11299147458865512,11969.976225293387,0.10235998140322719,12777.877348307786,0.10651781717495652,13596.790321771939,0.11075912611414092,14319.415059928724,0.11321485657755159,14906.790086602317,0.11486199789337585,11969.976225293387,0.10235998140322719,12832.682274708222,0.10697467718162905,13712.544216048133,0.11170205454584663,14500.978059819274,0.11465036416681906,15157.092770793266,0.11679066705804643]
["NHS Islington CCG","E38000088",13939.840034740058,7.2975814232750805E-2,15845.427375606565,7.643717981479288E-2,17949.619654071092,8.2217019302267727E-2,20148.282494594543,8.8145430460208868E-2,22528.528697741222,9.3790710648381445E-2,13939.840034740058,7.2975814232750805E-2,15713.925998957098,7.5802826816001423E-2,17647.022591332952,8.0830993914130414E-2,19630.833677090806,8.5881676774393234E-2,21745.391406912713,9.0530355565831444E-2,13939.840034740058,7.2975814232750805E-2,15648.17531063237,7.5485650316605729E-2,17497.906250320179,8.0147976595457027E-2,19379.524402862015,8.4782239928523989E-2,21370.548178272344,8.8969809235105515E-2,13939.840034740058,7.2975814232750805E-2,15582.424622307637,7.5168473817210008E-2,17350.244702878248,7.9471622860380398E-2,19133.094765545175,8.3704150693609133E-2,21006.569113185964,8.7454492561140559E-2,13939.840034740058,7.2975814232750805E-2,15187.920492359255,7.3265414820835761E-2,16494.826083214666,7.5553435705453767E-2,17754.310300451474,7.7672194857168059E-2,19039.117736471322,7.9263604231770701E-2,13939.840034740058,7.2975814232750805E-2,15319.421869008718,7.3899767819627191E-2,16774.146448819105,7.6832843756042074E-2,18195.215793846059,7.9601084057424359E-2,19655.086310971539,8.1828002959914811E-2,13939.840034740058,7.2975814232750805E-2,15385.172557333444,7.4216944319022871E-2,16915.988821977608,7.7482543156731434E-2,18422.605279290743,8.0595875751556315E-2,19977.707589482561,8.3171139007004832E-2,13939.840034740058,7.2975814232750805E-2,15450.923245658176,7.4534120818418592E-2,17059.285988706961,7.8138906141017594E-2,18654.683043337103,8.1611177895428752E-2,20310.357661342365,8.4556026899843317E-2]
["NHS Kernow CCG","E38000089",44778.704613748647,9.7582602453252787E-2,49150.864239709299,0.1035758086561919,54122.451542255927,0.11006314626073925,58729.4861929166,0.1151377944497267,62940.411643989988,0.11982715539730798,44778.704613748647,9.7582602453252787E-2,48741.352681093238,0.10271284334533073,53204.567292012667,0.10819654144875882,57209.682663058891,0.11215825490718884,60732.374618735499,0.11562345242115428,44778.704613748647,9.7582602453252787E-2,48536.596901785233,0.10228136068990019,52752.244524464906,0.10727670013516269,56471.559955770739,0.11071118247288804,59675.513022184205,0.11361137916876253,44778.704613748647,9.7582602453252787E-2,48331.841122477214,0.10184987803446963,52304.334661966393,0.10636583288316262,55747.769273510661,0.10929220764097917,58649.282677211078,0.11165762227698869,44778.704613748647,9.7582602453252787E-2,47103.30644662906,9.9260982101886178E-2,49709.546493009475,0.10108908466467945,51698.129142779697,0.10135298216511075,53102.100163940668,0.10109679047317646,44778.704613748647,9.7582602453252787E-2,47512.818005245113,0.10012394741274733,50556.824262464805,0.10281210449112295,52993.116593765444,0.1038917750034611,54838.80895666188,0.10440316977622868,44778.704613748647,9.7582602453252787E-2,47717.573784553133,0.1005554300681779,50987.082504766331,0.10368707549673878,53660.984276406089,0.10520111409270327,55748.432002875954,0.10613492746996907,44778.704613748647,9.7582602453252787E-2,47922.329563861145,0.10098691272360845,51421.753652117113,0.10457102056395068,54342.621943877639,0.10653744891757691,56686.330994179196,0.10792051744693903]
["NHS Kingston CCG","E38000090",9222.4220302126123,6.6233999067887184E-2,10446.77852368709,6.9803411223353526E-2,11890.939377601124,7.4541997101310958E-2,13293.066950433664,7.8741067115470104E-2,14688.884242425258,8.3147765438838783E-2,9222.4220302126123,6.6233999067887184E-2,10359.881279546904,6.9222780165354159E-2,11689.653535847239,7.3280175124418506E-2,12949.737008081102,7.6707362919565814E-2,14174.765213170891,8.0237547906548704E-2,9222.4220302126123,6.6233999067887184E-2,10316.432657476813,6.8932464636354496E-2,11590.462195559865,7.265836381369023E-2,12782.99201666364,7.5719654168129605E-2,13928.685708225743,7.8844592484013043E-2,9222.4220302126123,6.6233999067887184E-2,10272.984035406722,6.8642149107354819E-2,11492.238575665544,7.2042618954773971E-2,12619.484689345534,7.4751123618916795E-2,13689.738379573881,7.7492009394168934E-2,9222.4220302126123,6.6233999067887184E-2,10012.29230298617,6.6900255933356745E-2,10923.218984553609,6.8475545289328033E-2,11704.654130449127,6.933215336126719E-2,12398.133186272957,7.0180760705722628E-2,9222.4220302126123,6.6233999067887184E-2,10099.189547126354,6.7480886991356098E-2,11109.02130001873,6.9640304037228748E-2,11997.197184968712,7.1065023012490888E-2,12802.508216401109,7.2469762348019426E-2,9222.4220302126123,6.6233999067887184E-2,10142.638169196447,6.7771202520355789E-2,11203.37403834086,7.0231783088897062E-2,12148.071273938363,7.195872096871439E-2,13014.304718071224,7.3668655711939465E-2,9222.4220302126123,6.6233999067887184E-2,10186.086791266536,6.8061518049355452E-2,11298.694497056042,7.0829328592377394E-2,12302.05605978779,7.2870845040799617E-2,13232.684986804217,7.4904817088215891E-2]
["NHS Knowsley CCG","E38000091",10511.789779659293,8.9052776852416915E-2,11129.490957596447,9.42378573886236E-2,11868.741495926182,9.9871604644279549E-2,12657.557768993051,0.10542693460763826,13415.693122627386,0.11063576713365814,10511.789779659293,8.9052776852416915E-2,11036.488063436582,9.3450364635364797E-2,11666.839154090138,9.8172662016914644E-2,12328.932580423572,0.10268975995688465,12943.687657920194,0.10674325959030344,10511.789779659293,8.9052776852416915E-2,10989.986616356648,9.3056618258735374E-2,11567.344009675739,9.7335442693333371E-2,12169.329244133985,0.10136039683603185,12717.765518342905,0.10488013787186957,10511.789779659293,8.9052776852416915E-2,10943.485169276712,9.2662871882105938E-2,11468.819549597092,9.6506391363152907E-2,12012.824903428305,0.10005684577234969,12498.391329714965,0.10307101541905793,10511.789779659293,8.9052776852416915E-2,10664.47648679711,9.0300393622329458E-2,10898.057160175966,9.1703611243486735E-2,11137.176357116157,9.2763421265335294E-2,11312.586730405767,9.3291990189722632E-2,10511.789779659293,8.9052776852416915E-2,10757.47938095698,9.1087886375588317E-2,11084.428552640005,9.3271865976438939E-2,11417.189850251771,9.5095700901647248E-2,11683.837769855587,9.635360192854682E-2,10511.789779659293,8.9052776852416915E-2,10803.980828036911,9.1481632752217698E-2,11179.070275375652,9.4068245333016248E-2,11561.60203171827,9.629853433048699E-2,11878.285165314077,9.7957159535824484E-2,10511.789779659293,8.9052776852416915E-2,10850.482275116845,9.1875379128847121E-2,11274.68268244705,9.4872792682994353E-2,11708.991679530098,9.752616757896132E-2,12078.777024904821,9.9610564282573158E-2]
["NHS Lambeth CCG","E38000092",23648.799911427119,8.8665266614528795E-2,26521.852818652991,9.3796339010655649E-2,29446.994497114538,0.1003851997583505,32827.701172322821,0.10796455032665533,36348.816363995174,0.1145205304473698,23648.799911427119,8.8665266614528795E-2,26300.763632039012,9.3014442042859705E-2,28947.538348611146,9.8682547039650736E-2,31979.25225624863,0.10517415068160439,35076.243196603806,0.11051116319030814,23648.799911427119,8.8665266614528795E-2,26190.219038732041,9.2623493558961809E-2,28701.412121584239,9.784349942586841E-2,31567.18622361678,0.10381893778733402,34467.134882732782,0.10859210738101066,23648.799911427119,8.8665266614528795E-2,26079.674445425051,9.2232545075063843E-2,28457.687126040506,9.70126376424644E-2,31163.121219316097,0.10249003887165722,33875.680488789782,0.10672867198736541,23648.799911427119,8.8665266614528795E-2,25416.406885583154,8.9886854171676175E-2,27045.763013925152,9.2199369379986199E-2,28902.360067030284,9.5054792037855301E-2,30678.634633004422,9.6656063746075688E-2,23648.799911427119,8.8665266614528795E-2,25637.496072197111,9.0668751139472023E-2,27506.799458697511,9.3771048812632138E-2,29625.302656340758,9.7432423391241071E-2,31679.563957971208,9.9809590289764355E-2,23648.799911427119,8.8665266614528795E-2,25748.040665504101,9.1059699623370002E-2,27740.919528308481,9.4569167274522678E-2,29998.147961858944,9.8658646194366054E-2,32203.813265303095,0.10146128943069659,23648.799911427119,8.8665266614528795E-2,25858.585258811087,9.1450648107267954E-2,27977.440829402636,9.5375471566791561E-2,30378.680529891419,9.9910151055355584E-2,32744.35904257256,0.10316433220722293]
["NHS Lancashire North CCG","E38000093",11006.590978885262,8.2065247382085163E-2,11800.011137743008,8.6866984229556909E-2,12818.034774363563,9.2282467777995439E-2,13671.008582477136,9.6044742043537551E-2,14544.081281544786,0.10045642548380153,11006.590978885262,8.2065247382085163E-2,11701.775126603608,8.6143809824820464E-2,12600.898180212344,9.0719209360780026E-2,13317.686291183081,9.3562500289328943E-2,14034.765283495435,9.6938563914183137E-2,11006.590978885262,8.2065247382085163E-2,11652.65712103391,8.5782222622452234E-2,12493.895772036867,8.9948853650373431E-2,13146.088317450491,9.2356950382538217E-2,13790.984716099598,9.5254763890727984E-2,11006.590978885262,8.2065247382085163E-2,11603.539115464209,8.5420635420084004E-2,12387.937289794805,8.9186013605434183E-2,12977.82223749386,9.1174808469115215E-2,13554.269694385557,9.361976581285783E-2,11006.590978885262,8.2065247382085163E-2,11308.831082046012,8.3251112205874667E-2,11774.108840944251,8.4766802310613773E-2,12036.366252034892,8.456067340195933E-2,12274.731006494843,8.4781951971921829E-2,11006.590978885262,8.2065247382085163E-2,11407.067093185411,8.3974286610611112E-2,11974.542620160757,8.6209810080351043E-2,12337.423542921804,8.6675730946478888E-2,12675.328261871002,8.7548889776702596E-2,11006.590978885262,8.2065247382085163E-2,11456.18509875511,8.4335873812979328E-2,12076.325398669143,8.6942587463420776E-2,12492.688704027156,8.7766535787741712E-2,12885.146106559465,8.899810820941749E-2,11006.590978885262,8.2065247382085163E-2,11505.30310432481,8.4697461015347558E-2,12179.152103110944,8.7682880511957856E-2,12651.155096407447,8.8879830661848014E-2,13101.486211078336,9.0492376095305541E-2]
["NHS Leeds North CCG","E38000094",14579.129356748024,8.964049038826874E-2,15710.360269925312,9.36589976745279E-2,17045.826417195534,9.8303497215660521E-2,18431.143168312359,0.10282940843735974,19745.795581086164,0.10722087087905173,14579.129356748024,8.964049038826874E-2,15579.025431983951,9.2876030952569147E-2,16755.94930456765,9.6631772229340537E-2,17953.071493868905,0.10016219311464464,19052.001847194242,0.1034535287097863,14579.129356748024,8.964049038826874E-2,15513.358013013269,9.2484547591589764E-2,16613.10120820054,9.5807965445216497E-2,17720.886509635442,9.8866807128070971E-2,18719.922291964052,0.10165031652890995,14579.129356748024,8.964049038826874E-2,15447.690594042593,9.2093064230610408E-2,16471.646751797991,9.4992195800449777E-2,17493.209828658768,9.7596573469419592E-2,18397.467471357031,9.9899367242381812E-2,14579.129356748024,8.964049038826874E-2,15053.686080218506,8.9744164064734136E-2,15652.186452638385,9.0266357858352853E-2,16219.348964305334,9.0489561282667566E-2,16654.47112462762,9.0434791076388049E-2,14579.129356748024,8.964049038826874E-2,15185.020918159873,9.0527130786692916E-2,15919.765325833365,9.180948861495597E-2,16626.702156289284,9.2762230285032832E-2,17200.167444120307,9.3397955278672395E-2,14579.129356748024,8.964049038826874E-2,15250.68833713055,9.0918614147672272E-2,16055.645222377683,9.2593109702293439E-2,16836.787614754154,9.3934320546497183E-2,17485.982746331691,9.4949949752018314E-2,14579.129356748024,8.964049038826874E-2,15316.355756101233,9.1310097508651669E-2,16192.918758886563,9.3384767928988255E-2,17051.204580269663,9.5130576770082922E-2,17780.682715465922,9.6550188507091253E-2]
["NHS Leeds South and East CCG","E38000095",15951.592187615761,8.1719222272621725E-2,17064.899086603302,8.5384264418109188E-2,18368.522853468494,8.952394411476991E-2,19710.350109336265,9.3157907691352029E-2,21083.412091520033,9.7149627184222792E-2,15951.592187615761,8.1719222272621725E-2,16922.928220876929,8.4673912843375013E-2,18057.586590420575,8.8008512478899362E-2,19201.267805807125,9.075180927217659E-2,20345.148438776261,9.3747804067718446E-2,15951.592187615761,8.1719222272621725E-2,16851.942788013748,8.4318737056007953E-2,17904.360787716676,8.7261725254492023E-2,18954.021894917183,8.9583239885231022E-2,19991.783665545325,9.211954504444439E-2,15951.592187615761,8.1719222272621725E-2,16780.957355150571,8.3963561268640907E-2,17752.629870892812,8.6522223759103276E-2,18711.576723183458,8.8437360446088742E-2,19648.660541081845,9.0538478209758744E-2,15951.592187615761,8.1719222272621725E-2,16355.044757971456,8.1832506544438383E-2,16873.636973430443,8.223821509616161E-2,17355.085515132658,8.2026115488858381E-2,17793.943804974864,8.1992184153418399E-2,15951.592187615761,8.1719222272621725E-2,16497.015623697829,8.2542858119172571E-2,17160.655062397742,8.3637075067734379E-2,17788.862106407501,8.4076293158178939E-2,18374.617481367946,8.4667853107399979E-2,15951.592187615761,8.1719222272621725E-2,16568.00105656101,8.2898033906539631E-2,17306.40643570145,8.4347433647048678E-2,18012.574982217964,8.5133637310794791E-2,18678.752613631201,8.6069268333016299E-2,15951.592187615761,8.1719222272621725E-2,16638.986489424198,8.3253209693906732E-2,17453.652694885201,8.506507795538161E-2,18240.90033290401,8.621278160933929E-2,18992.341891032203,8.7514247032679945E-2]
["NHS Leeds West CCG","E38000096",18840.371375477258,7.035239497937737E-2,20151.755251729122,7.3611028827181194E-2,21752.067367965708,7.7597272288690455E-2,23436.113027022107,8.0508804627351799E-2,25034.911511412382,8.3908404314963089E-2,18840.371375477258,7.035239497937737E-2,19983.961963001242,7.2998107696527037E-2,21383.484191920124,7.6282406506564371E-2,22830.10575930995,7.8427020815217963E-2,24157.600592880011,8.0967960158466343E-2,18840.371375477258,7.035239497937737E-2,19900.065318637306,7.269164713119998E-2,21201.85065564766,7.563445582066089E-2,22535.786318479408,7.7415961245205792E-2,23737.681810981361,7.9560536972051774E-2,18840.371375477258,7.035239497937737E-2,19816.168674273365,7.2385186565872908E-2,21021.989153875416,7.4992826604863783E-2,22247.181636930211,7.6424533276984577E-2,23329.933627288476,7.819390544070412E-2,18840.371375477258,7.035239497937737E-2,19312.788808089743,7.0546423173910522E-2,19980.03286774657,7.1275802182315107E-2,20632.425977643416,7.0877450970949551E-2,21125.892784529955,7.0806719347533048E-2,18840.371375477258,7.035239497937737E-2,19480.582096817619,7.1159344304564651E-2,20320.263491788643,7.2489524442739164E-2,21148.789962511168,7.2651288088324176E-2,21815.93265647905,7.3119495429947223E-2,18840.371375477258,7.035239497937737E-2,19564.478741181556,7.1465804869891722E-2,20493.036855560011,7.3105867778110775E-2,21415.095877452823,7.3566114316224049E-2,22177.349707490819,7.4330840955526292E-2,18840.371375477258,7.035239497937737E-2,19648.375385545489,7.1772265435218766E-2,20667.582253831599,7.3728532583588746E-2,21686.892443468692,7.4499802279177921E-2,22550.001531776241,7.5579841573187576E-2]
["NHS Leicester City CCG","E38000097",29194.326841441896,0.1089177989906055,31832.667770004802,0.11379376481734754,34759.904394952857,0.11971312989031842,37992.496052085837,0.12534640729820468,41080.300878493712,0.13075402915046697,29194.326841441896,0.1089177989906055,31567.318244904891,0.11284520713843173,34170.549522803682,0.11768339138587851,37010.219220872576,0.12210563913187916,39640.914766008471,0.12617262322874934,29194.326841441896,0.1089177989906055,31434.643482354946,0.11237092829897385,33880.122242057092,0.11668315967095018,36533.157008739516,0.12053169583879748,38951.962593786826,0.12397976508303146,29194.326841441896,0.1089177989906055,31301.968719804991,0.11189664945951594,33592.528398195849,0.11569268631421631,36065.357846634244,0.1189883135817692,38282.978473561299,0.12185046302616748,29194.326841441896,0.1089177989906055,30505.920144505282,0.10905097642276858,31926.46750962031,0.10995477169589582,33448.001328492159,0.11035302318869072,34666.853661477522,0.11034073989903088,29194.326841441896,0.1089177989906055,30771.26966960519,0.10999953410168438,32470.487391604151,0.11182837646922493,34284.975414171706,0.11311440255417916,35798.9879912385,0.1139441975658492,29194.326841441896,0.1089177989906055,30903.944432155142,0.11047381294114228,32746.747487924084,0.11277981639318117,34716.630518325466,0.11453853684699923,36391.957567990125,0.11583155378442334,29194.326841441896,0.1089177989906055,31036.619194705087,0.11094809178060015,33025.84102112933,0.11374101467533176,35157.185415643165,0.11599203370387055,37003.359807877925,0.11777757911986099]
["NHS Lewisham CCG","E38000098",22347.928475482047,9.4960178785935448E-2,25281.558550511832,0.10037144096598313,28486.284176299225,0.10657843526002404,32089.601679480002,0.11367198611222104,35845.415820262242,0.1207729643539833,22347.928475482047,9.4960178785935448E-2,25070.197917932786,9.9532308710230208E-2,28002.114807106711,0.10476696650369167,31258.272556930595,0.11072714331183349,34587.461511096335,0.11653457382444857,22347.928475482047,9.4960178785935448E-2,24964.517601643256,9.9112742582353724E-2,27763.521728538275,0.10387429560213363,30854.521091344064,0.10929692203805903,33985.350412248081,0.11450589761539111,22347.928475482047,9.4960178785935448E-2,24858.837285353737,9.8693176454477283E-2,27527.256387321733,0.10299033368498105,30458.609211307175,0.10789447117005729,33400.690431509327,0.11253601897408803,22347.928475482047,9.4960178785935448E-2,24224.755387616609,9.6175779687218549E-2,26158.546824412086,9.7869450854579793E-2,28243.465141444038,0.10004769798598667,30240.371077039297,0.10188804271239656,22347.928475482047,9.4960178785935448E-2,24436.116020195652,9.701491194297146E-2,26605.472395974422,9.9541575860425099E-2,28951.820373018763,0.10255692657817486,31229.802089555105,0.10522170515348755,22347.928475482047,9.4960178785935448E-2,24541.796336485168,9.7434478070847888E-2,26832.426787783417,0.10039070183995591,29317.142497675715,0.10385101841188706,31748.029011302369,0.10696775273349855,22347.928475482047,9.4960178785935448E-2,24647.476652774687,9.7854044198724344E-2,27061.708916944295,0.10124853680389216,29689.99677315485,0.1051717916158514,32282.365195060996,0.10876807680276616]
["NHS Lincolnshire East CCG","E38000099",19995.812979493901,0.10252160059215494,21680.417891616882,0.10891398518847022,23566.982928925652,0.11510688155184944,25383.928203044394,0.12053147294892874,27020.492929327767,0.12543168196698434,19995.812979493901,0.10252160059215494,21500.170520175641,0.10800849251570201,23168.280391932305,0.11315952130473921,24728.657297106092,0.11742002515245058,26075.078466762276,0.12104297867775636,19995.812979493901,0.10252160059215494,21410.046834455025,0.10755574617931792,22971.804382115883,0.11219988464450466,24410.411993949296,0.1159088888601581,25622.562396206587,0.11894235630956544,19995.812979493901,0.10252160059215494,21319.923148734415,0.10710299984293387,22777.245211419598,0.11124961029315034,24098.346015185158,0.11442709408919828,25183.161698227199,0.1169026167404475,19995.812979493901,0.10252160059215494,20779.181034410714,0.10438652182462933,21650.143808765351,0.10574457267151192,22352.323384591193,0.10613638834088886,22808.026447072716,0.10587701442332521,19995.812979493901,0.10252160059215494,20959.428405851944,0.10529201449739749,22018.176919836125,0.10754213597653671,22910.663711821246,0.1087875769792082,23551.632460524434,0.10932890381823616,19995.812979493901,0.10252160059215494,21049.552091572561,0.10574476083378158,22205.068734051758,0.10845496109236963,23198.61820913171,0.11015488228457603,23941.105451030351,0.11113687425044264,19995.812979493901,0.10252160059215494,21139.675777293181,0.10619750717016568,22393.877387387547,0.10937714851708287,23492.509704388056,0.11155037846338109,24342.685343333775,0.11300104606505326]
["NHS Lincolnshire West CCG","E38000100",15777.770229055381,8.1606342345377988E-2,17335.185586698692,8.7410173389969203E-2,19007.099187327392,9.325433807932193E-2,20604.976815002537,9.7876576168547114E-2,22131.9267245515,0.10267176992276628,15777.770229055381,8.1606342345377988E-2,17190.936211541266,8.6682816718138697E-2,18685.103728129667,9.1674535021733242E-2,20072.356365153846,9.5346553131074707E-2,21356.220680691324,9.907320783397347E-2,15777.770229055381,8.1606342345377988E-2,17118.811523962555,8.6319138382223451E-2,18526.428081169255,9.0896026303450381E-2,19813.678686969903,9.4117797297025949E-2,20984.9343668334,9.7350781067143247E-2,15777.770229055381,8.1606342345377988E-2,17046.686836383844,8.5955460046308205E-2,18369.300489301142,9.012511279217518E-2,19560.023716963529,9.2912900042578045E-2,20624.409125687762,9.5678275773277782E-2,15777.770229055381,8.1606342345377988E-2,16613.938710911563,8.3773390030816672E-2,17459.044095030655,8.5659131071684116E-2,18140.813203380127,8.6171447859491393E-2,18675.627038827872,8.6637720536406893E-2,15777.770229055381,8.1606342345377988E-2,16758.188086068989,8.4500746702647178E-2,17756.270672751627,8.7117410817150576E-2,18594.646073972955,8.832721866793157E-2,19285.750642522275,8.9468132503814579E-2,15777.770229055381,8.1606342345377988E-2,16830.312773647704,8.4864425038562438E-2,17907.206044250561,8.7857943500395261E-2,18828.702633639426,8.9439020680407683E-2,19605.310544150943,9.0950596326549171E-2,15777.770229055381,8.1606342345377988E-2,16902.437461226411,8.5228103374477671E-2,18059.689470841789,8.8606071390647592E-2,19067.584932535319,9.0573745641912021E-2,19934.804075175598,9.2479143046834272E-2]
["NHS Liverpool CCG","E38000101",30911.455824672004,7.8403733132126022E-2,32848.529812798333,8.1969680622843571E-2,35236.238083918179,8.6460808960882776E-2,37916.644864639777,9.0575330525631312E-2,40562.839868388612,9.4711029859878157E-2,30911.455824672004,7.8403733132126022E-2,32575.14878670195,8.1287490110051278E-2,34639.488031881723,8.4996535387647135E-2,36936.952296864234,8.8235039646610863E-2,39142.154142947584,9.1393840811963181E-2,30911.455824672004,7.8403733132126022E-2,32438.458273653752,8.0946394853655124E-2,34345.416491815668,8.4274958266220876E-2,36461.145183490662,8.7098430995868961E-2,38462.152781188641,8.9806091298189616E-2,30911.455824672004,7.8403733132126022E-2,32301.767760605562,8.060529959725897E-2,34054.21394238442,8.3560420921589065E-2,35994.576750068387,8.5983891715800467E-2,37801.860048121933,8.8264359877000889E-2,30911.455824672004,7.8403733132126022E-2,31481.624682316407,7.8558728058882088E-2,32367.247449127488,7.942103216648054E-2,33384.106212067898,7.9747996302297799E-2,34232.715634834291,7.9930689350038053E-2,30911.455824672004,7.8403733132126022E-2,31755.005708412795,7.9240918571674396E-2,32918.093651007308,8.0772669311005782E-2,34218.87831001934,8.1742100974677143E-2,35350.141367667071,8.2539790248592218E-2,30911.455824672004,7.8403733132126022E-2,31891.696221460985,7.9582013828070536E-2,33197.820237899388,8.1459047548459979E-2,34649.397776572863,8.277052643584365E-2,35935.407132012493,8.3906339618970066E-2,30911.455824672004,7.8403733132126022E-2,32028.386734509175,7.9923109084466676E-2,33480.415815426284,8.2152465562708624E-2,35088.793621903118,8.3820155802166937E-2,36538.866083837114,8.5315368646299433E-2]
["NHS Luton CCG","E38000102",16801.264029397211,0.10208569710412693,18523.245012308376,0.10589552373832824,20434.271884787031,0.11074285651846429,22486.069947861248,0.11583592596260688,24676.977081582838,0.12150161044600118,16801.264029397211,0.10208569710412693,18369.294787233845,0.1050154058268571,20089.003405567903,0.10887168548432638,21906.478466918335,0.11285018785760527,23815.61243830177,0.1172605240684479,16801.264029397211,0.10208569710412693,18292.319674696584,0.10457534687112156,19918.859082875792,0.10794959398913825,21624.988376501988,0.11140010496858638,23403.32623037192,0.11523055751044767,16801.264029397211,0.10208569710412693,18215.344562159316,0.10413528791538598,19750.374704795297,0.10703649850853726,21348.963939670299,0.10997817813553626,23002.989404081563,0.11325942591866846,16801.264029397211,0.10208569710412693,17753.493886935739,0.10149493418097266,18774.327273156618,0.10174684193126284,19804.595292970338,0.10202243608577342,20839.00989100818,0.10260467696212791,16801.264029397211,0.10208569710412693,17907.444112010267,0.10237505209244378,19093.03663858966,0.10347407673200552,20298.451031408833,0.1045665105677356,21516.507384309039,0.10594045979472692,16801.264029397211,0.10208569710412693,17984.419224547524,0.10281511104817931,19254.881238223628,0.10435118815425769,20553.148702292532,0.10587857357455456,21871.355206950117,0.10768761795642598,16801.264029397211,0.10208569710412693,18061.394337084788,0.10325517000391486,19418.385782469217,0.10523729559109699,20813.097687404643,0.10721768847828479,22237.233596142662,0.10948908713019528]
["NHS Mansfield and Ashfield CCG","E38000103",14043.899274457826,8.7829263755208414E-2,15331.281207598353,9.3953187937237115E-2,16776.97706932604,0.10008935132636941,18227.736882724497,0.10577841737885618,19534.503614395358,0.11095367269337361,14043.899274457826,8.7829263755208414E-2,15203.787778121758,9.3171882449575666E-2,16493.107714245609,9.8395822182589243E-2,17757.387387196723,0.10304890545030596,18851.239248274622,0.10707281181571408,14043.899274457826,8.7829263755208414E-2,15140.041063383467,9.2781229705744983E-2,16353.220171477607,9.756127056125527E-2,17528.952832209812,0.10172326388236892,18524.199501845669,0.10521526469297779,14043.899274457826,8.7829263755208414E-2,15076.29434864517,9.2390576961914259E-2,16214.697385224415,9.6734860906958695E-2,17304.953758921318,0.10042336211073188,18206.638420155421,0.10341155526613326,14043.899274457826,8.7829263755208414E-2,14693.814060215402,9.0046660498930023E-2,15412.220554516272,9.1947384288964762E-2,16051.669268434132,9.3150355550337349E-2,16490.094675492026,9.3661789591571204E-2,14043.899274457826,8.7829263755208414E-2,14821.307489691993,9.0827965986591458E-2,15674.253805359747,9.351064196014644E-2,16452.442580457544,9.5476105968300515E-2,17027.50922915342,9.6714240765383513E-2,14043.899274457826,8.7829263755208414E-2,14885.054204430286,9.1218618730422141E-2,15807.317565553703,9.4304483746293424E-2,16659.134578099329,9.6675572064179024E-2,17308.98685247753,9.8313000411663812E-2,14043.899274457826,8.7829263755208414E-2,14948.80091916858,9.1609271474252851E-2,15941.746082262462,9.5106467499477751E-2,16870.088116980762,9.7899768552581021E-2,17599.214304485151,9.99614580511482E-2]
["NHS Medway CCG","E38000104",17495.955537884478,7.9210229707915969E-2,19437.472467524,8.3876208110485878E-2,21652.33548698471,8.9243819499566029E-2,23848.766160856037,9.3715679663848001E-2,26079.420608584503,9.8116706578572244E-2,17495.955537884478,7.9210229707915969E-2,19275.750726693997,8.3178349558531095E-2,21285.720913392008,8.7732754568428023E-2,23232.798948919382,9.1295186061456229E-2,25166.259521596476,9.46811870639446E-2,17495.955537884478,7.9210229707915969E-2,19194.889856279005,8.2829420282553731E-2,21105.057481693682,8.6988119205727812E-2,22933.642263766811,9.0119625368464365E-2,24729.18130539608,9.3036799493589464E-2,17495.955537884478,7.9210229707915969E-2,19114.02898586401,8.2480491006576367E-2,20926.156620060705,8.6250748578273445E-2,22640.294261989773,8.8966890372484175E-2,24304.771023051402,9.1440071569042145E-2,17495.955537884478,7.9210229707915969E-2,18628.863763374025,8.0386915350712101E-2,19889.765421635188,8.1979084253710283E-2,20998.999521144786,8.2517288278626158E-2,22010.664920842741,8.2809123103245827E-2,17495.955537884478,7.9210229707915969E-2,18790.58550420402,8.1084773902666857E-2,20228.178874182293,8.3373913420914575E-2,21523.850131112322,8.4579731731815155E-2,22728.902373749661,8.5511295612301211E-2,17495.955537884478,7.9210229707915969E-2,18871.446374619016,8.1433703178644234E-2,20400.029455553875,8.4082225107385514E-2,21794.532878149537,8.5643401753181136E-2,23105.088261997833,8.6926592407817277E-2,17495.955537884478,7.9210229707915969E-2,18952.307245034008,8.1782632454621584E-2,20573.642606990805,8.4797801529102323E-2,22070.79651705737,8.6729002346185829E-2,23492.968017902163,8.8385884190753064E-2]
["NHS Merton CCG","E38000105",13324.028409808867,8.1174780125556636E-2,14809.9315111822,8.5804933436745084E-2,16394.913564810147,9.0760150380924193E-2,18209.298382029931,9.6457772973990524E-2,20047.784452757936,0.10179640729540945,13324.028409808867,8.1174780125556636E-2,14686.239972413192,8.5088296479798348E-2,16116.153203642001,8.9216968576406125E-2,17737.177652499253,9.3956868590418754E-2,19343.109309606152,9.8218286328862356E-2,13324.028409808867,8.1174780125556636E-2,14624.394203028687,8.4729978001324965E-2,15978.783314124043,8.8456506389083492E-2,17507.882862612387,9.2742254807778299E-2,19005.821443359626,9.6505643563316881E-2,13324.028409808867,8.1174780125556636E-2,14562.548433644186,8.4371659522851611E-2,15842.753618650166,8.7703463345051844E-2,17283.040257484263,9.1551225010510981E-2,18678.309265357406,9.4842638698879891E-2,13324.028409808867,8.1174780125556636E-2,14191.473817337162,8.2221748652011387E-2,15054.719520732513,8.3341007089971844E-2,16025.036169918807,8.4887361849342133E-2,16907.975893715968,8.5853437055529433E-2,13324.028409808867,8.1174780125556636E-2,14315.165356106168,8.293838560895811E-2,15312.036777195419,8.4765482601834696E-2,16427.318707155515,8.7018321364315684E-2,17462.230873648983,8.866777126865534E-2,13324.028409808867,8.1174780125556636E-2,14377.011125490675,8.3296704087431506E-2,15442.705696492989,8.5488849072702558E-2,16634.789061950509,8.8117327375519167E-2,17752.528881777354,9.0141814165620768E-2,13324.028409808867,8.1174780125556636E-2,14438.856894875178,8.3655022565904874E-2,15574.714809834637,8.6219634686861363E-2,16846.537006023511,8.9238992509924314E-2,18051.850903283019,9.1661678192764384E-2]
["NHS Mid Essex CCG","E38000106",25535.946897633603,8.1040770858881644E-2,28418.574992454905,8.710407341523603E-2,31634.420194279122,9.3394013327465511E-2,34601.42504738515,9.8720185584551076E-2,37497.849821335163,0.10355089423764267,25535.946897633603,8.1040770858881644E-2,28182.005101947099,8.6378977202069204E-2,31098.383661109146,9.1811477506817257E-2,33706.579356435876,9.6167130831486092E-2,36183.329069258754,9.9920824779793319E-2,25535.946897633603,8.1040770858881644E-2,28063.720156693205,8.6016429095485819E-2,30834.231042599913,9.1031622114430527E-2,33271.979810486388,9.4927189188263594E-2,35554.142835128841,9.8183317229451131E-2,25535.946897633603,8.1040770858881644E-2,27945.4352114393,8.5653880988902406E-2,30572.655522807836,9.0259375067335348E-2,32845.818822934081,9.3711323317928905E-2,34943.192443695872,9.649616824173167E-2,25535.946897633603,8.1040770858881644E-2,27235.725539915893,8.3478592349401984E-2,29057.321477115813,8.5785668035887483E-2,30461.429689939327,8.6908501255176393E-2,31640.76297994678,8.7376458024817125E-2,25535.946897633603,8.1040770858881644E-2,27472.295430423692,8.4203688562568782E-2,29552.124430811167,8.7246470331870454E-2,31223.905837403236,8.9083896825686834E-2,32674.685745839924,9.0231651789020012E-2,25535.946897633603,8.1040770858881644E-2,27590.580375677593,8.4566236669152195E-2,29803.39155573459,8.7988283997799316E-2,31617.139901013557,9.0205819974361071E-2,33216.215782310923,9.1727095389127697E-2,25535.946897633603,8.1040770858881644E-2,27708.865320931491,8.492878477573558E-2,30057.235779375176,8.8737706009019757E-2,32018.481599162344,9.1350874747966743E-2,33774.579466125302,9.3269025367627587E-2]
["NHS Milton Keynes CCG","E38000107",15739.551685008624,7.5598230955853149E-2,18115.142022117125,8.1931895170136257E-2,20718.155844404573,8.8012556688209731E-2,23329.479108314983,9.4032563919044673E-2,25919.303366805336,9.9666628342710673E-2,15739.551685008624,7.5598230955853149E-2,17964.346189993466,8.1249869696940161E-2,20367.030522467499,8.6520945295104068E-2,22726.311929812389,9.1601418499848403E-2,25010.662596386719,9.6172662448614624E-2,15739.551685008624,7.5598230955853149E-2,17888.948273931641,8.0908856960342126E-2,20194.000015262933,8.5785896411482293E-2,22433.371834598009,9.0420684540902893E-2,24575.747998337567,9.4500299924392711E-2,15739.551685008624,7.5598230955853149E-2,17813.550357869812,8.0567844223744065E-2,20022.65761056768,8.5058018736481208E-2,22146.119716104684,8.9262876727548096E-2,24153.438625524457,9.2876407850205553E-2,15739.551685008624,7.5598230955853149E-2,17361.162861498855,7.8521767804155845E-2,19030.053335091732,8.0841348067509478E-2,20538.931705538293,8.2784892001363533E-2,21870.688773569527,8.4098626369182222E-2,15739.551685008624,7.5598230955853149E-2,17511.958693622506,7.9203793277351914E-2,19354.16901687979,8.2218220122683885E-2,21052.875719788903,8.4856411607371632E-2,22585.37081801083,8.6846769276362493E-2,15739.551685008624,7.5598230955853149E-2,17587.356609684331,7.9544806013949948E-2,19518.759011537801,8.2917412963202208E-2,21317.933576174535,8.5924762499695828E-2,22959.694516413139,8.8286143645363149E-2,15739.551685008624,7.5598230955853149E-2,17662.754525746157,7.9885818750547982E-2,19685.037108705117,8.362377701234118E-2,21588.456351370613,8.7015140473077845E-2,23345.654195660085,8.9770261461432299E-2]
["NHS Nene CCG","E38000108",42107.902364619818,8.2390041411559478E-2,47112.112768379186,8.859323925002667E-2,52675.24044499841,9.4872735933500971E-2,58068.655212733705,0.10051349306365316,63159.749891609186,0.10568900584271952,42107.902364619818,8.2390041411559478E-2,46720.551504668205,8.7856917343014415E-2,51783.915929943287,9.3267382172730243E-2,56569.035336826935,9.7917737549032297E-2,60948.355059868045,0.10198854595024773,42107.902364619818,8.2390041411559478E-2,46524.770872812725,8.7488756389508301E-2,51344.681493437769,9.2476282362735071E-2,55840.71522112684,9.6657057434616833E-2,59889.886272547876,0.10021734650694089,42107.902364619818,8.2390041411559478E-2,46328.990240957246,8.7120595436002188E-2,50909.732270946915,9.1692900599666644E-2,55126.536794909516,9.542085576907415E-2,58862.095318368592,9.849748212578413E-2,42107.902364619818,8.2390041411559478E-2,45154.306449824355,8.4911629714965506E-2,48390.026430310303,8.7154689006718605E-2,51130.677651930484,8.8504254053746595E-2,53306.47709264743,8.9200932216612169E-2,42107.902364619818,8.2390041411559478E-2,45545.867713535306,8.5647951621977705E-2,49212.787521130427,8.8636554016660832E-2,52408.467104577598,9.0716033899774284E-2,55045.826933495497,9.2111490852569436E-2,42107.902364619818,8.2390041411559478E-2,45741.648345390793,8.6016112575483833E-2,49630.595887562507,8.9389063592022089E-2,53067.465213009047,9.1856721617754364E-2,55956.833261842105,9.3635932499735786E-2,42107.902364619818,8.2390041411559478E-2,45937.428977246273,8.6384273528989947E-2,50052.689468009296,9.0149291214310173E-2,53740.050434865174,9.3020927845435808E-2,56896.158535078474,9.5207761939555685E-2]
["NHS Newark & Sherwood CCG","E38000109",8523.7665100737522,8.7729173631882998E-2,9444.8131308612483,9.4184414946761552E-2,10331.667787863413,0.10009366196341227,11293.604196075354,0.10586430629991896,12137.142392782662,0.11065957688532697,8523.7665100737522,8.7729173631882998E-2,9366.1446072889066,9.3399926279307002E-2,10156.543855650794,9.839705343587285E-2,11001.615793757577,0.10312725715933237,11711.692794328686,0.10678056887608212,8523.7665100737522,8.7729173631882998E-2,9326.8103455027394,9.3007681945579776E-2,10070.244802517173,9.7560984329753672E-2,10859.805838864449,0.10179795499497984,11508.054296997627,0.10492390861595211,8523.7665100737522,8.7729173631882998E-2,9287.4760837165686,9.2615437611852494E-2,9984.7876913653436,9.6733071995401515E-2,10720.749387965569,0.10049446370421418,11310.317898922603,0.10312106034758027,8523.7665100737522,8.7729173631882998E-2,9051.4705129995509,9.0261971609488942E-2,9489.7258060719851,9.1936890196395921E-2,9942.7225387683084,9.320137362924924E-2,10241.47414955215,9.3375949576514863E-2,8523.7665100737522,8.7729173631882998E-2,9130.1390365718889,9.104646027694345E-2,9651.3786665759399,9.3502990375663064E-2,10191.518721568526,9.5533546321414753E-2,10576.107151645747,9.6426943395748962E-2,8523.7665100737522,8.7729173631882998E-2,9169.4732983580579,9.1438704610670704E-2,9733.4680098006029,9.4298275622947139E-2,10319.831107862408,9.6736324595635623E-2,10751.375390053865,9.8024939734262087E-2,8523.7665100737522,8.7729173631882998E-2,9208.807560144227,9.1830948944397958E-2,9816.3992950070569,9.5101717641998235E-2,10450.78901760175,9.7963901552322361E-2,10932.091901904188,9.9672610338294929E-2]
["NHS Newbury and District CCG","E38000110",6325.7092831544433,7.464844563552564E-2,7059.0625897690679,8.1532254444087168E-2,7764.0424895716696,8.7828534949905765E-2,8476.8041565747171,9.3769957484233613E-2,9121.7379742424309,9.9106236139096388E-2,6325.7092831544433,7.464844563552564E-2,7000.4303216309354,8.0855051069888356E-2,7632.6018729752477,8.6341650146778817E-2,8257.8842708246921,9.1348277332131564E-2,8802.4441860278985,9.5637159778660344E-2,6325.7092831544433,7.464844563552564E-2,6971.1141875618696,8.0516449382788957E-2,7567.8294537390348,8.5608930472161032E-2,8151.5614892450603,9.0172140367755102E-2,8649.6164304596095,9.397671045697098E-2,6325.7092831544433,7.464844563552564E-2,6941.798053492802,8.0177847695689544E-2,7503.6889605441465,8.4883359282173609E-2,8047.3031621952878,8.9018840289770904E-2,8501.2181152685807,9.2364386302353121E-2,6325.7092831544433,7.464844563552564E-2,6765.9012490784062,7.814623757309315E-2,7132.1164482427312,8.0680050319487912E-2,7463.9733190073766,8.2566076537692226E-2,7699.0662952032517,8.3649134020026633E-2,6325.7092831544433,7.464844563552564E-2,6824.5335172165387,7.8823440947291962E-2,7253.4462481778864,8.2052559368528122E-2,7650.5096042889727,8.4629531020895724E-2,7950.2035375189816,8.637770032071905E-2,6325.7092831544433,7.464844563552564E-2,6853.8496512856018,7.9162042634391319E-2,7315.0590372074594,8.2749536619993888E-2,7746.7125107222219,8.5693722463741406E-2,8081.7398228942047,8.7806821196156071E-2,6325.7092831544433,7.464844563552564E-2,6883.1657853546703,7.9500644321490746E-2,7377.3037522783607,8.3453662356090058E-2,7844.8989126841607,8.6779855228807101E-2,8217.3649589180422,8.9280366785289458E-2]
["NHS Newcastle Gateshead CCG","E38000212",31494.413881402907,7.7564806130930225E-2,33589.432626154681,8.1141735013418412E-2,36189.290164230348,8.5785071265894727E-2,38599.873703923331,8.9339151284366369E-2,41353.515967822037,9.3738135750797966E-2,31494.413881402907,7.7564806130930225E-2,33310.118483015016,8.0466997978101792E-2,35577.209861202515,8.4334162663448814E-2,37604.045762257731,8.703431412826397E-2,39907.831950450251,9.0461129636526985E-2,31494.413881402907,7.7564806130930225E-2,33170.461411445198,8.0129629460443524E-2,35275.583750335449,8.3619171645416601E-2,37120.402184745959,8.5914924280761834E-2,39215.865329767286,8.8892613405039622E-2,31494.413881402907,7.7564806130930225E-2,33030.804339875373,7.9792260942785243E-2,34976.90033323293,8.2911156149511528E-2,36646.149446709976,8.4817269468846865E-2,38543.954129501697,8.7369557823695917E-2,31494.413881402907,7.7564806130930225E-2,32192.861910456417,7.7768049836835496E-2,33246.596399673486,7.8809549138750976E-2,33992.684892479214,7.8675843383972627E-2,34912.00728750752,7.9136837626955114E-2,31494.413881402907,7.7564806130930225E-2,32472.176053596068,7.8442786872152073E-2,33811.593602468405,8.0148849387162574E-2,34841.205548250196,8.0639738805374714E-2,36049.095169526488,8.1714333052694002E-2,31494.413881402907,7.7564806130930225E-2,32611.833125165889,7.8780155389810355E-2,34098.506244512697,8.0828962794559089E-2,35278.815598919879,8.1652584360782945E-2,36644.659231498299,8.3064328659666092E-2,31494.413881402907,7.7564806130930225E-2,32751.490196735718,7.9117523907468651E-2,34388.361580321551,8.1516051724082758E-2,35725.448220850623,8.2686312597441608E-2,37258.736607071267,8.4456289344163715E-2]
["NHS Newham CCG","E38000113",26800.568890197483,0.1038701220455681,31310.205266104229,0.11096613717785735,35919.108796052984,0.12013079864900664,40961.725437001711,0.12955191801189736,45850.098341580386,0.13816929345943946,26800.568890197483,0.1038701220455681,31051.116190862605,0.11004790257606538,35314.980783211926,0.11811030362278237,39911.620095505728,0.12623069168039006,44258.140160120551,0.13337192671203155,26800.568890197483,0.1038701220455681,30921.57165324179,0.10958878527516937,35017.273469191699,0.11711462698726322,39401.615622970159,0.12461767228468011,43496.160426059432,0.13107570041604216,26800.568890197483,0.1038701220455681,30792.027115620989,0.10912966797427343,34722.470616771672,0.11612866427013938,38901.513835709899,0.12303597266022487,42756.265317844904,0.1288460261506898,26800.568890197483,0.1038701220455681,30014.759889896119,0.1063749641688975,33014.647195855636,0.11041688025369778,36103.422734542903,0.11418629494130844,38756.838458128215,0.11679375138056959,26800.568890197483,0.1038701220455681,30273.848965137742,0.10729319877068948,33572.303823093534,0.1122819525855971,36998.191836426558,0.11701623074333152,40008.976778167067,0.12056707081173779,26800.568890197483,0.1038701220455681,30403.39350275855,0.10775231607158545,33855.488829112772,0.11322905962913971,37459.653734083258,0.11847572184857758,40664.799952281646,0.12254339426314383,26800.568890197483,0.1038701220455681,30532.938040379358,0.10821143337248142,34141.578296732216,0.11418588059107765,37930.629976416203,0.11996530449875452,41341.009615213377,0.1245811524084299]
["NHS North & West Reading CCG","E38000114",6253.5593717028796,7.7935685091012952E-2,6951.8489839034355,8.3898732608054985E-2,7690.3816243205529,8.9798944702481925E-2,8375.0494342316324,9.5041414369401195E-2,9015.7971496940991,9.9886961552117209E-2,6253.5593717028796,7.7935685091012952E-2,6894.0085784480198,8.3200682819792662E-2,7560.106108590714,8.8277745312829434E-2,8158.5261733793777,9.2584273415562635E-2,8699.9192563432025,9.6387317265047665E-2,6253.5593717028796,7.7935685091012952E-2,6865.0883757203146,8.2851657925661529E-2,7495.9078376180778,8.7528115805909343E-2,8053.3673601832497,9.1390914209977886E-2,8548.7264951422858,9.4712236817441675E-2,6253.5593717028796,7.7935685091012952E-2,6836.1681729926095,8.2502633031530409E-2,7432.3358912402964,8.678579975759336E-2,7950.2504009062213,9.0220726292626216E-2,8401.9157869180817,9.3085705594040349E-2,6253.5593717028796,7.7935685091012952E-2,6662.6469566263686,8.0408483666743524E-2,7064.0570294655599,8.2485486098383451E-2,7373.3065597071563,8.3673474349831564E-2,7608.3456129202841,8.4293658463552898E-2,6253.5593717028796,7.7935685091012952E-2,6720.4873620817825,8.1106533455005819E-2,7184.3113516777166,8.3889670150370341E-2,7557.8007394755314,8.576714411570055E-2,7856.796118294179,8.7046267652273204E-2,6253.5593717028796,7.7935685091012952E-2,6749.4075648094877,8.1455558349136953E-2,7245.3779996760777,8.460273236426992E-2,7652.9504648329439,8.6846918575044771E-2,7986.9251914461183,8.8487981292334567E-2,6253.5593717028796,7.7935685091012952E-2,6778.3277675371965,8.1804583243268114E-2,7307.0709722692973,8.5323108036773662E-2,7750.0619714067452,8.7948955644652133E-2,8121.099371570951,8.9974511096509543E-2]
["NHS North Derbyshire CCG","E38000115",20155.222177726799,8.8345849819088274E-2,21955.243567490354,9.4912863425083663E-2,23920.000795528784,0.10156250337775469,25683.352253693156,0.10719262209387795,27281.176765603559,0.11225897772036687,20155.222177726799,8.8345849819088274E-2,21772.523250248083,9.4122960618399115E-2,23514.804284727747,9.9842069823062776E-2,25019.546751460548,0.10442214837838291,26325.399898362954,0.108326063280236,20155.222177726799,8.8345849819088274E-2,21681.163091626957,9.3728009215056876E-2,23315.128119549354,9.899426001846702E-2,24697.156452454885,0.10307661290673992,25867.92393473312,0.10644360108111728,20155.222177726799,8.8345849819088274E-2,21589.802933005823,9.3333057811714609E-2,23117.400014519033,9.8154721529038008E-2,24381.025960644605,0.10175720350853341,25423.707097348964,0.10461569869701656,20155.222177726799,8.8345849819088274E-2,21041.641981279034,9.096334939166105E-2,21971.940647446867,9.3291188210966658E-2,22612.262203994535,9.4375050934868671E-2,23022.538700304391,9.4735160481871417E-2,20155.222177726799,8.8345849819088274E-2,21224.362298521301,9.1753252198345583E-2,22345.968195878591,9.4879280722989942E-2,23177.874652181836,9.6735703890575273E-2,23774.295156482905,9.7828553849407071E-2,20155.222177726799,8.8345849819088274E-2,21315.722457142423,9.2148203601687809E-2,22535.904060316581,9.5685733951751784E-2,23469.57962179833,9.7953170374784349E-2,24168.037043750461,9.9448757483953834E-2,20155.222177726799,8.8345849819088274E-2,21407.082615763557,9.2543155005030076E-2,22727.787984902647,9.6500458495680397E-2,23767.298915975109,9.9195738380530502E-2,24574.018532938851,0.10111932570545161]
["NHS North Durham CCG","E38000116",16690.649206108486,8.1521193738929798E-2,18059.385978416107,8.6615760088326652E-2,19405.559403359868,9.1596145583686714E-2,20816.812449534009,9.5894658418712031E-2,22080.522550480669,9.995709619955033E-2,16690.649206108486,8.1521193738929798E-2,17909.211192318126,8.5895497325266787E-2,19077.050368433935,9.0045550686462444E-2,20279.281539653577,9.3418470331921771E-2,21307.525887337899,9.6457790345576708E-2,16690.649206108486,8.1521193738929798E-2,17834.123799269131,8.5535365943736841E-2,18915.164906511302,8.9281435412589927E-2,20018.218999228269,9.2215860508698497E-2,20937.536399755045,9.4782871886623099E-2,16690.649206108486,8.1521193738929798E-2,17759.036406220144,8.5175234562206922E-2,18754.858814948879,8.8524774921877089E-2,19762.225473515995,9.1036601591652819E-2,20578.270398683962,9.3156497956921505E-2,16690.649206108486,8.1521193738929798E-2,17308.512047926186,8.3014446273027273E-2,17826.189043139038,8.4141362423954674E-2,18329.930639746308,8.4438597013756722E-2,18636.295004449919,8.436530106133959E-2,16690.649206108486,8.1521193738929798E-2,17458.686834024174,8.3734709036087165E-2,18129.428152301432,8.5572680790623204E-2,18787.947593343783,8.6548496376192108E-2,19244.287572631358,8.7117644058992097E-2,16690.649206108486,8.1521193738929798E-2,17533.774227073161,8.4094840417617084E-2,18283.41676242297,8.6299522148697114E-2,19024.162022430661,8.7636640973054458E-2,19562.731317640668,8.8559218278137911E-2,16690.649206108486,8.1521193738929798E-2,17608.861620122152,8.4454971799147016E-2,18438.984742904719,8.7033818289930703E-2,19265.246681339871,8.874722075428354E-2,19891.073995933762,9.0045604327450249E-2]
["NHS North East Essex CCG","E38000117",23904.310424164396,8.9886103723262376E-2,26202.951646626458,9.4759697839673307E-2,29014.870710913994,0.10066219369592698,31776.365093415374,0.10546420542122591,34546.279251796324,0.11028693414569127,23904.310424164396,8.9886103723262376E-2,25984.521753471192,9.3969773446662797E-2,28522.601345909188,9.8954348271958051E-2,30953.746533146856,0.10273397455408845,33334.395965869611,0.10641806910314652,23904.310424164396,8.9886103723262376E-2,25875.306806893561,9.3574811250157555E-2,28280.016682865968,9.811274175293494E-2,30554.225524778285,0.10140798381937696,32754.336442524105,0.10456626370362697,23904.310424164396,8.9886103723262376E-2,25766.091860315933,9.3179849053652314E-2,28039.798699462182,9.7279346029219338E-2,30162.461959765187,0.10010773966068763,32191.088911636161,0.1027681295863752,23904.310424164396,8.9886103723262376E-2,25110.802180850162,9.081007587462088E-2,26648.191071467852,9.2451398388384162E-2,27970.527891642989,9.283281742994684E-2,29146.512351130979,9.3048500674023066E-2,23904.310424164396,8.9886103723262376E-2,25329.232074005424,9.1600000267631376E-2,27102.593562241509,9.402787108743238E-2,28671.461065943105,9.5159180437912716E-2,30099.706674572288,9.6091516647210745E-2,23904.310424164396,8.9886103723262376E-2,25438.447020583048,9.1994962464136604E-2,27333.344827087505,9.4828423629917794E-2,29032.955391196545,9.6358962466633058E-2,30598.954175222116,9.7685334488641681E-2,23904.310424164396,8.9886103723262376E-2,25547.661967160675,9.2389924660641831E-2,27566.462771572958,9.5637186967710786E-2,29401.902946340553,9.7583481401727679E-2,31113.72095605404,9.9328696705574149E-2]
["NHS North East Hampshire and Farnham CCG","E38000118",11984.290342020369,7.1556546107119479E-2,13235.337737603002,7.7463055938212594E-2,14587.468123942739,8.3214307609485103E-2,15852.674797462752,8.8227264010812295E-2,17032.384805577385,9.2860019657493104E-2,11984.290342020369,7.1556546107119479E-2,13125.149243428536,7.6818150786775938E-2,14340.152971420179,8.180349669948761E-2,15442.26101173805,8.5943126734962433E-2,16434.596378937829,8.9600896188735304E-2,11984.290342020369,7.1556546107119479E-2,13070.054996341301,7.6495698211057617E-2,14218.278917893434,8.1108265361628268E-2,15242.935422162767,8.4833790194583522E-2,16148.469097668469,8.8040939361402615E-2,11984.290342020369,7.1556546107119479E-2,13014.960749254074,7.6173245635339323E-2,14097.593879523052,8.0419816768528538E-2,15047.480109589298,8.3745993486138121E-2,15870.634706181962,8.6526195105124645E-2,11984.290342020369,7.1556546107119479E-2,12684.395266730678,7.4238530181029383E-2,13398.45296758427,7.6431562849881743E-2,13953.899193224712,7.7659723915987938E-2,14368.829496865712,7.8338400920650489E-2,11984.290342020369,7.1556546107119479E-2,12794.583760905143,7.4883435332466025E-2,13626.743877605102,7.7733849843725625E-2,14303.602751470024,7.9605981475233886E-2,14839.013830215925,8.0901830935644556E-2,11984.290342020369,7.1556546107119479E-2,12849.678007992372,7.5205887908184332E-2,13742.672855350047,7.8395167457786921E-2,14483.956394957999,8.0609730604174076E-2,15085.278781125757,8.2244459607053524E-2,11984.290342020369,7.1556546107119479E-2,12904.772255079606,7.5528340483902653E-2,13859.790848251359,7.9063267816607871E-2,14668.028539879084,8.1634174865756248E-2,15339.198962692175,8.3628824352263514E-2]
["NHS North East Lincolnshire CCG","E38000119",11317.584444721742,8.7421477249511367E-2,12109.395605372636,9.3091909635398498E-2,12956.296841187359,9.8707122056889848E-2,13843.289864547374,0.10403795178526512,14669.620545693937,0.10926277778708429,11317.584444721742,8.7421477249511367E-2,12008.636813482261,9.2317318676831656E-2,12736.828959935116,9.7035113209927762E-2,13485.76334534761,0.10135099462909675,14156.292624718213,0.105439390918503,11317.584444721742,8.7421477249511367E-2,11958.257417537074,9.1930023197548241E-2,12628.677720375721,9.6211166542554655E-2,13312.123505003416,0.10004602062981677,13910.591778259706,0.1036093533312953,11317.584444721742,8.7421477249511367E-2,11907.878021591881,9.1542727718264785E-2,12521.581614860801,9.5395258379253417E-2,13141.855205072645,9.8766385127556353E-2,13672.012133352471,0.10183235612507427,11317.584444721742,8.7421477249511367E-2,11605.601645920753,8.921895484256423E-2,11901.162796705432,9.0668617984956831E-2,12189.196712374285,9.1606769219707562E-2,12382.394416692221,9.2226980609952491E-2,11317.584444721742,8.7421477249511367E-2,11706.360437811129,8.9993545801131072E-2,12103.748533245962,9.2212010766767979E-2,12493.836323128215,9.3896259755961345E-2,12786.147208747456,9.5234226193560673E-2,11317.584444721742,8.7421477249511367E-2,11756.739833756321,9.0380841280414528E-2,12206.624102582949,9.2995764913781448E-2,12650.949004583083,9.5077025436517998E-2,12997.617805410509,9.6809308844112235E-2,11317.584444721742,8.7421477249511367E-2,11807.119229701506,9.0768136759697929E-2,12310.554805964419,9.3787557564866841E-2,12811.301009180259,9.6282135947544423E-2,13215.662038267261,9.843335348031626E-2]
["NHS North Hampshire CCG","E38000120",13155.49383671593,7.41990628128366E-2,14731.221361914788,7.994801564047968E-2,16466.525348018051,8.5960144852881865E-2,18093.991736466181,9.1190362546447842E-2,19634.239368367234,9.5982789247004471E-2,13155.49383671593,7.41990628128366E-2,14608.779760910336,7.9283511130523898E-2,16187.812835466677,8.4505182895524514E-2,17626.661498165482,8.8835104818896699E-2,18946.581105193814,9.2621143455190721E-2,13155.49383671593,7.41990628128366E-2,14547.558960408112,7.8951258875546021E-2,16050.46652519497,8.3788194430961416E-2,17399.693305293589,8.7691227221517939E-2,18617.438250437841,9.1012115029516241E-2,13155.49383671593,7.41990628128366E-2,14486.338159905885,7.861900662056813E-2,15914.460178925909,8.3078200975808675E-2,17177.132121972685,8.6569560134929363E-2,18297.835015270743,8.9449721427799875E-2,13155.49383671593,7.41990628128366E-2,14119.013356892538,7.6625493090700839E-2,15126.561345367221,7.8965135442510034E-2,15931.892687962581,8.0293784336067847E-2,16570.252620160376,8.1004363610482868E-2,13155.49383671593,7.41990628128366E-2,14241.454957896984,7.7289997600656579E-2,15383.834433876184,8.0308177249301435E-2,16330.093364679158,8.2300641894361246E-2,17111.12314831786,8.3648431503313747E-2,13155.49383671593,7.41990628128366E-2,14302.675758399209,7.762224985563447E-2,15514.480924134637,8.0990190666812678E-2,16535.458569556009,8.3335644438846931E-2,17394.410881697237,8.5033295276189066E-2,13155.49383671593,7.41990628128366E-2,14363.896558901433,7.7954502110612348E-2,15646.467378395744,8.1679199093734306E-2,16745.057960079881,8.4391986493699639E-2,17686.504711653444,8.6461208015513519E-2]
["NHS North Kirklees CCG","E38000121",14536.623514219387,9.7639867774176436E-2,15896.372590415402,0.10320979476961045,17387.51858643792,0.10928672901595173,18732.396362062314,0.114459222547124,20021.436270216855,0.11911849280233731,14536.623514219387,9.7639867774176436E-2,15764.345116568149,0.10235258483682735,17093.737016629817,0.10744020752124335,18249.404440543196,0.11150803153209823,19321.835199724534,0.11495618276847057,14536.623514219387,9.7639867774176436E-2,15698.331379644524,0.1019239798704358,16948.964848815733,0.10653026303466834,18014.829840796494,0.11007472712206094,18986.976003138243,0.11296392196060354,14536.623514219387,9.7639867774176436E-2,15632.3176427209,0.10149537490404428,16805.605092394951,0.10562919605527939,17784.809943135679,0.10866925298262055,18661.822104130522,0.11102940328492696,14536.623514219387,9.7639867774176436E-2,15236.235221179148,9.892374510569503E-2,15975.107193129747,0.10040922182985385,16497.838680221335,0.10080556446426332,16904.236166887025,0.10057256167829025,14536.623514219387,9.7639867774176436E-2,15368.262695026402,9.9780955038478128E-2,16246.290180644915,0.10211370320958464,16909.384294510906,0.10332020221502448,17454.500187202146,0.10384638378868483,14536.623514219387,9.7639867774176436E-2,15434.276431950022,0.10020956000486964,16384.000291492459,0.10297926016022915,17121.631923248369,0.10461708372997904,17742.707880097383,0.1055610892437969,14536.623514219387,9.7639867774176436E-2,15500.290168873646,0.10063816497126117,16523.122813733316,0.10385369461805981,17338.255638303639,0.10594070413236978,18039.874608202314,0.1073290969074388]
["NHS North Lincolnshire CCG","E38000122",12117.780798853413,8.7341652002691436E-2,13221.725286652931,9.3625019732707357E-2,14429.201894812462,9.9800815429606213E-2,15456.342438750007,0.10531713299775149,16467.115984018415,0.1106512295660423,12117.780798853413,8.7341652002691436E-2,13111.882534979697,9.284720673402988E-2,14185.254806145216,9.8113534417936216E-2,15057.415438945691,0.10259890596174497,15890.980127875589,0.10677986915653534,12117.780798853413,8.7341652002691436E-2,13056.961159143084,9.2458300234691163E-2,14065.040495624095,9.728206180401229E-2,14863.668634624566,0.10127874512554215,15615.216699187897,0.10492686936693923,12117.780798853413,8.7341652002691436E-2,13002.039783306471,9.2069393735352459E-2,13945.999007644645,9.6458701118029108E-2,14673.683784814833,9.9984217667040298E-2,15347.445782469373,0.10312757547688062,12117.780798853413,8.7341652002691436E-2,12672.511528286783,8.9735954739320112E-2,13256.379353142993,9.1688887488885013E-2,13610.710343905082,9.2741280620775982E-2,13900.037650309445,9.3401677531981211E-2,12117.780798853413,8.7341652002691436E-2,12782.354279960011,9.0513767737997547E-2,13481.561281143531,9.3246377653503479E-2,13950.626292550329,9.5057415457551975E-2,14353.191377226627,9.644665621036573E-2,12117.780798853413,8.7341652002691436E-2,12837.275655796624,9.0902674237336265E-2,13595.911478956305,9.4037290627723799E-2,14125.93214338424,9.6251922481495222E-2,14590.536334083679,9.8041502043298479E-2,12117.780798853413,8.7341652002691436E-2,12892.197031633239,9.1291580736674982E-2,13711.43449931075,9.4836315529884863E-2,14304.852421101645,9.7471057652641357E-2,14835.259240515787,9.9685924207201904E-2]
["NHS North Manchester CCG","E38000123",10464.434422113871,7.4543627454864439E-2,11416.18807725745,7.77563552462706E-2,12518.390962504172,8.2368673262956771E-2,13724.456236196684,8.6775772864167183E-2,15046.2162891804,9.1600001760504077E-2,10464.434422113871,7.4543627454864439E-2,11321.708737956787,7.7112850687622858E-2,12307.460478040934,8.0980790091070745E-2,13372.046422544678,8.4547587395957732E-2,14522.422185287216,8.8411190705510873E-2,10464.434422113871,7.4543627454864439E-2,11274.469068306464,7.6791098408299036E-2,12203.516369110734,8.0296857278001912E-2,13200.891611664565,8.3465424959942858E-2,14271.711773019146,8.6884888427000762E-2,10464.434422113871,7.4543627454864439E-2,11227.229398656133,7.6469346128975157E-2,12100.586349048144,7.9619596980182533E-2,13033.06008972949,8.2404274720090334E-2,14028.267755647548,8.5402823302371533E-2,10464.434422113871,7.4543627454864439E-2,10943.791380754164,7.4538832453032042E-2,11504.302094892453,7.5696158013504738E-2,12094.035475171455,7.6467093292687485E-2,12712.356174257495,7.7391672800788347E-2,10464.434422113871,7.4543627454864439E-2,11038.270720054819,7.5182337011679742E-2,11699.007157473901,7.6977280941399523E-2,12394.315266156213,7.836567568384048E-2,13124.341034747758,7.9899799310530609E-2,10464.434422113871,7.4543627454864439E-2,11085.510389705149,7.5504089291003607E-2,11797.880822066048,7.7627851178221116E-2,12549.179444952808,7.93448371582752E-2,13340.123280662492,8.1213462076357559E-2,10464.434422113871,7.4543627454864439E-2,11132.750059355476,7.5825841570327443E-2,11897.768575525801,7.8285093930292135E-2,12707.236587637777,8.0344186821179664E-2,13562.61319187011,8.256796050085298E-2]
["NHS North Norfolk CCG","E38000124",14897.991503234907,0.10327181133533142,16212.2779728654,0.1096758082320755,17744.002714613722,0.11652221378128265,19187.527923605197,0.12202701554060799,20568.778877180128,0.1273293232461318,14897.991503234907,0.10327181133533142,16077.295635245895,0.1087626548183324,17443.581607994845,0.1145493932755112,18691.853182801544,0.11887467045790859,19848.65263039085,0.12287144131726417,14897.991503234907,0.10327181133533142,16009.804466436146,0.10830607811146087,17295.53755305045,0.11357721009358057,18451.118920491597,0.1173436715879649,19503.96920063156,0.12073770707336612,14897.991503234907,0.10327181133533142,15942.313297626399,0.10784950140458936,17148.937830349409,0.11261451162561997,18215.058961571165,0.11584239990823689,19169.2758063568,0.118665815317301,14897.991503234907,0.10327181133533142,15537.366284767902,0.10511004116336019,16299.670471253747,0.10703749981122765,16894.293295014209,0.10744272001408174,17360.125109222929,0.10746641766264041,14897.991503234907,0.10327181133533142,15672.348622387401,0.10602319457710324,16576.982261978861,0.1088585648934782,17316.645629708048,0.1101287562306541,17926.532995668644,0.11097271880443635,14897.991503234907,0.10327181133533142,15739.83979119715,0.10647977128397476,16717.804655706459,0.10978332450555857,17534.466640108669,0.11151403357993304,18223.196241244284,0.11280918807257824,14897.991503234907,0.10327181133533142,15807.330960006897,0.10693634799084628,16860.071381677422,0.11071756883160902,17756.778647883515,0.11292787234726226,18529.081365791422,0.11470274461923625]
["NHS North Somerset CCG","E38000125",14875.709835132853,8.6516865389861891E-2,16609.483524627794,9.2459828126407226E-2,18431.654063550239,9.8218342020410521E-2,20253.719447911775,0.10320892503012523,22007.713856050643,0.10788095027475805,14875.709835132853,8.6516865389861891E-2,16471.034949244717,9.1689127973974147E-2,18118.992048011012,9.6552233017217368E-2,19729.531404724941,0.1005377670440529,21235.395328923129,0.10409507514178004,14875.709835132853,8.6516865389861891E-2,16401.81066155318,9.1303777897757621E-2,17964.915814391923,9.5731193724778452E-2,19474.949091969447,9.9240466224874882E-2,20865.730426437156,0.10228299228645665,14875.709835132853,8.6516865389861891E-2,16332.586373861639,9.0918427821541081E-2,17812.342763539855,9.4918164571777972E-2,19225.309968255686,9.7968354913655145E-2,20506.779602941853,0.10052342942618556,14875.709835132853,8.6516865389861891E-2,15917.240647712408,8.8606327364241858E-2,16928.471296534739,9.0208202581981978E-2,17828.568288140315,9.0850837179679553E-2,18566.507868656634,9.1012293473807029E-2,14875.709835132853,8.6516865389861891E-2,16055.689223095484,8.9377027516674923E-2,17217.082387801711,9.1746149354160242E-2,18275.216111064688,9.3126865629151484E-2,19173.967055936006,9.39900345879216E-2,14875.709835132853,8.6516865389861891E-2,16124.913510787022,8.9762377592891462E-2,17363.642707585728,9.2527137949407062E-2,18505.567104988157,9.4300688468141852E-2,19492.131435997671,9.5549663901949369E-2,14875.709835132853,8.6516865389861891E-2,16194.137798478563,9.0147727669108016E-2,17511.706210136752,9.3316136684092249E-2,18740.667437402695,9.5498712991248957E-2,19820.186065187696,9.7157774829351451E-2]
["NHS North Staffordshire CCG","E38000126",15322.674903983303,8.4833766493097679E-2,16516.925467960547,9.014804861893104E-2,17884.815609063349,9.5979476274891881E-2,19080.623296966507,0.10073183030813276,20138.000271737583,0.1047544749882313,15322.674903983303,8.4833766493097679E-2,16379.636379787749,8.9398735835540588E-2,17582.23139851942,9.4355647732743492E-2,18588.203962735413,9.813221393060613E-2,19433.52546163672,0.1010899160509609,15322.674903983303,8.4833766493097679E-2,16310.99183570135,8.9024079443845369E-2,17433.121390919649,9.355544376365596E-2,18349.050753150685,9.6869658711596904E-2,19096.333483414553,9.9335900350679129E-2,15322.674903983303,8.4833766493097679E-2,16242.347291614957,8.8649423052150164E-2,17285.466115101339,9.2763046662559523E-2,18114.541147876549,9.5631618350103198E-2,18768.914414293027,9.7632721672352429E-2,15322.674903983303,8.4833766493097679E-2,15830.480027096562,8.6401484701978823E-2,16430.083827602157,8.8172608283793918E-2,16802.449776936824,8.8704729051508946E-2,16999.08433312373,8.8426364612587044E-2,15322.674903983303,8.4833766493097679E-2,15967.769115269359,8.7150797485369261E-2,16709.392329642706,8.9671526938084722E-2,17222.028259236919,9.0919798644477454E-2,17553.181743157755,9.1308685721794416E-2,15322.674903983303,8.4833766493097679E-2,16036.413659355761,8.7525453877064507E-2,16851.228678335174,9.0432696567216794E-2,17438.418702593201,9.2062182993312217E-2,17843.397222072188,9.2818337609613971E-2,15322.674903983303,8.4833766493097679E-2,16105.058203442157,8.7900110268759712E-2,16994.5197588091,9.1201673064339933E-2,17659.27064813027,9.3228120832701253E-2,18142.634148914931,9.4374917545333614E-2]
["NHS North Tyneside CCG","E38000127",14100.750344859225,8.4213750267912238E-2,15299.030596961673,8.9124027711532522E-2,16672.340854048354,9.4578743215613534E-2,18048.396778517719,9.9869393418092742E-2,19400.18832431555,0.10512728039620435,14100.750344859225,8.4213750267912238E-2,15171.290472333494,8.8379881581809941E-2,16389.00935794914,9.2971462207562625E-2,17580.412747443417,9.7279840346632451E-2,18718.456500204134,0.10143305787473791,14100.750344859225,8.4213750267912238E-2,15107.420410019409,8.8007808516948671E-2,16249.386865881019,9.2179412672345237E-2,17353.12702715263,9.6022172571672365E-2,18392.150294370847,9.9664843905770281E-2,14100.750344859225,8.4213750267912238E-2,15043.550347705326,8.7635735452087415E-2,16111.126544467221,9.1395090449666552E-2,17130.254481798172,9.4788924755412646E-2,18075.301492908213,9.7947878470294861E-2,14100.750344859225,8.4213750267912238E-2,14660.32997382081,8.5403297062919784E-2,15310.170199725209,8.6851430676907246E-2,15883.272963761316,8.7888849954411888E-2,16362.607905709458,8.8666998513652631E-2,14100.750344859225,8.4213750267912238E-2,14788.070098448981,8.6147443192642323E-2,15571.706965355248,8.8335074684338821E-2,16282.030721324682,9.0095344850180836E-2,16898.81705422937,9.1572651209653036E-2,14100.750344859225,8.4213750267912238E-2,14851.940160763064,8.6519516257503579E-2,15704.518604151757,8.9088487656862697E-2,16487.683231143288,9.1233306945237319E-2,17179.663331468695,9.3094523309140004E-2,14100.750344859225,8.4213750267912238E-2,14915.810223077149,8.6891589322364848E-2,15838.692413602585,8.9849627941925261E-2,16697.575850214445,9.2394731353554915E-2,17469.239811781434,9.4663703326007556E-2]
["NHS North West Surrey CCG","E38000128",21416.191955190014,7.752748318559953E-2,23409.462638302117,8.190281519243621E-2,25790.188050703604,8.6748025733950893E-2,28139.810437587115,9.1351157114618609E-2,30583.385631125453,9.5824619724042659E-2,21416.191955190014,7.752748318559953E-2,23214.61785745942,8.1221110690152615E-2,25353.400559299324,8.527884480087225E-2,27412.872344780641,8.8991274979809895E-2,29512.421509654821,9.2469048469904822E-2,21416.191955190014,7.752748318559953E-2,23117.195467038069,8.088025843901081E-2,25138.156723390959,8.4554849389138764E-2,27059.820451853779,8.7845151447389233E-2,28999.811966281719,9.0862927579526631E-2,21416.191955190014,7.752748318559953E-2,23019.773076616722,8.053940618786902E-2,24925.012827345112,8.3837917347275845E-2,26713.623717988794,8.6721282034764299E-2,28502.059497794929,8.9303357243373002E-2,21416.191955190014,7.752748318559953E-2,22435.238734088623,7.8494292681018207E-2,23690.248188182977,7.9684655863380333E-2,24776.638038358411,8.0433184126601776E-2,25811.509756548094,8.0873260297493713E-2,21416.191955190014,7.752748318559953E-2,22630.083514931317,7.9175997183301788E-2,24093.436641786939,8.1040822878529886E-2,25396.044224311943,8.2443982029320684E-2,26653.865561805764,8.3512550325246779E-2,21416.191955190014,7.752748318559953E-2,22727.505905352667,7.9516849434443593E-2,24298.180778382706,8.1729501440910526E-2,25715.492396347257,8.3481016739213279E-2,27095.059996235967,8.4894911631269485E-2,21416.191955190014,7.752748318559953E-2,22824.928295774018,7.9857701685585397E-2,24505.024854840987,8.2425243373161733E-2,26041.526897677315,8.453943285832137E-2,27549.969111328144,8.6320244113698916E-2]
["NHS North, East, West Devon CCG","E38000129",64860.733559628228,8.7925297635327263E-2,70549.646570291821,9.336656860629923E-2,77019.502105715743,9.9185471212223444E-2,83246.575139925568,0.10385310903456368,89084.476149285081,0.10841220385202391,64860.733559628228,8.7925297635327263E-2,69961.881300527239,9.2588710331287211E-2,75713.925209688459,9.7504153414836023E-2,81094.076767520266,0.10116778957498972,85962.558791610951,0.10461295671470933,64860.733559628228,8.7925297635327263E-2,69667.998665644947,9.2199781193781194E-2,75070.551979675045,9.6675619404104282E-2,80048.673269726132,9.9863610955520501E-2,84468.274717025561,0.10279447344232288,64860.733559628228,8.7925297635327263E-2,69374.1160307627,9.1810852056275247E-2,74433.455561661714,9.5855168652013767E-2,79023.568224949224,9.8584755389292664E-2,83017.29980569036,0.1010286956696811,64860.733559628228,8.7925297635327263E-2,67610.82022146901,8.9477277231239258E-2,70742.690105584625,9.1102212570937813E-2,73288.061220934309,9.142950325723484E-2,75174.204252358613,9.1483965648102294E-2,64860.733559628228,8.7925297635327263E-2,68198.585491233578,9.0255135506251263E-2,71947.838009609812,9.2654198230064683E-2,75122.152487187035,9.3717598352238113E-2,77629.716213077059,9.4472224374576572E-2,64860.733559628228,8.7925297635327263E-2,68492.46812611584,9.0644064643757238E-2,72559.827179622574,9.3442315947590004E-2,76068.053764308483,9.4897644357778976E-2,78915.821447924231,9.6037362420196948E-2,64860.733559628228,8.7925297635327263E-2,68786.350760998102,9.10329937812632E-2,73178.093161635508,9.4238516923756663E-2,77033.457476681753,9.610202035564977E-2,80241.905706116042,9.7651153320006873E-2]
["NHS Northumberland CCG","E38000130",24421.451270255733,9.2470470542429892E-2,26524.133832155912,9.9617418433696064E-2,28886.701378462887,0.10722606302324751,30890.178798735084,0.11362531743814859,32766.537387140157,0.11964703639501993,24421.451270255733,9.2470470542429892E-2,26303.274644614496,9.8787931512861471E-2,28397.142139561231,0.10540884238886869,30091.082615442276,0.11068595091386106,31617.677608328067,0.11545197403172448,24421.451270255733,9.2470470542429892E-2,26192.8450508438,9.837318805244423E-2,28155.892995390946,0.10451333702817721,29702.985715673316,0.1092583893021162,31067.783849228195,0.11344403654870443,24421.451270255733,9.2470470542429892E-2,26082.41545707309,9.7958444592026933E-2,27916.997501407681,0.10362656830515098,29322.424438946284,0.10785854645385963,30533.827781620948,0.11149429555839097,24421.451270255733,9.2470470542429892E-2,25419.837894448869,9.5469983829523278E-2,26533.05119143569,9.8489425357964677E-2,27193.167657657286,0.10002636525291429,27647.583211291952,0.10095517129661853,24421.451270255733,9.2470470542429892E-2,25640.697081990278,9.6299470750357843E-2,26984.952027344916,0.100166859789699,27874.057989311972,0.10253092764405196,28551.207043975068,0.10425475441457338,24421.451270255733,9.2470470542429892E-2,25751.126675760977,9.6714214210775099E-2,27214.432920580068,0.10101868196206408,28225.21556044402,0.1038226129641875,29024.491377400343,0.10598295252099739,24421.451270255733,9.2470470542429892E-2,25861.556269531684,9.7128957671192381E-2,27446.267464002252,0.10187924077209445,28583.61323998891,0.1051409300374785,29512.487917029266,0.10776487225965554]
["NHS Norwich CCG","E38000131",12714.706012176646,7.698417299695233E-2,13785.28017977494,8.0776281376860076E-2,15020.55070852429,8.5373142597046092E-2,16231.356518430708,8.9261749441435917E-2,17467.61746300404,9.3091118434257297E-2,12714.706012176646,7.698417299695233E-2,13670.591561175534,8.0104251501087159E-2,14766.261066603203,8.3927822363323884E-2,15812.083037787987,8.6956021985195697E-2,16855.993909808523,8.9831559954212978E-2,12714.706012176646,7.698417299695233E-2,13613.247251875833,7.9768236563200715E-2,14640.950065175744,8.3215585228917491E-2,15608.454561773658,8.583619974578563E-2,16563.244541240263,8.8271394911747292E-2,12714.706012176646,7.698417299695233E-2,13555.902942576127,7.9432221625314228E-2,14516.861610103675,8.2510296749480933E-2,15408.779911303314,8.4738120937655703E-2,16278.979991864249,8.6756448475081266E-2,12714.706012176646,7.698417299695233E-2,13211.837086777918,7.7416131997995533E-2,13798.004353134447,7.8424487627227729E-2,14291.591617155224,7.8594322575644651E-2,14742.417225848378,7.8567561425327101E-2,12714.706012176646,7.698417299695233E-2,13326.52570537732,7.8088161873768436E-2,14032.733253369297,7.9758629381432855E-2,14648.844304951168,8.0558976600039425E-2,15223.483435572656,8.1131333593970664E-2,12714.706012176646,7.698417299695233E-2,13383.870014677024,7.8424176811654894E-2,14151.931523019806,8.0436123240990143E-2,14833.09128320088,8.15722133919978E-2,15475.447905928339,8.2474141472651558E-2,12714.706012176646,7.698417299695233E-2,13441.214323976725,7.8760191749541339E-2,14272.352339025707,8.1120565755517265E-2,15021.137035012451,8.2606340931656683E-2,15735.244778461878,8.3858690995853108E-2]
["NHS Nottingham City CCG","E38000132",19935.552092652404,7.7679052730098203E-2,21366.880182722725,8.1434866158711511E-2,23156.339187858244,8.6057452013744026E-2,25067.76925933205,8.9566132840260285E-2,27034.976509763244,9.3969330934178807E-2,19935.552092652404,7.7679052730098203E-2,21189.242472765,8.075784157620626E-2,22764.911682171529,8.4602763795791319E-2,24421.462587605249,8.7256905057900708E-2,26090.417597891508,9.0686192554367426E-2,19935.552092652404,7.7679052730098203E-2,21100.423617786135,8.0419329284953642E-2,22572.020723840342,8.3885910226848298E-2,24107.570942467391,8.6135382815733144E-2,25638.311030737161,8.9114741156542096E-2,19935.552092652404,7.7679052730098203E-2,21011.604762807277,8.0080816993701037E-2,22381.011628517266,8.3176050351260841E-2,23799.774087355359,8.5035637013560664E-2,25199.30796743216,8.7588835479430513E-2,19935.552092652404,7.7679052730098203E-2,20478.691632934107,7.8049743246185327E-2,21274.476179749076,7.9063758658202296E-2,22077.637387995943,7.8882511747877457E-2,22826.322089586778,7.9340709383339508E-2,19935.552092652404,7.7679052730098203E-2,20656.329342891826,7.872676782869055E-2,21635.793877306038,8.0406547782466323E-2,22628.339510297832,8.0850148314627099E-2,23569.255178447343,8.1923028079413776E-2,19935.552092652404,7.7679052730098203E-2,20745.148197870683,7.9065280119943154E-2,21819.27552059669,8.1088432884631675E-2,22912.354733740412,8.1864923301916581E-2,23958.375716245577,8.3275549934812565E-2,19935.552092652404,7.7679052730098203E-2,20833.967052849552,7.9403792411195787E-2,22004.639026895442,8.1777311680152523E-2,23202.225735835262,8.2900620751162141E-2,24359.592199727722,8.4670115397037615E-2]
["NHS Nottingham North and East CCG","E38000133",10321.938889454781,8.417826528669696E-2,11299.247355297288,8.9293878262188139E-2,12313.802673986163,9.425752199928171E-2,13323.083972014363,9.8938689826335677E-2,14219.243953999476,0.10299322000579078,10321.938889454781,8.417826528669696E-2,11205.134388146209,8.8550137412250748E-2,12104.971640950242,9.2658999088718941E-2,12978.36029932189,9.6378733843174594E-2,13720.539124729808,9.938098743104308E-2,10321.938889454781,8.417826528669696E-2,11158.077904570673,8.8178266987282067E-2,12002.06211745898,9.1871265442888705E-2,12810.938415140652,9.5135440480771216E-2,13481.837519620158,9.765201738099491E-2,10321.938889454781,8.417826528669696E-2,11111.021420995135,8.7806396562313385E-2,11900.156589318854,9.1091217003359259E-2,12646.767338190573,9.3916287971116688E-2,13250.054255513804,9.5973158449324955E-2,10321.938889454781,8.417826528669696E-2,10828.682519541908,8.5575174012501254E-2,11309.807322851917,8.6572315698499061E-2,11728.223071433225,8.7095077019406095E-2,11997.173675810043,8.6898259277198631E-2,10321.938889454781,8.417826528669696E-2,10922.795486692985,8.6318914862438631E-2,11502.574430269691,8.8047875308249327E-2,12021.953689519274,8.9276352959448052E-2,12389.424825613718,8.9739423624610445E-2,10321.938889454781,8.417826528669696E-2,10969.851970268523,8.6690785287407326E-2,11600.463977005282,8.8797182922575643E-2,12173.440244136003,9.0401308808376685E-2,12594.871292667262,9.1227519141440394E-2,10321.938889454781,8.417826528669696E-2,11016.908453844058,8.7062655712375994E-2,11699.357519092007,8.9554175743202749E-2,12328.050123347379,9.1549458809946374E-2,12806.7041337747,9.2761872618967831E-2]
["NHS Nottingham West CCG","E38000134",7682.9640578346653,8.2364537498227544E-2,8292.0479193031479,8.6664380427499438E-2,8975.1394573804464,9.1415150309436199E-2,9613.8653106897291,9.5167940117696775E-2,10172.346303638293,9.8569247128278026E-2,7682.9640578346653,8.2364537498227544E-2,8223.0382496385482,8.5943125518797528E-2,8823.2162967398017,8.9867756128944806E-2,9365.5257705292024,9.2709619585519709E-2,9816.3624206872082,9.5119790898131856E-2,7682.9640578346653,8.2364537498227544E-2,8188.5334148062493,8.5582498064446566E-2,8748.3503161356366,8.9105218131346878E-2,9244.9147506777517,9.1515687494335279E-2,9645.9732059326052,9.3468732615626021E-2,7682.9640578346653,8.2364537498227544E-2,8154.0285799739513,8.5221870610095632E-2,8674.2147353422461,8.8350119528847484E-2,9126.6456180736423,9.0344937815023174E-2,9480.5224191806701,9.1865527317642151E-2,7682.9640578346653,8.2364537498227544E-2,7946.9995709801597,8.3058105883989944E-2,8244.7396466081191,8.3975755210919933E-2,8464.9247126251084,8.3794542789795159E-2,8586.1952190809589,8.3199566076365875E-2,7682.9640578346653,8.2364537498227544E-2,8016.0092406447566,8.377936079269184E-2,8384.9764102764038,8.5404119069835041E-2,8676.5287665527594,8.588921764554304E-2,8866.1906777245531,8.5912700365547989E-2,7682.9640578346653,8.2364537498227544E-2,8050.5140754770546,8.4139988247042788E-2,8456.1903918267053,8.6129460091940363E-2,8785.6599469564389,8.6969510462843375E-2,9012.8418164099476,8.7333738531104141E-2,7682.9640578346653,8.2364537498227544E-2,8085.0189103093544,8.4500615701393736E-2,8528.1347731877831,8.6862240509144262E-2,8897.0411758918817,8.8072076577824995E-2,9164.0516561550721,8.8798950156541392E-2]
["NHS Oldham CCG","E38000135",16713.252188930812,9.3863035993096769E-2,18044.702400270431,9.9037883645831104E-2,19538.402036655734,0.10441642815656123,21014.299098140968,0.10951792317146637,22430.719586737676,0.11452424990675827,16713.252188930812,9.3863035993096769E-2,17894.446591861943,9.8213208517354225E-2,19207.266070117374,0.10264678318788679,20471.046671365817,0.10668671394291128,21644.964347199486,0.11051242901664192,16713.252188930812,9.3863035993096769E-2,17819.318687657702,9.7800870953115807E-2,19044.086086606887,0.10177472256630446,20207.205362858222,0.10531168106555254,21268.868055579936,0.10859219879291299,16713.252188930812,9.3863035993096769E-2,17744.19078345345,9.7388533388877319E-2,18882.498102935526,0.10091116985322536,19948.487024013579,0.10396334700861777,20903.672245313679,0.10672762302314755,16713.252188930812,9.3863035993096769E-2,17293.423358227996,9.4914508003446724E-2,17946.402197529016,9.5908519653318827E-2,18500.946743072422,9.6419359719993852E-2,18929.643877752915,9.6648850596103925E-2,16713.252188930812,9.3863035993096769E-2,17443.679166636484,9.5739183131923603E-2,18252.066166641343,9.7542038085941349E-2,18963.838861409076,9.8831763922290372E-2,19547.671572861622,9.9804307019614125E-2,16713.252188930812,9.3863035993096769E-2,17518.807070840729,9.6151520696162049E-2,18407.286150956199,9.8371559165007491E-2,19202.567573529643,0.10007592022894331,19871.371341657406,0.10145701695934549,16713.252188930812,9.3863035993096769E-2,17593.934975044966,9.6563858260400454E-2,18564.098135110184,9.9209588152576883E-2,19446.218354542063,0.10134572834345457,20205.133429043221,0.10316110195569907]
["NHS Oxfordshire CCG","E38000136",39560.190769960296,7.3308484860203652E-2,43795.301329509319,7.8567868626007911E-2,48309.937805038142,8.3862684104152596E-2,52889.445145220197,8.8645489985955034E-2,57222.149369720333,9.32078273549002E-2,39560.190769960296,7.3308484860203652E-2,43430.817102780733,7.7913991429767043E-2,47491.520741982902,8.2441969138601717E-2,51521.849961642758,8.6353328576097427E-2,55216.491993310527,8.9940858732913936E-2,39560.190769960296,7.3308484860203652E-2,43248.57498941644,7.7587052831646602E-2,47088.21425658308,8.1741857196443224E-2,50857.650254545799,8.524009495599659E-2,54256.498010998112,8.8377146877440235E-2,39560.190769960296,7.3308484860203652E-2,43066.332876052147,7.7260114233526161E-2,46688.842468601804,8.1048575614696042E-2,50206.347219955693,8.4148476836879357E-2,53324.327744943032,8.6858756425825898E-2,39560.190769960296,7.3308484860203652E-2,41972.880195866397,7.5298482644803572E-2,44375.240386503341,7.7032323692850291E-2,46562.27860897666,7.804082630895795E-2,48285.577307889143,7.8651253107716229E-2,39560.190769960296,7.3308484860203652E-2,42337.364422594983,7.5952359841044439E-2,45130.702290862027,7.8343752891820342E-2,47727.573047348676,7.9993921036720109E-2,49863.106471103943,8.1220853647224298E-2,39560.190769960296,7.3308484860203652E-2,42519.606535959276,7.627929843916488E-2,45514.335289169168,7.9009713031922321E-2,48328.553771568928,8.1001196318666091E-2,50689.357186796246,8.2566714208359801E-2,39560.190769960296,7.3308484860203652E-2,42701.848649323569,7.6606237037285307E-2,45901.902984894848,7.9682503532435597E-2,48941.925416433005,8.2029239434890405E-2,51541.292190022861,8.395441130769947E-2]
["NHS Portsmouth CCG","E38000137",12342.282548820373,7.209277189731525E-2,13349.81296045467,7.5670632357185519E-2,14585.01091854438,8.0269735379991103E-2,15842.094798083281,8.399838175017646E-2,17075.186412317715,8.8189166472046887E-2,12342.282548820373,7.209277189731525E-2,13238.958188418643,7.5042275186592469E-2,14338.708513988293,7.8914191051118854E-2,15433.981893702172,8.1834474515918201E-2,16478.797635626161,8.5108964134005594E-2,12342.282548820373,7.209277189731525E-2,13183.530802400632,7.4728096601295951E-2,14217.333530973878,7.8246194446746728E-2,15235.773772755641,8.0783530078237756E-2,16193.340287089693,8.3634646664031073E-2,12342.282548820373,7.209277189731525E-2,13128.103416382619,7.4413918015999433E-2,14097.142694135207,7.7584714882417222E-2,15041.414231079365,7.9752991681226751E-2,15916.156411528669,8.2203059660823627E-2,12342.282548820373,7.209277189731525E-2,12795.539100274535,7.2528846504220243E-2,13400.864742793972,7.3752695337336124E-2,13953.964200215441,7.3987084836773284E-2,14417.867499098495,7.4464763449532567E-2,12342.282548820373,7.209277189731525E-2,12906.393872310564,7.3157203674813306E-2,13628.220808538052,7.5003967025525892E-2,14301.707233690528,7.5830897315432272E-2,14886.950952190087,7.6887464890972465E-2,12342.282548820373,7.209277189731525E-2,12961.821258328573,7.347138226010981E-2,13743.675060673719,7.5639378429684753E-2,14481.049769978928,7.6781812141987954E-2,15132.639303235528,7.8156385204191353E-2,12342.282548820373,7.209277189731525E-2,13017.248644346586,7.3785560845406342E-2,13860.313458985134,7.6281306873886276E-2,14664.089960860325,7.7752332772324101E-2,15385.964961132551,7.9464750341558477E-2]
["NHS Redbridge CCG","E38000138",24902.876518326939,0.10807601995628389,27813.757170060486,0.11192658820949894,31225.157727456444,0.11760002157071574,34955.413195229346,0.12370970128549458,39000.560257941353,0.13027979776169613,24902.876518326939,0.10807601995628389,27582.393034805933,0.1109955454116939,30696.868042543156,0.11561037979264521,34053.38246952289,0.12051735018942132,37637.369983577337,0.12572611565866293,24902.876518326939,0.10807601995628389,27466.71096717866,0.11053002401279138,30436.532981468103,0.1146299072818172,33615.293369033789,0.11896692160615016,36984.888420410854,0.12354652732633235,24902.876518326939,0.10807601995628389,27351.02889955138,0.11006450261388885,30178.737774647445,0.1136590003564607,33185.710583132684,0.11744659747711171,36351.317873574866,0.12143011048094222,24902.876518326939,0.10807601995628389,26656.936493787718,0.10727137422047371,28685.303473065644,0.10803443609922282,30782.17634057489,0.10894031830611159,32926.617487791809,0.10999003703832111,24902.876518326939,0.10807601995628389,26888.300629042278,0.10820241701827879,29172.955489908669,0.10987102850974943,31550.774680587157,0.11166044266912216,33998.820765437093,0.11357168882094165,24902.876518326939,0.10807601995628389,27003.982696669547,0.10866793841718128,29420.591279711782,0.11080367309322003,31947.166160546822,0.11306330039831124,34560.400700806815,0.11544762393374805,24902.876518326939,0.10807601995628389,27119.66476429682,0.10913345981608379,29670.766923769275,0.11174588326216207,32351.730374130264,0.11449508201490043,35139.437541519692,0.11738187313441907]
["NHS Redditch and Bromsgrove CCG","E38000139",12422.571648192346,8.4403938362497252E-2,13534.529816653621,9.0592569053906433E-2,14801.097222270455,9.6929254893716163E-2,15949.467005531405,0.10225328250757408,16977.480361715287,0.1069649720370167,12422.571648192346,8.4403938362497252E-2,13421.919377019711,8.9838817784603148E-2,14550.533304828879,9.5288364799141337E-2,15537.138210802752,9.9609810301338322E-2,16382.341437489267,0.1032153568390201,12422.571648192346,8.4403938362497252E-2,13365.614157202759,8.946194214995154E-2,14427.058297435795,9.447975309388211E-2,15336.882559148578,9.8325955629879336E-2,16097.482322160424,0.10142062954990189,12422.571648192346,8.4403938362497252E-2,13309.308937385809,8.9085066515299932E-2,14304.787924261178,9.3679030283308318E-2,15140.515243381085,9.7067029384415221E-2,15820.879341082687,9.9677919235652029E-2,12422.571648192346,8.4403938362497252E-2,12971.477618484088,8.6823812707390147E-2,13596.463003801333,8.9040360208260214E-2,14041.831629752813,9.0023282662859416E-2,14325.730393998052,9.0257877986378868E-2,12422.571648192346,8.4403938362497252E-2,13084.088058117992,8.757756397669339E-2,13827.752773747407,9.055502798786777E-2,14393.166920376641,9.2275720735842046E-2,14793.830788498832,9.3207099221892853E-2,12422.571648192346,8.4403938362497252E-2,13140.393277934945,8.7954439611345012E-2,13945.204610048148,9.1324195219699741E-2,14574.362101998053,9.3437377240659397E-2,15039.004250258449,9.4751790891245288E-2,12422.571648192346,8.4403938362497252E-2,13196.698497751899,8.8331315245996647E-2,14063.861080567356,9.2101251346217147E-2,14759.293135745887,9.462298458613852E-2,15291.799013359196,9.6344499832152208E-2]
["NHS Richmond CCG","E38000140",10927.241975975498,6.9992582474862272E-2,12378.950838538753,7.4303426401793229E-2,13918.541474065401,7.8921192300212079E-2,15569.140756022054,8.3777124171448863E-2,17160.511241992521,8.858409685108673E-2,10927.241975975498,6.9992582474862272E-2,12275.845810045475,7.3684548679744749E-2,13682.607471997269,7.7583394601935071E-2,15166.546369512513,8.1610774696042374E-2,16558.945275283491,8.5478759422276951E-2,10927.241975975498,6.9992582474862272E-2,12224.293295798843,7.3375109818720544E-2,13566.341918093503,7.6924143332351466E-2,14971.018426149167,8.0558644135542243E-2,16271.009900679093,8.3992411215564181E-2,10927.241975975498,6.9992582474862272E-2,12172.740781552209,7.3065670957696338E-2,13451.2106622766,7.627132378247109E-2,14779.287021424048,7.9526942646491877E-2,15991.419820223469,8.2549142165101536E-2,10927.241975975498,6.9992582474862272E-2,11863.425696072394,7.120903779155098E-2,12784.243387199389,7.2489472596957302E-2,13706.541530321865,7.3754528251839577E-2,14480.124414874761,7.4747699849652904E-2,10927.241975975498,6.9992582474862272E-2,11966.530724565666,7.1827915513599433E-2,13002.028619877663,7.3724362779982219E-2,14049.582369565062,7.560042170450422E-2,14953.279933480699,7.719017103799658E-2,10927.241975975498,6.9992582474862272E-2,12018.083238812302,7.2137354374623666E-2,13112.622683347097,7.4351455451049542E-2,14226.499829407669,7.6552409757897497E-2,15201.101079991375,7.8469446004498108E-2,10927.241975975498,6.9992582474862272E-2,12069.635753058938,7.2446793235647886E-2,13224.351044903404,7.4984979841820162E-2,14407.064944020345,7.7524025742683744E-2,15456.625832033851,7.9788487673104744E-2]
["NHS Rotherham CCG","E38000141",18926.899219206287,8.9811612504537772E-2,20362.392544412734,9.5347408430477315E-2,21987.67414058463,0.10107416631692852,23456.36798442683,0.10585003603080699,24891.345344346893,0.11059870854148622,18926.899219206287,8.9811612504537772E-2,20193.027175676449,9.4554350888164676E-2,21615.52818170283,9.9363465025755396E-2,22850.744309151651,0.10311707720736304,24020.043159329591,0.10672728676499417,18926.899219206287,8.9811612504537772E-2,20108.344491308315,9.4157822117008405E-2,21432.138947157709,9.8520451168326334E-2,22556.611167591069,0.1017897615866023,23603.000416022391,0.1048742576025166,18926.899219206287,8.9811612504537772E-2,20023.661806940167,9.3761293345852065E-2,21250.538875876442,9.7685661836335577E-2,22268.189167965043,0.10048821826699027,23198.044914063321,0.10307493519089718,18926.899219206287,8.9811612504537772E-2,19515.565700731324,9.1382120718914231E-2,20198.510876729822,9.2849640878596221E-2,20654.455621929163,9.3206027174770584E-2,21009.099625002684,9.3348883075636185E-2,18926.899219206287,8.9811612504537772E-2,19684.931069467606,9.2175178261226856E-2,20542.030223389946,9.4428749762756031E-2,21170.492757054548,9.553471460764687E-2,21694.4133894593,9.6393910021591117E-2,18926.899219206287,8.9811612504537772E-2,19769.613753835743,9.2571707032383141E-2,20716.473641615787,9.5230640992993415E-2,21436.630104818312,9.6735695418855197E-2,22053.355082303911,9.7988781135270181E-2,18926.899219206287,8.9811612504537772E-2,19854.296438203881,9.2968235803539426E-2,20892.706223105488,9.6040756748669159E-2,21708.254628166254,9.7961437852735811E-2,22423.454601062589,9.9633229365780618E-2]
["NHS Rushcliffe CCG","E38000142",7263.8314870388876,7.7671423086386748E-2,8056.5248764863845,8.2580205786043318E-2,8861.9140512087215,8.7499151374493697E-2,9644.7537021473545,9.2100398225242117E-2,10413.470107720465,9.6349649405259682E-2,7263.8314870388876,7.7671423086386748E-2,7989.4061868005692,8.1892232337029219E-2,8711.6660151013912,8.6015659706767292E-2,9395.0695889587187,8.9716096151248273E-2,10047.971352468592,9.2967906666067662E-2,7263.8314870388876,7.7671423086386748E-2,7955.8468419576629,8.1548245612522177E-2,8637.6255165388866,8.5284612130123283E-2,9273.805550566276,8.855811259135099E-2,9873.0279101282267,9.1349258976019879E-2,7263.8314870388876,7.7671423086386748E-2,7922.2874971147567,8.1204258888015149E-2,8564.3073643038188,8.4560696724958723E-2,9154.8960789905577,8.7422613435738705E-2,9703.1548919680627,8.9777524907180453E-2,7263.8314870388876,7.7671423086386748E-2,7720.9314280573171,7.9140338540972924E-2,8139.5677237696364,8.0366979895039853E-2,8489.5924493369785,8.1069446613225543E-2,8784.9237751136716,8.128167815612207E-2,7263.8314870388876,7.7671423086386748E-2,7788.0501177431306,7.9828311989986994E-2,8278.2582186379386,8.1736356819094969E-2,8702.3421810868822,8.3101052149416363E-2,9072.4030586195368,8.3941553096035695E-2,7263.8314870388876,7.7671423086386748E-2,7821.6094625860387,8.017229871449405E-2,8348.6869855632522,8.2431743538341748E-2,8812.0642252797152,8.4148818041250142E-2,9222.9739445861505,8.5334696008384087E-2,7263.8314870388876,7.7671423086386748E-2,7855.1688074289441,8.0516285439001078E-2,8419.8380988160025,8.3134262429067948E-2,8924.0485003356735,8.5218186596024384E-2,9378.2253783042124,8.6771145247078213E-2]
["NHS Salford CCG","E38000143",15281.212696302608,7.7766985731819879E-2,16590.690534892394,8.068617126199977E-2,18239.925453240354,8.4939580205086865E-2,19982.144715197261,8.9110527627529704E-2,21853.203401129667,9.3621812188885559E-2,15281.212696302608,7.7766985731819879E-2,16453.157236858795,8.001730005281002E-2,17932.692706066347,8.3508860510693617E-2,19468.906070379351,8.6821735954242557E-2,21092.687505010352,9.036366851602412E-2,15281.212696302608,7.7766985731819879E-2,16384.390587841994,7.9682864448215124E-2,17781.291953252225,8.2803818353600747E-2,19219.641549962449,8.5710138913496478E-2,20728.671849936523,8.8804180661196649E-2,15281.212696302608,7.7766985731819879E-2,16315.623938825192,7.9348428843620228E-2,17631.368280953368,8.2105654656577098E-2,18975.216963759685,8.4620125596502338E-2,20375.206540475909,8.7289891785090862E-2,15281.212696302608,7.7766985731819879E-2,15903.024044724398,7.7341815216050963E-2,16762.844937980673,7.8061120135888395E-2,17607.650846255561,7.8521454005777563E-2,18464.586187752895,7.9104559111271081E-2,15281.212696302608,7.7766985731819879E-2,16040.557342758,7.8010686425240741E-2,17046.44439691053,7.9381784469174488E-2,18044.968954381253,8.0471677463348434E-2,19062.762137108828,8.1667218477888909E-2,15281.212696302608,7.7766985731819879E-2,16109.323991774794,7.8345122029835595E-2,17190.459747148343,8.0052434325921309E-2,18270.508307081833,8.1477471936683157E-2,19376.064304694781,8.3009443512530118E-2,15281.212696302608,7.7766985731819879E-2,16178.090640791592,7.8679557634430464E-2,17335.952177901429,8.0729962642737393E-2,18500.697792654802,8.2504003713230481E-2,19699.105577862825,8.4393392073784698E-2]
["NHS Sandwell and West Birmingham CCG","E38000144",43324.005726952993,0.11478990442200465,46732.538500185743,0.11935571972259729,50503.328289214187,0.12426388536295996,54554.445982403995,0.12930045028063139,58768.159791240745,0.13457329927007269,43324.005726952993,0.11478990442200465,46343.37057355282,0.11836177803941569,49647.756727903936,0.12215874397889852,53145.229664063059,0.12596044194174977,56711.272139700057,0.12986322908106265,43324.005726952993,0.11478990442200465,46148.786610236377,0.11786480719782494,49226.140934469797,0.12112135459492593,52460.815827923449,0.12433830069189289,55726.757141776368,0.12760878667684078,43324.005726952993,0.11478990442200465,45954.202646919919,0.11736783635623416,48808.638465849639,0.12009408608299207,51789.691159197719,0.12274765633105261,54770.776558086502,0.12541968527155142,43324.005726952993,0.11478990442200465,44786.698867021172,0.11438601130668941,46390.003475222569,0.11414301332420297,48034.719649052182,0.11384793242570199,49603.321899542832,0.11358672292086749,43324.005726952993,0.11478990442200465,45175.866793654088,0.11537995298987098,47179.761839508981,0.11608622075564436,49235.478439332575,0.1166938719172653,51221.145708298303,0.11729138014265698,43324.005726952993,0.11478990442200465,45370.450756970531,0.11587692383146174,47580.811008873141,0.11707300577942312,49854.749297953254,0.11816161665233517,52068.501250762049,0.11923174089938642,43324.005726952993,0.11478990442200465,45565.034720286996,0.11637389467305255,47985.97350305134,0.11806991167524074,50486.788180167641,0.11965962310430328,52942.197131555433,0.12123241843726913]
["NHS Scarborough and Ryedale CCG","E38000145",9021.153475597479,9.7631531121184834E-2,9721.9930838395685,0.10471771955880621,10371.349240380674,0.11120897748638939,11075.003346122388,0.11714621690419282,11714.344510409805,0.12245812785291453,9021.153475597479,9.7631531121184834E-2,9641.0263887728015,0.10384560953008187,10195.551901718736,0.10932395348186506,10788.705876216871,0.11411789587705597,11303.942180823953,0.11816790906150902,9021.153475597479,9.7631531121184834E-2,9600.5430412394198,0.10340955451571973,10108.921001656965,0.10839503540271248,10649.659835445937,0.1126471317478944,11107.505954296243,0.11611442561463771,9021.153475597479,9.7631531121184834E-2,9560.0596937060382,0.10297349950135759,10023.135281107992,0.10747517993896624,10513.313632136587,0.11120492523943926,10916.763082029362,0.11412045872913822,9021.153475597479,9.7631531121184834E-2,9317.1596085057481,0.1003571694151847,9526.1697275829047,0.10214636208002256,9750.4507352694727,0.10313571752982306,9885.7221166625459,0.10334227594253131,9021.153475597479,9.7631531121184834E-2,9398.1263035725133,0.10122927944390901,9688.4441940400739,0.10388638423804497,9994.3978136206642,0.1057160758792116,10208.519844324228,0.10671670336947761,9021.153475597479,9.7631531121184834E-2,9438.6096511058931,0.10166533445827114,9770.849196537858,0.10476998924016576,10120.209357030868,0.10704685167157676,10377.589209077389,0.1084841021229081,9021.153475597479,9.7631531121184834E-2,9479.0929986392712,0.10210138947263325,9854.099378548437,0.10566265685769287,10248.614861923777,0.10840506517795406,10551.914153154225,0.11030644107416082]
["NHS Sheffield CCG","E38000146",37641.016021726908,8.1168361628772376E-2,40386.29494713014,8.4320809560569032E-2,43576.029087236981,8.8353668060091206E-2,46786.26427207829,9.1655103773220795E-2,50207.338706199589,9.5684057604435865E-2,37641.016021726908,8.1168361628772376E-2,40050.274033206006,8.3619245935372497E-2,42838.731073226016,8.6858741024383651E-2,45578.671557844958,8.9289408685979219E-2,48451.382686543184,9.2337594691536795E-2,37641.016021726908,8.1168361628772376E-2,39882.263576243939,8.3268464122774222E-2,42475.399119206195,8.6122058230345078E-2,44992.180221287279,8.8140461977994897E-2,47610.90652550869,9.0735833445473188E-2,37641.016021726908,8.1168361628772376E-2,39714.253119281893,8.2917682310176002E-2,42115.611867176791,8.5392562585516613E-2,44417.076704710336,8.701382420701001E-2,46794.790069489609,8.9180496397106276E-2,37641.016021726908,8.1168361628772376E-2,38706.190377509542,8.0812991434586492E-2,40031.32709679965,8.1166518849958735E-2,41199.347688384514,8.0710237214246972E-2,42383.356558682775,8.0773282052681E-2,37641.016021726908,8.1168361628772376E-2,39042.211291433661,8.1514555059783E-2,40711.909878963626,8.2546451498304196E-2,42228.307932331547,8.272598819169287E-2,43764.485690164394,8.34054080083938E-2,37641.016021726908,8.1168361628772376E-2,39210.221748395707,8.186533687238122E-2,41057.518323031254,8.3247198546292075E-2,42758.976621924761,8.3765577365366051E-2,44487.869422116863,8.4784017041692444E-2,37641.016021726908,8.1168361628772376E-2,39378.232205357774,8.2216118684979494E-2,41406.671469089335,8.3955132743490132E-2,43300.586550323016,8.4826600615764233E-2,45233.73978605189,8.6205480610710261E-2]
["NHS Shropshire CCG","E38000147",23513.492761604921,9.062473121716226E-2,26053.413406451316,9.7989368912484248E-2,28640.698133156166,0.10504950899778523,31126.83559380228,0.11150976425378763,33391.629044466579,0.11732828195525852,23513.492761604921,9.062473121716226E-2,25836.593692782753,9.7173889321433532E-2,28155.645011185774,0.10327041157271777,30322.222528957289,0.10862729286006051,32221.833650865803,0.11321796785265564,23513.492761604921,9.062473121716226E-2,25728.183835948483,9.6766149525908216E-2,27916.616429445567,0.10239369288969177,29931.446246316074,0.10722736349615274,31661.919205057653,0.1112505945363937,23513.492761604921,9.062473121716226E-2,25619.773979114205,9.6358409730382871E-2,27679.919833868666,0.10152552755967087,29548.25761191803,0.10585461636425461,31118.232882504006,0.10934024203269149,23513.492761604921,9.062473121716226E-2,24969.31483810853,9.3911970957230792E-2,26308.711969837008,9.6496155992653349E-2,27404.300650973382,9.8174036866709835E-2,28179.392420470274,9.9014028181553998E-2,23513.492761604921,9.062473121716226E-2,25186.134551777086,9.472745054828148E-2,26756.453313194281,9.8138399769638646E-2,28089.891782592211,0.10063012030734474,29099.482945454598,0.10224695342745815,23513.492761604921,9.062473121716226E-2,25294.54440861136,9.5135190343806811E-2,26983.821964117902,9.8972351687639015E-2,28443.473711100243,0.10189680343591116,29581.391915822376,0.10394023863605893,23513.492761604921,9.062473121716226E-2,25402.954265445642,9.5542930139332169E-2,27213.522601204841,9.9814856958644518E-2,28804.345733018381,0.1031896028266045,30078.281192198032,0.1056861601974632]
["NHS Slough CCG","E38000148",11041.78131438576,0.10087503484730276,12384.970611881323,0.10827916254486207,13860.003384013567,0.11546154101977313,15418.470437626762,0.12262184219521841,16889.908368030672,0.12940475304957608,11041.78131438576,0.10087503484730276,12282.126042559375,0.10738001436054709,13625.777771575906,0.11351031132602386,15021.288456184082,0.11946308617929124,16300.13684723746,0.12488612356142705,11041.78131438576,0.10087503484730276,12230.703757898398,0.10693044026838956,13510.354092369844,0.11254876784713297,14828.389154617133,0.11792897371255871,16017.846802307547,0.12272331291991684,11041.78131438576,0.10087503484730276,12179.281473237425,0.10648086617623208,13396.056497838961,0.11159660528023126,14639.235351719524,0.1164246488923137,15743.7384316976,0.12062318749385227,11041.78131438576,0.10087503484730276,11870.747765271572,0.10378342162328703,12733.918708832491,0.10608062903059388,13580.91165417943,0.10800788654508851,14262.073844758921,0.10927117564173246,11041.78131438576,0.10087503484730276,11973.592334593524,0.10468256980760207,12950.126966467253,0.10788176413251625,13919.340715318718,0.11069938536121138,14725.952563341585,0.11282525715094685,11041.78131438576,0.10087503484730276,12025.014619254496,0.10513214389975954,13059.920222297409,0.10879640305146124,14093.879729290855,0.11208747995300505,14968.914869307626,0.11468675198672712,11041.78131438576,0.10087503484730276,12076.43690391547,0.10558171799191703,13170.839562802745,0.10972042288239539,14272.017359631574,0.11350419404828674,15219.429742076836,0.11660611202939652]
["NHS Solihull CCG","E38000149",15203.33584116712,8.9169125168135605E-2,16403.17190136213,9.4098048998176531E-2,17699.068019695773,9.8943806013504998E-2,18936.401950670988,0.10279232412697312,20221.936128629397,0.10661079781015076,15203.33584116712,8.9169125168135605E-2,16266.251678454881,9.3312595677230853E-2,17398.519230367718,9.7263636126832059E-2,18445.64303753119,0.10012834131761585,19511.986654835389,0.10286791783443373,15203.33584116712,8.9169125168135605E-2,16197.791567001257,9.2919869016758028E-2,17250.4122548575,9.6435667793255256E-2,18207.296244359546,9.8834525265223891E-2,19172.174266835147,0.10107641431271165,15203.33584116712,8.9169125168135605E-2,16129.331455547637,9.2527142356285216E-2,17103.750225449821,9.5615777199518234E-2,17973.577397424171,9.7565831057562544E-2,18842.210735847199,9.9336834330700119E-2,15203.33584116712,8.9169125168135605E-2,15718.570786825896,9.0170782393448251E-2,16254.121917157048,9.0866066173731261E-2,16665.910353545878,9.0467432165594816E-2,17058.62682792711,8.9933713770176671E-2,15203.33584116712,8.9169125168135605E-2,15855.491009733147,9.0956235714393929E-2,16531.551568844487,9.2416992222967842E-2,17084.074031606913,9.2737346822315242E-2,17617.030278332899,9.2877637485938941E-2,15203.33584116712,8.9169125168135605E-2,15923.95112118677,9.1348962374866755E-2,16672.433813842006,9.3204571857345736E-2,17299.734813816434,9.3908016577008105E-2,17909.501099983252,9.4419554512775478E-2,15203.33584116712,8.9169125168135605E-2,15992.41123264039,9.1741689035339566E-2,16814.761004942076,9.4000229231563481E-2,17519.84205417454,9.5102823006050052E-2,18211.063477666175,9.6009402560450097E-2]
["NHS Somerset CCG","E38000150",41239.768907448335,9.1770370081998162E-2,45516.392303409521,9.8350026584722389E-2,50341.352991331143,0.10506167666610557,55001.830854621847,0.11101164746825545,59323.415615271406,0.11629305970217088,41239.768907448335,9.1770370081998162E-2,45137.302594240304,9.75309044819367E-2,49488.185719582871,0.10328112889135753,53579.505753979691,0.10814093116291869,57243.915848691395,0.11221656835389987,41239.768907448335,9.1770370081998162E-2,44947.757739655688,9.7121343430543836E-2,49067.754732303081,0.10240369549274372,52888.725377895054,0.10674671089067746,56248.577718850713,0.11026538406424119,41239.768907448335,9.1770370081998162E-2,44758.212885071087,9.6711782379151012E-2,48651.42551075283,0.10153482241997001,52211.357787436973,0.10537956199781409,55282.087692451365,0.10837075137703163,41239.768907448335,9.1770370081998162E-2,43620.943757563437,9.4254416070793948E-2,46239.58726177214,9.6501350825970736E-2,48421.456860541715,9.773030488947991E-2,50057.825322941047,9.8129509376109647E-2,41239.768907448335,9.1770370081998162E-2,44000.033466732668,9.5073538173579664E-2,47027.126281847464,9.8144933387276617E-2,49633.385323904397,0.10017637210653614,51693.434458012016,0.10133583168276489,41239.768907448335,9.1770370081998162E-2,44189.578321317262,9.5483099224972473E-2,47427.04844047947,9.8979565156689764E-2,50258.416750839184,0.10143788953868967,52550.105288547551,0.10301518326775574,41239.768907448335,9.1770370081998162E-2,44379.123175901863,9.589266027636531E-2,47831.072364841035,9.9822757251943062E-2,50896.334971807344,0.10272541672750039,53433.406026344717,0.10474673807407027]
["NHS South Cheshire CCG","E38000151",12161.065841106023,8.3181024904965956E-2,13363.214733168619,9.0012223717961873E-2,14542.303164325451,9.6077584330902827E-2,15627.436993270934,0.10145051281012032,16671.206588655084,0.10647085572011164,12161.065841106023,8.3181024904965956E-2,13252.145446459286,8.9264080873361754E-2,14296.200064769595,9.4451638905718782E-2,15223.689753498244,9.8829458280305399E-2,16087.321960321013,0.10274186971721171,12161.065841106023,8.3181024904965956E-2,13196.610803104621,8.8890009451061708E-2,14174.923296959616,9.3650391761096824E-2,15027.601904097719,9.7556491197726039E-2,15807.84963560681,0.10095701644914297,12161.065841106023,8.3181024904965956E-2,13141.076159749962,8.8515938028761704E-2,14054.829717128276,9.2856961661788293E-2,14835.321464952372,9.6308241138356093E-2,15536.477318609221,9.922389397502375E-2,12161.065841106023,8.3181024904965956E-2,12807.86829962197,8.6271509494961401E-2,13359.115185691535,8.8260539017518069E-2,13759.504102553963,8.9324228139145437E-2,14069.602187885883,8.985567880882539E-2,12161.065841106023,8.3181024904965956E-2,12918.937586331302,8.7019652339561507E-2,13586.287277589247,8.9761411717687936E-2,14103.527259892409,9.1557564657831797E-2,14528.850631804369,9.2788674363292675E-2,12161.065841106023,8.3181024904965956E-2,12974.472229685967,8.7393723761861566E-2,13701.648105506052,9.052357363574294E-2,14280.951333532226,9.2709369861933441E-2,14769.387773250899,9.4324867628374609E-2,12161.065841106023,8.3181024904965956E-2,13030.006873040627,8.7767795184161571E-2,13818.192121401495,9.1293552599111358E-2,14462.033507221149,9.3884922794216757E-2,15017.402094427822,9.5908813989192862E-2]
["NHS South Devon and Torbay CCG","E38000152",23363.267803588693,0.10030597545761932,25460.011627455169,0.10688501942676394,27996.713112107926,0.11390964729476738,30323.136992301774,0.11978801055661602,32522.162982367929,0.12507562103825831,23363.267803588693,0.10030597545761932,25247.605151263637,0.10599330458129151,27521.497132749289,0.11197614587333912,29538.071141372744,0.11668669961828533,31380.92388687647,0.12068657752048484,23363.267803588693,0.10030597545761932,25141.401913167872,0.1055474471585553,27287.316181382648,0.11102333868249104,29156.788350602106,0.11518048649206807,30834.677714954229,0.11858579230426208,23363.267803588693,0.10030597545761932,25035.198675072115,0.10510158973581912,27055.419922224464,0.11007982717155368,28782.908874275196,0.11370351929475862,30304.263515704995,0.11654589460697252,23363.267803588693,0.10030597545761932,24397.97924649754,0.10242644519940193,25712.020903652938,0.1046139673840546,26691.037054839246,0.10543982402954589,27437.164150267017,0.10551943754429281,23363.267803588693,0.10030597545761932,24610.385722689072,0.10331816004487436,26150.68180767629,0.10639873792691143,27359.972483121684,0.10808237529873464,28334.794012931463,0.1089715945424639,23363.267803588693,0.10030597545761932,24716.588960784829,0.10376401746761053,26373.439298000656,0.10730506671820594,27704.964516815253,0.10944522602834501,28804.938929264954,0.11077970513523942,23363.267803588693,0.10030597545761932,24822.79219888059,0.10420987489034672,26598.481480533472,0.10822069118941115,28057.069538895925,0.11083617578769032,29289.698461942578,0.11264402146735858]
["NHS South East Staffs and Seisdon Peninsular CCG","E38000153",15743.443965709253,8.4551256529050767E-2,17387.627991280398,9.1842531118109014E-2,19009.81090219774,9.8435226295555817E-2,20351.071793614323,0.10386379398598715,21581.912424818416,0.10846272200632434,15743.443965709253,8.4551256529050767E-2,17242.845362945216,9.1077780281772741E-2,18687.525605118168,9.6766391907198462E-2,19824.41272006731,0.10117593508251153,20824.729649050572,0.10465740099030341,15743.443965709253,8.4551256529050767E-2,17170.454048777632,9.0695404863604653E-2,18528.707129393857,9.5944009576397357E-2,19568.63030244075,9.9870523131778854E-2,20462.309368898386,0.1028360104980319,15743.443965709253,8.4551256529050767E-2,17098.062734610041,9.031302944543651E-2,18371.438102213207,9.5129650487848008E-2,19317.814376123792,9.8590458181707627E-2,20110.393195257962,0.10106740976609691,15743.443965709253,8.4551256529050767E-2,16663.714849604512,8.8018776936427803E-2,17460.362358545961,9.0411984043837823E-2,17914.488434612627,9.1428439494807737E-2,18208.146536778666,9.1507420528589137E-2,15743.443965709253,8.4551256529050767E-2,16808.497477939691,8.8783527772764048E-2,17757.8564789271,9.1952446556167675E-2,18363.241762126621,9.3718698387907626E-2,18803.700854633225,9.4500456601835495E-2,15743.443965709253,8.4551256529050767E-2,16880.888792107278,8.9165903190932164E-2,17908.927711933149,9.2734712675710179E-2,18594.678634117856,9.4899860335397851E-2,19115.629909788178,9.6068096842839373E-2,15743.443965709253,8.4551256529050767E-2,16953.280106274869,8.9548278609100307E-2,18061.548393482852,9.3525002037504412E-2,18830.887233053614,9.61053752835236E-2,19437.255386853263,9.7684467719636459E-2]
["NHS South Eastern Hampshire CCG","E38000154",14972.725291372413,8.6278237244280367E-2,16429.194133143705,9.2381883339764423E-2,17999.156457308316,9.8560707793824975E-2,19571.080324566097,0.10405721142368195,21004.99153421192,0.10895835425983982,14972.725291372413,8.6278237244280367E-2,16292.129454709882,9.1611164275246751E-2,17693.491598337529,9.6886932418889113E-2,19063.897402824325,0.10136057742888308,20266.987437669814,0.10513013506416544,14972.725291372413,8.6278237244280367E-2,16223.597115492972,9.1225804742987929E-2,17542.86348273894,9.6062115226913478E-2,18817.5739643458,0.100050903681124,19913.746899213271,0.10329778451713492,14972.725291372413,8.6278237244280367E-2,16155.064776276064,9.0840445210729107E-2,17393.704909731561,9.5245345031932757E-2,18576.033353506133,9.8766659684741256E-2,19570.744408800456,0.10151854138811317,14972.725291372413,8.6278237244280367E-2,15743.870740974595,8.8528288017176091E-2,16529.613866102598,9.0513710798940952E-2,17224.603202729246,9.1581259053218039E-2,17716.679747639046,9.1901025768435757E-2,14972.725291372413,8.6278237244280367E-2,15880.935419408423,8.929900708169379E-2,16811.766043614098,9.2058734221958705E-2,17656.761377194976,9.3878994987212777E-2,18297.149272773582,9.4912072169175132E-2,14972.725291372413,8.6278237244280367E-2,15949.467758625327,8.9684366613952585E-2,16955.046446256652,9.2843316428959877E-2,17879.639582149728,9.5064013090970498E-2,18601.177478250673,9.6489145545443883E-2,14972.725291372413,8.6278237244280367E-2,16018.000097842239,9.0069726146211421E-2,17099.796391490418,9.3635945632955964E-2,18107.113052875146,9.6273463700952508E-2,18914.656505009625,9.8115242789758403E-2]
["NHS South Gloucestershire CCG","E38000155",16842.77139098983,7.5413143149412692E-2,18633.644367918652,8.0013931500853022E-2,20485.47961174175,8.4260774974258601E-2,22369.512680145614,8.8249616064958236E-2,24178.051025928824,9.1910784710441812E-2,16842.77139098983,7.5413143149412692E-2,18478.667633452424,7.9348452565494776E-2,20138.711991886445,8.2834452089036045E-2,21791.734264593149,8.5970231436772723E-2,23331.559977081164,8.8692921679773301E-2,16842.77139098983,7.5413143149412692E-2,18401.179266219315,7.9015713097815674E-2,19967.828909986594,8.2131576628770131E-2,21511.124725319238,8.4863203113931029E-2,22926.392911891937,8.7152713874750765E-2,16842.77139098983,7.5413143149412692E-2,18323.69089898621,7.8682973630136585E-2,19798.612980105278,8.1435558490067769E-2,21235.963742092015,8.3777669804686816E-2,22532.968892665864,8.5657146250535485E-2,16842.77139098983,7.5413143149412692E-2,17858.760695587545,7.6686536824061943E-2,18818.32759320661,7.7403453410688591E-2,19696.426155605139,7.7704064050832966E-2,20406.355846733601,7.7573009377075952E-2,16842.77139098983,7.5413143149412692E-2,18013.737430053763,7.7352015759420148E-2,19138.420780765358,7.8720059150894042E-2,20188.737025327169,7.9646271995136381E-2,21072.154667441366,8.0103986419225143E-2,16842.77139098983,7.5413143149412692E-2,18091.225797286872,7.768475522709925E-2,19300.968102572537,7.9388648003342124E-2,20442.637956529063,8.064793260426488E-2,21420.875163356512,8.1429617438441848E-2,16842.77139098983,7.5413143149412692E-2,18168.714164519984,7.8017494694778367E-2,19465.182576398249,8.0064094177353773E-2,20701.773774913072,8.1670245285281176E-2,21780.435755765484,8.2796456153597972E-2]
["NHS South Kent Coast CCG","E38000156",15963.18594233114,9.3945303332928096E-2,17649.912046355264,0.10097203687846261,19734.912441603112,0.10858871157479427,21717.323487873622,0.11518682236063234,23602.889999954874,0.12131419613463648,15963.18594233114,9.3945303332928096E-2,17503.144815714975,0.10013240741255706,19401.200491835632,0.10675250628279759,21156.914322731871,0.1122144601820933,22777.71012184798,0.11707293442561667,15963.18594233114,9.3945303332928096E-2,17429.761200394838,9.9712592679604334E-2,19236.751093512721,0.10584764550188577,20884.74050418425,0.11077087357687626,22382.743500616834,0.11504288394642699,15963.18594233114,9.3945303332928096E-2,17356.377585074701,9.9292777946651603E-2,19073.906079563687,0.10495161263103162,20617.851446477751,0.10935531689019705,21999.224283643147,0.11307167086576453,15963.18594233114,9.3945303332928096E-2,16916.075893153844,9.6773889548935038E-2,18130.528067721014,9.9760801517117942E-2,19124.595640577652,0.10143521608453195,19926.150626914248,0.10241648142945234,15963.18594233114,9.3945303332928096E-2,17062.843123794133,9.7613519014840583E-2,18438.569867506376,0.10145576024819179,19602.106596447007,0.10396789326639974,20575.187365652659,0.10575240216721145,15963.18594233114,9.3945303332928096E-2,17136.226739114267,9.8033333747793286E-2,18594.99734395988,0.10231648147881522,19848.37472459699,0.10527407831015695,20915.128510576,0.10749963255847039,15963.18594233114,9.3945303332928096E-2,17209.610354434411,9.8453148480746058E-2,18753.029204787264,0.10318603061949634,20099.720368064915,0.1066071940599603,21265.636842849544,0.10930117620708031]
["NHS South Lincolnshire CCG","E38000157",10566.319576722828,8.7687299391890683E-2,11757.243287306681,9.3937706034729007E-2,12976.667991565633,9.9928137929813907E-2,14167.830903417587,0.10513380011440775,15402.22196547332,0.11044186121807917,10566.319576722828,8.7687299391890683E-2,11659.286442226608,9.3155053069883434E-2,12756.66277512848,9.8233965617807492E-2,13801.166693303347,0.10241293182920264,14861.860721974312,0.10656719290100611,10566.319576722828,8.7687299391890683E-2,11610.308019686576,9.2763726587460668E-2,12648.246742989981,9.7399097050592812E-2,13623.088952254457,0.10109148821797607,14603.220563323443,0.10471260980441303,10566.319576722828,8.7687299391890683E-2,11561.329597146543,9.2372400105037902E-2,12540.888428238199,9.6572373542570464E-2,13448.46892171421,9.9795702891913099E-2,14352.076629148618,0.10291177849669166,10566.319576722828,8.7687299391890683E-2,11267.459061906335,9.0024441210501252E-2,11918.95060484856,9.1783078737475446E-2,12471.462308286755,9.2545728022311924E-2,12994.543939930567,9.3177570198842444E-2,10566.319576722828,8.7687299391890683E-2,11365.415906986407,9.0807094175346825E-2,12122.032343098239,9.3346930102404441E-2,12783.887922186987,9.4864113402990405E-2,13419.559513535965,9.6225150677871546E-2,10566.319576722828,8.7687299391890683E-2,11414.394329526438,9.1198420657769563E-2,12225.159788303152,9.414107337365743E-2,12945.016101918995,9.6059781106552347E-2,13642.166759132742,9.7821359236574951E-2,10566.319576722828,8.7687299391890683E-2,11463.372752066472,9.1589747140192343E-2,12329.344950894785,9.494336170410278E-2,13109.466395669113,9.7280100888016571E-2,13871.693827483721,9.9467186487048054E-2]
["NHS South Manchester CCG","E38000158",9633.9757780637883,7.2632507373822278E-2,10479.696464115219,7.5360969826802959E-2,11589.644007617382,8.0149681933730163E-2,12734.201075487901,8.4556448044408372E-2,13970.494690382728,8.9439786750209527E-2,9633.9757780637883,7.2632507373822278E-2,10392.319174248636,7.4732627457562456E-2,11393.050171660943,7.8790111837212615E-2,12404.759915839551,8.236892374395452E-2,13481.055959283278,8.6306376179790506E-2,9633.9757780637883,7.2632507373822278E-2,10348.630529315349,7.4418456272942246E-2,11296.170997692028,7.812013138099605E-2,12244.760287022697,8.1306509209978062E-2,13246.789507748488,8.4806590958697109E-2,9633.9757780637883,7.2632507373822278E-2,10304.941884382059,7.4104285088322008E-2,11200.236986395976,7.7456687319474249E-2,12087.86734854614,8.0264723429921248E-2,13019.312852187646,8.3350274341790306E-2,9633.9757780637883,7.2632507373822278E-2,10042.810014782319,7.2219257980600596E-2,10644.481334749889,7.3613287238934233E-2,11210.044580920779,7.4435886991505842E-2,11789.71120175372,7.5478304748743411E-2,9633.9757780637883,7.2632507373822278E-2,10130.187304648898,7.2847600349841057E-2,10825.952567940447,7.4868275020335037E-2,11490.753343074228,7.6299822995180802E-2,12174.674197426655,7.794285657763543E-2,9633.9757780637883,7.2632507373822278E-2,10173.875949582187,7.3161771534461295E-2,10918.10592854503,7.5505573503077669E-2,11635.524097673928,7.7261116186413861E-2,12376.303402202571,7.9233696556994693E-2,9633.9757780637883,7.2632507373822278E-2,10217.564594515479,7.3475942719081547E-2,11011.204451822477,7.6149408380515066E-2,11783.279711620187,7.8242229160824614E-2,12584.200320122236,8.0564662740859383E-2]
["NHS South Norfolk CCG","E38000159",17908.174631678328,8.9945628486581261E-2,19931.911753504039,9.5835713787402826E-2,22122.190623384606,0.10159911189209427,24278.523110838185,0.10681268416558813,26242.539894731137,0.11167988720202203,17908.174631678328,8.9945628486581261E-2,19766.230231505029,9.5039091410255933E-2,21747.782399647956,9.987959217253585E-2,23651.574298480857,0.1040544403804701,25324.028305564258,0.1077709945764076,17908.174631678328,8.9945628486581261E-2,19683.389470505525,9.4640780221682486E-2,21563.278347085423,9.9032232695349609E-2,23347.084181425005,0.10271484461691598,24884.389108632819,0.10590003025207601,17908.174631678328,8.9945628486581261E-2,19600.54870950602,9.4242469033109053E-2,21380.574334060089,9.8193140139892027E-2,23048.506306243515,0.10140125959631989,24457.49207102364,0.10408329249733442,17908.174631678328,8.9945628486581261E-2,19103.504143508988,9.1852601901668371E-2,20322.15108618918,9.3332190163448056E-2,21377.950197800976,9.4051694666964239E-2,22149.944069161913,9.4263103537160234E-2,17908.174631678328,8.9945628486581261E-2,19269.185665508001,9.2649224278815279E-2,20667.758677330698,9.4919439135348116E-2,21912.15796114863,9.6401926797838225E-2,22872.389904479634,9.733760279376813E-2,17908.174631678328,8.9945628486581261E-2,19352.026426507502,9.3047535467388698E-2,20843.262532207253,9.572546400389112E-2,22187.66650038895,9.7614018919441034E-2,23250.779985879923,9.8947910400374164E-2,17908.174631678328,8.9945628486581261E-2,19434.867187507007,9.3445846655962145E-2,21020.566426621004,9.6539755794162782E-2,22468.855428881117,9.8851101754866319E-2,23640.932453038244,0.10060827497250083]
["NHS South Reading CCG","E38000160",6088.8184763596519,6.8475241524512509E-2,6617.2430872545601,7.3329378183228724E-2,7263.5259981352992,7.838901357797648E-2,7851.1802677221167,8.2073805851161585E-2,8553.2774602607642,8.7082849320512773E-2,6088.8184763596519,6.8475241524512509E-2,6562.4194147562275,7.2721846351465294E-2,7140.8213241540625,7.706476715037841E-2,7648.8430693929631,7.9958635473478604E-2,8254.5675517980962,8.4041616287905685E-2,6088.8184763596519,6.8475241524512509E-2,6535.007578507063,7.2418080435583593E-2,7080.3538766392676,7.6412193790624527E-2,7550.5739986336712,7.8931361056174695E-2,8111.5921274040411,8.2585951205498276E-2,6088.8184763596519,6.8475241524512509E-2,6507.5957422578986,7.2114314519701891E-2,7020.4763554416922,7.5765987000234111E-2,7454.2130046314014,7.7924033082076113E-2,7972.7605911107576,8.1172475983615933E-2,6088.8184763596519,6.8475241524512509E-2,6343.1247247629017,7.0291719024411586E-2,6673.5996809178087,7.2022444214524167E-2,6915.0690809624593,7.2287989556371099E-2,7222.3210097936171,7.3532081142268557E-2,6088.8184763596519,6.8475241524512509E-2,6397.9483972612325,7.0899250856175003E-2,6786.8655338235676,7.3244825532307017E-2,7087.4756634951354,7.4090274550440469E-2,7457.2682133806002,7.5924131677668497E-2,6088.8184763596519,6.8475241524512509E-2,6425.3602335103997,7.1203016772056732E-2,6844.3833497522737,7.3865566045243636E-2,7176.3914168180272,7.5019772285365119E-2,7580.3247625971271,7.7176998193821289E-2,6088.8184763596519,6.8475241524512509E-2,6452.7720697595651,7.1506782687938447E-2,6902.4910919981949,7.4492673127543665E-2,7267.1404203584534,7.5968434250036104E-2,7707.2065669487256,7.8468810496321789E-2]
["NHS South Sefton CCG","E38000161",11914.802810938836,9.1175411776391449E-2,12629.314746228496,9.6880291087975592E-2,13411.339203285192,0.1027531351768709,14226.93453468619,0.10797612731243314,14909.236401612694,0.1127096794799871,11914.802810938836,9.1175411776391449E-2,12523.770618272376,9.6070655249097719E-2,13183.394712585849,0.10100670175134728,13858.296662216679,0.10517832925179629,14385.861934640601,0.10875311411128365,11914.802810938836,9.1175411776391449E-2,12470.998554294321,9.5665837329658818E-2,13071.066297697949,0.10014607951040413,13679.260372926305,0.1038195231703575,14135.352378672198,0.10685933155936043,11914.802810938836,9.1175411776391449E-2,12418.226490316261,9.5261019410219888E-2,12959.833769784567,9.9293853584006789E-2,13503.70040614127,0.10248710083592343,13892.103396138047,0.10502043692272488,11914.802810938836,9.1175411776391449E-2,12101.594106447916,9.2832111893586367E-2,12315.452228769111,9.4356820631084193E-2,12521.434808824508,9.5032140321983205E-2,12577.246055489431,9.5080481217791293E-2,11914.802810938836,9.1175411776391449E-2,12207.138234404028,9.3641747732464184E-2,12525.862527876199,9.5968913023875252E-2,12835.5421321907,9.7416075684507442E-2,12988.900854879146,9.819247697973349E-2,11914.802810938836,9.1175411776391449E-2,12259.910298382089,9.4046565651903127E-2,12632.711507891518,9.6787553692089454E-2,12997.537624886283,9.8645549672785993E-2,13204.510227146333,9.9822423852028525E-2,11914.802810938836,9.1175411776391449E-2,12312.682362360145,9.4451383571342029E-2,12740.65637488135,9.7614590674849441E-2,13162.873113714446,9.9900372751323963E-2,13426.82189086964,0.10150303818316933]
["NHS South Tees CCG","E38000162",19787.736408811732,8.9238461300675267E-2,21126.461726167581,9.4779998771501048E-2,22493.278380633936,0.10030000169728857,23874.028124245662,0.10511636194190588,25176.145614741028,0.10966175457244109,19787.736408811732,8.9238461300675267E-2,20950.524596879386,9.399068908425029E-2,22112.065982891294,9.8600133697009248E-2,23256.694243721427,0.10239826630733281,24293.849637979081,0.10581866729671174,19787.736408811732,8.9238461300675267E-2,20862.556032235294,9.3596034240624931E-2,21924.208911888305,9.7762458360333121E-2,22956.873808881475,0.10107816928884059,23871.544792559223,0.10397920024635954,19787.736408811732,8.9238461300675267E-2,20774.587467591209,9.3201379396999601E-2,21738.184592797548,9.6932955465966059E-2,22662.874945351592,9.9783704408909796E-2,23461.479701147786,0.1021930468731936,19787.736408811732,8.9238461300675267E-2,20246.776079726653,9.0833450335247451E-2,20660.526468409698,9.2127559388253358E-2,21017.938604886058,9.2541117492453584E-2,21244.915052165674,9.2538178639975932E-2,19787.736408811732,8.9238461300675267E-2,20422.713209014837,9.1622760022498154E-2,21012.414835556752,9.3696668311588127E-2,21543.95371976215,9.4857140365278925E-2,21938.875870349151,9.5560919376030798E-2,19787.736408811732,8.9238461300675267E-2,20510.681773658926,9.2017414866123498E-2,21191.108146998617,9.4493481436719054E-2,21815.237040337059,9.605158964572498E-2,22302.34656620496,9.7144117807321892E-2,19787.736408811732,8.9238461300675267E-2,20598.650338303021,9.241206970974887E-2,21371.634210352706,9.5298467004159032E-2,22092.113635307916,9.7270665882828095E-2,22677.115873590359,9.877653050609965E-2]
["NHS South Tyneside CCG","E38000163",11314.863068152963,9.1856332750064662E-2,11989.204625211893,9.6843332998480539E-2,12941.820807580405,0.10310564696925115,13858.140370344248,0.1088620610396249,14741.780044770414,0.11425965001372203,11314.863068152963,9.1856332750064662E-2,11889.087414415295,9.6034631780414326E-2,12722.07659396121,0.1013549760513162,13499.025592611457,0.10604104943135474,14223.834228414527,0.1102451885631261,11314.863068152963,9.1856332750064662E-2,11839.028809016996,9.5630281171381212E-2,12613.789180999831,0.10049226562300692,13324.614383030879,0.10467096923040754,13975.923058384285,0.1083236944534513,11314.863068152963,9.1856332750064662E-2,11788.970203618695,9.5225930562348099E-2,12506.558230603925,9.9637971881803095E-2,13153.589691431947,0.10332749168446149,13735.19715219844,0.1064578914292237,11314.863068152963,9.1856332750064662E-2,11488.618571228906,9.2799826908149474E-2,11885.358242103513,9.4688959863794706E-2,12196.699154678558,9.5810676784591972E-2,12433.978041083315,9.6372485204490127E-2,11314.863068152963,9.1856332750064662E-2,11588.735782025504,9.3608528126215687E-2,12088.199054675077,9.6304963788042347E-2,12502.692081718958,9.8214391843825299E-2,12841.362991213284,9.9530018533663653E-2,11314.863068152963,9.1856332750064662E-2,11638.794387423801,9.4012878735248787E-2,12191.204154809073,9.7125590780824347E-2,12660.502712958159,9.9454066873198438E-2,13054.735976294085,0.10118381627882565,11314.863068152963,9.1856332750064662E-2,11688.852992822098,9.4417229344281872E-2,12295.26571750855,9.7954634460711829E-2,12821.567057552269,0.10071930131620008,13274.741733966528,0.10288902289541567]
["NHS South Warwickshire CCG","E38000164",18006.407453767348,8.2871904702537511E-2,19699.298188416615,8.8536171633333105E-2,21486.838465544628,9.4265326250524833E-2,23186.636840563715,9.8826344048093581E-2,24724.780541653177,0.10292557048394463,18006.407453767348,8.2871904702537511E-2,19535.269432968125,8.7798963743676961E-2,21122.750287029939,9.2668027932920685E-2,22587.362375192395,9.6272109688826171E-2,23858.64710972516,9.9319986303077007E-2,18006.407453767348,8.2871904702537511E-2,19453.255055243881,8.7430359798848903E-2,20943.331833675344,9.1880897752370558E-2,22296.312853265081,9.5031595146471234E-2,23444.078354208759,9.7594198460614262E-2,18006.407453767348,8.2871904702537511E-2,19371.240677519636,8.7061755854020831E-2,20765.663804255913,9.1101446890655066E-2,22010.914599062609,9.3815167500906183E-2,23041.52513590944,9.5918429505908911E-2,18006.407453767348,8.2871904702537511E-2,18879.154411174171,8.4850132185052454E-2,19736.414530377853,8.658600741588951E-2,20414.099039279543,8.7009202281474476E-2,20865.565143935924,8.6860232886253955E-2,18006.407453767348,8.2871904702537511E-2,19043.183166622661,8.5587340074708584E-2,20072.495925929878,8.8060436632139513E-2,20924.72616779049,8.9185602965606042E-2,21546.813478857213,8.9696168007897814E-2,18006.407453767348,8.2871904702537511E-2,19125.197544346905,8.5955944019536656E-2,20243.162259608642,8.8809170218516476E-2,21188.073396948934,9.0308044484481001E-2,21903.625851913963,9.1181524652043808E-2,18006.407453767348,8.2871904702537511E-2,19207.21192207115,8.6324547964364715E-2,20415.579017222561,8.9565583123728018E-2,21456.85027549008,9.145362831595806E-2,22271.529860247188,9.2713054118088375E-2]
["NHS South West Lincolnshire CCG","E38000165",8884.3178720816595,8.6591792125552236E-2,9917.6409810422392,9.3298598128337157E-2,10949.32300826163,9.9485035510281941E-2,11973.682875934182,0.10514298275319794,12954.408552430699,0.1102690547534108,8884.3178720816595,8.6591792125552236E-2,9835.187218123916,9.2522927733997326E-2,10764.014486282666,9.7801330967496505E-2,11664.345252412711,0.10242663551468836,12500.452018804473,0.10640493717062031,8884.3178720816595,8.6591792125552236E-2,9793.9603366647571,9.2135092536827445E-2,10672.696584826683,9.6971620796171928E-2,11514.10930437466,0.10110738763939814,12283.168874814713,0.10455540410976094,8884.3178720816595,8.6591792125552236E-2,9752.7334552055945,9.1747257339657523E-2,10582.269589726367,9.6150005358226126E-2,11366.790466657349,9.9813755414974961E-2,12072.183295869379,0.10275947647147923,8884.3178720816595,8.6591792125552236E-2,9505.3721664506338,8.9420246156638142E-2,10058.41665259352,9.1390302131505716E-2,10542.535206324605,9.257582724204956E-2,10931.722462869535,9.3051774454115901E-2,8884.3178720816595,8.6591792125552236E-2,9587.8259293689553,9.0195916550977945E-2,10229.470672881798,9.2944490940230773E-2,10806.11423657963,9.4890360349311809E-2,11288.777301372993,9.6091056361704077E-2,8884.3178720816595,8.6591792125552236E-2,9629.0528108281142,9.0583751748147825E-2,10316.334042559438,9.3733727444661435E-2,10942.050624221913,9.608404130858722E-2,11475.789258257309,9.7682918439371047E-2,8884.3178720816595,8.6591792125552236E-2,9670.2796922872731,9.097158694531772E-2,10404.088318592747,9.45310586824709E-2,11080.789725701765,9.7302333383401524E-2,11668.614546109755,9.9324264096950596E-2]
["NHS South Worcestershire CCG","E38000166",21793.801211428359,8.8134103896103044E-2,23950.407656645049,9.4166893357887277E-2,26259.85552054154,0.10035102231940363,28422.461178184029,0.10562044287693804,30499.242757948945,0.11051251089915554,21793.801211428359,8.8134103896103044E-2,23751.256144038893,9.3383880412199777E-2,25815.451976518882,9.8652751362423116E-2,27688.280501626261,0.10289216091276945,29431.238271415132,0.10664264900143174,21793.801211428359,8.8134103896103044E-2,23651.680387735818,9.2992373939356054E-2,25596.455037757714,9.7815863030257244E-2,27331.711104350165,0.10156711670141273,28920.045336762261,0.1047903664640998,21793.801211428359,8.8134103896103044E-2,23552.104631432747,9.2600867466512332E-2,25379.594654496668,9.6987139462307664E-2,26982.06516502428,0.10026780068756701,28423.668419114274,0.10299176903802548,21793.801211428359,8.8134103896103044E-2,22954.650093614298,9.0251828629449943E-2,24123.300020432613,9.2186258103151231E-2,25025.781031854873,9.2998071467316507E-2,25740.554076359163,9.3269635757515623E-2,21793.801211428359,8.8134103896103044E-2,23153.801606220448,9.1034841575137401E-2,24533.518676453528,9.3753892832671687E-2,25651.358446448412,9.5322773862684548E-2,26580.582011223691,9.6313435796882715E-2,21793.801211428359,8.8134103896103044E-2,23253.377362523515,9.142634804798111E-2,24741.832837714148,9.4549957343756291E-2,25973.989324360686,9.6521699458791105E-2,27020.557194293466,9.7907664302824354E-2,21793.801211428359,8.8134103896103044E-2,23352.95311882659,9.1817854520824846E-2,24952.283554474878,9.535418661905716E-2,26303.272152068275,9.774534430348672E-2,27474.209157177535,9.955144994991498E-2]
["NHS Southampton CCG","E38000167",14404.764187718891,7.1022405027703822E-2,15565.271769969591,7.4474984545309056E-2,16939.174920880872,7.8625951173787928E-2,18405.47423996032,8.1962389739759167E-2,19823.057133180362,8.5695387917950727E-2,14404.764187718891,7.1022405027703822E-2,15435.979300368805,7.3856360288845957E-2,16653.089449469277,7.7298038662594118E-2,17931.46841332487,7.9851569350395737E-2,19131.114338929157,8.2704108330145062E-2,14404.764187718891,7.1022405027703822E-2,15371.333065568411,7.3547048160614414E-2,16512.109830143854,7.6643658699145259E-2,17701.258088665818,7.8826407591137404E-2,18799.920723110965,8.1272353117374047E-2,14404.764187718891,7.1022405027703822E-2,15306.686830768022,7.3237736032382872E-2,16372.505621738683,7.5995662930461769E-2,17475.517725575708,7.7821151253899656E-2,18478.326164539536,7.988209478012942E-2,14404.764187718891,7.1022405027703822E-2,14918.809421965669,7.1381863262993631E-2,15563.76400063284,7.2241756408433166E-2,16212.490643435078,7.2196698625913228E-2,16739.979875708017,7.236719641928073E-2,14404.764187718891,7.1022405027703822E-2,15048.101891566452,7.2000487519456702E-2,15827.842897320457,7.3467521803381258E-2,16616.379425851908,7.3995277101228649E-2,17284.220357679842,7.4719956586891928E-2,14404.764187718891,7.1022405027703822E-2,15112.74812636684,7.230979964768823E-2,15961.945462044643,7.4089980793003357E-2,16824.678174192635,7.4922863262346956E-2,17569.273146701853,7.5952244279361286E-2,14404.764187718891,7.1022405027703822E-2,15177.394361167235,7.2619111775919787E-2,16097.423437689076,7.4718823977390811E-2,17037.271591491753,7.5869574240700705E-2,17863.186899662116,7.7222838058369866E-2]
["NHS Southend CCG","E38000168",12648.013179954549,8.7239710166606088E-2,13897.099337626172,9.2265962937366705E-2,15371.471181714489,9.7845138012186431E-2,16913.397402425933,0.10316821643543939,18450.924521101464,0.10833093307363471,12648.013179954549,8.7239710166606088E-2,13781.381445001758,9.1497685865102624E-2,15111.1497087631,9.6188094899828769E-2,16476.404506012121,0.10050265039656045,17804.877892312234,0.1045377988040878,12648.013179954549,8.7239710166606088E-2,13723.522498689552,9.1113547328970604E-2,14982.866290601958,9.5371523173787123E-2,16264.170244523828,9.9208065417371163E-2,17495.652157535409,0.10272224141343007,12648.013179954549,8.7239710166606088E-2,13665.663552377353,9.0729408792838626E-2,14855.834417983855,9.456291800117031E-2,16056.056905908434,9.7938617213056203E-2,17195.388780088342,0.10095930472104475,12648.013179954549,8.7239710166606088E-2,13318.509874504118,8.8424577576046465E-2,14119.925638678964,8.9878584587389967E-2,14891.653787087278,9.0835999677243373E-2,15572.345995484735,9.1429931866396988E-2,12648.013179954549,8.7239710166606088E-2,13434.22776712853,8.9192854648310518E-2,14360.222382941784,9.1408162844950888E-2,15264.004756083104,9.3107263365152515E-2,16080.487320966726,9.4413382579654329E-2,12648.013179954549,8.7239710166606088E-2,13492.086713440733,8.9576993184442524E-2,14482.248073387749,9.2184901803868555E-2,15456.038415253272,9.4278628859663732E-2,16346.632723310182,9.5976002367955504E-2,12648.013179954549,8.7239710166606088E-2,13549.945659752937,8.9961131720574544E-2,14605.525309376746,9.2969607316210984E-2,15652.031392477791,9.5474145373171837E-2,16621.05134697726,9.7587196729551781E-2]
["NHS Southern Derbyshire CCG","E38000169",36807.260775751565,8.6740021623583838E-2,40330.713390424491,9.2062439258638801E-2,44236.847703663203,9.761429830015271E-2,47993.778117782487,0.10259903826111097,51729.427220294645,0.10747855229647757,36807.260775751565,8.6740021623583838E-2,39994.971276576209,9.1296044732871173E-2,43487.30008634703,9.5960325006282335E-2,46752.815534225549,9.9946161730355185E-2,49915.887521305347,0.10371054959755943,36807.260775751565,8.6740021623583838E-2,39827.100219652079,9.0912847469987387E-2,43117.931669159967,9.5145266051370248E-2,46150.11745922891,9.8657739662296184E-2,49047.849331836092,0.10190702125874943,36807.260775751565,8.6740021623583838E-2,39659.229162727934,9.052965020710356E-2,42752.166846286935,9.4338158891140236E-2,45559.121888179048,9.7394334704730953E-2,48204.969683700765,0.10015576497756237,36807.260775751565,8.6740021623583838E-2,38652.002821183116,8.8230466629800747E-2,40633.253389643127,8.9662503618083603E-2,42252.476140634142,9.0325529395515289E-2,43648.870492295348,9.0689529383534917E-2,36807.260775751565,8.6740021623583838E-2,38987.744935031391,8.899686115556836E-2,41325.14349793498,9.118924819704087E-2,43309.870034830157,9.2585980663624265E-2,45075.291473990939,9.3653213118618212E-2,36807.260775751565,8.6740021623583838E-2,39155.615991955521,8.9380058418452146E-2,41676.493943551941,9.1964548178542618E-2,43855.202894401489,9.3751769837106091E-2,45822.397381435898,9.5205479703793686E-2,36807.260775751565,8.6740021623583838E-2,39323.487048879651,8.9763255681335932E-2,42031.447983482918,9.2747799954726415E-2,44411.779336196174,9.4941595057925043E-2,46592.727332843489,9.6805999029386025E-2]
["NHS Southport and Formby CCG","E38000170",9324.8088665329742,9.7153666040143499E-2,9973.4845405758624,0.10333075570426711,10728.977001456242,0.10968081170983686,11490.359580696413,0.11585359528832842,12233.470327102808,0.1212675488412253,9324.8088665329742,9.7153666040143499E-2,9890.0084656674553,0.10246589790372415,10546.531226762279,0.10781569440566632,11192.424469758707,0.11284961151198536,11803.560593476375,0.11700595354358025,9324.8088665329742,9.7153666040143499E-2,9848.2704282132527,0.10203346900345268,10456.624054136653,0.1068965861187554,11047.726377958563,0.11139066725104418,11597.787283402013,0.11496617053332685,9324.8088665329742,9.7153666040143499E-2,9806.5323907590482,0.10160104010318119,10367.594024658592,0.10598644474196067,10905.837868701703,0.10996005110608695,11397.977946329907,0.11298550700168425,9324.8088665329742,9.7153666040143499E-2,9556.1041660338306,9.9006466701552331E-2,9851.8338538891312,0.1007139015936325,10111.965530663336,0.10195569198087655,10317.929138551233,0.10227923412521048,9324.8088665329742,9.7153666040143499E-2,9639.5802409422395,9.9871324502095307E-2,10020.245338222017,0.10243554833594375,10365.828758569176,0.10451531315355088,10656.070214052175,0.10563114803778921,9324.8088665329742,9.7153666040143499E-2,9681.3182783964403,0.10030375340236676,10105.766795109808,0.10330982207227365,10496.754386921859,0.10583539410084553,10833.175849974779,0.10738675505526149,9324.8088665329742,9.7153666040143499E-2,9723.0563158506466,0.10073618230263828,10192.165395145172,0.10419306271871981,10630.379418110242,0.10718269225761486,11015.786875472966,0.10919693572039023]
["NHS Southwark CCG","E38000171",22047.507800713542,8.7538742955266993E-2,24957.469627689166,9.2127979430377135E-2,27982.945427990831,9.8441375599770745E-2,31244.823233307456,0.1049611100285792,34667.909854504775,0.11125773380778169,22047.507800713542,8.7538742955266993E-2,24749.321124991104,9.1359620247290899E-2,27508.189053960741,9.6771227235491239E-2,30436.388648897835,0.10224532601752834,33452.764444807864,0.10735803737101368,22047.507800713542,8.7538742955266993E-2,24645.246873642071,9.0975440655747766E-2,27274.23459079687,9.5948197392516962E-2,30043.756369536255,0.10092635168481677,32871.143528561559,0.10549147473864429,22047.507800713542,8.7538742955266993E-2,24541.172622293037,9.0591261064204648E-2,27042.562610200457,9.5133197108986337E-2,29658.74777604573,9.9632987691634409E-2,32306.379858965913,0.10367901110066083,22047.507800713542,8.7538742955266993E-2,23916.727114198857,8.8286183514945951E-2,25700.462860538464,9.0411816156119276E-2,27504.608065367112,9.2396560284087312E-2,29253.607966712585,9.3881925438743852E-2,22047.507800713542,8.7538742955266993E-2,24124.875616896912,8.905454269803216E-2,26138.699513489315,9.1953491569300341E-2,28193.455420427115,9.4710613478994607E-2,30209.368080025091,9.6949191527680015E-2,22047.507800713542,8.7538742955266993E-2,24228.949868245942,8.9438722289575279E-2,26361.241563815918,9.273637361505635E-2,28548.716690616926,9.5904046931661269E-2,30709.959445350669,9.8555710671857089E-2,22047.507800713542,8.7538742955266993E-2,24333.024119594978,8.9822901881118411E-2,26586.066096709979,9.3527285220256037E-2,28911.302678604403,9.7122086396816729E-2,31226.111865353752,0.10021216901589779]
["NHS St Helens CCG","E38000172",13006.562899086004,8.926947768761842E-2,14070.345821606505,9.5456891598415902E-2,15165.873867709201,0.10132197934065473,16217.24842083488,0.10660825940596158,17148.073936713048,0.11117786525358564,13006.562899086004,8.926947768761842E-2,13953.387801271992,9.4663417919077286E-2,14909.125054305816,9.9606661239349387E-2,15798.277716601398,0.10385404757166312,16547.683494163488,0.10728529236361183,13006.562899086004,8.926947768761842E-2,13894.908791104739,9.4266681079407999E-2,14782.602201546935,9.8761372271158041E-2,15594.796289951348,0.10251641000493916,16260.310776038925,0.10542213936747229,13006.562899086004,8.926947768761842E-2,13836.429780937488,9.3869944239738726E-2,14657.313718083265,9.7924330024607598E-2,15395.265833608406,0.10120474515914017,15981.2670444669,0.10361298654348354,13006.562899086004,8.926947768761842E-2,13485.555719933969,9.1489523201722989E-2,13931.504572500617,9.3075257699763603E-2,14278.884311831491,9.3865923690714489E-2,14472.924871779947,9.383379714587621E-2,13006.562899086004,8.926947768761842E-2,13602.513740268476,9.2282996881061577E-2,14168.503477180666,9.4658628254814706E-2,14635.879011247545,9.6212720294816867E-2,14945.155793959078,9.6895460282411042E-2,13006.562899086004,8.926947768761842E-2,13660.992750435726,9.2679733720730836E-2,14288.854483463501,9.5462683614801591E-2,14819.992936392146,9.7423040602104535E-2,15192.492671476703,9.8499044809885264E-2,13006.562899086004,8.926947768761842E-2,13719.471760602977,9.307647056040011E-2,14410.439859041551,9.6274985696429394E-2,15007.902891831816,9.8658315092241738E-2,15447.518100858006,0.10015247731365408]
["NHS Stafford and Surrounds CCG","E38000173",10709.384422205592,8.406110221511455E-2,11768.686142506669,9.0098653671004975E-2,12752.949535211439,9.5771624626099727E-2,13707.596449443618,0.10086531603711271,14486.229946375381,0.10503356979680528,10709.384422205592,8.406110221511455E-2,11670.935140189968,8.9350291993492342E-2,12537.175526719875,9.4151213027334604E-2,13353.796682409471,9.8261932909561964E-2,13979.409607749893,0.10135882836245574,10709.384422205592,8.406110221511455E-2,11622.059639031613,8.8976111154735985E-2,12430.844585035329,9.335269288852005E-2,13181.966813119981,9.6997548293745267E-2,13736.823570415369,9.9599938880621894E-2,10709.384422205592,8.406110221511455E-2,11573.184137873266,8.8601930315979696E-2,12325.551018391614,9.2561963190084209E-2,13013.473340289936,9.5757714056585258E-2,13501.268457435735,9.7892027678623386E-2,10709.384422205592,8.406110221511455E-2,11279.931130923169,8.6356845283441813E-2,11715.574494386623,8.7981184247421323E-2,12070.745081882176,8.8820787946152877E-2,12227.99953683461,8.8660089449206878E-2,10709.384422205592,8.406110221511455E-2,11377.682133239867,8.7105206960954432E-2,11914.750502224986,8.9476948800127562E-2,12372.209218179971,9.1039067094775356E-2,12626.633856981203,9.1550419496673474E-2,10709.384422205592,8.406110221511455E-2,11426.557634398216,8.7479387799710734E-2,12015.894568705407,9.0236516737048716E-2,12527.684202864348,9.2183106717176957E-2,12835.423589685359,9.3064266166512186E-2,10709.384422205592,8.406110221511455E-2,11475.433135556565,8.785356863846705E-2,12118.07601022665,9.1003875114348529E-2,12686.364744931328,9.3350733958287926E-2,13050.703623005465,9.4625171280492082E-2]
["NHS Stockport CCG","E38000174",20114.039350939227,8.6171019411101127E-2,21714.932613167344,9.1315948751755027E-2,23545.389981777658,9.6465871770639366E-2,25340.972229283845,0.10111312835880554,27082.265804473729,0.10556741952316882,20114.039350939227,8.6171019411101127E-2,21534.319623625917,9.055643239539915E-2,23147.033914755375,9.4833800044064956E-2,24687.054481099309,9.8503928182504627E-2,26135.650931180855,0.10187748862236241,20114.039350939227,8.6171019411101127E-2,21444.013128855197,9.0176674217221184E-2,22950.72864134295,9.402953392880592E-2,24369.466365825665,9.7236718401666533E-2,25682.560292362337,0.10011132880783635,20114.039350939227,8.6171019411101127E-2,21353.706634084487,8.9796916039043259E-2,22756.338541329667,9.3233114312232329E-2,24058.044814419769,9.5994113855317892E-2,25242.601678958163,9.8396357990793493E-2,20114.039350939227,8.6171019411101127E-2,20811.867665460195,8.7518366969975586E-2,21630.216582632052,8.8619373085185402E-2,22315.627782730659,8.9041687745314249E-2,22864.450673393982,8.9126259738808694E-2,20114.039350939227,8.6171019411101127E-2,20992.480655001618,8.8277883326331449E-2,21997.929875268008,9.0125900832792566E-2,22872.815117303508,9.1264923459035627E-2,23609.000857546314,9.2028536904756819E-2,20114.039350939227,8.6171019411101127E-2,21082.787149772335,8.8657641504509402E-2,22184.659281684704,9.0890934454624317E-2,23160.174978323485,9.241151934531755E-2,23998.968369317081,9.3548641027976456E-2,20114.039350939227,8.6171019411101127E-2,21173.093644543049,8.903739968268734E-2,22373.303861500546,9.1663814575141542E-2,23453.459577177193,9.3581755554932533E-2,24401.058155248866,9.5115998110426703E-2]
["NHS Stoke on Trent CCG","E38000175",18416.333915930463,8.8310798484369735E-2,19726.053011820699,9.3523862183864506E-2,21160.493186716038,9.8530886509201165E-2,22573.567584888642,0.10305682790763625,23834.156220748719,0.10715833207781997,18416.333915930463,8.8310798484369735E-2,19562.271248517805,9.274735088430594E-2,20802.937057288247,9.6865976239934121E-2,21991.662167908304,0.10040021077386917,23001.421283986878,0.10341435700021076,18416.333915930463,8.8310798484369735E-2,19480.380366866371,9.2359095234526706E-2,20626.73752235388,9.6045527669742434E-2,21709.048268592396,9.9109972007817737E-2,22602.838486368833,0.10162232931556889,18416.333915930463,8.8310798484369735E-2,19398.489485214937,9.1970839584747485E-2,20452.257007272528,9.523308347584529E-2,21431.921843700853,9.784478562683005E-2,22215.80790144204,9.9882240362566502E-2,18416.333915930463,8.8310798484369735E-2,18907.144195306282,8.9641305686071898E-2,19441.473333697806,9.0526510214648026E-2,19881.387526206589,9.0766013176618823E-2,20123.75390662182,9.0476368611733748E-2,18416.333915930463,8.8310798484369735E-2,19070.925958609168,9.0417816985630436E-2,19771.525145477302,9.2063350463202215E-2,20377.214913000935,9.3029651721151088E-2,20778.732998973643,9.3421153668616322E-2,18416.333915930463,8.8310798484369735E-2,19152.81684026061,9.0806072635409699E-2,19939.129581146586,9.2843777151921172E-2,20632.929427883708,9.4197084678066603E-2,21121.786526248125,9.4963521833684575E-2,18416.333915930463,8.8310798484369735E-2,19234.707721912044,9.1194328285188919E-2,20108.453036668881,9.3632208216934659E-2,20893.916222115375,9.5388587573572742E-2,21475.503990348108,9.6553835043377875E-2]
["NHS Sunderland CCG","E38000176",19949.967182612345,8.7011371173291815E-2,21240.393885077734,9.2109253621325826E-2,22802.011703235014,9.7770395777527719E-2,24230.403044767681,0.10268860419040381,25556.823947253906,0.10732749851862047,19949.967182612345,8.7011371173291815E-2,21063.351650056866,9.1341507589145124E-2,22415.35640683927,9.6112496384698015E-2,23603.737753259647,0.10003279264815922,24661.242431121755,0.10356644730019215,19949.967182612345,8.7011371173291815E-2,20974.830532546428,9.0957634573054766E-2,22224.817138182712,9.5295502693519912E-2,23299.385333723731,9.874294513359777E-2,24232.578554494881,0.10176624623926962,19949.967182612345,8.7011371173291815E-2,20886.309415036005,9.0573761556964463E-2,22036.136789220363,9.4486479672499624E-2,23000.942482408765,9.7478142407224813E-2,23816.338737073384,0.10001822080074493,19949.967182612345,8.7011371173291815E-2,20355.182709973389,8.8270523460422329E-2,20943.092009024702,8.9799725619692572E-2,21331.141838331616,9.0401516521154496E-2,21566.397242127707,9.0569449194220164E-2,19949.967182612345,8.7011371173291815E-2,20532.224944994257,8.9038269492603031E-2,21300.004590313089,9.1330094289996944E-2,21865.108020491494,9.2664468640835287E-2,22270.807664541717,9.3527665313882569E-2,19949.967182612345,8.7011371173291815E-2,20620.746062504692,8.9422142508693375E-2,21481.249260498585,9.2107234630385837E-2,22140.491968356102,9.3831547585845484E-2,22639.751471878131,9.5077068166798798E-2,19949.967182612345,8.7011371173291815E-2,20709.267180015129,8.9806015524783733E-2,21664.352850378302,9.28923456409326E-2,22421.553736668291,9.5022689170487756E-2,23020.164024295984,9.6674634740030171E-2]
["NHS Surrey Downs CCG","E38000177",18300.221289959758,7.8798748234411645E-2,20172.225575003802,8.3418350736100419E-2,22360.451290780838,8.8339330320720763E-2,24575.3627874626,9.2807261281958459E-2,26818.608609293802,9.7295779311035419E-2,18300.221289959758,7.8798748234411645E-2,20004.103423064633,8.2723113981741106E-2,21981.266288082734,8.6841285904245946E-2,23939.483915142951,9.040590602395375E-2,25877.954711880859,9.3883161775797627E-2,18300.221289959758,7.8798748234411645E-2,19920.042347095052,8.2375495604561463E-2,21794.40829396468,8.6103066900935055E-2,23630.656737469635,8.9239640247241819E-2,25427.717252793223,9.2249736078918967E-2,18300.221289959758,7.8798748234411645E-2,19835.981271125471,8.2027877227381821E-2,21609.37330466729,8.5372050034241823E-2,23327.826013768085,8.8096019689456517E-2,24990.529124785658,9.0663652317463567E-2,18300.221289959758,7.8798748234411645E-2,19331.614815307967,7.9942166964303896E-2,20537.446470116891,8.1137193703053459E-2,21633.475034157815,8.1697413270988728E-2,22627.353692903005,8.2090239779796126E-2,18300.221289959758,7.8798748234411645E-2,19499.736967247132,8.0637403718663195E-2,20887.463395684368,8.2520003933645572E-2,22175.291883390953,8.3743549408576104E-2,23367.215332839151,8.4774398972714951E-2,18300.221289959758,7.8798748234411645E-2,19583.798043216713,8.0985022095842837E-2,21065.206365699105,8.3222212253868139E-2,22454.724678849732,8.4798809210157602E-2,23754.727160680566,8.6180261067626496E-2,18300.221289959758,7.8798748234411645E-2,19667.859119186302,8.1332640473022508E-2,21244.772340534502,8.3931622710708365E-2,22739.918773222562,8.5875826182864656E-2,24154.284926903882,8.762982486904615E-2]
["NHS Surrey Heath CCG","E38000178",5925.2263955736025,7.61205857601953E-2,6471.7071262960208,8.1548728909980106E-2,7084.8167109132582,8.6951604208557395E-2,7722.0033748860351,9.1862995180657089E-2,8323.6059361862262,9.6606382731966409E-2,5925.2263955736025,7.61205857601953E-2,6417.8594914211817,8.0870205285045127E-2,6964.8510143743888,8.5479271163161355E-2,7522.477680705626,8.9489384733590596E-2,8032.088475660079,9.3222939596797574E-2,5925.2263955736025,7.61205857601953E-2,6390.9356739837604,8.0530943472577624E-2,6905.7333033396098,8.4753722426848407E-2,7425.5740726611184,8.8336593774222205E-2,7892.5556665493568,9.1603478024017609E-2,5925.2263955736025,7.61205857601953E-2,6364.0118565463445,8.019168166011019E-2,6847.1923504612696,8.4035252214792203E-2,7330.5520283757196,8.7206186395142993E-2,7757.0669674651763,9.0030953661387844E-2,5925.2263955736025,7.61205857601953E-2,6202.4689519218255,7.8156110785305266E-2,6508.0585544763935,7.9873079951845755E-2,6798.8995862073734,8.0881508282267117E-2,7024.6967486472868,8.15308350585804E-2,5925.2263955736025,7.61205857601953E-2,6256.3165867966645,7.8834634410240231E-2,6618.7961205122701,8.1232156609134382E-2,6968.9105547547597,8.2904003744405902E-2,7253.9868063487238,8.4192047427445724E-2,5925.2263955736025,7.61205857601953E-2,6283.2404042340831,7.9173896222707707E-2,6675.0300407648656,8.1922312724163782E-2,7056.5908110389455,8.3947071270984358E-2,7374.0803543442871,8.5585890835007977E-2,5925.2263955736025,7.61205857601953E-2,6310.1642216715045,7.951315803517521E-2,6731.840719173897,8.2619547363449869E-2,7146.0788442681514,8.5011644590389623E-2,7497.9070515633912,8.7023062344050495E-2]
["NHS Sutton CCG","E38000179",12483.828822951878,7.8327449008356628E-2,13929.302416266413,8.2863191054529522E-2,15638.59794297316,8.7926447447279663E-2,17432.935821167393,9.2767857711618731E-2,19317.127888636671,9.7778537601926868E-2,12483.828822951878,7.8327449008356628E-2,13813.195401435663,8.2172489003186577E-2,15373.491239776704,8.6435911614622191E-2,16982.177349083697,9.0369185552808082E-2,18640.188190611247,9.4352035789690453E-2,12483.828822951878,7.8327449008356628E-2,13755.141894020288,8.1827137977515091E-2,15242.84971536499,8.5701392754778977E-2,16763.257562933028,8.9204222876399661E-2,18316.175702667741,9.2711964479994635E-2,12483.828822951878,7.8327449008356628E-2,13697.088386604917,8.1481786951843646E-2,15113.482742410952,8.4974039932592782E-2,16548.58851154946,8.8061880116802133E-2,18001.554139765929,9.1119427716976759E-2,12483.828822951878,7.8327449008356628E-2,13348.767342112673,7.9409680797814824E-2,14364.046485297908,8.0760409790272727E-2,15347.505896622259,8.1670423034388331E-2,16300.89966138718,8.2511134143486431E-2,12483.828822951878,7.8327449008356628E-2,13464.874356943423,8.0100382849157784E-2,14608.760365171551,8.213628902041803E-2,15731.586176280867,8.3714272968714698E-2,16833.339612464217,8.520621387155404E-2,12483.828822951878,7.8327449008356628E-2,13522.927864358793,8.0445733874829228E-2,14733.029132294889,8.2834977691976217E-2,15929.669027298694,8.4768353699971752E-2,17112.211725195273,8.6617795733930317E-2,12483.828822951878,7.8327449008356628E-2,13580.981371774165,8.0791084900500687E-2,14858.572450875903,8.3540832401191409E-2,16131.835917602557,8.5844167292478471E-2,17399.752673417363,8.8073257103752592E-2]
["NHS Swale CCG","E38000180",7602.5237038948253,8.5134643940591559E-2,8602.4697975587223,9.1224494141661935E-2,9682.2076163826969,9.7504608422786479E-2,10709.742930659126,0.10266241306229988,11803.044423213501,0.10808648739206504,7602.5237038948253,8.5134643940591559E-2,8531.0294575047392,9.0466908351057668E-2,9518.6405471718008,9.5857407322978858E-2,10433.5851050252,0.10001519464172928,11390.606316432084,0.10430958165230847,7602.5237038948253,8.5134643940591559E-2,8495.3092874777503,9.0088115455755555E-2,9438.0365827770092,9.5045685627160217E-2,10299.463583465897,9.8729520547027369E-2,11193.195679279677,0.1025017919347956,7602.5237038948253,8.5134643940591559E-2,8459.5891174507597,8.9709322560453428E-2,9358.2189985226505,9.4241883167398288E-2,10167.946280669696,9.7468810205806111E-2,11001.506637945065,0.10074639778337974,7602.5237038948253,8.5134643940591559E-2,8245.2680972888156,8.7436565188640666E-2,8895.8274759457017,8.9585372366019156E-2,9432.1012907536388,9.0415081391426733E-2,9965.3512530594599,9.1257795357687368E-2,7602.5237038948253,8.5134643940591559E-2,8316.708437342797,8.819415097924492E-2,9046.8124629096037,9.1105865688918472E-2,9667.4086259859232,9.2670711522104307E-2,10289.750200318065,9.4228481687894383E-2,7602.5237038948253,8.5134643940591559E-2,8352.4286073697876,8.8572943874547047E-2,9123.4845266022112,9.187799120445328E-2,9788.7643692947149,9.3834014276214656E-2,10459.658223949162,9.5784415970230435E-2,7602.5237038948253,8.5134643940591559E-2,8388.1487773967783,8.8951736769849174E-2,9200.9429704352569,9.2658035956044882E-2,9912.6222051406039,9.5021301813080924E-2,10634.847896903459,9.7388717004610437E-2]
["NHS Swindon CCG","E38000181",13474.075415737037,7.5705559139999087E-2,15128.90632431538,8.1919570740282541E-2,16936.675830493004,8.7955316942734757E-2,18788.099141757244,9.3856025286028807E-2,20558.698558913809,9.9250258563839941E-2,13474.075415737037,7.5705559139999087E-2,15003.344618194949,8.1239682792911785E-2,16650.329516742888,8.6468267120600795E-2,18303.244226480132,9.1433930594865293E-2,19839.179512346116,9.5776670427469887E-2,13474.075415737037,7.5705559139999087E-2,14940.563765134735,8.0899738819226422E-2,16509.221357322756,8.5735466126520332E-2,18067.764826889706,9.025759230137731E-2,19494.786714758426,9.4114061575545152E-2,13474.075415737037,7.5705559139999087E-2,14877.782912074523,8.0559794845541058E-2,16369.48986287258,8.5009814410430928E-2,17836.857697756761,8.9104094803460709E-2,19160.375529199257,9.2499640480830619E-2,13474.075415737037,7.5705559139999087E-2,14501.097793713236,7.852013100342882E-2,15560.010860540522,8.0806038951706072E-2,16544.922336432668,8.2650226478332853E-2,17352.750282233439,8.3773053404622169E-2,13474.075415737037,7.5705559139999087E-2,14626.65949983366,7.9200018950799547E-2,15824.330534771398,8.2178700325983581E-2,16958.055362180676,8.4714034180141271E-2,17918.680581595363,8.6505168396231347E-2,13474.075415737037,7.5705559139999087E-2,14689.440352893882,7.9539962924484953E-2,15958.555369341771,8.2875754930108902E-2,17171.121671293255,8.5778407789455779E-2,18215.093684936564,8.7936147943113649E-2,13474.075415737037,7.5705559139999087E-2,14752.221205954093,7.9879906898170303E-2,16094.15686888209,8.3579958812225227E-2,17388.580946139489,8.6864726476868284E-2,18520.720891491917,8.9411609981133122E-2]
["NHS Tameside and Glossop CCG","E38000182",18237.444441323729,8.8980505666099385E-2,19824.441329094097,9.5355658148600766E-2,21524.204106388319,0.10156759204599999,23195.052053277996,0.10711670847546871,24741.545659924624,0.11220655628083728,18237.444441323729,8.8980505666099385E-2,19659.640131599404,9.4562963595956742E-2,21160.264773137573,9.9850249023865481E-2,22596.638536677405,0.10435318433858597,23876.402049513359,0.10828300249212407,18237.444441323729,8.8980505666099385E-2,19577.239532852062,9.4166616319634744E-2,20980.919669011611,9.9003962198054032E-2,22306.007151584887,0.10301102406753897,23462.307065195779,0.10640502070383571,18237.444441323729,8.8980505666099385E-2,19494.838934104715,9.3770269043312732E-2,20803.324273218583,9.8165931829079761E-2,22021.018915312972,0.10169492433413213,23060.213886680656,0.10458146887383517,18237.444441323729,8.8980505666099385E-2,19000.435341620654,9.1392185385380742E-2,19774.495773452072,9.3311135208814983E-2,20426.497423561694,9.4331289477979557E-2,20886.740592414739,9.4724447131132594E-2,18237.444441323729,8.8980505666099385E-2,19165.236539115343,9.2184879938024752E-2,20110.439773375827,9.4896374921554491E-2,20936.390958662618,9.6686020867565434E-2,21567.210393411231,9.78104779746541E-2,18237.444441323729,8.8980505666099385E-2,19247.637137862683,9.2581227214346737E-2,20281.036335837121,9.5701379463180081E-2,21199.359849536482,9.7900433405082116E-2,21923.614999545149,9.9426825394762566E-2,18237.444441323729,8.8980505666099385E-2,19330.037736610026,9.2977574490668721E-2,20453.382606631338,9.6514640461642778E-2,21467.75058927721,9.9139884498370787E-2,22291.098565380576,0.10109341753007063]
["NHS Telford and Wrekin CCG","E38000183",11351.174748693587,8.3698383340905375E-2,12553.8416239289,9.0458579218395299E-2,13734.654134936922,9.6641247783119347E-2,14910.109284155847,0.10246089392630464,15904.365078052761,0.10756367562594861,11351.174748693587,8.3698383340905375E-2,12449.420506060636,8.970615727093699E-2,13502.114273252546,9.5005025846133878E-2,14524.778147069508,9.9812933940829518E-2,15347.257952657077,0.10379587415566804,11351.174748693587,8.3698383340905375E-2,12397.20994712651,8.9329946297207877E-2,13387.521312566734,9.4198714555071311E-2,14337.634442951899,9.8526899690433628E-2,15080.602493866516,0.10199244213354873,11351.174748693587,8.3698383340905375E-2,12344.999388192375,8.8953735323478708E-2,13274.046331985171,9.3400269715628842E-2,14154.124481875635,9.726583618661104E-2,14821.675568754879,0.10024127937748464,11351.174748693587,8.3698383340905375E-2,12031.736034587597,8.6696469481103877E-2,12616.674030685099,8.8774796162996758E-2,13127.378323106619,9.0210131412222519E-2,13422.072723029461,9.077554932388382E-2,11351.174748693587,8.3698383340905375E-2,12136.157152455859,8.7448891428562173E-2,12831.326210701451,9.0285154874060303E-2,13455.709569348417,9.2466393412234879E-2,13860.25959765888,9.3739074784653598E-2,11351.174748693587,8.3698383340905375E-2,12188.367711389985,8.7825102402291286E-2,12940.329270866001,9.1052133907022242E-2,13625.040807577099,9.3630022042173591E-2,14089.765477621009,9.5291258471669207E-2,11351.174748693587,8.3698383340905375E-2,12240.578270324118,8.8201313376020454E-2,13050.450311134806,9.1826979391604321E-2,13797.863289120012,9.4817642173721933E-2,14326.405626758109,9.6891692322183878E-2]
["NHS Thanet CCG","E38000184",10999.979916198276,9.6864916486423702E-2,12153.000455970354,0.1022807646521659,13532.137898442454,0.10851754529625064,15034.02353668021,0.11464102132591283,16468.918511252723,0.12001835382052706,10999.979916198276,9.6864916486423702E-2,12051.605430050904,0.10142741482958174,13302.33006623055,0.10667465971315598,14644.806395696596,0.11167306996870975,15890.778472491724,0.11580511931563711,10999.979916198276,9.6864916486423702E-2,12000.907917091186,0.10100073991828973,13189.083418145356,0.10576650696187134,14455.775376764388,0.11023162556629852,15614.055755704514,0.11378848386317238,10999.979916198276,9.6864916486423702E-2,11950.210404131465,0.10057406500699767,13076.941615407339,0.10486721423742855,14270.414746600431,0.10881816948757382,15345.353354143974,0.11183029699857144,10999.979916198276,9.6864916486423702E-2,11646.02532637313,9.8014015539245325E-2,12427.292551269844,9.9657518454449437E-2,13233.314014347787,0.10090982167414814,13892.910176536094,0.10124551943256153,10999.979916198276,9.6864916486423702E-2,11747.420352292575,9.8867365361829426E-2,12639.422857926986,0.10135864360807528,13564.95642955491,0.10343874050293511,14347.640272660579,0.10455939566142385,10999.979916198276,9.6864916486423702E-2,11798.117865252294,9.929404027312147E-2,12747.145279276318,0.10222249622515091,13735.995346681961,0.10474298724021626,14585.810872691844,0.10629507996423147,10999.979916198276,9.6864916486423702E-2,11848.815378212013,9.97207151844135E-2,12855.97254597282,0.10309520886906834,13910.560715762827,0.10607412471986295,14831.385087700062,0.10808471861026135]
["NHS Thurrock CCG","E38000185",10152.39718869315,7.8933270010054041E-2,11256.962492318144,8.3236930585020283E-2,12585.377823062801,8.7923556120321378E-2,14017.937780749357,9.2649952285190726E-2,15448.158035971452,9.7219370899757393E-2,10152.39718869315,7.8933270010054041E-2,11163.200418769537,8.2543629242602307E-2,12372.119006378196,8.6433694329874217E-2,13655.595311436404,9.0255091285105116E-2,14906.798787795286,9.3812453038359236E-2,10152.39718869315,7.8933270010054041E-2,11116.319381995236,8.2196978571393339E-2,12267.027522194674,8.5699507630254815E-2,13479.616509465999,8.9091979573469926E-2,14647.680941132674,9.2181755450803468E-2,10152.39718869315,7.8933270010054041E-2,11069.438345220933,8.1850327900184358E-2,12162.961320783676,8.497248372770487E-2,13307.054663198694,8.7951451838722369E-2,14396.073163882562,9.0598320729279799E-2,10152.39718869315,7.8933270010054041E-2,10788.152124575117,7.9770423872930471E-2,11560.095050540649,8.0760759050863828E-2,12341.56367967975,8.1570149898742561E-2,13036.033218658387,8.2039227304332191E-2,10152.39718869315,7.8933270010054041E-2,10881.914198123724,8.0463725215348447E-2,11756.949342864906,8.2136016088199704E-2,12650.306843846103,8.361075243784602E-2,13461.833762569164,8.471890347746483E-2,10152.39718869315,7.8933270010054041E-2,10928.795234898023,8.0810375886557401E-2,11856.914413185812,8.2834388802471792E-2,12809.535862958186,8.4663158380424236E-2,13684.852146223944,8.6122417534448978E-2,10152.39718869315,7.8933270010054041E-2,10975.676271672328,8.1157026557766396E-2,11957.904766279247,8.353992431381338E-2,12972.047839510502,8.5737262653737614E-2,13914.803133000802,8.7569560308375066E-2]
["NHS Tower Hamlets CCG","E38000186",19396.601703682252,8.2363489187610398E-2,23337.001988661199,8.8011019718891234E-2,27453.270097461365,9.5829621954277314E-2,31896.015762964864,0.10393644344031824,36663.822904640554,0.11195744138463587,19396.601703682252,8.2363489187610398E-2,23144.454348423471,8.7284863284143421E-2,26992.412304399011,9.4220930970395883E-2,31078.857274545877,0.10127364857451081,35390.197850013246,0.10806827241362296,19396.601703682252,8.2363489187610398E-2,23048.180528304598,8.6921785066769494E-2,26765.306901567808,9.3428186615358164E-2,30681.988058291478,9.9980409470449283E-2,34780.5860576177,0.10620674867966808,19396.601703682252,8.2363489187610398E-2,22951.906708185725,8.6558706849395553E-2,26540.417161203251,9.2643176351589127E-2,30292.824795917197,9.8712281008593583E-2,34188.642777578752,0.10439917789660057,19396.601703682252,8.2363489187610398E-2,22374.263787472522,8.4380237545152073E-2,25237.607630815448,8.809553068561661E-2,28115.439533376859,9.1617047488845346E-2,30988.954298316356,9.4628540058374122E-2,19396.601703682252,8.2363489187610398E-2,22566.81142771025,8.5106393979899872E-2,25663.014824411461,8.9580476209199456E-2,28811.720313872313,9.388594992789466E-2,31990.710974360441,9.768752587749005E-2,19396.601703682252,8.2363489187610398E-2,22663.085247829131,8.5469472197273841E-2,25879.041914909445,9.0334550107893902E-2,29170.815246400598,9.5056097648594226E-2,32515.393617212027,9.9289708126334517E-2,19396.601703682252,8.2363489187610398E-2,22759.359067948,8.5832550414647754E-2,26097.284667874064,9.1096358097856975E-2,29537.313938539199,9.6250371280432734E-2,33056.386200384775,0.1009416947611603]
["NHS Trafford CCG","E38000187",15334.263919348958,8.2460012472300268E-2,16685.926917609744,8.6383966233225015E-2,18255.693084514838,9.0833381851501832E-2,19863.008456951095,9.531194077231811E-2,21551.08202673282,0.10006073928281559,15334.263919348958,8.2460012472300268E-2,16546.886681389467,8.566414724264583E-2,17946.248877650774,8.9293705232614068E-2,19349.394302332497,9.2847381489119474E-2,20796.001799162947,9.6554934530425046E-2,15334.263919348958,8.2460012472300268E-2,16477.366563279335,8.5304237747356251E-2,17793.758343018246,8.8534970360325635E-2,19099.947408138163,9.1650419424847238E-2,20434.58788911231,9.487690541885184E-2,15334.263919348958,8.2460012472300268E-2,16407.846445169194,8.4944328252066645E-2,17642.755520918723,8.7783637779474191E-2,18855.343989284011,9.0476698605009648E-2,20083.648917727936,9.3247510993258134E-2,15334.263919348958,8.2460012472300268E-2,15990.725736508361,8.2784871280329062E-2,16767.980551514553,8.3431090414541512E-2,17486.777295370852,8.3909679920205621E-2,18186.684425473075,8.4439987117991805E-2,15334.263919348958,8.2460012472300268E-2,16129.765972728641,8.3504690270908261E-2,17053.62135785061,8.4852330370437906E-2,17924.41536622202,8.6009670663253449E-2,18780.58500568612,8.7197441757294644E-2,15334.263919348958,8.2460012472300268E-2,16199.286090838777,8.3864599766197853E-2,17198.673329818135,8.5574053785541518E-2,18150.119734239033,8.709270505872857E-2,19091.647894977548,8.8641693262965685E-2,15334.263919348958,8.2460012472300268E-2,16268.806208948914,8.4224509261487446E-2,17345.213014318666,8.6303179492082133E-2,18380.477637386797,8.8198069277287891E-2,19412.380281115496,9.0130839823175296E-2]
["NHS Vale of York CCG","E38000188",22143.25971439949,7.4808309845944207E-2,24210.51011275647,7.9305916249857417E-2,26523.118536892125,8.4237815336632563E-2,28770.230948767803,8.8512893640068299E-2,30811.413080515857,9.2593500061653608E-2,22143.25971439949,7.4808309845944207E-2,24008.742179858335,7.8644988796705756E-2,26073.346049015003,8.2809331286968837E-2,28026.032380593937,8.6223333683835626E-2,29731.315037352342,8.9347623023657716E-2,22143.25971439949,7.4808309845944207E-2,23907.858213409283,7.8314525070129995E-2,25851.7033566717,8.2105390829802782E-2,27664.597595696534,8.5111363511249469E-2,29214.333605757842,8.7794006508468095E-2,22143.25971439949,7.4808309845944207E-2,23806.974246960213,7.7984061343554165E-2,25632.223032058588,8.1408318084413997E-2,27310.180739298026,8.4020984307463756E-2,28712.335960445373,8.6285418801674993E-2,22143.25971439949,7.4808309845944207E-2,23201.670448265842,7.6001278984099321E-2,24360.75080671363,7.737010355940302E-2,25327.203119031852,7.7920265564336233E-2,25998.839352767918,7.8130903211828098E-2,22143.25971439949,7.4808309845944207E-2,23403.438381163967,7.666220643725094E-2,24775.925410907901,7.8688704220631095E-2,25961.31653428161,7.9871143657031768E-2,26848.379350108698,8.0683914383064964E-2,22143.25971439949,7.4808309845944207E-2,23504.32234761303,7.6992670163826743E-2,24986.75626460031,7.9358306118910996E-2,26288.349708890233,8.0877275747262584E-2,27293.336595388148,8.2021086054177628E-2,22143.25971439949,7.4808309845944207E-2,23605.206314062092,7.7323133890402559E-2,25199.749486022887,8.0034775728968083E-2,26622.125599115458,8.1904152101635042E-2,27752.125489598347,8.3399824166361186E-2]
["NHS Vale Royal CCG","E38000189",6965.0996515050019,8.3997825030209874E-2,7608.9587912576271,9.0690808000686865E-2,8118.3498626066439,9.616619121779961E-2,8668.6964758839094,0.10141198497758436,9118.2748520560381,0.10565787777585212,6965.0996515050019,8.3997825030209874E-2,7545.6777268075557,8.9936564085906515E-2,7980.8031574442748,9.4536877013080708E-2,8444.6965678073084,9.8791490030501986E-2,8798.6275208670359,0.10195396895558559,6965.0996515050019,8.3997825030209874E-2,7514.03719458252,8.9559442128516339E-2,7913.0217282176291,9.3733969772774553E-2,8335.9065726970348,9.7518794720367757E-2,8645.6305444078989,0.10018111870692814,6965.0996515050019,8.3997825030209874E-2,7482.396662357487,8.9182320171126206E-2,7845.9015812273401,9.2938895773837224E-2,8229.2289376555291,9.6270811156475553E-2,8497.0679128922311,9.8459651366074527E-2,6965.0996515050019,8.3997825030209874E-2,7292.5534690072718,8.6919588426785141E-2,7457.0676262491079,8.8332949848958855E-2,7632.3629617540464,8.9288289210973884E-2,7694.0278978450078,8.9154436823232999E-2,6965.0996515050019,8.3997825030209874E-2,7355.8345334573432,8.7673832341565491E-2,7584.0338156297539,8.983693219177627E-2,7823.2278099284131,9.1521148922887388E-2,7945.443215747945,9.2067708177844085E-2,6965.0996515050019,8.3997825030209874E-2,7387.4750656823771,8.8050954298955639E-2,7648.508833674613,9.0600673225238237E-2,7921.6630988192328,9.2672708222031289E-2,8077.1251467050697,9.3593570645481683E-2,6965.0996515050019,8.3997825030209874E-2,7419.1155979074128,8.8428076256345814E-2,7713.6451339558316,9.1372247500069059E-2,8022.1279101290693,9.3848010179329325E-2,8212.9004557537901,9.5166865072465703E-2]
["NHS Wakefield CCG","E38000190",23683.734302439312,8.7361616755585791E-2,25784.805971204933,9.3267763767651474E-2,28185.656323800584,9.9476446402910229E-2,30351.814320967362,0.10453886588471226,32418.039640743769,0.10943167580591334,23683.734302439312,8.7361616755585791E-2,25570.435253004034,9.2492350622166056E-2,27708.821361464546,9.7793539074837815E-2,29568.226537322102,0.10184000322836019,31283.404663964859,0.10560155503633831,23683.734302439312,8.7361616755585791E-2,25463.249893903605,9.2104644049423423E-2,27473.842593967216,9.6964221761725186E-2,29187.661599223607,0.10052924708694497,30740.319507626384,0.10376829431415874,23683.734302439312,8.7361616755585791E-2,25356.064534803161,9.1716937476680735E-2,27241.156302250354,9.6142995349228322E-2,28814.48603712425,9.9243941713591799E-2,30212.97470755257,0.10198816738979398,23683.734302439312,8.7361616755585791E-2,24712.95238020051,8.9390698040224648E-2,25893.180543338876,9.1385545787177516E-2,26726.552648196361,9.205260263207396E-2,27362.466663464176,9.2365874505347612E-2,23683.734302439312,8.7361616755585791E-2,24927.323098401401,9.0166111185710038E-2,26333.335893187526,9.2938998705398207E-2,27394.228651463283,9.4352237554120269E-2,28254.902124537944,9.5378416569463761E-2,23683.734302439312,8.7361616755585791E-2,25034.508457501834,9.0553817758452684E-2,26556.852281782532,9.3727861515432109E-2,27738.571158193521,9.5538235028564844E-2,28722.326407787783,9.6956273318214228E-2,23683.734302439312,8.7361616755585791E-2,25141.693816602277,9.0941524331195372E-2,26782.661146158018,9.4524815226081804E-2,28090.013261471944,9.6748685201735685E-2,29204.280735567081,9.8583178286413317E-2]
["NHS Walsall CCG","E38000191",21843.772907945528,0.10038498579019085,23555.87845977936,0.10550872731245795,25256.677325647408,0.10986896348376285,26993.872385646271,0.1140714688372476,28768.51280240943,0.11832077322698623,21843.772907945528,0.10038498579019085,23359.504444923004,0.10462915186295353,24828.225770533641,0.10800515821530206,26295.688311252332,0.1111210628433584,27759.748230401798,0.11417186900716376,21843.772907945528,0.10038498579019085,23261.317437494821,0.10418936413820129,24617.089787845362,0.10708669648444996,25956.601377281746,0.10968813969439548,27276.910069663314,0.11218602479914171,21843.772907945528,0.10038498579019085,23163.130430066649,0.10374957641344912,24408.013668402826,0.1061771953558501,25624.098446724664,0.10828303941313668,26808.066113294983,0.11025773674958864,21843.772907945528,0.10038498579019085,22574.008385497575,0.10111085006493584,23196.814079908127,0.10090836123154744,23763.730188093476,0.10042144264745384,24273.778359129057,9.9834574151225861E-2,21843.772907945528,0.10038498579019085,22770.38240035393,0.10199042551444025,23592.307823090072,0.1026287968639728,24358.635777569827,0.1029354115008867,25067.211749037619,0.10309785205658312,21843.772907945528,0.10038498579019085,22868.569407782103,0.10243021323919244,23793.144489549646,0.10350245558356379,24665.448185003657,0.10423194804345697,25482.782453879699,0.10480703485185366,21843.772907945528,0.10038498579019085,22966.756415210286,0.10287000096394466,23996.041019254972,0.10438507490540704,24978.586399638691,0.10555521636088019,25911.271316940936,0.10656934818187437]
["NHS Waltham Forest CCG","E38000192",21571.296519854608,0.10123566979469968,24206.867388964554,0.10746189908978315,27259.726878974896,0.1147874636978899,30588.139155987887,0.12227430107126597,33964.061792637316,0.1295151837730221,21571.296519854608,0.10123566979469968,24004.991663383931,0.10656570923991801,26797.180870267159,0.11283973753691746,29796.509080417829,0.11910980604580203,32773.094993348313,0.1249736691326583,21571.296519854608,0.10123566979469968,23904.053800593618,0.10611761431498543,26569.243534245328,0.11187992055855368,29412.038243845167,0.11757290631533888,32203.04700115438,0.12279990467188218,21571.296519854608,0.10123566979469968,23803.115937803312,0.10566951939005288,26343.52997711151,0.11092946764827147,29035.032623554187,0.11606584835127196,31649.520835013634,0.12068914290349922,21571.296519854608,0.10123566979469968,23197.488761061442,0.10298094984045744,25035.947990956975,0.10542339561629178,26925.669893608287,0.10763379394630754,28657.492111156429,0.10927963739763739,21571.296519854608,0.10123566979469968,23399.364486642069,0.1038771396903226,25462.913537456407,0.10722129668795859,27600.198537308763,0.11033018283222246,29594.234787346781,0.11285171898774703,21571.296519854608,0.10123566979469968,23500.302349432372,0.10432523461525513,25679.731979038159,0.10813429332591443,27948.075176422182,0.11172079939407654,30084.865531088155,0.11472264159200792,21571.296519854608,0.10123566979469968,23601.240212222681,0.1047733295401877,25898.774199507923,0.10905665403195185,28303.124278237607,0.11314008745697798,30590.747700160973,0.11665172246858212]
["NHS Wandsworth CCG","E38000193",18311.885695968769,7.0284354402275165E-2,20284.747801138416,7.444490531832948E-2,22538.791787042312,7.997016671530767E-2,24905.230177495599,8.5543828321410997E-2,27319.198329603889,9.0251728872163497E-2,18311.885695968769,7.0284354402275165E-2,20114.8294392424,7.3821305927930125E-2,22154.44905848441,7.860647551264692E-2,24257.1734194938,8.3317900046348148E-2,26355.209848357335,8.7067095633820077E-2,18311.885695968769,7.0284354402275165E-2,20029.870258294384,7.3509506232730421E-2,21965.049396574868,7.7934464222874214E-2,23942.431810269172,8.2236833860923175E-2,25893.803452678865,8.5542793038251949E-2,18311.885695968769,7.0284354402275165E-2,19944.91107734638,7.3197706537530757E-2,21777.49753624494,7.726900914080663E-2,23633.801494703792,8.117675858591672E-2,25445.770099820686,8.4062669639315121E-2,18311.885695968769,7.0284354402275165E-2,19435.155991658332,7.1326908366332695E-2,20690.990207437033,7.341395901020803E-2,21907.001548107291,7.5245591633259917E-2,23023.971921165288,7.6062014936125827E-2,18311.885695968769,7.0284354402275165E-2,19605.074353554348,7.1950507756732049E-2,21045.768110721245,7.4672750889587164E-2,22459.194876160294,7.7142250725287811E-2,23782.18713780999,7.8566855427188595E-2,18311.885695968769,7.0284354402275165E-2,19690.033534502356,7.2262307451931726E-2,21225.928764732762,7.5311981140834386E-2,22743.97916352591,7.812042029101432E-2,24179.31188200476,7.9878797099454113E-2,18311.885695968769,7.0284354402275165E-2,19774.99271545036,7.2574107147131389E-2,21407.937220323878,7.5957767599786674E-2,23034.635085975882,7.91187575942017E-2,24588.781385390874,8.1231520929603146E-2]
["NHS Warrington CCG","E38000194",13249.062848852845,7.8713538788336757E-2,14669.846386700628,8.4435630175553278E-2,16120.92409665241,9.0101297209101344E-2,17556.791153759747,9.5303393517314872E-2,18936.546334869257,0.10023579470076888,13249.062848852845,7.8713538788336757E-2,14547.857695742689,8.3733496579617164E-2,15848.1612360121,8.8576801006103864E-2,17103.552249867727,9.2843080283724497E-2,18274.135854568987,9.6729493195897673E-2,13249.062848852845,7.8713538788336757E-2,14486.863350263719,8.3382429781649114E-2,15713.74684555233,8.782554686760749E-2,16883.427792846363,9.1648180397602669E-2,17957.077675844936,9.505122631719741E-2,13249.062848852845,7.8713538788336757E-2,14425.869004784754,8.3031362983681078E-2,15580.64381499949,8.7081622037779416E-2,16667.577461517343,9.0476481714891671E-2,17649.208863892381,9.3421601015733546E-2,13249.062848852845,7.8713538788336757E-2,14059.902931910941,8.0924962195872793E-2,14809.564189727847,8.2771988540844235E-2,15459.885534271032,8.3920776974655484E-2,15985.055685797364,8.4612829164711856E-2,13249.062848852845,7.8713538788336757E-2,14181.891622868876,8.1627095791808879E-2,15061.345291857362,8.4179215805149588E-2,15846.079329263495,8.6017149762585468E-2,16506.067830236181,8.7370674519564789E-2,13249.062848852845,7.8713538788336757E-2,14242.885968347842,8.1978162589776901E-2,15189.202882782511,8.4893823400304685E-2,16045.25218975375,8.7098318259438437E-2,16778.954485687722,8.8815130667413311E-2,13249.062848852845,7.8713538788336757E-2,14303.880313826814,8.2329229387744979E-2,15318.371833614576,8.5615760304127986E-2,16248.531563164101,8.8201778108588105E-2,17060.32391663317,9.0304488231172819E-2]
["NHS Warwickshire North CCG","E38000195",13643.669198412637,8.8583750152010352E-2,14942.402192244306,9.5223057559548213E-2,16189.995610678674,0.10142836493345868,17404.739419309695,0.10660749368681673,18480.308824105723,0.11107289832976151,13643.669198412637,8.8583750152010352E-2,14818.061333416237,9.4430673804589832E-2,15915.814962611339,9.9710656325092961E-2,16954.876784421871,0.10385199549443755,17832.935517647464,0.10718196608755536,13643.669198412637,8.8583750152010352E-2,14755.890904002208,9.4034481927110683E-2,15780.701902866622,9.8864189342605074E-2,16736.392079361169,0.10251373318241561,17523.074777812595,0.10531959837608242,13643.669198412637,8.8583750152010352E-2,14693.720474588179,9.363829004963152E-2,15646.907019314534,9.8025980574580465E-2,16522.149661159092,0.10120145572191042,17222.194799798417,0.10351120807668238,13643.669198412637,8.8583750152010352E-2,14320.697898103983,9.126113878475646E-2,14871.819418047266,9.3170150470162041E-2,15323.454077310394,9.3859206647742235E-2,15595.819044287986,9.373614042726279E-2,13643.669198412637,8.8583750152010352E-2,14445.038756932052,9.2053522539714841E-2,15124.909247032498,9.4755727647115012E-2,15706.771035984428,9.6207099326132736E-2,16105.003854433762,9.6796513129184761E-2,13643.669198412637,8.8583750152010352E-2,14507.209186346079,9.2449714417193976E-2,15253.431425814062,9.5560903557286442E-2,15904.460217228318,9.7417984915033201E-2,16371.695794977815,9.839942177532042E-2,13643.669198412637,8.8583750152010352E-2,14569.37961576011,9.2845906294673139E-2,15383.271780788253,9.6374337681921149E-2,16106.2253211403,9.8653836341665455E-2,16646.677946173335,0.10005215738774692]
["NHS West Cheshire CCG","E38000196",15977.387291780571,8.3537526360873013E-2,17363.086629567195,8.9574322273871215E-2,18834.560196063758,9.5830671598981176E-2,20203.047350863129,0.10099503774676628,21426.165723085898,0.1058082257930168,15977.387291780571,8.3537526360873013E-2,17218.355135966915,8.8827667849602332E-2,18515.077192404853,9.4205134793959783E-2,19679.978816158069,9.8380218037182901E-2,20674.058591215256,0.10209411649982844,15977.387291780571,8.3537526360873013E-2,17145.989389166771,8.8454340637467876E-2,18357.639654544095,9.3404089012639149E-2,19425.940214885777,9.7110279018625151E-2,20314.067732785334,0.1003163838656066,15977.387291780571,8.3537526360873013E-2,17073.623642366634,8.8081013425333449E-2,18201.738092662468,9.2610858312111896E-2,19176.83424548565,9.5864998227782675E-2,19964.510568404265,9.8590175646440834E-2,15977.387291780571,8.3537526360873013E-2,16639.4291615658,8.584105015252684E-2,17298.584216934407,8.8015590805609084E-2,17783.07558678418,8.8897598414238041E-2,18075.015291694421,8.9259334773799617E-2,15977.387291780571,8.3537526360873013E-2,16784.16065516607,8.6587704576795668E-2,17593.49160492724,8.9516086317936519E-2,18228.76950388672,9.11256223949546E-2,18666.577414090232,9.2180629205383877E-2,15977.387291780571,8.3537526360873013E-2,16856.526401966214,8.6961031788930124E-2,17743.249262892361,9.0278056695290335E-2,18458.628537158216,9.2274687748241421E-2,18976.415506724868,9.3710693860369731E-2,15977.387291780571,8.3537526360873013E-2,16928.892148766357,8.7334359001064593E-2,17894.5428968366,9.1047842153437475E-2,18693.22676575787,9.3447444339921359E-2,19295.8850229809,9.5288321101140258E-2]
["NHS West Essex CCG","E38000197",19892.974519814739,8.2440839286426593E-2,22018.092775682493,8.6959292163043031E-2,24513.667302398098,9.2018270654647516E-2,27069.267194925815,9.6682860186176917E-2,29804.6830511019,0.10136957707333481,19892.974519814739,8.2440839286426593E-2,21834.581871390754,8.6234525558415306E-2,24097.947551095887,9.0457761077687271E-2,26368.961371830697,9.4181589298630963E-2,28759.245146514702,9.7813907715511544E-2,19892.974519814739,8.2440839286426593E-2,21742.826419244888,8.5872142256101458E-2,23893.085654420523,8.9688759964041007E-2,26028.843968549634,9.2966797516071273E-2,28258.85354968,9.6112011256649213E-2,19892.974519814739,8.2440839286426593E-2,21651.070967099018,8.5509758953787596E-2,23690.222410395643,8.8927261300283944E-2,25695.330577160057,9.1775593175084144E-2,27772.96491230587,9.4459441236330419E-2,19892.974519814739,8.2440839286426593E-2,21100.538254223811,8.3335459139904478E-2,22515.014651906698,8.4515820765415528E-2,23829.30874652513,8.5110753434263622E-2,25146.543889149441,8.5526644068938992E-2,19892.974519814739,8.2440839286426593E-2,21284.049158515543,8.4060225744532174E-2,22898.755960801049,8.5956291144148086E-2,24426.02222622425,8.7242025238317908E-2,25968.822311283853,8.8323319200339617E-2,19892.974519814739,8.2440839286426593E-2,21375.804610661413,8.4422609046846037E-2,23093.624594223958,8.6687780008348189E-2,24733.767022194075,8.8341192307286501E-2,26399.500964097064,8.9788112931423247E-2,19892.974519814739,8.2440839286426593E-2,21467.560062807286,8.4784992349159913E-2,23290.491880297366,8.7426771322437563E-2,25047.856849196894,8.9463021820118921E-2,26843.567410885691,9.1298440279184045E-2]
["NHS West Hampshire CCG","E38000198",37779.453706640983,8.2824250683213446E-2,41744.928713362744,8.8423911699560986E-2,46105.705829755367,9.4189388824832201E-2,50309.177352191044,9.9205666020253672E-2,54325.657579958679,0.10386123500164164,37779.453706640983,8.2824250683213446E-2,41397.003049357365,8.7686937194148204E-2,45323.548286896425,9.2591518461484001E-2,49006.861107073441,9.6637602750973023E-2,52419.298210369256,0.10021660652768183,37779.453706640983,8.2824250683213446E-2,41223.040217354683,8.731844994144182E-2,44938.11007467025,9.1804106383391718E-2,48374.365410289829,9.5390371924376535E-2,51506.832529811851,9.8472130405329886E-2,37779.453706640983,8.2824250683213446E-2,41049.077385352,8.6949962688735435E-2,44556.432235246299,9.1024376374354024E-2,47754.150793693785,9.4167358403718621E-2,50620.813042312067,9.6778214817252448E-2,37779.453706640983,8.2824250683213446E-2,40005.3003933359,8.4739039172497144E-2,42345.333027548884,8.6507319770273497E-2,44284.02322422772,8.7324544928671158E-2,45831.525889042154,8.7621928438500654E-2,37779.453706640983,8.2824250683213446E-2,40353.226057341264,8.5476013677909898E-2,43067.324605572532,8.7982277028748779E-2,45393.695074246425,8.9512728889111895E-2,47330.95322716426,9.0488573446954962E-2,37779.453706640983,8.2824250683213446E-2,40527.188889343946,8.5844500930616283E-2,43433.96095378766,8.873127876156825E-2,45965.989397561614,9.0641247431695882E-2,48116.297130872052,9.1990014780086518E-2,37779.453706640983,8.2824250683213446E-2,40701.151721346629,8.6212988183322667E-2,43804.357674805004,8.9487962563442283E-2,46550.083190076599,9.1793033581946279E-2,48926.053719801224,9.3538128933203124E-2]
["NHS West Kent CCG","E38000199",29744.843009144137,7.7906870113001944E-2,33015.550814501017,8.2899489816956301E-2,36824.04768367832,8.8209763051977003E-2,40456.906733193682,9.2901870885445215E-2,44243.218928875613,9.752936012890312E-2,29744.843009144137,7.7906870113001944E-2,32740.698604254969,8.2209357214520593E-2,36200.215176882783,8.6715410283339206E-2,39411.251385153264,9.0500715038930063E-2,42693.44470505965,9.4113051549818472E-2,29744.843009144137,7.7906870113001944E-2,32603.272499131948,8.1864290913302731E-2,35892.797715601329,8.5979010481486443E-2,38903.408140139763,8.9334546110360444E-2,41951.656029533529,9.2477859160421325E-2,29744.843009144137,7.7906870113001944E-2,32465.846394008939,8.1519224612084912E-2,35588.379449064094,8.5249795067944459E-2,38405.425616150038,8.8191020520230631E-2,41231.366777973628,9.089005991088446E-2,29744.843009144137,7.7906870113001944E-2,31641.289763270837,7.9448826804777883E-2,33824.852939469041,8.1025374741218417E-2,35619.19188452138,8.1792945449897542E-2,37337.917358628729,8.2307374478945261E-2,29744.843009144137,7.7906870113001944E-2,31916.141973516878,8.0138959407213578E-2,34400.69833035722,8.2404777296884058E-2,36510.169255718327,8.3838911673827329E-2,38556.876321023679,8.4994436824406314E-2,29744.843009144137,7.7906870113001944E-2,32053.568078639888,8.0484025708431398E-2,34693.119817917628,8.3105255157183033E-2,36969.675632968225,8.4894083845338988E-2,39195.321389782926,8.6401819481930445E-2,29744.843009144137,7.7906870113001944E-2,32190.994183762905,8.0829092009649231E-2,34988.54050022224,8.3812917405792747E-2,37438.656036299806,8.5971011381234058E-2,39853.612742980324,8.7852951113174149E-2]
["NHS West Lancashire CCG","E38000200",7888.2492055891589,8.5149494878984877E-2,8497.1887516982624,9.1015303681429544E-2,9099.5767717978106,9.661899311741147E-2,9633.202623256173,0.10121036586736891,10034.519959329678,0.10487583569533526,7888.2492055891589,8.5149494878984877E-2,8426.4033465680204,9.0257105254584621E-2,8945.2931662557421,9.4980815101462557E-2,9383.993158682526,9.8592069328456877E-2,9682.4021823965995,0.10119567498324206,7888.2492055891589,8.5149494878984877E-2,8391.0106440029012,8.9878006041162181E-2,8869.2639856400601,9.4173539877256976E-2,9262.9596427976485,9.7320441718823786E-2,9513.8634524535701,9.9434191601730462E-2,7888.2492055891589,8.5149494878984877E-2,8355.6179414377802,8.9498906827739713E-2,8793.9765531279445,9.337414050889728E-2,9144.2762177063069,9.6073505124041891E-2,9350.2095175058275,9.7723761679617757E-2,7888.2492055891589,8.5149494878984877E-2,8143.2617260470643,8.7224311547205058E-2,8357.8286682301768,8.8743137271503278E-2,8480.237327896717,8.9096841015935249E-2,8465.5950149072232,8.8478208767843056E-2,7888.2492055891589,8.5149494878984877E-2,8214.0471311773035,8.7982509974049952E-2,8500.2443041151637,9.0255301593917661E-2,8692.5826231599549,9.132782751796549E-2,8742.5496276599843,9.1372801292432942E-2,7888.2492055891589,8.5149494878984877E-2,8249.4398337424245,8.836160918747242E-2,8572.5647442130066,9.1023197538893694E-2,8802.0960861353324,9.2478420741073042E-2,8887.6080851118386,9.2888880488209022E-2,7888.2492055891589,8.5149494878984877E-2,8284.8325363075401,8.8740708400894819E-2,8645.6269324144196,9.1798969339715666E-2,8913.8674794809685,9.3652736703939574E-2,9037.1757345797669,9.445208752696245E-2]
["NHS West Leicestershire CCG","E38000201",25447.401463652965,8.01391996713893E-2,28190.079011063794,8.5336559336028919E-2,31129.189407739399,9.0713338989798928E-2,34035.795631019027,9.5274313153675474E-2,36666.766540274511,9.9529768024632231E-2,25447.401463652965,8.01391996713893E-2,27955.765765787834,8.4627250002384913E-2,30602.450234130934,8.917837228736139E-2,33157.116524297082,9.2814680674888253E-2,35383.26574639116,9.6045781070551464E-2,25447.401463652965,8.01391996713893E-2,27838.609143149861,8.4272595335562944E-2,30342.879247136374,8.8421958407554416E-2,32730.368600404687,9.1620111410829375E-2,34768.92699994643,9.4378194896705833E-2,25447.401463652965,8.01391996713893E-2,27721.452520511888,8.3917940668740962E-2,30085.840660014939,8.7672924175355341E-2,32311.906781065798,9.0448736930539134E-2,34172.393768204813,9.2758940738883855E-2,25447.401463652965,8.01391996713893E-2,27018.512784684008,8.1790012667808942E-2,28596.789534621763,8.3333691381926103E-2,29970.594826783719,8.3894846116850635E-2,30947.894777397458,8.4006229037452376E-2,25447.401463652965,8.01391996713893E-2,27252.826029959964,8.2499322001452935E-2,29083.01031026035,8.475058372263769E-2,30719.295822862339,8.5990638850247283E-2,31957.419114492728,8.6746523112086665E-2,25447.401463652965,8.01391996713893E-2,27369.982652597941,8.2853976668274931E-2,29329.919297889315,8.5470099364405278E-2,31105.425587178699,8.7071508193871619E-2,32486.170167394932,8.8181786556446609E-2,25447.401463652965,8.01391996713893E-2,27487.139275235917,8.3208631335096928E-2,29579.360685391403,8.6196994653780751E-2,31499.516510771948,8.8174662721901095E-2,33031.357628543301,8.9661665658369444E-2]
["NHS West London (K&C & QPP) CCG","E38000202",15742.207586928058,8.3699529917737436E-2,17538.247416677925,9.0459291400236869E-2,19397.279976391081,9.7807986972524616E-2,21088.437219199612,0.10363886976213688,22896.699193913719,0.10943838635844431,15742.207586928058,8.3699529917737436E-2,17392.130556948356,8.9705645538211032E-2,19068.437116353463,9.6149844273666116E-2,20542.723877286375,0.10095696814078227,22094.028642527428,0.10560189581554072,15742.207586928058,8.3699529917737436E-2,17319.072127083575,8.9328822607198141E-2,18906.387149267619,9.5332730684084405E-2,20277.687376565813,9.9654449462187017E-2,21709.835954297912,0.10376558624556884,15742.207586928058,8.3699529917737436E-2,17246.013697218794,8.8951999676185237E-2,18745.918157470409,9.4523588934401007E-2,20017.797052387672,9.8377221605994061E-2,21336.778407061367,0.10198249883883648,15742.207586928058,8.3699529917737436E-2,16807.663118030105,8.6691062090107823E-2,17816.304687748678,8.9836147074166386E-2,18563.699462882785,9.1231076581889059E-2,19320.254229413593,9.2344203371635569E-2,15742.207586928058,8.3699529917737436E-2,16953.77997775967,8.7444707952133646E-2,18119.851943168014,9.1366740334651142E-2,19028.688466875479,9.3516259420461365E-2,19951.586488930508,9.5361755515392929E-2,15742.207586928058,8.3699529917737436E-2,17026.838407624444,8.7821530883146495E-2,18273.99703381065,9.214399472474108E-2,19268.498611995878,9.4694803479437178E-2,20282.254690463134,9.6942236356290679E-2,15742.207586928058,8.3699529917737436E-2,17099.896837489228,8.8198353814159414E-2,18429.723099741928,9.2929220954729372E-2,19513.253122813916,9.5897646563858449E-2,20623.201826712921,9.8571846987443465E-2]
["NHS West Norfolk CCG","E38000203",14567.873342744953,0.1006763879940909,15880.420888038294,0.10705420579775039,17381.347551177339,0.11372250426051646,18844.326420699861,0.11932830813513083,20271.579726803553,0.12485575096577702,14567.873342744953,0.1006763879940909,15748.214343505344,0.1061629657779786,17086.928789010781,0.11179618417306188,18357.348886179116,0.11624461047479176,19561.636770386016,0.12048310403046329,14567.873342744953,0.1006763879940909,15682.111071238867,0.10571734576809268,16941.842620154664,0.1108469158607345,18120.838594482007,0.11474695158613227,19221.827501882781,0.11839016692462913,14567.873342744953,0.1006763879940909,15616.007798972392,0.10527172575820677,16798.171926116647,0.10990690870267367,17888.920589929745,0.11327837252995025,18891.866999978774,0.11635788987422258,14567.873342744953,0.1006763879940909,15219.388165373539,0.10259800569889133,15965.872733068867,0.10446134999390777,16591.329336970746,0.10506160927666379,17108.299465460193,0.10537262543397509,14567.873342744953,0.1006763879940909,15351.594709906491,0.10348924571866314,16237.643898145694,0.10623949161309665,17006.270994709474,0.107689152702061,17666.697789690614,0.10881188586899862,14567.873342744953,0.1006763879940909,15417.697982172966,0.10393486572854904,16375.652692911273,0.10714245415409102,17220.270074912205,0.10904426339230119,17959.165926442223,0.11061324172482279,14567.873342744953,0.1006763879940909,15483.801254439437,0.10438048573843492,16515.076962494957,0.10805467784935197,17438.68135256783,0.11042731352943155,18260.725535765399,0.11247059334667038]
["NHS West Suffolk CCG","E38000204",15800.147696840691,8.5507888823685957E-2,17581.043881842234,9.2172821022555473E-2,19529.967608733234,9.9026303664604146E-2,21370.749172172738,0.10463547381596525,23132.663643369306,0.11000886267533433,15800.147696840691,8.5507888823685957E-2,17434.703592850943,9.140559711046943E-2,19198.957522238856,9.7347923751337856E-2,20817.907977277722,0.10192865245435627,22321.561581980561,0.10615161490384514,15800.147696840691,8.5507888823685957E-2,17361.533448355294,9.1021985154426402E-2,19035.839570961583,9.6520837496002335E-2,20549.409693480124,0.10061403100998886,21933.333210009969,0.104305370030483,15800.147696840691,8.5507888823685957E-2,17288.363303859656,9.0638373198383415E-2,18874.313014330914,9.5701820374865174E-2,20286.124803181192,9.9324935385728536E-2,21556.356946139822,0.10251263527743874,15800.147696840691,8.5507888823685957E-2,16849.342436885789,8.8336701462125328E-2,17938.572962125672,9.0957169466208646E-2,18813.034469605169,9.2112389686668489E-2,19518.650549031445,9.2822192072624321E-2,15800.147696840691,8.5507888823685957E-2,16995.682725877075,8.9103925374211343E-2,18244.120734274326,9.2506443232300589E-2,19284.096942952656,9.4418806026991084E-2,20156.614525946992,9.585607060085119E-2,15800.147696840691,8.5507888823685957E-2,17068.852870372724,8.9487537330254385E-2,18399.28171231856,9.3293183816644143E-2,19527.039376266639,9.5608300902206428E-2,20490.756172772817,9.7445102590701993E-2,15800.147696840691,8.5507888823685957E-2,17142.023014868366,8.9871149286297386E-2,18556.034085009403,9.4087993535186085E-2,19774.990756275412,9.6822320584975599E-2,20835.284727556817,9.9083530186212729E-2]
["NHS Wigan Borough CCG","E38000205",21768.382955958161,8.3193392020018964E-2,23940.159793139865,8.9542787975538093E-2,26120.308611068325,9.5517840309618685E-2,28093.307137089523,0.10080124555826883,29985.683193794441,0.10591905049026645,21768.382955958161,8.3193392020018964E-2,23741.481485651289,8.879967641251979E-2,25679.217598612464,9.3904840190932731E-2,27369.460469124871,9.8204020341316367E-2,28938.716539473378,0.1022208284686449,21768.382955958161,8.3193392020018964E-2,23642.142331906998,8.8428120631010618E-2,25461.853037185898,9.3109972343984118E-2,27017.90998794551,9.6942626436833546E-2,28437.593217189329,0.10045070016668782,21768.382955958161,8.3193392020018964E-2,23542.803178162711,8.8056564849501459E-2,25246.609105626903,9.2322859305298405E-2,26673.185513126813,9.5705724840785114E-2,27950.994062125144,9.8731875881756054E-2,21768.382955958161,8.3193392020018964E-2,22946.768255696985,8.5827230160446535E-2,23999.678743492077,8.7763032046705464E-2,24744.437186453328,8.8785206984044948E-2,25320.73240871937,8.9440948105684787E-2,21768.382955958161,8.3193392020018964E-2,23145.446563185556,8.6570341723464825E-2,24406.839678066721,8.9251955233184826E-2,25361.209244838945,9.0998239127516839E-2,26144.213253220034,9.234974656736146E-2,21768.382955958161,8.3193392020018964E-2,23244.785716929848,8.6941897504973997E-2,24613.6010901554,9.0008049038818844E-2,25679.298910524845,9.2139572696536942E-2,26575.521689852034,9.3873266301137515E-2,21768.382955958161,8.3193392020018964E-2,23344.124870674128,8.7313453286483128E-2,24822.483132111658,9.0771897652715788E-2,26003.94689604747,9.3304438091307743E-2,27020.237497505972,9.5444145169572475E-2]
["NHS Wiltshire CCG","E38000206",32303.689694856039,8.1984898469255454E-2,36013.029289993654,8.8262902039100172E-2,39971.506662455991,9.50977984927103E-2,43660.299435560781,0.10109358950532737,47181.787160766879,0.10672197955387215,32303.689694856039,8.1984898469255454E-2,35713.355719921179,8.7528443997650057E-2,39294.217309013489,9.3486432501459577E-2,42530.864586553405,9.8478430551434223E-2,45526.840507330904,0.10297860327376364,32303.689694856039,8.1984898469255454E-2,35563.518934884953,8.7161214976925028E-2,38960.456930514185,9.2692369933655747E-2,41982.33216635765,9.7208326772153505E-2,44734.711778350029,0.10118686219938934,32303.689694856039,8.1984898469255454E-2,35413.682149848719,8.6793985956199984E-2,38629.952750829507,9.1906054317732938E-2,41444.450523190346,9.5962884419723879E-2,43965.541490151641,9.9447051549766213E-2,32303.689694856039,8.1984898469255454E-2,34514.661439631302,8.4590611831849669E-2,36715.307847828597,8.7350846611697272E-2,38434.979496356696,8.8994580662120737E-2,39807.87065794388,9.004268413920806E-2,32303.689694856039,8.1984898469255454E-2,34814.335009703769,8.5325069873299769E-2,37340.49802023705,8.8838261372851751E-2,39397.343333153069,9.1222893704624136E-2,41109.551912213377,9.2986998218080472E-2,32303.689694856039,8.1984898469255454E-2,34964.171794739996,8.5692298894024799E-2,37657.97740466323,8.9593589181250544E-2,39893.666062032862,9.2372108136595507E-2,41791.323820475081,9.4529119702499623E-2,32303.689694856039,8.1984898469255454E-2,35114.008579776244,8.605952791474987E-2,37978.712987904037,9.0356663941530344E-2,40400.221890410583,9.35450168806395E-2,42494.288842875183,9.6119178563391056E-2]
["NHS Windsor, Ascot and Maidenhead CCG","E38000207",8774.0913791151997,7.638944261810203E-2,9670.9242546067635,8.1652518191546467E-2,10585.659601064643,8.6512419099907187E-2,11576.441123230868,9.135449118711228E-2,12640.808652956392,9.6406411325170777E-2,8774.0913791151997,7.638944261810203E-2,9590.3769095782063,8.0972449422308398E-2,10406.31389756783,8.5046697430269949E-2,11277.360286663492,8.899432044399852E-2,12198.100087105477,9.3030049474568915E-2,8774.0913791151997,7.638944261810203E-2,9550.1032370639259,8.0632415037689351E-2,10317.934404258105,8.4324406703645854E-2,11132.105750502633,8.7848056743234162E-2,11986.200704821251,9.1413977309497033E-2,8774.0913791151997,7.638944261810203E-2,9509.8295645496546,8.0292380653070372E-2,10230.417149907498,8.3609162715818072E-2,10989.671601287122,8.672404988389458E-2,11780.442848834493,8.9844744118627917E-2,8774.0913791151997,7.638944261810203E-2,9268.1875294639922,7.8252174345356237E-2,9723.420641945364,7.9465680303574412E-2,10192.746384111697,8.0435182955426898E-2,10668.239934265986,8.1362415606055422E-2,8774.0913791151997,7.638944261810203E-2,9348.7348744925439,7.8932243114594264E-2,9888.9705220962642,8.081865415247029E-2,10447.585856830474,8.2446226774230386E-2,11016.447799502148,8.4018058263439194E-2,8774.0913791151997,7.638944261810203E-2,9389.0085470068225,7.9272277499213298E-2,9973.0388206103962,8.1505711185112767E-2,10579.014966788638,8.348338831114771E-2,11198.826043004641,8.5408984464647966E-2,8774.0913791151997,7.638944261810203E-2,9429.2822195210993,7.9612311883832318E-2,10057.969358083643,8.2199814956551515E-2,10713.153860282531,8.4541933872179065E-2,11386.873576901868,8.6843148084974592E-2]
["NHS Wirral CCG","E38000208",23439.055341434723,8.9653669451632195E-2,25084.620115072721,9.5378783707500844E-2,26983.995589866139,0.10136737637064665,28811.289081673985,0.10690645299322443,30497.664843216913,0.11180315581500445,23439.055341434723,8.9653669451632195E-2,24875.252389168916,9.4582708704064322E-2,26525.822909181341,9.9646216788810443E-2,28064.939795211725,0.10413706788575779,29426.80487104637,0.10787742822437997,23439.055341434723,8.9653669451632195E-2,24770.568526217015,9.4184671202346068E-2,26300.040698747725,9.8798049206415203E-2,27702.460471349601,0.10279206111818034,28914.24517801289,0.10599840596089483,23439.055341434723,8.9653669451632195E-2,24665.884663265118,9.3786633700627828E-2,26076.461241586629,9.7958156429701834E-2,27347.019357652884,0.10147317015826673,28416.541115042372,0.10417384381201837,23439.055341434723,8.9653669451632195E-2,24037.781485553714,9.1398408690318303E-2,24781.242317343047,9.309257068874173E-2,25358.310973561343,9.409391826924432E-2,25726.253024832007,9.4311360894611063E-2,23439.055341434723,8.9653669451632195E-2,24247.149211457519,9.2194483693754825E-2,25204.170945667487,9.4681333379667498E-2,25994.256963311265,9.6453643648650333E-2,26568.5269125298,9.7399101519648798E-2,23439.055341434723,8.9653669451632195E-2,24351.833074409413,9.2592521195473051E-2,25418.939389738491,9.5488126933653231E-2,26322.235256950775,9.7670631751208811E-2,27009.67844160899,9.901634445930417E-2,23439.055341434723,8.9653669451632195E-2,24456.51693736131,9.2990558697191292E-2,25635.910587082013,9.6303195293320862E-2,26656.975752513925,9.8912711512111035E-2,27464.543317622571,0.1006838599516921]
["NHS Wokingham CCG","E38000209",9291.9942145351797,7.2889819693561189E-2,10305.778191453977,7.7991359099848473E-2,11423.319886177323,8.3175476089830516E-2,12463.894736238566,8.7972153700159275E-2,13457.419888211078,9.2478146565496702E-2,9291.9942145351797,7.2889819693561189E-2,10219.962380176019,7.7341928107885718E-2,11229.60718616974,8.176501518981899E-2,12141.421028071505,8.5696082919759359E-2,12985.50752934099,8.9235208420430132E-2,9291.9942145351797,7.2889819693561189E-2,10177.054474537043,7.7017212611904362E-2,11134.147802752543,8.1069956332842169E-2,11984.80528016375,8.4590664032776319E-2,12759.629954226401,8.7682998585942848E-2,9291.9942145351797,7.2889819693561189E-2,10134.146568898066,7.6692497115923006E-2,11039.619730393077,8.0381678537884638E-2,11831.230518255532,8.3506708909200533E-2,12540.299038439558,8.6175776789716607E-2,9291.9942145351797,7.2889819693561189E-2,9876.6991350641947,7.474420414003477E-2,10492.008828448566,7.6394414070544384E-2,10971.973091855687,7.7441933172329808E-2,11354.728346019394,7.8028644488863361E-2,9291.9942145351797,7.2889819693561189E-2,9962.5149463421531,7.5393635131997525E-2,10670.82055153249,7.7696377978247341E-2,11246.74505885347,7.938131746790987E-2,11725.906154031474,8.0579344104119544E-2,9291.9942145351797,7.2889819693561189E-2,10005.422851981129,7.5718350627978881E-2,10761.623379661043,7.8357531525127741E-2,11388.454012645829,8.0381521828386704E-2,11920.315193604532,8.1915305068750235E-2,9291.9942145351797,7.2889819693561189E-2,10048.330757620108,7.6043066123960251E-2,10853.357518847326,7.9025466134027417E-2,11533.084698084802,8.1402348236058741E-2,12120.767505003965,8.3292794839224624E-2]
["NHS Wolverhampton CCG","E38000210",22293.724790925266,0.11024490550353706,23776.51228240988,0.11517395990316741,25472.779377130348,0.12024537092678601,27263.090881163338,0.12493396976062386,29102.781660231947,0.12961067809847665,22293.724790925266,0.11024490550353706,23578.108769569997,0.11421288882760122,25040.082241170341,0.11820280514147631,26556.537548135359,0.12169616693307377,28079.549103583249,0.12505366127898482,22293.724790925266,0.11024490550353706,23478.907013150059,0.11373235328981815,24826.854085228511,0.11719625229054244,26213.385917827665,0.12012366381554242,27589.785942415987,0.12287247680776693,22293.724790925266,0.11024490550353706,23379.705256730122,0.11325181775203508,24615.706203978803,0.1161995194674226,25876.897214571844,0.11858169377037781,27114.217694425977,0.12075451008473313,22293.724790925266,0.11024490550353706,22784.494718210484,0.11036860452533659,23392.504685014948,0.11042534311279716,23994.228385529397,0.1099543047636761,24543.582473942563,0.10930605893801801,22293.724790925266,0.11024490550353706,22982.898231050367,0.11132967560090276,23791.917425901098,0.11231078845308298,24596.265215782743,0.11271315743645285,25348.395508237387,0.11289033360754158,22293.724790925266,0.11024490550353706,23082.099987470301,0.11181021113868582,23994.744208382352,0.1132682411649469,24906.755438973356,0.11413598863061752,25769.926444774526,0.11476764249031142,22293.724790925266,0.11024490550353706,23181.301743890239,0.11229074667646889,24199.651265555716,0.11423551390462479,25223.647297958931,0.11558815552176212,26204.560815381992,0.11670330816505742]
["NHS Wyre Forest CCG","E38000211",7692.7913673109051,9.3883223911531657E-2,8467.5575876670155,0.10182248181417768,9222.5021209789957,0.10880724541032322,9816.9356448101244,0.11412387403871335,10330.413114632451,0.11841372208427846,7692.7913673109051,9.3883223911531657E-2,8397.1312233845856,0.10097560393680358,9066.2540417296786,0.10696382776934496,9563.2741661971595,0.11117500774467749,9968.3125899867227,0.11426309708833934,7692.7913673109051,9.3883223911531657E-2,8361.9180412433725,0.10055216499811655,8989.2567911380647,0.10605541282607438,9440.0784414536847,0.10974283238146575,9794.9956871394825,0.11227642924277263,7692.7913673109051,9.3883223911531657E-2,8326.7048591021648,0.10012872605942959,8913.0107332351563,0.10515586046761628,9319.2747908097354,0.10833846536630706,9626.7020661213737,0.11034734142734268,7692.7913673109051,9.3883223911531657E-2,8115.4257662548853,9.7588092427307427E-2,8471.3094322803499,9.9944660597927684E-2,8643.3731474520737,0.10048097125612732,8717.0082179716519,9.991985577684151E-2,7692.7913673109051,9.3883223911531657E-2,8185.8521305373115,9.8434970304681471E-2,8615.5384285104901,0.10164627688190762,8859.5118950920605,0.10299362816893814,9001.8146581755755,0.10318448714093967,7692.7913673109051,9.3883223911531657E-2,8221.0653126785255,9.8858409243368514E-2,8688.7797156586075,0.10251037890111618,8970.9817664064776,0.10428948810051704,9150.9856088873294,0.10489437882722755,7692.7913673109051,9.3883223911531657E-2,8256.2784948197368,9.9281848182055515E-2,8762.7721954954286,0.1033833435051372,9084.7499049929884,0.10561206585669597,9304.7935898818778,0.10665742308438651]

{"sheet":"Baseline","index":5,"n_rows":214,"n_cols":14,"rows_kept":214,"cut":false,"hidden":true,"merged":[]}
["CCGCD","CCGname","Num_2015","Prev_2015","Num_2020","Prev_2020","Num_2025","Prev_2025","Num_2030","Prev_2030","Num_2035","Prev_2035","% Increase","% Increase"]
["E38000001","NHS Airedale, Wharfdale and Craven CCG",12033.475277344636,9.3398597309411968E-2,12751.938252262311,9.6649524422179098E-2,13659.426295625384,0.10024531260549967,14592.017708918718,0.10409486167012925,15328.365617559246,0.10678811214685277,{"$f":"SUM(K2-C2)/C2","v":0.27381037183978624},{"$f":"SUM(L2-D2)/D2","v":0.14335884288587183}]
["E38000002","NHS Ashford CCG",8276.5848729807567,8.3366084538484653E-2,9199.5981716228198,8.7349014162768898E-2,10160.499087530645,9.1256503390790764E-2,11027.458801745566,9.4348552376330996E-2,11850.888049362087,9.7011198832368112E-2,{"$f":"SUM(K3-C3)/C3","v":0.4318572492441643},{"$f":"SUM(L3-D3)/D3","v":0.16367704408121034}]
["E38000003","NHS Aylesbury Vale CCG",12549.168950372712,7.6379604080174759E-2,13953.782128769004,7.9854538907914635E-2,15392.613570105228,8.3446891304918308E-2,16670.709388030889,8.6144633051007072E-2,17947.130966933295,8.8812009931380123E-2,{"$f":"SUM(K4-C4)/C4","v":0.4301449791541983},0.16277127907281655]
["E38000004","NHS Barking and Dagenham CCG",13631.498948757688,9.2179462731658696E-2,14931.886043070373,9.2629566024009763E-2,16511.185272983061,9.4252684512975568E-2,18216.122258539457,9.672962116896483E-2,19981.052714515488,9.9606444239857872E-2,0.46580011410531413,8.0570891694386138E-2]
["E38000005","NHS Barnet CCG",25808.208036002019,8.5650497929118607E-2,28727.382523602286,8.8697611842664836E-2,31928.085866993806,9.2480841927336938E-2,35341.788653191499,9.6351659359845965E-2,38688.142169596424,9.9953862888431833E-2,0.49906348072005274,0.16699686872982566]
["E38000006","NHS Barnsley CCG",17198.332429825146,8.8205623293800106E-2,18503.524560124497,9.1938410812503701E-2,19866.116624639126,9.5445933624671492E-2,21124.300976908038,9.8252562683293188E-2,22278.683282272807,0.1006536698394904,0.29539787494963032,0.14112531696791775]
["E38000007","NHS Basildon and Brentwood CCG",17185.619213311416,8.2702691113144461E-2,18230.518249094792,8.480099660012462E-2,19587.987764954716,8.76341614394896E-2,20926.274464375379,8.9666100198711879E-2,22306.325986355005,9.1569482702606758E-2,0.29796463598339573,0.10721285450471928]
["E38000008","NHS Bassetlaw CCG",8439.1344652843709,8.9340826437480106E-2,9121.6278405647008,9.4878592059129394E-2,9673.8577363566819,9.9198705253862623E-2,10211.670099282759,0.10273309959036982,10664.709837829601,0.10536168581139699,0.26372080948590926,0.17932293681129235]
["E38000009","NHS Bath and North East Somerset CCG",11199.8787201417,7.3557590438340342E-2,11810.004752464059,7.6144453594223449E-2,12564.321965467438,7.9120415399669006E-2,13238.153157287863,8.0533843273438752E-2,13835.803820250296,8.2082367229771566E-2,0.23535300390067496,0.11589255086566652]
["E38000010","NHS Bedfordshire CCG",28640.437379509167,8.118498038298419E-2,31721.040117353106,8.4279292516480947E-2,35025.527388195376,8.7581334737435929E-2,38191.980131977121,9.0331078836275128E-2,41193.417207274804,9.2765430814022456E-2,0.43829567479813281,0.14264276934487563]
["E38000011","NHS Bexley CCG",15834.931290618288,8.2336373183331368E-2,16810.021397008193,8.3424423806492287E-2,18106.098329986875,8.5398067776562947E-2,19454.761426276105,8.6913694720675949E-2,20930.414884659396,8.8808617127712972E-2,0.32178754050294028,7.860734805467337E-2]
["E38000012","NHS Birmingham Crosscity CCG",56451.720040294102,9.904505586408538E-2,59387.41844802181,0.10031319625692005,62840.255189918003,0.10231902955242608,66578.352514138212,0.10430900625765842,70291.47283209271,0.10629286682608909,0.24516086988881952,7.3176908213869032E-2]
["E38000013","NHS Birmingham South and Central CCG",15780.740860548101,9.9087911971292866E-2,16586.375720655175,0.10051130602748258,17541.476288467962,0.10291877662795096,18554.170263683893,0.1044128883718846,19603.828535405726,0.10655412835854836,0.24226287654310041,7.5349416883651307E-2]
["E38000014","NHS Blackburn with Darwen CCG",10981.760368255631,9.7685112686849582E-2,11472.038398121864,0.10181077740612232,11902.446074046595,0.10544335643202157,12378.701828876223,0.10914037937644352,12655.009179966075,0.11128217710135486,0.15236617405595665,0.13919280062759989]
["E38000015","NHS Blackpool CCG",11046.124412427307,9.6170332686986826E-2,11197.537744539854,9.8830871531684503E-2,11553.787933407042,0.10217357564031697,11854.103588910401,0.10433113526588982,12177.888918106024,0.10637568936151315,0.10245806252240279,0.10611751451190776]
["E38000016","NHS Bolton CCG",20427.518963212806,9.1553957346776654E-2,21648.949845874493,9.5378226477550856E-2,22908.966931090974,9.8694498238372286E-2,24012.86493136378,0.10097924697798058,24933.924311899071,0.10279487265789525,{"$f":"SUM(K17-C17)/C17","v":0.22060463420945492},0.1227791308740665]
["E38000017","NHS Bracknell and Ascot CCG",7489.148292390194,6.8657391752752053E-2,8220.4802519046934,7.2274312044177016E-2,9023.062101632233,7.5709532653400177E-2,9704.9855631129976,7.8544719675566504E-2,10420.157659541954,8.1369339837122856E-2,{"$f":"SUM(K18-C18)/C18","v":0.39136751640102929},0.18515046610201674]
["E38000018","NHS Bradford City CCG",6664.5121047235134,0.11070618114158658,6853.6893727822135,0.11287367214726965,7184.5785799392188,0.11610501906818388,7623.9495624341389,0.11972282604324966,7845.4446515309464,0.12155941511513707,0.1771971493562807,9.8036386601303302E-2]
["E38000019","NHS Bradford Districts CCG",26121.640910489819,0.10071576538591077,27619.847758783533,0.10363142637994723,29320.957177760876,0.10690155015954819,31007.466921382249,0.11015085940100267,32436.847297191314,0.11280027575876796,0.24176147311501633,0.11998628344384002]
["E38000020","NHS Brent CCG",29551.572193634503,0.11430174129200317,32765.727050005433,0.11978404273599998,36051.224821740157,0.12584203023506058,39350.22579988189,0.1310975006659178,42557.840329669656,0.13588071625054168,0.44012102133898451,0.18878955573748754]
["E38000021","NHS Brighton and Hove CCG",16418.793923923371,6.8963348134758795E-2,17496.985779241397,7.0820795674092912E-2,18802.000564839727,7.3664004720418924E-2,20172.952737922904,7.6049735119968723E-2,21461.683291340036,7.8253056557062772E-2,0.30714127912092315,0.1347050088715428]
["E38000022","NHS Bristol CCG",26558.947723782283,7.3072546425417606E-2,27872.994005978289,7.3396339809296107E-2,29597.677159338593,7.4991580924644266E-2,31470.843453051788,7.6348479992847607E-2,33283.692164446329,7.7685772020461036E-2,0.2532007107586704,6.3132131295738747E-2]
["E38000023","NHS Bromley CCG",21435.473569065573,8.2279569971846975E-2,22920.94028498531,8.3567669115448856E-2,24870.820452643904,8.5820636482553156E-2,26926.740744732804,8.7938408702589177E-2,29009.389450862644,9.0164074876803141E-2,0.35333559845989621,9.5825791355666448E-2]
["E38000024","NHS Bury CCG",13006.210135214189,8.6569556278049714E-2,13769.495425966474,8.964515251280257E-2,14662.194895190021,9.2998825924077252E-2,15387.996355684061,9.5069790903769061E-2,16060.648091975667,9.6984589927389273E-2,0.2348445800127138,0.1203082711419691]
["E38000025","NHS Calderdale CCG",15116.21688808728,8.9891870171784474E-2,16142.479162922285,9.3633869854537602E-2,17343.212990617849,9.7840533626412332E-2,18424.081301503433,0.10110899627649782,19351.300646420375,0.10372695457986909,0.28016823188549655,0.15390807179387414]
["E38000026","NHS Cambridgeshire and Peterborough CCG",55218.422138416587,7.8117904731370549E-2,60210.387884680531,8.1605795295167566E-2,65815.026388702128,8.5440771632743259E-2,70954.024435271451,8.8264447971427878E-2,75655.10800695901,9.0837725436398689E-2,0.3701062992584897,0.16282849301666075]
["E38000027","NHS Camden CCG",15681.912264973389,7.8034993356754526E-2,17644.093619478663,8.0397765512980321E-2,19551.822582312936,8.4435233124516063E-2,21457.45695904459,8.8063108261694958E-2,23225.815162400457,9.1296443248429462E-2,0.48105758851086577,0.16994234664757688]
["E38000028","NHS Cannock Chase CCG",9224.9887869508766,8.3152954632692233E-2,9904.5882233921857,8.7962595234388874E-2,10580.520609514977,9.2649042114842178E-2,11205.59255156879,9.6267977247154565E-2,11681.438779103173,9.8644137638094695E-2,0.26628216563547974,0.18629744515791363]
["E38000029","NHS Canterbury and Coastal CCG",14082.346419529924,8.1750530706663882E-2,15230.080184207727,8.5236625163463892E-2,16623.046877175555,8.9160302924134058E-2,17956.327032834884,9.1492545770074804E-2,19275.777977880487,9.4276523417198915E-2,0.36879021461566364,0.15322215773106876]
["E38000030","NHS Castle Point and Rochford CCG",12503.666546926937,8.6446809644129818E-2,13366.454407035939,9.063231900621059E-2,14343.856133721258,9.4628949292263217E-2,15042.724321401647,9.6712899070346192E-2,15734.88894365223,9.8466138571040238E-2,0.25842199042963432,0.13903727594331866]
["E38000031","NHS Central London (Westminster) CCG",11743.892955103765,8.0327585192228212E-2,13248.61136326395,8.3883825270760728E-2,14688.434468543272,8.8623352652004772E-2,16105.650647819351,9.2508045076504022E-2,17478.503894607475,9.6279078410308874E-2,0.48830579105470395,0.19858051477469271]
["E38000032","NHS Central Manchester CCG",11734.906137070057,7.9097506990226871E-2,12534.105172408921,8.114790348574985E-2,13371.016988069361,8.3736328833099713E-2,14336.717058409005,8.5961848293614376E-2,15305.196338482927,8.8983699642342595E-2,0.30424531391303417,0.12498741146591691]
["E38000033","NHS Chiltern CCG",21618.351472379705,8.3850560361413792E-2,23166.518915567594,8.7275915143036426E-2,24654.442845082918,9.0078344337168131E-2,26116.448372564992,9.2473792127204135E-2,27405.974009228437,9.4308238159767507E-2,0.2677180331832047,0.12471804306708141]
["E38000034","NHS Chorley and South Ribble CCG",11320.944274180072,8.0886998243641539E-2,12355.418604034541,8.550462701754008E-2,13318.805178861187,8.9339986442589128E-2,14161.715967304002,9.229481209139731E-2,14808.740124814032,9.4479648620735199E-2,0.30808347485541937,0.16804493518415572]
["E38000035","NHS City and Hackney CCG",19903.357918415222,9.0297422731218699E-2,22385.035636486198,9.3567278199658085E-2,25035.322764963981,9.8486714260283159E-2,27902.059231480798,0.10408109232871082,30758.288433666297,0.10874801454414615,0.54538186771025943,0.20433132258766554]
["E38000213","NHS Coastal West Sussex CCG",38235.091761320531,9.417510286039539E-2,41462.615943043318,9.7886151241898395E-2,45270.643750023599,0.10207585963928659,48789.263759487018,0.10514927534372202,52225.819288619423,0.10809665788098569,0.3659132718873771,0.14782627889695565]
["E38000037","NHS Corby CCG",4052.5287286030557,7.7279342650706628E-2,4497.3357933191155,8.0424459823303207E-2,5005.6555373612591,8.301252964114858E-2,5530.9612052474895,8.612521341089209E-2,6014.2041609827729,8.8967517174301375E-2,0.48406206686064013,0.15124578086053209]
["E38000038","NHS Coventry and Rugby CCG",30575.754353417171,8.5378516568237389E-2,32916.779797004456,8.6609429555871323E-2,35345.464902116481,8.8368080659324166E-2,37911.217799270722,8.9896656073391631E-2,40429.662120962923,9.1706351496989788E-2,0.32227848424104283,7.4115072305045021E-2]
["E38000039","NHS Crawley CCG",6825.5489432082513,7.784613302016713E-2,7373.5547175251322,8.0356960740247729E-2,8124.8311755049199,8.3743879359976486E-2,8799.6600092084609,8.6833037391044601E-2,9496.7397266052958,8.9558088708084641E-2,0.39135178805728255,0.15045006390854848]
["E38000040","NHS Croydon CCG",30993.77009749764,0.10424381170959787,34024.500573872421,0.1081928916747406,37205.212223862356,0.1118886449653024,40489.493788567408,0.11560499597009881,43671.210967906853,0.11900809616281571,0.40903190642924586,0.1416322389893814]
["E38000041","NHS Cumbria CCG",39116.630901242701,9.2984289486647095E-2,40966.477648352396,9.7585701877923745E-2,42873.882418424902,0.10210984666672597,44357.652765558247,0.10545276903185204,45298.888485391188,0.10788018215144365,0.15804678065850711,0.16019795114889454]
["E38000042","NHS Darlington CCG",7395.3992805948283,8.6597181271602208E-2,7761.7473565539822,9.0378986452654658E-2,8200.5309255139291,9.4280649867945834E-2,8553.9523984652878,9.7115717512094565E-2,8861.9562816032922,9.9976943610145461E-2,0.19830666950689718,0.15450574882546292]
["E38000043","NHS Dartford, Gravesham and Swanley CCG",17369.856299631534,8.4237906399764959E-2,18748.95979960866,8.6720443106423031E-2,20351.913038556791,8.9482558206809684E-2,21964.398243222484,9.167876385016481E-2,23579.70945306823,9.390565293933982E-2,0.35750745695970004,0.11476717493066561]
["E38000044","NHS Doncaster CCG",21789.797939386437,8.8432621507250148E-2,22890.463606970628,9.2292813510888749E-2,24148.694350164093,9.5980502186661737E-2,25388.822992601294,9.9322521682971981E-2,26326.744582928968,0.10201001465797027,0.20821425954307329,0.15353376298594723]
["E38000045","NHS Dorset CCG",57473.27514477502,8.9793574266123513E-2,61592.873189074111,9.3271659684223907E-2,66449.991384644149,9.7089493855591832E-2,70919.036166847596,9.9849401862483589E-2,74982.397722520749,0.10226731822493285,0.30464807397247329,0.13891577499566482]
["E38000046","NHS Dudley CCG",23662.707421075029,9.2497488159936789E-2,24866.671221793185,9.6151385127960662E-2,25986.122095427316,9.8987208957135892E-2,26957.33162391081,0.10097891678120621,27751.881365649093,0.10240546629390809,0.17281090755202716,0.10711618586700955]
["E38000047","NHS Durham Dales, Easington and Sedgefield CCG",21020.906354547937,9.3070514276755223E-2,22184.943918571345,9.6531824552133605E-2,23510.888939305583,9.9952763112429149E-2,24634.694785856595,0.10261035815501747,25425.32562976921,0.10428763588912719,0.20952565988042487,0.12052282830431824]
["E38000048","NHS Ealing CCG",29144.515676375697,0.10677993579678939,31680.98714729214,0.11185999275224963,34545.292869737983,0.11732540711091557,37348.955039101696,0.12199959181780132,39929.662955201573,0.12592930161221638,0.37005752295167588,0.17933486916371386]
["E38000049","NHS East and North Hertfordshire CCG",34535.384644793186,7.6953929864952059E-2,37465.494414941437,7.9812309690557359E-2,40800.698898122639,8.2867614952722879E-2,44077.832074093865,8.5355987749988121E-2,47366.585390371401,8.7839524869021954E-2,0.37153779746630805,0.14145599871472758]
["E38000050","NHS East Lancashire CCG",27935.455627643958,9.3379648441115001E-2,29358.38051247755,9.7581534642283946E-2,30995.841164863563,0.10169906544019805,32238.358556960968,0.10469718938997456,33243.404065732619,0.10703652542254047,0.19000758422698139,0.14625110727459489]
["E38000051","NHS East Leicestershire and Rutland CCG",23057.335909201091,8.652557756379875E-2,24831.886437235804,9.0806284053374542E-2,26716.839277868701,9.4405792501302835E-2,28387.943801200603,9.7125851242646097E-2,29819.805768642895,9.9062539926393245E-2,0.29328929786477298,0.14489313698426912]
["E38000052","NHS East Riding of Yorkshire CCG",23929.689627255433,9.0416721934766991E-2,25616.453890504494,9.4960164184847623E-2,27328.395883752833,9.9253271895666573E-2,28781.762732332161,0.10231696669865681,29810.703478149568,0.10456960670039835,0.24576222853286733,0.15652950541429986]
["E38000053","NHS East Staffordshire CCG",8679.5283382126163,8.5193642895687247E-2,9357.8745649922039,8.9446325415715955E-2,10059.657042649522,9.3491236455850557E-2,10747.297864558128,9.6944775974726047E-2,11269.574519901007,9.9308904828172409E-2,0.2984086324466983,0.16568445077255545]
["E38000054","NHS East Surrey CCG",11116.671416037574,7.6287890584940801E-2,12131.488217142893,7.9394556394914217E-2,13310.58681157769,8.2530920210675165E-2,14363.690580771014,8.5052644367426641E-2,15398.217972304948,8.7579444729296713E-2,0.38514645220965688,0.14801240482306455]
["E38000055","NHS Eastbourne, Hailsham and Seaford CCG",15193.590329922681,9.7133297084277467E-2,16545.082869633396,0.10111895165403616,18185.126649809474,0.10578898574641928,19780.990840768027,0.10946868201863878,21277.24269065728,0.11263760026816982,0.40040913494641778,0.15961882947760012]
["E38000056","NHS Eastern Cheshire CCG",14039.146553892011,8.6150874778424202E-2,15194.612570911821,9.1094799585802286E-2,16302.939169144876,9.5271968029130877E-2,17301.646375898992,9.8810087812101613E-2,18080.142262989328,0.10132337067355596,0.28783770392204139,0.17611540142981327]
["E38000057","NHS Enfield CCG",24055.346580520942,9.4393920030297215E-2,26442.141461235449,9.7170885863719858E-2,29100.972059143616,0.10054233022092184,31861.543716820237,0.10391215092564163,34831.385984743298,0.10773704294693257,0.44796857813507296,0.14135574528902564]
["E38000058","NHS Erewash CCG",6585.7855959506232,8.3554752549487715E-2,7052.1841087741332,8.7366007294030407E-2,7557.3415410934358,9.1184140215895687E-2,7984.0890621355702,9.3424866161193193E-2,8340.9823714418781,9.5478278061376806E-2,0.26651289355220825,0.14270313953508557]
["E38000059","NHS Fareham and Gosport CCG",13324.185600370303,8.1254943288024781E-2,14374.975526090931,8.5301302670845777E-2,15542.231572329851,8.9498051205400497E-2,16545.746825080594,9.2558440507275644E-2,17452.41960916467,9.5316327739839821E-2,0.30983011889894685,0.17305266464800281]
["E38000060","NHS Fylde & Wyre CCG",13627.795632869424,9.6664744168459549E-2,14430.471265108119,0.10063090143032161,15309.231294764806,0.10461412665549275,16075.605788780493,0.10778869376948165,16771.307935741301,0.1103811237050237,0.23066916965572293,0.14189640343598645]
["E38000062","NHS Gloucestershire CCG",42305.337796159241,8.3656985952460447E-2,45903.47275074225,8.7638842167975586E-2,49721.361669788523,9.1503849368376661E-2,53180.52545381985,9.446926040753871E-2,56272.889461048479,9.6918620545362683E-2,0.33016050438338074,0.15852393487423025]
["E38000063","NHS Great Yarmouth and Waveney CCG",17650.631409805177,9.9395379039335388E-2,18722.986521349972,0.10377445139868069,19889.795321972437,0.10790904580063171,20904.648899841664,0.11080594137518109,21808.479910291429,0.11317322216030841,0.23556372596260258,0.13861653584036826]
["E38000064","NHS Greater Huddersfield CCG",17522.467055557641,8.9127502825827265E-2,18810.571158962572,9.2480684164024426E-2,20193.122809016688,9.6111960061954729E-2,21344.604082135673,9.8525683540138811E-2,22432.443568483061,0.10083809929193141,0.28021034351827251,0.13139150200347205]
["E38000065","NHS Greater Preston CCG",13926.610414216086,8.485626623334197E-2,14619.548874882239,8.8453224073585662E-2,15350.304463881619,9.1775107400942357E-2,15920.393531724827,9.3992168684170666E-2,16457.797524050737,9.6053446504323181E-2,0.18175184302210762,0.13195466602537811]
["E38000066","NHS Greenwich CCG",17595.54936085283,8.2191467492772924E-2,19516.989724256051,8.4768023472272636E-2,21698.486724173523,8.8464150049631124E-2,23899.441215085641,9.1892653087840823E-2,26039.010721443901,9.5109250936678727E-2,0.47986346930300267,0.15716696438157235]
["E38000214","NHS Guildford and Waverley CCG",12272.115924924539,7.1175710039000931E-2,13083.451233522705,7.3239203053754504E-2,14019.09257055838,7.5885528691990778E-2,14881.548606533745,7.7767289958892885E-2,15709.083470347416,7.9644511611982438E-2,{"$f":"SUM(K67-C67)/C67","v":0.28006315833787321},{"$f":"SUM(L67-D67)/D67","v":0.11898443399217239}]
["E38000068","NHS Halton CCG",8529.5189736033371,8.4333784591688124E-2,9137.1626138288848,8.9125659518424549E-2,9775.3043657095495,9.3704988168228059E-2,10292.04445321676,9.7333501543566875E-2,10671.146291883053,9.9823632290767572E-2,0.25108418480661104,0.18367310057381342]
["E38000069","NHS Hambleton, Richmondshire and Whitby CCG",11204.374871076403,8.8057017220028302E-2,11853.000501173939,9.2702960278225707E-2,12544.205309507095,9.739289836573832E-2,13127.656344996531,0.10098197188458871,13454.142234239598,0.10300216072760372,0.20079365328724139,0.16972120995459056]
["E38000070","NHS Hammersmith and Fulham CCG",11266.913693131706,7.5505385961209662E-2,12312.398415272344,7.9599162239929813E-2,13273.369607182249,8.3617044268503526E-2,14192.545428031372,8.6953470334710042E-2,15107.770493214957,8.9511615672561676E-2,0.34089697540016051,0.18549974327060076]
["E38000071","NHS Hardwick CCG",8264.498131321292,9.0738890330712474E-2,8785.9526700987735,9.4676214117443674E-2,9319.7217876348786,9.8330046292834775E-2,9781.7003764793699,0.10140680464938183,10122.48194560804,0.10352303073847452,0.22481508069379913,0.14088931836358359]
["E38000072","NHS Haringey CCG",19742.711869960647,9.0347390948016873E-2,21952.234663880256,9.3981653668465878E-2,24462.688507866449,9.921596571976983E-2,26933.68489290019,0.10423252667531033,29398.36109532752,0.10877806961935736,0.48907410942153001,0.20399790716640548]
["E38000073","NHS Harrogate and Rural District CCG",10663.714287016015,8.2895788922699123E-2,11430.631062815413,8.7927931252426247E-2,12319.535590105246,9.3047851889012434E-2,12991.847908001348,9.6997520591319608E-2,13506.021602239884,9.991138927533573E-2,0.26654008525759371,0.20526495463483396]
["E38000074","NHS Harrow CCG",21408.159355296139,0.10802381347914088,23245.366460245867,0.11196111386304723,25188.756553069034,0.11585298754976101,27175.382038759279,0.11942073316382174,29145.535933520361,0.12274905632378857,0.3614218508846293,0.13631478440159961]
["E38000075","NHS Hartlepool and Stockton-On-Tees CCG",19243.212055934724,8.2916287728088262E-2,20439.151221084678,8.6562558110641522E-2,21707.468100161943,8.9967954659159244E-2,22853.278608425022,9.2839123368642432E-2,23894.223341354773,9.527202289216416E-2,0.24169620289486174,0.14901457243955143]
["E38000076","NHS Hastings and Rother CCG",15385.819608385835,0.10066618429982879,16529.344774967212,0.10517526581170281,17929.204908316162,0.10996813609124241,19283.696972531881,0.11359387943291638,20537.063512088669,0.11678075464624513,0.33480464705924523,0.16007928043065542]
["E38000077","NHS Havering CCG",17292.003967446672,8.6124135707972269E-2,18314.332416632384,8.713641838725085E-2,19734.595778454532,8.9055035101329116E-2,21237.015084102713,9.0347209580969604E-2,22859.597888253134,9.19311424766876E-2,0.32197505455630376,6.7426009224703223E-2]
["E38000078","NHS Herefordshire CCG",14662.70282371702,9.3775280274475681E-2,15749.537185699866,9.804243765998423E-2,16946.863056149105,0.10253426340845295,17944.17082612278,0.1057405470013128,18740.254566046347,0.10812517058646637,0.27809004870056159,0.15302423271878535]
["E38000079","NHS Herts Valleys CCG",36641.162744308509,7.8632479386043397E-2,39573.238106180368,8.1119297528247716E-2,42951.417505960853,8.3722696007876615E-2,46327.004546761818,8.6209022566455434E-2,49680.705080570071,8.8478548674212065E-2,0.35587141235814085,0.12521631474736714]
["E38000080","NHS Heywood, Middleton and Rochdale CCG",16075.718604146834,9.5666023590495336E-2,16952.423531378063,9.9684955494402344E-2,17922.426323038035,0.10356192258776167,18807.141949396297,0.10667692540780656,19608.592927651396,0.10936192374596429,0.21976462828810867,0.14316368174865457]
["E38000081","NHS High Weald Lewes Havens CCG",12123.111951821891,8.5833417953992436E-2,13183.006538362324,8.9086407206124638E-2,14321.098191771845,9.2465768283650857E-2,15445.762454845255,9.5391319508678712E-2,16421.87705777496,9.7586623827994767E-2,0.35459254381520744,0.13693041887603924]
["E38000082","NHS Hillingdon CCG",20546.835935324645,8.7440786174672935E-2,22545.800658501361,8.939651331681743E-2,24857.326790111547,9.2544031236454008E-2,27148.269167108399,9.5076939017680176E-2,29302.55026639389,9.771425325594868E-2,0.42613443542497931,0.11749056167854351]
["E38000083","NHS Horsham and Mid Sussex CCG",14131.743984265351,7.6157275190048238E-2,15362.972036757244,7.9865731112275143E-2,16755.789908878378,8.3520037428363947E-2,17966.963120544402,8.6271790648921556E-2,19139.850635698396,8.8717208842580872E-2,0.3543870209514976,0.16492099567887231]
["E38000084","NHS Hounslow CCG",20413.357607842598,9.5514493766809844E-2,22750.71994730657,9.9678934224091173E-2,25114.843932649714,0.10411592708999963,27576.214786652781,0.10847382104733216,29898.973865909429,0.11241060931614945,0.4646769257803311,0.17689582892613107]
["E38000085","NHS Hull CCG",16470.750713359957,7.9186301506538256E-2,17146.028481566122,8.2030563972663492E-2,18016.689040864378,8.529821532461121E-2,18830.37878607466,8.7656544018595378E-2,19481.827696111039,8.9645811228193623E-2,0.18281358483002838,0.13208736262031059]
["E38000086","NHS Ipswich and East Suffolk CCG",29147.383578032157,8.9064913457288258E-2,31402.706345722439,9.3857093507449446E-2,33967.655669462787,9.8743185085647639E-2,36231.866091671276,0.10245409481866102,38129.670235819947,0.10530149195200206,0.30816785437158667,0.18230050268336218]
["E38000087","NHS Isle of Wight CCG",11969.976225293387,0.10235998140322719,12887.487201108663,0.1074315371883016,13829.473276763667,0.11265455585503149,14686.246299752944,0.11611516682284112,15415.096411197663,0.11877867476650997,0.2878134526804238,0.16040148833756168]
["E38000088","NHS Islington CCG",13939.840034740058,7.2975814232750805E-2,15516.673933982907,7.48512973178143E-2,17204.037949007175,7.8801932708900582E-2,18891.496925562729,8.2647199779345218E-2,20653.242236463979,8.598352304939208E-2,0.48159822386721585,0.17824684730689236]
["E38000089","NHS Kernow CCG",44778.704613748647,9.7582602453252787E-2,48127.085343169179,0.10141839537903904,51860.837704517122,0.10546393969275861,55038.170106229416,0.10790105494477222,57653.085924794526,0.10976104391119546,0.28751124942307932,0.12480135958432532]
["E38000090","NHS Kingston CCG",9222.4220302126123,6.6233999067887184E-2,10229.535413336629,6.8351833578355128E-2,11394.982676164267,7.1432940547669674E-2,12459.183284321882,7.3801583250336936E-2,13457.784068373086,7.6179010915731288E-2,0.45924617462586809,0.15014965105233744]
["E38000091","NHS Knowsley CCG",10511.789779659293,8.9052776852416915E-2,10896.983722196779,9.2269125505476543E-2,11371.265773854195,9.5685508026373225E-2,11859.389175996896,9.8778853706454228E-2,12285.437332256533,0.1013148386298576,0.16872935910774342,0.13769432252249741]
["E38000092","NHS Lambeth CCG",23648.799911427119,8.8665266614528795E-2,25969.129852118076,9.1841596591165919E-2,28216.363361979973,9.6189961689438788E-2,30766.978801892386,0.10118719595439185,33301.535561839744,0.10491977177643272,0.40817021102827361,0.18332438149168595]
["E38000093","NHS Lancashire North CCG",11006.590978885262,8.2065247382085163E-2,11554.421109894509,8.5059048217715774E-2,12283.022733486165,8.8430689225962325E-2,12812.855385687932,9.0015845058928845E-2,13324.482359568523,9.2032617485623178E-2,0.21059121622033916,0.12145665091498756]
["E38000094","NHS Leeds North CCG",14579.129356748024,8.964049038826874E-2,15382.02317507191,9.1701580869631025E-2,16331.585935359999,9.4184463295040363E-2,17269.997251887351,9.6351245547240297E-2,18084.449593194218,9.8199661127249246E-2,0.240434126803583,9.5483310074580385E-2]
["E38000095","NHS Leeds South and East CCG",15951.592187615761,8.1719222272621725E-2,16709.971922287383,8.3608385481273806E-2,17602.393839948993,8.5790007992733161E-2,18473.885224535792,8.7313948504281078E-2,19315.579236339796,8.9003682777346757E-2,0.21088722737882634,8.9140110516758242E-2]
["E38000096","NHS Leeds West CCG",18840.371375477258,7.035239497937737E-2,19732.272029909433,7.2078726000545851E-2,20843.899686603396,7.4357518859173077E-2,21964.235687610562,7.545254444387002E-2,22934.118576224831,7.6867269661566012E-2,0.21728590796654995,9.2603452719674573E-2]
["E38000097","NHS Leicester City CCG",29194.326841441896,0.1089177989906055,31169.293957255031,0.11142237062005803,33307.767991219924,0.11471197131567683,35606.730920340779,0.11747519274279372,37633.572800408678,0.11978347698901483,0.28907143517305262,9.9760352294178567E-2]
["E38000098","NHS Lewisham CCG",22347.928475482047,9.4960178785935448E-2,24753.156969064217,9.8273610326600827E-2,27293.318783457071,0.10211508075223388,30070.460058138055,0.10651951844894812,32833.141072895189,0.11062379067687059,0.46918051527310406,0.164949267063249]
["E38000099","NHS Lincolnshire East CCG",19995.812979493901,0.10252160059215494,21229.799463013795,0.10665025350654976,22584.602879843496,0.11030869825067645,23792.398779201969,0.11297435317759719,24756.620473363979,0.11492257206092275,0.23809021912499276,0.12095959677902988]
["E38000100","NHS Lincolnshire West CCG",15777.770229055381,8.1606342345377988E-2,16974.562148805126,8.5591781710392931E-2,18213.720952525317,8.9361794487907556E-2,19311.342212897682,9.1731627460087797E-2,20274.434993512903,9.4054717913865743E-2,0.28500001579289946,0.15254176588142115]
["E38000101","NHS Liverpool CCG",30911.455824672004,7.8403733132126022E-2,32165.077247557365,8.0264204340862816E-2,33765.880383587959,8.2852923353751648E-2,35537.156421303749,8.4891205440026166E-2,37160.891400539702,8.6767748670355152E-2,0.20217215298153979,0.10667879199239258]
["E38000102","NHS Luton CCG",16801.264029397211,0.10208569710412693,18138.369449622052,0.10369522895965043,19583.55027132645,0.10613239904252357,21078.351571584211,0.10858413131869056,22614.368810102082,0.11134598133974437,0.34599210931592217,9.0710887992193359E-2]
["E38000103","NHS Mansfield and Ashfield CCG",14043.899274457826,8.7829263755208414E-2,15012.547633906877,9.1999924218083576E-2,16077.539355486033,9.5916593219699517E-2,17085.346682216525,9.9148947784450589E-2,17898.371061054866,0.10166063308562345,0.27445880316211851,0.15748019212554104]
["E38000104","NHS Medway CCG",17495.955537884478,7.9210229707915969E-2,19033.168115449014,8.2131561730599004E-2,20749.018328493075,8.5520642686064935E-2,22352.697995712031,8.7836757292172399E-2,23892.781505264309,8.9890073383236679E-2,0.36561741103700263,0.13482909612435334]
["E38000105","NHS Merton CCG",13324.028409808867,8.1174780125556636E-2,14500.702664259683,8.4013341044378242E-2,15708.064117220363,8.6957839444311139E-2,17062.606188244696,9.0383547983073922E-2,18360.382038101983,9.3228303229927811E-2,0.37799030994150834,0.14848852175179847]
["E38000106","NHS Mid Essex CCG",25535.946897633603,8.1040770858881644E-2,27827.150266185396,8.5291332882318993E-2,30313.65710173293,8.9494736365531777E-2,32428.013662814297,9.2519297183492999E-2,34350.122087888885,9.4858395249886457E-2,0.34516735273568749,0.17050213422902644]
["E38000107","NHS Milton Keynes CCG",15739.551685008624,7.5598230955853149E-2,17738.152441807983,8.0226831487146016E-2,19853.003308381736,8.4337312270100828E-2,21864.499809854777,8.8127770293650848E-2,23743.488532183077,9.1300040499050522E-2,0.50852381359743071,0.20770075363756471]
["E38000108","NHS Nene CCG",42107.902364619818,8.2390041411559478E-2,46133.209609101767,8.6752434482496088E-2,50479.068262470755,9.0917236883525002E-2,54426.361414160492,9.420889256761146E-2,57864.383629436496,9.6827951187142727E-2,0.37419297518975186,0.17523853038818335]
["E38000109","NHS Newark & Sherwood CCG",8523.7665100737522,8.7729173631882998E-2,9248.1418219303978,9.2223193278125226E-2,9900.1725221953056,9.5913316432816378E-2,10584.419445923735,9.9216530239255113E-2,11118.36844180337,0.10137097412293372,0.30439617611101921,0.15549901961111084]
["E38000110","NHS Newbury and District CCG",6325.7092831544433,7.464844563552564E-2,6912.481919423738,7.9839246008590173E-2,7440.1803933905885,8.4164936576816618E-2,7945.0890499250854,8.7888153207135916E-2,8357.1628158111653,9.0799248324762771E-2,0.32114241134453408,0.21635819140955923]
["E38000212","NHS Newcastle Gateshead CCG",31494.413881402907,7.7564806130930225E-2,32891.147268305547,7.9454892425126947E-2,34681.159609894952,8.2210116175733539E-2,36181.195481096096,8.3741136603934854E-2,37891.707040048888,8.5891075890944066E-2,0.20312469324674465,0.1073459752604681]
["E38000113","NHS Newham CCG",26800.568890197483,0.1038701220455681,30662.482578000167,0.1086705506733774,34430.572225951844,0.11515241547141085,38411.21764857517,0.12148528575044332,42038.023933205768,0.12668160539177245,0.56854968659197025,0.21961544760866741]
["E38000114","NHS North & West Reading CCG",6253.5593717028796,7.7935685091012952E-2,6807.2479702649016,8.2153608137399248E-2,7369.390269457369,8.6050797167881457E-2,7849.1552773726116,8.907348249401513E-2,8259.4016316221223,9.1506776330845585E-2,0.32075209343907457,0.17413192973134672]
["E38000115","NHS North Derbyshire CCG",20155.222177726799,8.8345849819088274E-2,21498.44277438469,9.2938106408372342E-2,22921.619969636802,9.7323454354775824E-2,24071.093905370948,0.1004636640457886,24992.490681913085,0.10284129158881197,0.24000075323068734,0.16407609185272412]
["E38000116","NHS North Durham CCG",16690.649206108486,8.1521193738929798E-2,17683.949013171146,8.4815103180676962E-2,18596.132093746692,8.7775569214324042E-2,19511.25126629409,8.9880464650332087E-2,20229.518653743035,9.1577721384078908E-2,0.21202707000392673,0.12336089774832008]
["E38000117","NHS North East Essex CCG",23904.310424164396,8.9886103723262376E-2,25656.876913738306,9.2784886857147086E-2,27801.947395697847,9.64541611008113E-2,29778.379784741359,9.8832989660608536E-2,31644.325347465878,0.10102261954879926,0.32379160017422021,0.12389585669241525]
["E38000118","NHS North East Hampshire and Farnham CCG",11984.290342020369,7.1556546107119479E-2,12959.866502166838,7.5850793059620975E-2,13978.097856309023,7.9738150920188378E-2,14855.857130125458,8.2679525434803308E-2,15600.931398475026,8.505578125872329E-2,0.30178182881414956,0.18865129587718757]
["E38000119","NHS North East Lincolnshire CCG",11317.584444721742,8.7421477249511367E-2,11857.498625646695,9.1155432238981371E-2,12415.540643390372,9.4587388720024188E-2,12974.925391237522,9.7511839705678074E-2,13440.414745287013,0.10010736440702378,0.18756920356404402,0.14511179125131199]
["E38000120","NHS North Hampshire CCG",13155.49383671593,7.41990628128366E-2,14425.117359403661,7.8286754365590239E-2,15779.7937966595,8.2375202530066291E-2,16958.934742226782,8.5469885809025203E-2,17987.585268228198,8.7933052738698669E-2,0.36730597053120789,0.18509654172459519]
["E38000121","NHS North Kirklees CCG",14536.623514219387,9.7639867774176436E-2,15566.303905797273,0.10106676993765272,16663.657747367477,0.10473700658307654,17559.300093618735,0.1072913362679869,18346.184138625271,0.10915150011081194,0.2620664021930168,0.1178988931371748]
["E38000122","NHS North Lincolnshire CCG",12117.780798853413,8.7341652002691436E-2,12947.118407469856,9.1680487236013727E-2,13828.130342206859,9.56434523599866E-2,14487.424007609521,9.8715072278614896E-2,15087.511432512509,0.10138093960833564,0.24507215330550391,0.16073989080503742]
["E38000123","NHS North Manchester CCG",10464.434422113871,7.4543627454864439E-2,11179.989729005803,7.6147593849651293E-2,11998.670417853165,7.8949009197612607E-2,12868.519275475279,8.1363930674476961E-2,13791.948355535502,8.3964132202212965E-2,0.31798316078982658,0.12637572209713788]
["E38000124","NHS North Norfolk CCG",14897.991503234907,0.10327181133533142,15874.82212881665,0.10739292469771783,17003.782439891733,0.11166129787162946,17983.627479536412,0.11437056397568313,18844.377527851389,0.11665455941470468,0.26489382973265729,0.12958761840555366]
["E38000125","NHS North Somerset CCG",14875.709835132853,8.6516865389861891E-2,16263.362086170098,9.0533077745324528E-2,17661.272895454793,9.4113145558215885E-2,18980.565570945993,9.6721186154433314E-2,20158.333811609667,9.8815361821616016E-2,0.35511743876588164,0.14215143343826314]
["E38000126","NHS North Staffordshire CCG",15322.674903983303,8.4833766493097679E-2,16173.702747528554,8.8274766660454931E-2,17139.26557106449,9.1978456429454181E-2,17884.629621380565,9.441785250438478E-2,18451.077570999671,9.597938811381436E-2,0.20416818124902616,0.13138190229504335]
["E38000127","NHS North Tyneside CCG",14100.750344859225,8.4213750267912238E-2,14979.680285391241,8.7263662387226146E-2,15974.228393707743,9.061849553952657E-2,16911.75184495909,9.3579857486493417E-2,17767.725568487047,9.628116163697327E-2,0.26005532570574924,0.14329502403907368]
["E38000128","NHS North West Surrey CCG",21416.191955190014,7.752748318559953E-2,22922.350686195368,8.0198553936727202E-2,24713.968871161789,8.3128048675283506E-2,26374.214935743894,8.5619448564290004E-2,28018.874221660026,8.7789429194322671E-2,0.30830328194130302,0.13236526696160392]
["E38000129","NHS North, East, West Devon CCG",64860.733559628228,8.7925297635327263E-2,69080.233395880394,9.1421922918769216E-2,73802.635955648555,9.5042801158564574E-2,78018.562628748216,9.7330974611078369E-2,81608.789034604255,9.931459503797431E-2,0.25821563457309787,0.12953379412924471]
["E38000130","NHS Northumberland CCG",24421.451270255733,9.2470470542429892E-2,25971.985863302387,9.754370113160965E-2,27680.455657611445,0.10274853621979005,28949.324906603902,0.10648615061650811,30015.498438614264,0.10960161556493925,0.22906284751274539,0.18526070995441474]
["E38000131","NHS Norwich CCG",12714.706012176646,7.698417299695233E-2,13498.558633276429,7.9096206687427797E-2,14393.995701386995,8.1811956925014181E-2,15213.020323381419,8.366157238991101E-2,16003.03471086307,8.5285838365290287E-2,0.25862404490809704,0.10783600115658326]
["E38000132","NHS Nottingham City CCG",19935.552092652404,7.7679052730098203E-2,20922.785907828413,7.9742304702448405E-2,22191.884396202295,8.2473184169028893E-2,23498.012269425788,8.3957454156873612E-2,24773.152740092031,8.610758686163375E-2,{"$f":"SUM(K131-C131)/C131","v":0.24266198522902255},{"$f":"SUM(L131-D131)/D131","v":0.1085045946790975}]
["E38000133","NHS Nottingham North and East CCG",10321.938889454781,8.417826528669696E-2,11063.964937419598,8.743452613734469E-2,11799.255056529862,9.0318853770130603E-2,12485.815197812526,9.2721039639184058E-2,13025.054345797329,9.4343432897271692E-2,0.26188059097154082,0.12075762758894933]
["E38000134","NHS Nottingham West CCG",7682.9640578346653,8.2364537498227544E-2,8119.5237451416524,8.4861243155744684E-2,8600.8095543596264,8.7602460321446599E-2,9010.6954130379836,8.9197143269035661E-2,9319.9137047196255,9.0309241324802572E-2,0.21306225495298117,9.6457821143547312E-2]
["E38000135","NHS Oldham CCG",16713.252188930812,9.3863035993096769E-2,17669.06287924921,9.69761958246389E-2,18722.502119103294,0.10005612504864951,19694.841429639117,0.10264145001896559,20549.164232599527,0.10491761581027023,0.22951320307421916,0.11777351648828492]
["E38000136","NHS Oxfordshire CCG",39560.190769960296,7.3308484860203652E-2,42884.090762687862,7.6933175635405748E-2,46293.405378039053,8.0362124393360157E-2,49567.814419906681,8.3078262302069411E-2,52419.438315106825,8.5384803093410913E-2,0.32505524606597935,0.16473288537113157]
["E38000137","NHS Portsmouth CCG",12342.282548820373,7.209277189731525E-2,13072.676030364606,7.4099739430702902E-2,13978.136003472297,7.6929752358130432E-2,14850.865537504034,7.8742659265662956E-2,15647.08458178916,8.0813369392568751E-2,0.267762629796921,0.1209635482968336]
["E38000138","NHS Redbridge CCG",24902.876518326939,0.10807601995628389,27235.346831924104,0.10959898121498633,29923.482422081157,0.11269765901657561,32764.550716578531,0.11595608266059786,35736.289362406344,0.1193756325574771,0.43502656554983515,0.10455244933856588]
["E38000139","NHS Redditch and Bromsgrove CCG",12422.571648192346,8.4403938362497252E-2,13253.003717568856,8.8708190880648297E-2,14183.722185305032,9.2886196367420001E-2,14947.998142560213,9.5832787168612724E-2,15552.371405405152,9.798621097155466E-2,0.25194459294330046,0.16091989156624883]
["E38000140","NHS Richmond CCG",10927.241975975498,6.9992582474862272E-2,12121.188267305572,7.2756232096672105E-2,13337.213704546573,7.5624935952294026E-2,14591.314934370121,7.851546994387712E-2,15720.012205430061,8.1148111735649703E-2,0.43860749491883588,0.15938159253937975]
["E38000141","NHS Rotherham CCG",18926.899219206287,8.9811612504537772E-2,19938.979122572029,9.3364764574695766E-2,21070.727967859035,9.6859097029783195E-2,21985.422318685967,9.92121945789078E-2,22804.940814285987,0.10132827163550157,0.20489577030897976,0.12823129225501781]
["E38000142","NHS Rushcliffe CCG",7263.8314870388876,7.7671423086386748E-2,7888.7281522718504,8.0860272163508107E-2,8491.7115583961895,8.3843913491273597E-2,9038.3180902431559,8.6309378249075211E-2,9538.2533668442993,8.8251789108477988E-2,0.31311600274094237,0.13621954641314704]
["E38000143","NHS Salford CCG",15281.212696302608,7.7766985731819879E-2,16246.857289808398,7.9013993239025374E-2,17482.921689169765,8.1414369419622643E-2,18735.584861435611,8.3551484398125278E-2,20032.085724470617,8.5819919991734286E-2,0.31089633542745693,0.10355209455700161]
["E38000144","NHS Sandwell and West Birmingham CCG",43324.005726952993,0.11478990442200465,45759.618683603469,0.11687086551464337,48395.249322043499,0.11907693844309704,51131.725371930777,0.12118820006619922,53842.773641869855,0.12329464996993326,0.24279305983871344,7.4089664859920343E-2]
["E38000145","NHS Scarborough and Ryedale CCG",9021.153475597479,9.7631531121184834E-2,9519.5763461726565,0.10253744448699544,9938.1947400718163,0.10656438709062638,10379.640797294109,0.10979099637501702,10731.602478633009,0.11218484715275986,0.18960424602711301,0.14906368736049805]
["E38000146","NHS Sheffield CCG",37641.016021726908,8.1168361628772376E-2,39546.242662319826,8.2566900497577728E-2,41759.369317137847,8.4670254089898311E-2,43853.249362820228,8.5909276657956002E-2,46002.558026203849,8.7670677744709269E-2,0.22213911547048956,8.0108997957548611E-2]
["E38000147","NHS Shropshire CCG",23513.492761604921,9.062473121716226E-2,25511.364122279912,9.5950669934857485E-2,27445.555224455093,0.10066591558265513,29172.582237054885,0.1045087849718954,30590.458049578534,0.1074857977848859,0.30097465143628338,0.18605370014637393]
["E38000148","NHS Slough CCG",11041.78131438576,0.10087503484730276,12127.859188576451,0.10603129208407458,13282.884987983263,0.11065382362531874,14453.790326916067,0.11494981968280632,15477.652099375227,0.11858452420606211,0.40173506961328809,0.17555869383903241]
["E38000149","NHS Solihull CCG",15203.33584116712,8.9169125168135605E-2,16060.87134409401,9.2134415695812377E-2,16958.533142144679,9.4803964345620967E-2,17744.441124703142,9.6322012402036375E-2,18521.903896747914,9.7648164786735103E-2,0.21827894155931743,9.508941130252857E-2]
["E38000150","NHS Somerset CCG",41239.768907448335,9.1770370081998162E-2,44568.668030486479,9.6302221327758161E-2,48239.198054932152,0.10067450967303647,51547.271484707169,0.10403921907864846,54343.882902212747,0.10653156689056056,0.31775430226520185,0.16084926752908435]
["E38000151","NHS South Cheshire CCG",12161.065841106023,8.3181024904965956E-2,13085.541516395295,8.8141866606461644E-2,13935.919325275567,9.2071348607793119E-2,14646.811108510688,9.508446577843864E-2,15273.046966726739,9.7541492953932399E-2,0.25589707072399898,0.17264115301985314]
["E38000152","NHS South Devon and Torbay CCG",23363.267803588693,0.10030597545761932,24928.995436976358,0.10465573231308295,26825.808355274741,0.10914561134052707,28416.360130877852,0.11225551130156378,29789.372384960327,0.11456569642704532,0.2750516167256602,0.14216222816606705]
["E38000153","NHS South East Staffs and Seisdon Peninsular CCG",15743.443965709253,8.4551256529050767E-2,17025.671420442453,8.9930654027268395E-2,18215.718523576201,9.4323314641550332E-2,19071.916250025173,9.7335491732291377E-2,19768.776178161643,9.935056879164561E-2,0.25568307806220497,0.17503361712324148]
["E38000154","NHS South Eastern Hampshire CCG",14972.725291372413,8.6278237244280367E-2,16086.532437059152,9.0455085678470257E-2,17246.015879315386,9.4436621833946924E-2,18339.228679838263,9.7507596128446755E-2,19237.780207640546,9.9791369476297048E-2,0.28485495013561385,0.15662272044057673]
["E38000155","NHS South Gloucestershire CCG",16842.77139098983,7.5413143149412692E-2,18246.20253175309,7.8350234162457441E-2,19631.064202242491,8.0746397672928974E-2,20966.197897695347,8.2713420773612698E-2,22151.058795975106,8.4205347814092252E-2,0.31516709938988929,0.11658716634128294]
["E38000156","NHS South Kent Coast CCG",15963.18594233114,9.3945303332928096E-2,17282.993969754552,9.8872963213698817E-2,18912.66544998853,0.10406440767023512,20356.19533823157,0.10796751531893269,21626.929115886702,0.11115814718280582,0.35480030076806041,0.18322197320368414]
["E38000157","NHS South Lincolnshire CCG",10566.319576722828,8.7687299391890683E-2,11512.351174606511,9.198107362261515E-2,12434.587830873133,9.5753795093740449E-2,13277.272702559978,9.8525324299198414E-2,14108.282657512915,0.10116365020445228,0.33521256432494123,0.15368646207626155]
["E38000158","NHS South Manchester CCG",9633.9757780637883,7.2632507373822278E-2,10261.25323944877,7.3790113903701784E-2,11105.248137772793,7.6799779652647254E-2,11934.05064266145,7.9243364161098603E-2,12798.493514082593,8.1936578195151044E-2,0.32847474489444911,0.12809788836619562]
["E38000159","NHS South Norfolk CCG",17908.174631678328,8.9945628486581261E-2,19517.707948506519,9.3844157844535619E-2,21199.670360571949,9.7362314506163075E-2,22755.782709780768,0.10011343031139799,24043.088575194779,0.10231972327515014,0.34257617371366317,0.13757305381900728]
["E38000160","NHS South Reading CCG",6088.8184763596519,6.8475241524512509E-2,6480.1839060087323,7.1810548603820176E-2,6961.1887605613365,7.512614677920719E-2,7359.7413807512876,7.693645599781819E-2,7837.9920898031924,7.980036743843609E-2,0.28727636079723079,0.16539008350732806]
["E38000161","NHS South Sefton CCG",11914.802810938836,9.1175411776391449E-2,12365.454426338205,9.4856201490780973E-2,12849.697128845701,9.8450023972155215E-2,13331.582680268377,0.10118080358430766,13655.973322986194,0.10323535926055484,0.14613506741788546,0.13227192780593661]
["E38000162","NHS South Tees CCG",19787.736408811732,8.9238461300675267E-2,20686.618902947113,9.2806724553374229E-2,21553.993025619013,9.611162501390802E-2,22374.640578903251,9.8514620372064335E-2,23063.415548840767,0.10045916695200265,0.16554087200041401,0.12573844828544203]
["E38000163","NHS South Tyneside CCG",11314.863068152963,9.1856332750064662E-2,11738.911598220398,9.4821579953314999E-2,12400.383742773496,9.8792094827704707E-2,12985.918316657973,0.1020103559831734,13501.516315201605,0.10464669287863591,0.19325494563016316,0.13924309566519513]
["E38000164","NHS South Warwickshire CCG",18006.407453767348,8.2871904702537511E-2,19289.226299795391,8.6693151909192773E-2,20589.746198771652,9.032967534777421E-2,21731.11220799946,9.2622590606084132E-2,22650.753014709779,9.4291703499749302E-2,0.25792738350873701,0.13780060731320587]
["E38000165","NHS South West Lincolnshire CCG",8884.3178720816595,8.6591792125552236E-2,9711.5065737464338,9.1359422142487615E-2,10492.733500981725,9.533648465365914E-2,11222.360140139981,9.8545487707586768E-2,11867.37240757162,0.10101610833819903,0.33576629949993103,0.16657833102394409]
["E38000166","NHS South Worcestershire CCG",21793.801211428359,8.8134103896103044E-2,23452.528875129668,9.2209360993668582E-2,25164.870826735718,9.616658065857428E-2,26639.274806609897,9.8993960634001843E-2,27941.818437034082,0.10124580925079384,0.28209935320424001,0.148769940069369]
["E38000167","NHS Southampton CCG",14404.764187718891,7.1022405027703822E-2,15242.040595967628,7.2928423904151329E-2,16234.276824253751,7.5354051356543592E-2,17254.203500901898,7.6835605187486181E-2,18166.143372037848,7.8532523655705719E-2,0.2611204970315173,0.10574295006022977]
["E38000168","NHS Southend CCG",12648.013179954549,8.7239710166606088E-2,13607.804606065143,9.0345270256706564E-2,14730.054090908785,9.3762279381978259E-2,15852.0240889613,9.6694059344646213E-2,16903.912891709471,9.9247962022718836E-2,0.33648760886017803,0.13764662712863193]
["E38000169","NHS Southern Derbyshire CCG",36807.260775751565,8.6740021623583838E-2,39491.358105803803,9.0146452944219774E-2,42390.005617727911,9.3539003525592287E-2,44979.71409064508,9.6155701591870285E-2,47386.757698191403,9.845576085225724E-2,0.28742961849009846,0.13506728508225316]
["E38000170","NHS Southport and Formby CCG",9324.8088665329742,9.7153666040143499E-2,9764.7943533048474,0.10116861120290974,10279.441138328095,0.1050852702752821,10766.731397061229,0.10855748535048627,11204.016216715545,0.11106280944404782,0.20152770711763365,0.14316642871877963]
["E38000171","NHS Southwark CCG",22047.507800713542,8.7538742955266993E-2,24437.098370944008,9.0207081472661529E-2,26813.173112171484,9.4326226384899334E-2,29281.288126407886,9.8364982956221064E-2,31758.144527307719,0.1019195909092032,0.44044146913874338,0.16427980878460796]
["E38000172","NHS St Helens CCG",13006.562899086004,8.926947768761842E-2,13777.950770770231,9.3473207400069411E-2,14533.259603914803,9.7095534499698044E-2,15199.647612569566,9.9918798399747322E-2,15710.38978914512,0.1018567802719471,0.20788173716894251,0.14100343040401281]
["E38000173","NHS Stafford and Surrounds CCG",10709.384422205592,8.406110221511455E-2,11524.308636714917,8.822774947722338E-2,12221.294826788719,9.1779023932027026E-2,12848.283554150123,9.4542189508095092E-2,13272.607085537236,9.6234100098152836E-2,0.23934360391591486,0.14481130466130776]
["E38000174","NHS Stockport CCG",20114.039350939227,8.6171019411101127E-2,21263.40013931377,8.9417157860865307E-2,22563.863614715534,9.2444541194344212E-2,23752.729370373112,9.4775873315669584E-2,24815.518866587805,9.6731577401527269E-2,0.23374119109640909,0.12255347636128418]
["E38000175","NHS Stoke on Trent CCG",18416.333915930463,8.8310798484369735E-2,19316.598603563489,9.1582583934968195E-2,20279.495512044195,9.4428643658242689E-2,21160.229094464801,9.6604406019287811E-2,21840.104129205552,9.8193076743123608E-2,0.18590943392449383,0.11190339605527351]
["E38000176","NHS Sunderland CCG",19949.967182612345,8.7011371173291815E-2,20797.788297525563,9.0189888540874077E-2,21849.31535995223,9.3685427321637205E-2,22708.351262371398,9.6238138931901154E-2,23412.280567898284,9.8321352964464495E-2,0.17354982860841814,0.12998280154265957]
["E38000177","NHS Surrey Downs CCG",18300.221289959758,7.8798748234411645E-2,19751.92019515589,8.1680258850202178E-2,21426.16132019056,8.464823530416625E-2,23030.932955273875,8.6974822338647562E-2,24566.13571696102,8.9123986783344294E-2,0.34239555509850561,0.13103302755796301]
["E38000178","NHS Surrey Heath CCG",5925.2263955736025,7.61205857601953E-2,6337.0880391089231,7.9852419847642686E-2,6789.2281557393626,8.3323860526992657E-2,7237.3931011459017,8.6097943149487294E-2,7625.5434721037718,8.850445069758324E-2,0.28696238135312074,0.16268746244808413]
["E38000179","NHS Sutton CCG",12483.828822951878,7.8327449008356628E-2,13639.034879189539,8.113643592617216E-2,14985.39032091459,8.4253853148063593E-2,16338.12852106273,8.6941935510125204E-2,17696.14027168234,8.9573498034431764E-2,0.41752506563911518,0.14357736870602428]
["E38000180","NHS Swale CCG",7602.5237038948253,8.5134643940591559E-2,8423.8689474237708,8.9330529665151315E-2,9279.1877944087355,9.3445999943693209E-2,10039.007665080098,9.623281887538436E-2,10815.427556005248,9.9042376886494962E-2,0.42261017225956565,0.16336161522691586]
["E38000181","NHS Swindon CCG",13474.075415737037,7.5705559139999087E-2,14815.00205901431,8.0219850871855694E-2,16231.135033392356,8.4291311972332555E-2,17610.478012900341,8.7973214171747152E-2,18835.751200306957,9.0932466932060224E-2,0.39792532096916672,0.20113328486092627]
["E38000182","NHS Tameside and Glossop CCG",18237.444441323729,8.8980505666099385E-2,19412.438335357376,9.3373921766990761E-2,20627.47858575849,9.7336157916942667E-2,21741.618502873229,0.10040462964289844,22669.888341769882,0.10281128499668879,0.2430408446044556,0.15543606127042703]
["E38000183","NHS Telford and Wrekin CCG",11351.174748693587,8.3698383340905375E-2,12292.788829258248,8.8577524349749595E-2,13161.689331507863,9.2609691327806526E-2,13974.212638908934,9.6029498618120782E-2,14570.326382704283,9.8541366040202097E-2,0.2835963418130964,0.17733894140871184]
["E38000184","NHS Thanet CCG",10999.979916198276,9.6864916486423702E-2,11899.512891171742,0.10014739009570561,12965.90465801649,0.10397678153982752,14088.688521001117,0.1074324273372054,15084.514780121735,0.10992941830725649,0.37132202922558827,0.13487341232224015]
["E38000185","NHS Thurrock CCG",10152.39718869315,7.8933270010054041E-2,11022.55730844663,8.1503677228975377E-2,12059.920402145199,8.4252622622224382E-2,13137.87627306877,8.6833286669324328E-2,14151.828923973764,8.9061226708456648E-2,0.39393964410049187,0.1283103651617698]
["E38000186","NHS Tower Hamlets CCG",19396.601703682252,8.2363489187610398E-2,22855.632888066859,8.619562863202164E-2,26317.743083305329,9.1865900179088689E-2,29911.2919388556,9.7469017006177008E-2,33614.023272242404,0.1026445073660755,0.73298517883476033,0.24623796755706037]
["E38000187","NHS Trafford CCG",15334.263919348958,8.2460012472300268E-2,16338.326327059051,8.4584418756777024E-2,17493.240411352195,8.7039707490059681E-2,18615.536560717672,8.9325991174269065E-2,19742.980504148072,9.1665802322165812E-2,0.28750754571506648,0.11163944285065355]
["E38000188","NHS Vale of York CCG",22143.25971439949,7.4808309845944207E-2,23706.090280511155,7.7653597616978362E-2,25414.905075175651,8.071811305080244E-2,26962.713008177863,8.2951984396313863E-2,28225.029746562039,8.4820981327569531E-2,0.27465558868045287,0.13384437507336852]
["E38000189","NHS Vale Royal CCG",6965.0996515050019,8.3997825030209874E-2,7450.7561301324495,8.8805198213736003E-2,7779.4427164734079,9.2151655016268735E-2,8124.6429532703542,9.5047297066803413E-2,8352.8531059813722,9.678856437985367E-2,0.19924387645717428,0.15227464931435544]
["E38000190","NHS Wakefield CCG",23683.734302439312,8.7361616755585791E-2,25248.879175702721,9.1329230903938061E-2,27010.762486313954,9.5329859837347194E-2,28448.627406161271,9.7983837590966683E-2,29701.06314714063,0.10026013754773369,0.25407010431127669,0.14764517039828232]
["E38000191","NHS Walsall CCG",21843.772907945528,0.10038498579019085,23064.943422638466,0.10330978868869688,24200.997412206027,0.10527665482950245,25298.114970528,0.10690548922636917,26352.943314586009,0.10838588185648601,0.20642818553567277,7.9702118830971308E-2]
["E38000192","NHS Waltham Forest CCG",21571.296519854608,0.10123566979469968,23702.178075012995,0.10522142446512028,26120.040198865707,0.10998837880607086,28665.419031149966,0.11458833958726404,31112.194130742948,0.11864015455591423,0.44229597428725376,0.17192047819222095]
["E38000193","NHS Wandsworth CCG",18311.885695968769,7.0284354402275165E-2,19859.951896398368,7.2885906842331066E-2,21591.793477494604,7.6610110266444098E-2,23331.222558153942,8.0137468428089387E-2,25010.848862811941,8.2625863438427288E-2,0.36582596014772528,0.17559397309840863]
["E38000194","NHS Warrington CCG",13249.062848852845,7.8713538788336757E-2,14364.87465930578,8.2680296185713001E-2,15448.852144353568,8.6345026516619558E-2,16455.959352687609,8.9327756772812988E-2,17350.350121174615,9.1839668225569632E-2,0.30955300907768546,0.16675821770038138]
["E38000195","NHS Warwickshire North CCG",13643.669198412637,8.8583750152010352E-2,14631.550045174145,9.324209817215233E-2,15514.430311955077,9.7196030021019147E-2,16312.107938768017,9.9914908359475807E-2,16930.120356245759,0.10175574201373817,0.240877370305598,0.14869535145130555]
["E38000196","NHS West Cheshire CCG",15977.387291780571,8.3537526360873013E-2,17001.25789556649,8.7707686213198993E-2,18047.372506759973,9.1825442692378023E-2,18932.612548821682,9.464413391732493E-2,19625.18352195109,9.6914486528153543E-2,{"$f":"SUM(K195-C195)/C195","v":0.22830993350502909},{"$f":"SUM(L195-D195)/D195","v":0.16013115003541664}]
["E38000197","NHS West Essex CCG",19892.974519814739,8.2440839286426593E-2,21559.315514953149,8.5147375651473733E-2,23489.357819021254,8.8173265086416111E-2,25368.356452447351,9.0607745026242414E-2,27301.296261150492,9.2855235226006708E-2,0.37240894939852087,0.12632569039474573]
["E38000198","NHS West Hampshire CCG",37779.453706640983,8.2824250683213446E-2,40875.114553349318,8.6581475436029051E-2,44178.514768624547,9.0252328434370879E-2,47146.096854538358,9.2968324764431218E-2,49760.72374525648,9.5133873255948617E-2,0.31713719662678436,0.14862341006641966]
["E38000199","NHS West Kent CCG",29744.843009144137,7.7906870113001944E-2,32328.420288885918,8.1174158310867064E-2,35286.960377271054,8.4527764042713199E-2,37917.207139448561,8.7069916275026554E-2,40532.1574662247,8.9348729094049686E-2,0.36266167058822046,0.14686585360766791]
["E38000200","NHS West Lancashire CCG",7888.2492055891589,8.5149494878984877E-2,8320.2252388726629,8.9119807614317301E-2,8719.4308687193989,9.2582616996383524E-2,9027.9198433026886,9.4851017475338181E-2,9191.3450682974035,9.6063389091737075E-2,0.16519456076323577,0.12817332889952088]
["E38000201","NHS West Leicestershire CCG",25447.401463652965,8.01391996713893E-2,27604.295897873908,8.3563286001918952E-2,29831.334472766615,8.6931269590764124E-2,31901.649829961276,8.930032983417667E-2,33593.318640402882,9.1187075571126167E-2,0.32010801528733279,0.13785857539180163]
["E38000202","NHS West London (K&C & QPP) CCG",15742.207586928058,8.3699529917737436E-2,17172.955267354013,8.8575176745172332E-2,18587.030140961851,9.3722419024616033E-2,19763.002452040775,9.7125036622964303E-2,20974.638738475303,0.1002515951556988,0.33238229915683032,0.19775577299214536]
["E38000203","NHS West Norfolk CCG",14567.873342744953,0.1006763879940909,15549.904526705917,0.10482610574832087,16655.916706896747,0.10897616269887951,17661.549850099349,0.11183858820984897,18571.563101314456,0.11438508931580721,0.27483007741575455,0.13616600272271318]
["E38000204","NHS West Suffolk CCG",15800.147696840691,8.5507888823685957E-2,17215.193159364011,9.0254761242340401E-2,18714.377852346854,9.4890872387926428E-2,20028.002194679942,9.8061115328436865E-2,21190.413245834025,0.10077236658661795,0.34115285834139009,0.17851543258665609]
["E38000205","NHS Wigan Borough CCG",21768.382955958161,8.3193392020018964E-2,23443.464024418423,8.7685009067992301E-2,25033.485803935495,9.1543501074875647E-2,26335.220123037798,9.449307543250017E-2,27478.635687245598,9.7063354599949109E-2,0.26231864547956696,0.16671952234610884]
["E38000206","NHS Wiltshire CCG",32303.689694856039,8.1984898469255454E-2,35263.845364812471,8.6426756935474899E-2,38302.704769959448,9.1127485653691109E-2,40917.11523766887,9.4741861715450765E-2,43218.881691099799,9.775815808889346E-2,0.33789304253940594,0.19239225655140646]
["E38000207","NHS Windsor, Ascot and Maidenhead CCG",8774.0913791151997,7.638944261810203E-2,9469.555892035376,7.9952346268451338E-2,10143.762134516011,8.290096546678663E-2,10850.030188164559,8.5622081661652139E-2,11580.70668928488,8.8321436007358756E-2,0.31987532257188617,0.15619950847015604]
["E38000208","NHS Wirral CCG",23439.055341434723,8.9653669451632195E-2,24561.200800313218,9.3388596198909574E-2,25855.084537698058,9.7126538458670392E-2,26998.54745206115,0.10018013896868701,27933.402827790949,0.10240267918392459,0.1917461015765119,0.14220287702970641]
["E38000209","NHS Wokingham CCG",9291.9942145351797,7.2889819693561189E-2,10091.238663259086,7.6367781619941622E-2,10946.022969091337,7.9700181804946382E-2,11680.666928758628,8.2444007119979026E-2,12327.387047401982,8.471266525152546E-2,0.32666753366232526,0.16220160246889259]
["E38000210","NHS Wolverhampton CCG",22293.724790925266,0.11024490550353706,23280.50350031018,0.11277128221425199,24406.63859742121,0.11521260667211673,25547.006115553679,0.11706995745373329,26652.567396789866,0.11869852764224577,0.19551881288311593,7.6680388087751433E-2]
["E38000211","NHS Wyre Forest CCG",7692.7913673109051,9.3883223911531657E-2,8291.4916769609499,9.9705287120742545E-2,8837.5158680209424,0.10426517069397054,9200.8397625584566,0.10696163406833824,9463.3337156025063,0.10847471017426075,0.23015603358427134,0.1554216574036591]
["ENG","England",3807042.4161868379,8.5811804349166021E-2,4085166.0282777227,8.897294392161384E-2,4389883.5268733986,9.2325885939244151E-2,4675175.3268238856,9.4937403097907255E-2,4936101.636878076,9.7185299901400596E-2,0.29657122176802858,0.13253998839082926]
[]
[null,null,null,null,null,null,null,null,null,null,null,null,{"$f":"MIN(M2:M211)","v":0.10245806252240279},{"$f":"MIN(N2:N211)","v":6.3132131295738747E-2}]
[null,null,null,null,null,null,null,null,null,null,null,null,{"$f":"MAX(M2:M211)","v":0.73298517883476033},{"$f":"MAX(N2:N211)","v":0.24623796755706037}]