{"text_format":"1","workbook":"xlsx","n_sheets":6,"sheets":["Lookups","Guide to tool","Output","Data_lookup","All_data","Baseline"],"not_rendered":{"charts":1,"images":1,"macros":1,"external_links":0,"defined_names":4,"comments":0,"pivot_tables":0},"unopened":[],"bounds":{"document_bytes":16777216,"sheet_cells":100000,"rows_first":2000,"rows_last":500,"rows_between":2000,"halvings":0,"cell_chars":16384,"cell_head_chars":4096},"cells_cut":0,"cells_raw":0,"read":"whole","date_system":"1900"}

{"sheet":"Lookups","index":0,"n_rows":214,"n_cols":11,"rows_kept":214,"cut":false,"hidden":true,"merged":[]}
[]
[]
[]
[1,"ENG",{"$f":"VLOOKUP(B4,$B$5:$C215,2,0)","v":"England"},{"$f":"VLOOKUP(B4,B5:D214,3,FALSE)","v":"ENG"}]
[{"$f":"A4+1","v":2},"02N","NHS Airedale, Wharfdale and Craven CCG","E38000001","NHS Airedale, Wharfdale and Craven CCG",null,1,"the current level of obesity increases by 1% every 5 years",33,"Obesity levels increase by 1% every 5 years","obesity levels were to rise by 1% every 5 years"]
[{"$f":"A5+1","v":3},"09C","NHS Ashford CCG","E38000002","NHS Ashford CCG",null,{"$f":"G5+1","v":2},"the current level of obesity increases by 2% every 5 years",23,"Obesity levels increase by 2% every 5 years","obesity levels were to rise by 2% every 5 years"]
[4,"10Y","NHS Aylesbury Vale CCG","E38000003","NHS Aylesbury Vale CCG",null,{"$f":"G6+1","v":3},"the current level of obesity increases by 3% every 5 years",13,"Obesity levels increase by 3% every 5 years","obesity levels were to rise by 3% every 5 years"]
[5,"07L","NHS Barking and Dagenham CCG","E38000004","NHS Barking and Dagenham CCG",null,4,"the current level of obesity increases by 5% every 5 years",3,"Obesity levels increase by 5% every 5 years","obesity levels were to rise by 5% every 5 years"]
[6,"07M","NHS Barnet CCG","E38000005","NHS Barnet CCG",null,5,"the current level of obesity decreases by 1% every 5 years",73,"Obesity levels decrease by 1% every 5 years","obesity levels were to decline by 1% every 5 years"]
[7,"02P","NHS Barnsley CCG","E38000006","NHS Barnsley CCG",null,6,"the current level of obesity decreases by 2% every 5 years",63,"Obesity levels decrease by 2% every 5 years","obesity levels were to decline by 2% every 5 years"]
{"$rows_left_out":205}
{"sheet":"Guide to tool","index":1,"n_rows":19,"n_cols":15,"rows_kept":19,"cut":false,"hidden":false,"merged":[[6,1,6,16],[7,1,7,15],[10,1,10,16],[11,1,11,16],[12,1,13,16]]}
[null,null,null,null,null,null,null,null,null,null,null,null,null,null,"National Cardiovascular Intelligence Network"]
[]
[]
[]
[null,"Estimating the impact of obesity on diabetes prevalence"]
[]
[null,"The diabetes prevalence model estimates the number of people aged 16 years and over who have diabetes (diagnosed and undiagnosed).  The prevalence model adjusts for the age, sex, ethnic group and deprivation pattern of the local population.  Office for National Statistics population projections produced in 2014 were used as a basis to produce the population estimates.  Full details of the model methodology can be found on the National Cardiovascular (NCVIN) website: www.ncvin.org.uk"]
[null,"These estimates have assumed no change in the proportion of people who are overweight or obese in future years.  However, this is subject to uncertainty.  Different scenarios have been created assuming different levels of obesity in future years and the impact on diabetes prevalence. "]
[]
[null,"Methodology"]
{"$rows_left_out":10}
{"sheet":"Output","index":2,"n_rows":35,"n_cols":15,"rows_kept":35,"cut":false,"hidden":false,"merged":[[10,1,10,14],[11,1,11,14],[15,1,21,6],[25,4,25,5],[25,2,25,3],[22,1,23,6]]}
[null,null,null,null,null,null,null,null,null,null,null,null,null,null,"National Cardiovascular Intelligence Network"]
[]
[]
[]
[null,"Estimating the impact of obesity on diabetes prevalence"]
[null,{"$f":"Data_lookup!C1","v":"England"}]
[]
[null,null,"CCG:",null,null,null,null,null,null,null,"Scenario:"]
[]
[]
{"$rows_left_out":26}
{"sheet":"Data_lookup","index":3,"n_rows":30,"n_cols":20,"rows_kept":30,"cut":false,"hidden":true,"merged":[]}
["CCG:",1,{"$f":"VLOOKUP(B1,Lookups!A4:C214,3,FALSE)","v":"England"},{"$f":"IF(C1=\"ENGLAND\",\"England\",A3)","v":"England"}]
["Scenario",3,{"$f":"VLOOKUP(B2,Lookups!G5:I12,3,FALSE)","v":13},{"$f":"VLOOKUP(B2,Lookups!G5:J12,4,FALSE)","v":"Obesity levels increase by 3% every 5 years"},{"$f":"VLOOKUP(B2,Lookups!G5:K12,5,FALSE)","v":"obesity levels were to rise by 3% every 5 years"}]
[{"$f":"Output!B6","v":"England"},null,null,null,null,null,null,null,null,null,"Obesity levels maintained",{"$f":"D2","v":"Obesity levels increase by 3% every 5 years"}]
[null,null,null,null,null,null,null,null,{"$f":"C2+1","v":14},2015,{"$f":"D7","v":8.5811804349166021E-2},{"$f":"VLOOKUP($C$1,All_data!$A$4:$CD$214,$I4,FALSE)","v":8.5811804349166021E-2},{"$f":"L4-K4","v":0},null,null,{"$f":"SUM(L4-K4)/K4","v":0},null,{"$f":"ROUND(L4*100,1)","v":8.6}]
[null,null,null,null,null,null,null,null,{"$f":"I4+2","v":16},2020,{"$f":"D8","v":8.897294392161384E-2},{"$f":"VLOOKUP($C$1,All_data!$A$4:$CD$214,$I5,FALSE)","v":9.0107752681303152E-2},{"$f":"L5-K5","v":1.1348087596893125E-3},null,null,{"$f":"SUM(L5-K5)/K5","v":1.2754537611895721E-2},null,{"$f":"ROUND(L5*100,1)","v":9}]
[null,null,null,{"$f":"C1","v":"England"},null,null,null,null,{"$f":"I5+2","v":18},2025,{"$f":"D9","v":9.2325885939244151E-2},{"$f":"VLOOKUP($C$1,All_data!$A$4:$CD$214,$I6,FALSE)","v":9.4715391648865166E-2},2.3895057096210148E-3,null,null,{"$f":"SUM(L6-K6)/K6","v":2.5881210727763282E-2},null,9.5]
[null,null,2015,{"$f":"VLOOKUP($D$6,Baseline!$B$2:$L$211,3,FALSE)","v":8.5811804349166021E-2},{"$f":"ROUND(D7*100,1)","v":8.6},{"$f":"VLOOKUP($D$6,Baseline!$B$2:$L$211,2,FALSE)","v":3807042.4161868379},{"$f":"MROUND(F7,50)","v":3807050},null,20,2030,{"$f":"D10","v":9.4937403097907255E-2},{"$f":"VLOOKUP($C$1,All_data!$A$4:$CD$214,$I7,FALSE)","v":9.8677877816734857E-2},3.7404747188276022E-3,null,null,{"$f":"SUM(L7-K7)/K7","v":3.9399378925186287E-2},null,9.9]
[null,null,2020,{"$f":"VLOOKUP($D$6,Baseline!$B$2:$L$211,5,FALSE)","v":8.897294392161384E-2},{"$f":"ROUND(D8*100,1)","v":8.9},{"$f":"VLOOKUP($D$6,Baseline!$B$2:$L$211,4,FALSE)","v":4085166.0282777227},{"$f":"MROUND(F8,50)","v":4085150},null,22,2035,{"$f":"D11","v":9.7185299901400596E-2},{"$f":"VLOOKUP($C$1,All_data!$A$4:$CD$214,$I8,FALSE)","v":0.10236722927152783},5.1819293701272362E-3,{"$f":"IF(M8<0,\"fewer\",\"additional\")","v":"additional"},{"$f":"ROUND(L8*100,1)","v":10.199999999999999},{"$f":"SUM(L8-K8)/K8","v":5.3320094452397285E-2},null,10.199999999999999]
[null,null,2025,{"$f":"VLOOKUP($D$6,Baseline!$B$2:$L$211,7,FALSE)","v":9.2325885939244151E-2},{"$f":"ROUND(D9*100,1)","v":9.1999999999999993},{"$f":"VLOOKUP($D$6,Baseline!$B$2:$L$211,6,FALSE)","v":4389883.5268733986},{"$f":"MROUND(F9,50)","v":4389900},null,null,null,null,null,null,null,null,null,null,{"$f":"SUM(K8-K4)/K4","v":0.13253998839082926},{"$f":"SUM(L8-L4)/L4","v":0.19292712754294519},{"$f":"S9-R9","v":6.0387139152115937E-2}]
[null,null,2030,{"$f":"VLOOKUP($D$6,Baseline!$B$2:$L$211,9,FALSE)","v":9.4937403097907255E-2},{"$f":"ROUND(D10*100,1)","v":9.5},{"$f":"VLOOKUP($D$6,Baseline!$B$2:$L$211,8,FALSE)","v":4675175.3268238856},{"$f":"MROUND(F10,50)","v":4675200},null,{"$f":"C2","v":13},2015,{"$f":"F7","v":3807042.4161868379},{"$f":"VLOOKUP($C$1,All_data!$A$4:$CD$214,$I10,FALSE)","v":3807042.4161868379},{"$f":"L10-K10","v":0},null,null,{"$f":"MROUND(L10,50)","v":3807050}]
{"$rows_left_out":21}
{"sheet":"All_data","index":4,"n_rows":214,"n_cols":82,"rows_kept":214,"cut":false,"hidden":true,"merged":[]}
[null,null,"+5%","+5%","+5%","+5%","+5%","+5%","+5%","+5%","+5%","+5%","+3%","+3%","+3%","+3%","+3%","+3%","+3%","+3%","+3%","+3%","+2%","+2%","+2%","+2%","+2%","+2%","+2%","+2%","+2%","+2%","+1%","+1%","+1%","+1%","+1%","+1%","+1%","+1%","+1%","+1%","-5%","-5%","-5%","-5%","-5%","-5%","-5%","-5%","-5%","-5%","-3%","-3%","-3%","-3%","-3%","-3%","-3%","-3%","-3%","-3%","-2%","-2%","-2%","-2%","-2%","-2%","-2%","-2%","-2%","-2%","-1%","-1%","-1%","-1%","-1%","-1%","-1%","-1%","-1%","-1%"]
[null,null,2015,2015,2020,2020,2025,2025,2030,2030,2035,2035,2015,2015,2020,2020,2025,2025,2030,2030,2035,2035,2015,2015,2020,2020,2025,2025,2030,2030,2035,2035,2015,2015,2020,2020,2025,2025,2030,2030,2035,2035,2015,2015,2020,2020,2025,2025,2030,2030,2035,2035,2015,2015,2020,2020,2025,2025,2030,2030,2035,2035,2015,2015,2020,2020,2025,2025,2030,2030,2035,2035,2015,2015,2020,2020,2025,2025,2030,2030,2035,2035]
["2015 residence population",null,"Number","Prevalence","Number","Prevalence","Number","Prevalence","Number","Prevalence","Number","Prevalence","Number","Prevalence","Number","Prevalence","Number","Prevalence","Number","Prevalence","Number","Prevalence","Number","Prevalence","Number","Prevalence","Number","Prevalence","Number","Prevalence","Number","Prevalence","Number","Prevalence","Number","Prevalence","Number","Prevalence","Number","Prevalence","Number","Prevalence","Number","Prevalence","Number","Prevalence","Number","Prevalence","Number","Prevalence","Number","Prevalence","Number","Prevalence","Number","Prevalence","Number","Prevalence","Number","Prevalence","Number","Prevalence","Number","Prevalence","Number","Prevalence","Number","Prevalence","Number","Prevalence","Number","Prevalence","Number","Prevalence","Number","Prevalence","Number","Prevalence","Number","Prevalence","Number","Prevalence"]
["England","ENG",3807042.4161868379,8.5811804349166021E-2,4172006.7012085691,9.0864291854429388E-2,4581108.3021526784,9.6347632002235215E-2,4988291.9815613069,0.10129577042948489,5388020.700130336,0.10608298737306879,3807042.4161868379,8.5811804349166021E-2,4137270.4320362299,9.0107752681303152E-2,4503499.0275027454,9.4715391648865166E-2,4859374.331067102,9.8677877816734857E-2,5199295.0423830478,0.10236722927152783,3807042.4161868379,8.5811804349166021E-2,4119902.297450061,8.9729483094740048E-2,4465254.0724468902,9.3911042436266967E-2,4796762.9189137705,9.7406446381848283E-2,5108962.816213062,0.10058870744663211,3807042.4161868379,8.5811804349166021E-2,4102534.162863892,8.9351213508176944E-2,4427382.2389037749,9.3114540533059967E-2,4735367.2237640824,9.6159702152715382E-2,5021248.7087773159,9.8861732910078964E-2,3807042.4161868379,8.5811804349166021E-2,3998325.3553468771,8.7081595988798291E-2,4207986.7894126205,8.8500322611033161E-2,4391855.6574698817,8.9184114338723974E-2,4547119.128300488,8.952674978766724E-2,3807042.4161868379,8.5811804349166021E-2,4033061.6245192154,8.7838135161924513E-2,4279626.119858711,9.0007006014143937E-2,4501703.2373187002,9.1414756665141622E-2,4695559.3516631518,9.2449341072488408E-2,3807042.4161868379,8.5811804349166021E-2,4050429.7591053853,8.8216404748487631E-2,4316005.4673508666,9.0772118679786143E-2,4558355.2523953468,9.2565172385549302E-2,4773306.7833118849,9.3980084970647818E-2,3807042.4161868379,8.5811804349166021E-2,4067797.8936915523,8.8594674335050694E-2,4352757.9363557631,9.1545078654819562E-2,4616175.3092990238,9.3739307185994852E-2,4853471.0206003515,9.5558412569099388E-2]
[]
["NHS Airedale, Wharfdale and Craven CCG","E38000001",12033.475277344636,9.3398597309411968E-2,13023.597568561494,9.8708485437028148E-2,14255.308316968363,0.1046184376703975,15570.772354794663,0.11107698926233887,16734.203543801661,0.11658216207190791,12033.475277344636,9.3398597309411968E-2,12914.933842041817,9.7884901031088503E-2,14013.467418550139,0.10284358886357067,15167.795549033794,0.1082022795622328,16147.112383258864,0.11249207456638473,12033.475277344636,9.3398597309411968E-2,12860.601978781982,9.7473108828118701E-2,13894.29101428154,0.10196896385059108,14972.081876181363,0.10680611981867144,15866.105274158914,0.11053438257042576,12033.475277344636,9.3398597309411968E-2,12806.270115522144,9.7061316625148886E-2,13776.277306639957,0.10110287176456742,14780.168348250594,0.10543706911293048,15593.242655768236,0.10863343079119574,12033.475277344636,9.3398597309411968E-2,12480.278935963122,9.4590563407330019E-2,13092.611689957677,9.608551071449932E-2,13706.403869946109,9.7777171279398695E-2,14118.311854241803,9.8358031588698644E-2,12033.475277344636,9.3398597309411968E-2,12588.942662482797,9.5414147813269651E-2,13315.84944234373,9.7723832690031778E-2,14049.770559288841,0.10022664117055816,14580.082363061085,0.10157504781288201,12033.475277344636,9.3398597309411968E-2,12643.274525742634,9.5825940016239453E-2,13429.212363477269,9.8555793068231826E-2,14226.856070760599,0.10148991347382365,14821.940467680843,0.10326000047151207,12033.475277344636,9.3398597309411968E-2,12697.606389002472,9.6237732219209282E-2,13543.73798123782,9.9396286373387793E-2,14407.59270186297,0.10277923171538715,15071.31681462533,0.1049973304627653]
["NHS Ashford CCG","E38000002",8276.5848729807567,8.3366084538484653E-2,9395.0958593893574,8.9205239834688158E-2,10603.103007911161,9.5231749666886648E-2,11765.863065844391,0.10066617955034558,12935.531091742852,0.10589007115048178,8276.5848729807567,8.3366084538484653E-2,9316.8967842827387,8.8462749565920415E-2,10423.47058754209,9.3618381422149163E-2,11461.844287532032,9.8065060639391119E-2,12482.573940253835,0.10218217043429793,8276.5848729807567,8.3366084538484653E-2,9277.797246729433,8.8091504431536585E-2,10334.94980346599,9.282333216693002E-2,11314.191542091077,9.6801775685241953E-2,12265.769143587511,0.10040740949236668,8276.5848729807567,8.3366084538484653E-2,9238.6977091761255,8.7720259297152728E-2,10247.292636795506,9.2036039489810539E-2,11169.405749288524,9.5563019757773149E-2,12055.248047920175,9.8684086836281729E-2,8276.5848729807567,8.3366084538484653E-2,9004.1004838562822,8.5492788490849625E-2,9739.4856022906479,8.7475171567187412E-2,10359.322984666464,8.8632126836639846E-2,10917.297931476329,8.9368843577900536E-2,8276.5848729807567,8.3366084538484653E-2,9082.299558962899,8.6235278759617354E-2,9905.300144169787,8.8964434562329678E-2,10618.369956886201,9.0848476701627337E-2,11273.566716247391,9.2285254717152848E-2,8276.5848729807567,8.3366084538484653E-2,9121.3990965162047,8.6606523894001183E-2,9989.5028412177853,8.9720700927050326E-2,10751.969012923211,9.1991521328911807E-2,11460.166967615191,9.3812761686437388E-2,8276.5848729807567,8.3366084538484653E-2,9160.4986340695104,8.6977769028385027E-2,10074.569155671403,9.0484723869870679E-2,10888.322592083401,9.3158133060261827E-2,11652.567751943605,9.5387751734967302E-2]
["NHS Aylesbury Vale CCG","E38000003",12549.168950372712,7.6379604080174759E-2,14250.308562346947,8.1551496865897605E-2,16063.277636773135,8.7082715151106674E-2,17788.588501343933,9.1921189031334921E-2,19592.648848526409,9.6954913145914534E-2,12549.168950372712,7.6379604080174759E-2,14131.697988915768,8.0872713682704406E-2,15791.086171666939,8.5607102741336552E-2,17328.330809380161,8.9542842131976857E-2,18905.465080920581,9.3554360059979122E-2,12549.168950372712,7.6379604080174759E-2,14072.392702200181,8.053332209110782E-2,15656.953358333363,8.4879937972098918E-2,17104.797538817023,8.8387750820674987E-2,18576.549340174646,9.1926708928021808E-2,12549.168950372712,7.6379604080174759E-2,14013.087415484595,8.0193930499511248E-2,15524.129157812793,8.4159867493292836E-2,16885.604582400429,8.7255087755272992E-2,18257.166636522394,9.0346232366005516E-2,12549.168950372712,7.6379604080174759E-2,13657.25569519107,7.8157580949931721E-2,14754.66482376259,7.9988424719519641E-2,15659.210523407433,8.0917788979988803E-2,16530.776301819118,8.1803128967830152E-2,12549.168950372712,7.6379604080174759E-2,13775.866268622241,7.8836364133124878E-2,15005.918483860618,8.135052848238436E-2,16051.384856209876,8.2944320257388779E-2,17071.273620372358,8.4477798992341438E-2,12549.168950372712,7.6379604080174759E-2,13835.171555337833,7.9175755724721492E-2,15133.508233129143,8.2042221799464091E-2,16253.642077035085,8.3989469186828675E-2,17354.365880533362,8.5878691016099379E-2,12549.168950372712,7.6379604080174759E-2,13894.476842053422,7.9515147316318077E-2,15262.406595210687,8.274100940697543E-2,16460.069403608933,8.5056166823113552E-2,17646.258160919009,8.7323130249995093E-2]
["NHS Barking and Dagenham CCG","E38000004",13631.498948757688,9.2179462731658696E-2,15250.018165662868,9.4603090357710098E-2,17231.832001211998,9.8366434531407684E-2,19437.7753469079,0.10321673400014815,21812.491152307895,0.10873624702047804,13631.498948757688,9.2179462731658696E-2,15122.765316625864,9.3813680624229928E-2,16939.354890047864,9.6696854036122062E-2,18934.791415875803,0.10054583377164296,21047.66520912102,0.1049235553794667,13631.498948757688,9.2179462731658696E-2,15059.13889210737,9.3418975757489892E-2,16795.225544402074,9.5874104032435625E-2,18690.507300460831,9.9248658137536278E-2,20681.586579933559,0.10309863698870168,13631.498948757688,9.2179462731658696E-2,14995.512467588875,9.3024270890749841E-2,16652.502338713806,9.505938085805346E-2,18450.966415434952,9.7976669580686876E-2,20326.11808799077,0.10132661060812946,13631.498948757688,9.2179462731658696E-2,14613.753920477888,9.0656041690309483E-2,15825.692043692121,9.0339605227149913E-2,17110.724816962618,9.0859838662715686E-2,18404.669738521734,9.1748104379470258E-2,13631.498948757688,9.2179462731658696E-2,14741.006769514879,9.144545142378957E-2,16095.67091553594,9.1880756453567414E-2,17539.305134048096,9.3135647483263043E-2,19006.235711031113,9.4746937741929771E-2,13631.498948757688,9.2179462731658696E-2,14804.633194033377,9.1840156290529634E-2,16232.769561394125,9.2663372310732531E-2,17760.338120104749,9.43093570523829E-2,19321.313445828157,9.6317614385982839E-2,13631.498948757688,9.2179462731658696E-2,14868.259618551876,9.2234861157269699E-2,16371.274347209834,9.3454014997201934E-2,17985.928327515627,9.550726597024016E-2,19646.185480324431,9.7937116053461767E-2]
["NHS Barnet CCG","E38000005",25808.208036002019,8.5650497929118607E-2,29339.882462116377,9.058874417103982E-2,33321.370035771688,9.6516539322707942E-2,37710.37861129579,0.10280910199371808,42228.87950958898,0.10910163672192678,25808.208036002019,8.5650497929118607E-2,29094.882486710736,8.9832291239689804E-2,32755.900558492078,9.487863677005004E-2,36735.17321176493,0.10015041769837767,40750.234243793951,0.10528144019995336,25808.208036002019,8.5650497929118607E-2,28972.382499007919,8.9454064774014824E-2,32477.243724736505,9.4071497290975858E-2,36261.545380586569,9.8859174974336342E-2,40042.490950331281,0.1034529296500059,25808.208036002019,8.5650497929118607E-2,28849.88251130511,8.9075838308339844E-2,32201.305494237084,9.3272232343404829E-2,35797.113914542926,9.7593004129070141E-2,39355.260336055326,0.10167741522258907,25808.208036002019,8.5650497929118607E-2,28114.882585088209,8.6806479514289894E-2,30602.766779619724,8.8642007819545024E-2,33198.599801330289,9.0508723558697629E-2,35640.50597825514,9.2080054715690432E-2,25808.208036002019,8.5650497929118607E-2,28359.882560493828,8.7562932445639827E-2,31124.738604800907,9.0153917868152314E-2,34029.548492865579,9.2774123481094817E-2,36803.519190918931,9.5084790965015584E-2,25808.208036002019,8.5650497929118607E-2,28482.382548196652,8.7941158911314848E-2,31389.802422275727,9.0921684689710708E-2,34458.096102795324,9.3942464838591394E-2,37412.661970482353,9.6658559320214832E-2,25808.208036002019,8.5650497929118607E-2,28604.882535899473,8.8319385376989856E-2,31657.584843006687,9.169732604277224E-2,34895.479436089794,9.513489486393073E-2,38040.740162751179,9.8281248805743765E-2]
{"$rows_left_out":205}
{"sheet":"Baseline","index":5,"n_rows":214,"n_cols":14,"rows_kept":214,"cut":false,"hidden":true,"merged":[]}
["CCGCD","CCGname","Num_2015","Prev_2015","Num_2020","Prev_2020","Num_2025","Prev_2025","Num_2030","Prev_2030","Num_2035","Prev_2035","% Increase","% Increase"]
["E38000001","NHS Airedale, Wharfdale and Craven CCG",12033.475277344636,9.3398597309411968E-2,12751.938252262311,9.6649524422179098E-2,13659.426295625384,0.10024531260549967,14592.017708918718,0.10409486167012925,15328.365617559246,0.10678811214685277,{"$f":"SUM(K2-C2)/C2","v":0.27381037183978624},{"$f":"SUM(L2-D2)/D2","v":0.14335884288587183}]
["E38000002","NHS Ashford CCG",8276.5848729807567,8.3366084538484653E-2,9199.5981716228198,8.7349014162768898E-2,10160.499087530645,9.1256503390790764E-2,11027.458801745566,9.4348552376330996E-2,11850.888049362087,9.7011198832368112E-2,{"$f":"SUM(K3-C3)/C3","v":0.4318572492441643},{"$f":"SUM(L3-D3)/D3","v":0.16367704408121034}]
["E38000003","NHS Aylesbury Vale CCG",12549.168950372712,7.6379604080174759E-2,13953.782128769004,7.9854538907914635E-2,15392.613570105228,8.3446891304918308E-2,16670.709388030889,8.6144633051007072E-2,17947.130966933295,8.8812009931380123E-2,{"$f":"SUM(K4-C4)/C4","v":0.4301449791541983},0.16277127907281655]
["E38000004","NHS Barking and Dagenham CCG",13631.498948757688,9.2179462731658696E-2,14931.886043070373,9.2629566024009763E-2,16511.185272983061,9.4252684512975568E-2,18216.122258539457,9.672962116896483E-2,19981.052714515488,9.9606444239857872E-2,0.46580011410531413,8.0570891694386138E-2]
["E38000005","NHS Barnet CCG",25808.208036002019,8.5650497929118607E-2,28727.382523602286,8.8697611842664836E-2,31928.085866993806,9.2480841927336938E-2,35341.788653191499,9.6351659359845965E-2,38688.142169596424,9.9953862888431833E-2,0.49906348072005274,0.16699686872982566]
["E38000006","NHS Barnsley CCG",17198.332429825146,8.8205623293800106E-2,18503.524560124497,9.1938410812503701E-2,19866.116624639126,9.5445933624671492E-2,21124.300976908038,9.8252562683293188E-2,22278.683282272807,0.1006536698394904,0.29539787494963032,0.14112531696791775]
["E38000007","NHS Basildon and Brentwood CCG",17185.619213311416,8.2702691113144461E-2,18230.518249094792,8.480099660012462E-2,19587.987764954716,8.76341614394896E-2,20926.274464375379,8.9666100198711879E-2,22306.325986355005,9.1569482702606758E-2,0.29796463598339573,0.10721285450471928]
["E38000008","NHS Bassetlaw CCG",8439.1344652843709,8.9340826437480106E-2,9121.6278405647008,9.4878592059129394E-2,9673.8577363566819,9.9198705253862623E-2,10211.670099282759,0.10273309959036982,10664.709837829601,0.10536168581139699,0.26372080948590926,0.17932293681129235]
["E38000009","NHS Bath and North East Somerset CCG",11199.8787201417,7.3557590438340342E-2,11810.004752464059,7.6144453594223449E-2,12564.321965467438,7.9120415399669006E-2,13238.153157287863,8.0533843273438752E-2,13835.803820250296,8.2082367229771566E-2,0.23535300390067496,0.11589255086566652]
{"$rows_left_out":204}