{"text_format":"1","workbook":"xlsx","n_sheets":13,"sheets":["Cover","Index","Subject time series","Descriptions","2010","2011","2012","2013","2014","2015","2016","2017","Subject grouping composition"],"not_rendered":{"charts":0,"images":4,"macros":1,"external_links":0,"defined_names":19,"comments":0,"pivot_tables":0},"unopened":[],"bounds":{"document_bytes":16777216,"sheet_cells":100000,"rows_first":2000,"rows_last":500,"rows_between":2000,"halvings":0,"cell_chars":16384,"cell_head_chars":4096},"cells_cut":0,"cells_raw":0,"read":"whole","date_system":"1900"}

{"sheet":"Cover","index":0,"n_rows":20,"n_cols":10,"rows_kept":20,"cut":false,"hidden":false,"merged":[]}
[]
[]
[]
[]
[]
[]
[]
[]
[null,"SFR57/2017: GCSE and equivalent results in England 2016/17 (Provisional)"]
[]
[null,"Subject time series table"]
[]
[null,"Producer: Kathryn Kenney"]
[null,"Education Data Division, Department for Education, Bishopsgate House, Feethams, Darlington, DL1 5QE"]
[null,"Published: 12th October 2017"]
[null,"Crown copyright © 2017"]
[]
[null,"Index"]
[]
[null,"This table forms part of SFR57/2017. The text of the release and additional tables can be found at:",null,null,null,null,null,null,null,"https://www.gov.uk/government/collections/statistics-gcses-key-stage-4"]

{"sheet":"Index","index":1,"n_rows":11,"n_cols":4,"rows_kept":11,"cut":false,"hidden":false,"merged":[]}
["SFR57/2017: GCSE and equivalent results in England 2016/17 (PROVISIONAL)"]
[]
["Subject time series table"]
[]
["Index of tables"]
[null,"Source: key stage 4 attainment data"]
[null,"Coverage: England"]
[]
[null,"Table title","School types covered","Period"]
[null,"Subject time series","All schools","2009/10 to 2016/17"]
[null,"Subject grouping composition table","N/A","N/A"]

{"sheet":"Subject time series","index":2,"n_rows":40,"n_cols":19,"rows_kept":40,"cut":false,"hidden":false,"merged":[[1,4,1,16],[2,4,2,7],[5,4,6,4],[5,5,5,16],[6,5,6,15],[6,16,7,16],[30,4,30,16],[18,4,19,4],[18,5,18,18],[19,5,19,17],[19,18,20,18],[23,4,23,16],[24,4,24,16],[25,4,25,16],[26,4,26,16],[27,4,27,16],[28,4,28,16],[29,4,29,16],[39,4,39,14],[40,4,40,16],[31,4,31,16],[32,4,32,16],[35,4,35,16],[36,4,36,16],[37,4,37,16],[38,4,38,16]]}
[]
[null,null,null,null,"Time series of GCSE results1 of pupils at the end of key stage 4 in schools, by subject2, grade and gender"]
[null,null,null,null,"Years: 2009/10 - 2016/173"]
[null,null,null,null,"Coverage: England"]
[null,null,null,null,"English","Boys",{"$f":"IF(Sex=\"Boys\",3,IF(Sex=\"Girls\",16,29))","v":3},{"$f":"IF(Sex=\"Boys\",3,IF(Sex=\"Girls\",8,13))","v":3}]
[null,null,null,null,{"$f":"IF(Group=\"English\",\"English (8)\",IF(Group=\"Mathematics\",\"Mathematics (8)\",Group))","v":"English (8)"},{"$f":"Sex","v":"Boys"}]
[null,null,null,null,null,"Percentage achieving grade(s)4",null,null,null,null,null,null,null,null,null,null,"Total \nentries9"]
[null,null,null,null,"Year","A*","A","B","C","D","E","F","G",{"$f":"IF($E$6=\"All subjects\",\"A*-A/9-7\",\"A*-A\")","v":"A*-A"},{"$f":"IF($E$6=\"All subjects\",\"A*-C/9-4\",\"A*-C\")","v":"A*-C"},{"$f":"IF($E$6=\"All subjects\",\"A*-G/9-1\",\"A*-G\")","v":"A*-G"}]
[null,null,null,null,"2009/20101",{"$f":"IF(ISERROR(VLOOKUP(Group,GCSE2010,$G$5+Descriptions!F$1,FALSE)),\"-\",VLOOKUP(Group,GCSE2010,$G$5+Descriptions!F$1,FALSE))","v":3.6},{"$f":"IF(ISERROR(VLOOKUP(Group,GCSE2010,$G$5+Descriptions!G$1,FALSE)),\"-\",VLOOKUP(Group,GCSE2010,$G$5+Descriptions!G$1,FALSE))","v":10.199999999999999},{"$f":"IF(ISERROR(VLOOKUP(Group,GCSE2010,$G$5+Descriptions!H$1,FALSE)),\"-\",VLOOKUP(Group,GCSE2010,$G$5+Descriptions!H$1,FALSE))","v":19.600000000000001},{"$f":"IF(ISERROR(VLOOKUP(Group,GCSE2010,$G$5+Descriptions!I$1,FALSE)),\"-\",VLOOKUP(Group,GCSE2010,$G$5+Descriptions!I$1,FALSE))","v":29.9},{"$f":"IF(ISERROR(VLOOKUP(Group,GCSE2010,$G$5+Descriptions!J$1,FALSE)),\"-\",VLOOKUP(Group,GCSE2010,$G$5+Descriptions!J$1,FALSE))","v":18.600000000000001},{"$f":"IF(ISERROR(VLOOKUP(Group,GCSE2010,$G$5+Descriptions!K$1,FALSE)),\"-\",VLOOKUP(Group,GCSE2010,$G$5+Descriptions!K$1,FALSE))","v":10.1},{"$f":"IF(ISERROR(VLOOKUP(Group,GCSE2010,$G$5+Descriptions!L$1,FALSE)),\"-\",VLOOKUP(Group,GCSE2010,$G$5+Descriptions!L$1,FALSE))","v":4.9000000000000004},{"$f":"IF(ISERROR(VLOOKUP(Group,GCSE2010,$G$5+Descriptions!M$1,FALSE)),\"-\",VLOOKUP(Group,GCSE2010,$G$5+Descriptions!M$1,FALSE))","v":1.9},{"$f":"IF(ISERROR(VLOOKUP(Group,GCSE2010,$G$5+Descriptions!N$1,FALSE)),\"-\",VLOOKUP(Group,GCSE2010,$G$5+Descriptions!N$1,FALSE))","v":13.7},{"$f":"IF(ISERROR(VLOOKUP(Group,GCSE2010,$G$5+Descriptions!O$1,FALSE)),\"-\",VLOOKUP(Group,GCSE2010,$G$5+Descriptions!O$1,FALSE))","v":63.1},{"$f":"IF(ISERROR(VLOOKUP(Group,GCSE2010,$G$5+Descriptions!P$1,FALSE)),\"-\",VLOOKUP(Group,GCSE2010,$G$5+Descriptions!P$1,FALSE))","v":98.7},{"$f":"IF(ISERROR(VLOOKUP(Group,GCSE2010,$G$5+Descriptions!Q$1,FALSE)),\"-\",VLOOKUP(Group,GCSE2010,$G$5+Descriptions!Q$1,FALSE))","v":301727}]
[null,null,null,null,"2010/2011",{"$f":"IF(ISERROR(VLOOKUP(Group,GCSE2011,$G$5+Descriptions!F$1,FALSE)),\"-\",VLOOKUP(Group,GCSE2011,$G$5+Descriptions!F$1,FALSE))","v":3.8},{"$f":"IF(ISERROR(VLOOKUP(Group,GCSE2011,$G$5+Descriptions!G$1,FALSE)),\"-\",VLOOKUP(Group,GCSE2011,$G$5+Descriptions!G$1,FALSE))","v":10.7},{"$f":"IF(ISERROR(VLOOKUP(Group,GCSE2011,$G$5+Descriptions!H$1,FALSE)),\"-\",VLOOKUP(Group,GCSE2011,$G$5+Descriptions!H$1,FALSE))","v":19.899999999999999},{"$f":"IF(ISERROR(VLOOKUP(Group,GCSE2011,$G$5+Descriptions!I$1,FALSE)),\"-\",VLOOKUP(Group,GCSE2011,$G$5+Descriptions!I$1,FALSE))","v":31.4},{"$f":"IF(ISERROR(VLOOKUP(Group,GCSE2011,$G$5+Descriptions!J$1,FALSE)),\"-\",VLOOKUP(Group,GCSE2011,$G$5+Descriptions!J$1,FALSE))","v":17.899999999999999},{"$f":"IF(ISERROR(VLOOKUP(Group,GCSE2011,$G$5+Descriptions!K$1,FALSE)),\"-\",VLOOKUP(Group,GCSE2011,$G$5+Descriptions!K$1,FALSE))","v":9.1999999999999993},{"$f":"IF(ISERROR(VLOOKUP(Group,GCSE2011,$G$5+Descriptions!L$1,FALSE)),\"-\",VLOOKUP(Group,GCSE2011,$G$5+Descriptions!L$1,FALSE))","v":4.2},{"$f":"IF(ISERROR(VLOOKUP(Group,GCSE2011,$G$5+Descriptions!M$1,FALSE)),\"-\",VLOOKUP(Group,GCSE2011,$G$5+Descriptions!M$1,FALSE))","v":1.6},{"$f":"IF(ISERROR(VLOOKUP(Group,GCSE2011,$G$5+Descriptions!N$1,FALSE)),\"-\",VLOOKUP(Group,GCSE2011,$G$5+Descriptions!N$1,FALSE))","v":14.5},{"$f":"IF(ISERROR(VLOOKUP(Group,GCSE2011,$G$5+Descriptions!O$1,FALSE)),\"-\",VLOOKUP(Group,GCSE2011,$G$5+Descriptions!O$1,FALSE))","v":65.8},{"$f":"IF(ISERROR(VLOOKUP(Group,GCSE2011,$G$5+Descriptions!P$1,FALSE)),\"-\",VLOOKUP(Group,GCSE2011,$G$5+Descriptions!P$1,FALSE))","v":98.9},{"$f":"IF(ISERROR(VLOOKUP(Group,GCSE2011,$G$5+Descriptions!Q$1,FALSE)),\"-\",VLOOKUP(Group,GCSE2011,$G$5+Descriptions!Q$1,FALSE))","v":296070}]
[null,null,null,null,"2011/2012",{"$f":"IF(ISERROR(VLOOKUP(Group,GCSE2012,$G$5+Descriptions!F$1,FALSE)),\"-\",VLOOKUP(Group,GCSE2012,$G$5+Descriptions!F$1,FALSE))","v":2.5},{"$f":"IF(ISERROR(VLOOKUP(Group,GCSE2012,$G$5+Descriptions!G$1,FALSE)),\"-\",VLOOKUP(Group,GCSE2012,$G$5+Descriptions!G$1,FALSE))","v":9.4},{"$f":"IF(ISERROR(VLOOKUP(Group,GCSE2012,$G$5+Descriptions!H$1,FALSE)),\"-\",VLOOKUP(Group,GCSE2012,$G$5+Descriptions!H$1,FALSE))","v":18.899999999999999},{"$f":"IF(ISERROR(VLOOKUP(Group,GCSE2012,$G$5+Descriptions!I$1,FALSE)),\"-\",VLOOKUP(Group,GCSE2012,$G$5+Descriptions!I$1,FALSE))","v":31.5},{"$f":"IF(ISERROR(VLOOKUP(Group,GCSE2012,$G$5+Descriptions!J$1,FALSE)),\"-\",VLOOKUP(Group,GCSE2012,$G$5+Descriptions!J$1,FALSE))","v":20.3},{"$f":"IF(ISERROR(VLOOKUP(Group,GCSE2012,$G$5+Descriptions!K$1,FALSE)),\"-\",VLOOKUP(Group,GCSE2012,$G$5+Descriptions!K$1,FALSE))","v":10.4},{"$f":"IF(ISERROR(VLOOKUP(Group,GCSE2012,$G$5+Descriptions!L$1,FALSE)),\"-\",VLOOKUP(Group,GCSE2012,$G$5+Descriptions!L$1,FALSE))","v":4.7},{"$f":"IF(ISERROR(VLOOKUP(Group,GCSE2012,$G$5+Descriptions!M$1,FALSE)),\"-\",VLOOKUP(Group,GCSE2012,$G$5+Descriptions!M$1,FALSE))","v":1.5},{"$f":"IF(ISERROR(VLOOKUP(Group,GCSE2012,$G$5+Descriptions!N$1,FALSE)),\"-\",VLOOKUP(Group,GCSE2012,$G$5+Descriptions!N$1,FALSE))","v":11.9},{"$f":"IF(ISERROR(VLOOKUP(Group,GCSE2012,$G$5+Descriptions!O$1,FALSE)),\"-\",VLOOKUP(Group,GCSE2012,$G$5+Descriptions!O$1,FALSE))","v":62.2},{"$f":"IF(ISERROR(VLOOKUP(Group,GCSE2012,$G$5+Descriptions!P$1,FALSE)),\"-\",VLOOKUP(Group,GCSE2012,$G$5+Descriptions!P$1,FALSE))","v":99.2},{"$f":"IF(ISERROR(VLOOKUP(Group,GCSE2012,$G$5+Descriptions!Q$1,FALSE)),\"-\",VLOOKUP(Group,GCSE2012,$G$5+Descriptions!Q$1,FALSE))","v":286477}]
[null,null,null,null,"2012/2013",{"$f":"IF(ISERROR(VLOOKUP(Group,GCSE2013,$G$5+Descriptions!F$1,FALSE)),\"-\",VLOOKUP(Group,GCSE2013,$G$5+Descriptions!F$1,FALSE))","v":2.5},{"$f":"IF(ISERROR(VLOOKUP(Group,GCSE2013,$G$5+Descriptions!G$1,FALSE)),\"-\",VLOOKUP(Group,GCSE2013,$G$5+Descriptions!G$1,FALSE))","v":9.1999999999999993},{"$f":"IF(ISERROR(VLOOKUP(Group,GCSE2013,$G$5+Descriptions!H$1,FALSE)),\"-\",VLOOKUP(Group,GCSE2013,$G$5+Descriptions!H$1,FALSE))","v":19.7},{"$f":"IF(ISERROR(VLOOKUP(Group,GCSE2013,$G$5+Descriptions!I$1,FALSE)),\"-\",VLOOKUP(Group,GCSE2013,$G$5+Descriptions!I$1,FALSE))","v":32},{"$f":"IF(ISERROR(VLOOKUP(Group,GCSE2013,$G$5+Descriptions!J$1,FALSE)),\"-\",VLOOKUP(Group,GCSE2013,$G$5+Descriptions!J$1,FALSE))","v":19.600000000000001},{"$f":"IF(ISERROR(VLOOKUP(Group,GCSE2013,$G$5+Descriptions!K$1,FALSE)),\"-\",VLOOKUP(Group,GCSE2013,$G$5+Descriptions!K$1,FALSE))","v":10.199999999999999},{"$f":"IF(ISERROR(VLOOKUP(Group,GCSE2013,$G$5+Descriptions!L$1,FALSE)),\"-\",VLOOKUP(Group,GCSE2013,$G$5+Descriptions!L$1,FALSE))","v":4.5999999999999996},{"$f":"IF(ISERROR(VLOOKUP(Group,GCSE2013,$G$5+Descriptions!M$1,FALSE)),\"-\",VLOOKUP(Group,GCSE2013,$G$5+Descriptions!M$1,FALSE))","v":1.5},{"$f":"IF(ISERROR(VLOOKUP(Group,GCSE2013,$G$5+Descriptions!N$1,FALSE)),\"-\",VLOOKUP(Group,GCSE2013,$G$5+Descriptions!N$1,FALSE))","v":11.7},{"$f":"IF(ISERROR(VLOOKUP(Group,GCSE2013,$G$5+Descriptions!O$1,FALSE)),\"-\",VLOOKUP(Group,GCSE2013,$G$5+Descriptions!O$1,FALSE))","v":63.4},{"$f":"IF(ISERROR(VLOOKUP(Group,GCSE2013,$G$5+Descriptions!P$1,FALSE)),\"-\",VLOOKUP(Group,GCSE2013,$G$5+Descriptions!P$1,FALSE))","v":99.2},{"$f":"IF(ISERROR(VLOOKUP(Group,GCSE2013,$G$5+Descriptions!Q$1,FALSE)),\"-\",VLOOKUP(Group,GCSE2013,$G$5+Descriptions!Q$1,FALSE))","v":274738}]
[null,null,null,null,"2013/20143,5",{"$f":"IF(ISERROR(VLOOKUP(Group,GCSE2014,$G$5+Descriptions!F$1,FALSE)),\"-\",VLOOKUP(Group,GCSE2014,$G$5+Descriptions!F$1,FALSE))","v":2.7},{"$f":"IF(ISERROR(VLOOKUP(Group,GCSE2014,$G$5+Descriptions!G$1,FALSE)),\"-\",VLOOKUP(Group,GCSE2014,$G$5+Descriptions!G$1,FALSE))","v":9.5},{"$f":"IF(ISERROR(VLOOKUP(Group,GCSE2014,$G$5+Descriptions!H$1,FALSE)),\"-\",VLOOKUP(Group,GCSE2014,$G$5+Descriptions!H$1,FALSE))","v":21.1},{"$f":"IF(ISERROR(VLOOKUP(Group,GCSE2014,$G$5+Descriptions!I$1,FALSE)),\"-\",VLOOKUP(Group,GCSE2014,$G$5+Descriptions!I$1,FALSE))","v":31.5},{"$f":"IF(ISERROR(VLOOKUP(Group,GCSE2014,$G$5+Descriptions!J$1,FALSE)),\"-\",VLOOKUP(Group,GCSE2014,$G$5+Descriptions!J$1,FALSE))","v":19.7},{"$f":"IF(ISERROR(VLOOKUP(Group,GCSE2014,$G$5+Descriptions!K$1,FALSE)),\"-\",VLOOKUP(Group,GCSE2014,$G$5+Descriptions!K$1,FALSE))","v":9.1},{"$f":"IF(ISERROR(VLOOKUP(Group,GCSE2014,$G$5+Descriptions!L$1,FALSE)),\"-\",VLOOKUP(Group,GCSE2014,$G$5+Descriptions!L$1,FALSE))","v":3.8},{"$f":"IF(ISERROR(VLOOKUP(Group,GCSE2014,$G$5+Descriptions!M$1,FALSE)),\"-\",VLOOKUP(Group,GCSE2014,$G$5+Descriptions!M$1,FALSE))","v":1.5},{"$f":"IF(ISERROR(VLOOKUP(Group,GCSE2014,$G$5+Descriptions!N$1,FALSE)),\"-\",VLOOKUP(Group,GCSE2014,$G$5+Descriptions!N$1,FALSE))","v":12.1},{"$f":"IF(ISERROR(VLOOKUP(Group,GCSE2014,$G$5+Descriptions!O$1,FALSE)),\"-\",VLOOKUP(Group,GCSE2014,$G$5+Descriptions!O$1,FALSE))","v":64.7},{"$f":"IF(ISERROR(VLOOKUP(Group,GCSE2014,$G$5+Descriptions!P$1,FALSE)),\"-\",VLOOKUP(Group,GCSE2014,$G$5+Descriptions!P$1,FALSE))","v":98.8},{"$f":"IF(ISERROR(VLOOKUP(Group,GCSE2014,$G$5+Descriptions!Q$1,FALSE)),\"-\",VLOOKUP(Group,GCSE2014,$G$5+Descriptions!Q$1,FALSE))","v":229932}]
[null,null,null,null,"2014/20156",{"$f":"IF(ISERROR(VLOOKUP(Group,GCSE2015,$G$5+Descriptions!F$1,FALSE)),\"-\",VLOOKUP(Group,GCSE2015,$G$5+Descriptions!F$1,FALSE))","v":2.4},{"$f":"IF(ISERROR(VLOOKUP(Group,GCSE2015,$G$5+Descriptions!G$1,FALSE)),\"-\",VLOOKUP(Group,GCSE2015,$G$5+Descriptions!G$1,FALSE))","v":10.1},{"$f":"IF(ISERROR(VLOOKUP(Group,GCSE2015,$G$5+Descriptions!H$1,FALSE)),\"-\",VLOOKUP(Group,GCSE2015,$G$5+Descriptions!H$1,FALSE))","v":23.4},{"$f":"IF(ISERROR(VLOOKUP(Group,GCSE2015,$G$5+Descriptions!I$1,FALSE)),\"-\",VLOOKUP(Group,GCSE2015,$G$5+Descriptions!I$1,FALSE))","v":31.3},{"$f":"IF(ISERROR(VLOOKUP(Group,GCSE2015,$G$5+Descriptions!J$1,FALSE)),\"-\",VLOOKUP(Group,GCSE2015,$G$5+Descriptions!J$1,FALSE))","v":19.2},{"$f":"IF(ISERROR(VLOOKUP(Group,GCSE2015,$G$5+Descriptions!K$1,FALSE)),\"-\",VLOOKUP(Group,GCSE2015,$G$5+Descriptions!K$1,FALSE))","v":8},{"$f":"IF(ISERROR(VLOOKUP(Group,GCSE2015,$G$5+Descriptions!L$1,FALSE)),\"-\",VLOOKUP(Group,GCSE2015,$G$5+Descriptions!L$1,FALSE))","v":3.3},{"$f":"IF(ISERROR(VLOOKUP(Group,GCSE2015,$G$5+Descriptions!M$1,FALSE)),\"-\",VLOOKUP(Group,GCSE2015,$G$5+Descriptions!M$1,FALSE))","v":1.4},{"$f":"IF(ISERROR(VLOOKUP(Group,GCSE2015,$G$5+Descriptions!N$1,FALSE)),\"-\",VLOOKUP(Group,GCSE2015,$G$5+Descriptions!N$1,FALSE))","v":12.5},{"$f":"IF(ISERROR(VLOOKUP(Group,GCSE2015,$G$5+Descriptions!O$1,FALSE)),\"-\",VLOOKUP(Group,GCSE2015,$G$5+Descriptions!O$1,FALSE))","v":67.2},{"$f":"IF(ISERROR(VLOOKUP(Group,GCSE2015,$G$5+Descriptions!P$1,FALSE)),\"-\",VLOOKUP(Group,GCSE2015,$G$5+Descriptions!P$1,FALSE))","v":99.1},{"$f":"IF(ISERROR(VLOOKUP(Group,GCSE2015,$G$5+Descriptions!Q$1,FALSE)),\"-\",VLOOKUP(Group,GCSE2015,$G$5+Descriptions!Q$1,FALSE))","v":176842}]
[null,null,null,null,"2015/20166",{"$f":"IF(ISERROR(VLOOKUP(Group,GCSE2016,$G$5+Descriptions!F$1,FALSE)),\"-\",VLOOKUP(Group,GCSE2016,$G$5+Descriptions!F$1,FALSE))","v":2.8},{"$f":"IF(ISERROR(VLOOKUP(Group,GCSE2016,$G$5+Descriptions!G$1,FALSE)),\"-\",VLOOKUP(Group,GCSE2016,$G$5+Descriptions!G$1,FALSE))","v":9.6},{"$f":"IF(ISERROR(VLOOKUP(Group,GCSE2016,$G$5+Descriptions!H$1,FALSE)),\"-\",VLOOKUP(Group,GCSE2016,$G$5+Descriptions!H$1,FALSE))","v":21.9},{"$f":"IF(ISERROR(VLOOKUP(Group,GCSE2016,$G$5+Descriptions!I$1,FALSE)),\"-\",VLOOKUP(Group,GCSE2016,$G$5+Descriptions!I$1,FALSE))","v":30.8},{"$f":"IF(ISERROR(VLOOKUP(Group,GCSE2016,$G$5+Descriptions!J$1,FALSE)),\"-\",VLOOKUP(Group,GCSE2016,$G$5+Descriptions!J$1,FALSE))","v":20.2},{"$f":"IF(ISERROR(VLOOKUP(Group,GCSE2016,$G$5+Descriptions!K$1,FALSE)),\"-\",VLOOKUP(Group,GCSE2016,$G$5+Descriptions!K$1,FALSE))","v":8.6},{"$f":"IF(ISERROR(VLOOKUP(Group,GCSE2016,$G$5+Descriptions!L$1,FALSE)),\"-\",VLOOKUP(Group,GCSE2016,$G$5+Descriptions!L$1,FALSE))","v":3.7},{"$f":"IF(ISERROR(VLOOKUP(Group,GCSE2016,$G$5+Descriptions!M$1,FALSE)),\"-\",VLOOKUP(Group,GCSE2016,$G$5+Descriptions!M$1,FALSE))","v":1.5},{"$f":"IF(ISERROR(VLOOKUP(Group,GCSE2016,$G$5+Descriptions!N$1,FALSE)),\"-\",VLOOKUP(Group,GCSE2016,$G$5+Descriptions!N$1,FALSE))","v":12.4},{"$f":"IF(ISERROR(VLOOKUP(Group,GCSE2016,$G$5+Descriptions!O$1,FALSE)),\"-\",VLOOKUP(Group,GCSE2016,$G$5+Descriptions!O$1,FALSE))","v":65},{"$f":"IF(ISERROR(VLOOKUP(Group,GCSE2016,$G$5+Descriptions!P$1,FALSE)),\"-\",VLOOKUP(Group,GCSE2016,$G$5+Descriptions!P$1,FALSE))","v":99.1},{"$f":"IF(ISERROR(VLOOKUP(Group,GCSE2016,$G$5+Descriptions!Q$1,FALSE)),\"-\",VLOOKUP(Group,GCSE2016,$G$5+Descriptions!Q$1,FALSE))","v":164981}]
[null,null,null,null,"2016/20176,7",{"$f":"IF(ISERROR(VLOOKUP(Group,GCSE2017_AG,$G$5+Descriptions!F$1,FALSE)),\".\",VLOOKUP(Group,GCSE2017_AG,$G$5+Descriptions!F$1,FALSE))","v":"."},{"$f":"IF(ISERROR(VLOOKUP(Group,GCSE2017_AG,$G$5+Descriptions!G$1,FALSE)),\".\",VLOOKUP(Group,GCSE2017_AG,$G$5+Descriptions!G$1,FALSE))","v":"."},{"$f":"IF(ISERROR(VLOOKUP(Group,GCSE2017_AG,$G$5+Descriptions!H$1,FALSE)),\".\",VLOOKUP(Group,GCSE2017_AG,$G$5+Descriptions!H$1,FALSE))","v":"."},{"$f":"IF(ISERROR(VLOOKUP(Group,GCSE2017_AG,$G$5+Descriptions!I$1,FALSE)),\".\",VLOOKUP(Group,GCSE2017_AG,$G$5+Descriptions!I$1,FALSE))","v":"."},{"$f":"IF(ISERROR(VLOOKUP(Group,GCSE2017_AG,$G$5+Descriptions!J$1,FALSE)),\".\",VLOOKUP(Group,GCSE2017_AG,$G$5+Descriptions!J$1,FALSE))","v":"."},{"$f":"IF(ISERROR(VLOOKUP(Group,GCSE2017_AG,$G$5+Descriptions!K$1,FALSE)),\".\",VLOOKUP(Group,GCSE2017_AG,$G$5+Descriptions!K$1,FALSE))","v":"."},{"$f":"IF(ISERROR(VLOOKUP(Group,GCSE2017_AG,$G$5+Descriptions!L$1,FALSE)),\".\",VLOOKUP(Group,GCSE2017_AG,$G$5+Descriptions!L$1,FALSE))","v":"."},{"$f":"IF(ISERROR(VLOOKUP(Group,GCSE2017_AG,$G$5+Descriptions!M$1,FALSE)),\".\",VLOOKUP(Group,GCSE2017_AG,$G$5+Descriptions!M$1,FALSE))","v":"."},{"$f":"IF($E$6=\"All subjects\",IF(ISERROR(VLOOKUP(Group,Allsub2017,$H$5+Descriptions!F$1,FALSE)),\".\",VLOOKUP(Group,Allsub2017,$H$5+Descriptions!F$1,FALSE)),IF(ISERROR(VLOOKUP(Group,GCSE2017_AG,$G$5+Descriptions!N$1,FALSE)),\".\",VLOOKUP(Group,GCSE2017_AG,$G$5+Descriptions!N$1,FALSE)))","v":"."},{"$f":"IF($E$6=\"All subjects\",IF(ISERROR(VLOOKUP(Group,Allsub2017,$H$5+Descriptions!G$1,FALSE)),\".\",VLOOKUP(Group,Allsub2017,$H$5+Descriptions!G$1,FALSE)),IF(ISERROR(VLOOKUP(Group,GCSE2017_AG,$G$5+Descriptions!O$1,FALSE)),\".\",VLOOKUP(Group,GCSE2017_AG,$G$5+Descriptions!O$1,FALSE)))","v":"."},{"$f":"IF($E$6=\"All subjects\",IF(ISERROR(VLOOKUP(Group,Allsub2017,$H$5+Descriptions!H$1,FALSE)),\".\",VLOOKUP(Group,Allsub2017,$H$5+Descriptions!H$1,FALSE)),IF(ISERROR(VLOOKUP(Group,GCSE2017_AG,$G$5+Descriptions!P$1,FALSE)),\".\",VLOOKUP(Group,GCSE2017_AG,$G$5+Descriptions!P$1,FALSE)))","v":"."},{"$f":"IF($E$6=\"All subjects\",IF(ISERROR(VLOOKUP(Group,Allsub2017,$H$5+Descriptions!I$1,FALSE)),\".\",VLOOKUP(Group,Allsub2017,$H$5+Descriptions!I$1,FALSE)),IF(ISERROR(VLOOKUP(Group,GCSE2017_AG,$G$5+Descriptions!Q$1,FALSE)),\".\",VLOOKUP(Group,GCSE2017_AG,$G$5+Descriptions!Q$1,FALSE)))","v":"."}]
[null,null,null,null,null,null,null,null,null,null,null,null,null,null,null,null,"Source: key stage 4 attainment data"]
[null,null,null,null,{"$f":"IF(OR(Group=\"English Literature\",Group=\"English\",Group=\"Mathematics\"),1,0)","v":1},null,{"$f":"IF(Sex=\"Boys\",3,IF(Sex=\"Girls\",18,33))","v":3}]
[null,null,null,null,{"$f":"IF(Group=\"English\",\"English Language (8)\",IF(Group=\"Mathematics\",\"Mathematics (8)\",Group))","v":"English Language (8)"},{"$f":"Sex","v":"Boys"}]
[null,null,null,null,null,"Percentage achieving grade(s)(4)",null,null,null,null,null,null,null,null,null,null,null,null,"Total \nentries(9)"]
[null,null,null,null,"Year",9,8,7,6,5,4,3,2,1,"9 to 7","9 to 5","9 to 4","9 to 1"]
[null,null,null,null,"2016/2017(6)(7)",{"$f":"IF(ISERROR(VLOOKUP(Group,GCSE2017_91,$G$18+Descriptions!F$1,FALSE)),\"-\",VLOOKUP(Group,GCSE2017_91,$G$18+Descriptions!F$1,FALSE))","v":1.5},{"$f":"IF(ISERROR(VLOOKUP(Group,GCSE2017_91,$G$18+Descriptions!G$1,FALSE)),\"-\",VLOOKUP(Group,GCSE2017_91,$G$18+Descriptions!G$1,FALSE))","v":3.4},{"$f":"IF(ISERROR(VLOOKUP(Group,GCSE2017_91,$G$18+Descriptions!H$1,FALSE)),\"-\",VLOOKUP(Group,GCSE2017_91,$G$18+Descriptions!H$1,FALSE))","v":6.5},{"$f":"IF(ISERROR(VLOOKUP(Group,GCSE2017_91,$G$18+Descriptions!I$1,FALSE)),\"-\",VLOOKUP(Group,GCSE2017_91,$G$18+Descriptions!I$1,FALSE))","v":13.6},{"$f":"IF(ISERROR(VLOOKUP(Group,GCSE2017_91,$G$18+Descriptions!J$1,FALSE)),\"-\",VLOOKUP(Group,GCSE2017_91,$G$18+Descriptions!J$1,FALSE))","v":18.7},{"$f":"IF(ISERROR(VLOOKUP(Group,GCSE2017_91,$G$18+Descriptions!K$1,FALSE)),\"-\",VLOOKUP(Group,GCSE2017_91,$G$18+Descriptions!K$1,FALSE))","v":17.600000000000001},{"$f":"IF(ISERROR(VLOOKUP(Group,GCSE2017_91,$G$18+Descriptions!L$1,FALSE)),\"-\",VLOOKUP(Group,GCSE2017_91,$G$18+Descriptions!L$1,FALSE))","v":22.1},{"$f":"IF(ISERROR(VLOOKUP(Group,GCSE2017_91,$G$18+Descriptions!M$1,FALSE)),\"-\",VLOOKUP(Group,GCSE2017_91,$G$18+Descriptions!M$1,FALSE))","v":10.199999999999999},{"$f":"IF(ISERROR(VLOOKUP(Group,GCSE2017_91,$G$18+Descriptions!N$1,FALSE)),\"-\",VLOOKUP(Group,GCSE2017_91,$G$18+Descriptions!N$1,FALSE))","v":4.0999999999999996},{"$f":"IF(ISERROR(VLOOKUP(Group,GCSE2017_91,$G$18+Descriptions!O$1,FALSE)),\"-\",VLOOKUP(Group,GCSE2017_91,$G$18+Descriptions!O$1,FALSE))","v":11.4},{"$f":"IF(ISERROR(VLOOKUP(Group,GCSE2017_91,$G$18+Descriptions!P$1,FALSE)),\"-\",VLOOKUP(Group,GCSE2017_91,$G$18+Descriptions!P$1,FALSE))","v":43.7},{"$f":"IF(ISERROR(VLOOKUP(Group,GCSE2017_91,$G$18+Descriptions!Q$1,FALSE)),\"-\",VLOOKUP(Group,GCSE2017_91,$G$18+Descriptions!Q$1,FALSE))","v":61.3},{"$f":"IF(ISERROR(VLOOKUP(Group,GCSE2017_91,$G$18+Descriptions!R$1,FALSE)),\"-\",VLOOKUP(Group,GCSE2017_91,$G$18+Descriptions!R$1,FALSE))","v":97.7},{"$f":"IF(ISERROR(VLOOKUP(Group,GCSE2017_91,$G$18+Descriptions!S$1,FALSE)),\"-\",VLOOKUP(Group,GCSE2017_91,$G$18+Descriptions!S$1,FALSE))","v":270897}]
[null,null,null,null,null,null,null,null,null,null,null,null,null,null,null,null,null,null,"Source: key stage 4 attainment data"]
[null,null,null,null,"1. Discounting has been applied where pupils have taken the same subject more than once and only one entry is counted in these circumstances. Only the first entry is counted, in all subjects, in line with the early entry guidance (see SFR main text). "]
[null,null,null,null,"2. Dance and Ancient History are shown as separate subjects in this table. In previous years, Dance has been included in Physical Education and Ancient History has been in included in Other Classical Subjects. See the Subject Grouping Composition for full details of which subjects have been grouped together."]
[null,null,null,null,"3.  2016/17 figures are provisional, all other years are final."]
[null,null,null,null,"4. Each individual grade on the new 9 to 1 scale does not map directly onto a grade on the A* to G scale, therefore direct comparisons between the two should not be made. Further information on how the 9 to 1 grades compare to the A* to G scale is available here: https://www.gov.uk/government/publications/your-qualification-our-regulation-gcse-as-and-a-level-reforms."]
[null,null,null,null,"5. In 2013/14, two major reforms were implemented which affect the calculation of key stage 4 performance measures data: 1) Professor Alison Wolf’s Review of Vocational Education recommendations which: restrict the qualifications counted; prevent any qualification from counting as larger than one GCSE; and cap the number of non-GCSEs included in performance measures at two per pupil, and 2) an early entry policy to only count a pupil’s first attempt at a qualification, in subjects counted in the English Baccalaureate."]
[null,null,null,null,"6. From 2014/15, early entry policy, under which only a pupil’s first attempt at a qualification is counted in performance measures was extended to all subjects (see SFR main text)."]
[null,null,null,null,"7. From 2017, new reformed GCSEs in English language, English literature and mathematics are graded using a new 9 to 1 scale.  Unreformed subjects continue to be graded using the A* to G system. See the ‘Quality and methodology’ document for further information. Where reformed and unreformed subject totals are shown together in the above table, they are shown only at agreed anchor points (9-7/A*-A, 9-4/A*-C, 9-1/A*-G) as comparisons between other grades are not possible. For more on anchor points, see the following: https://www.gov.uk/government/news/setting-standards-for-new-gcses-in-2017 "]
[null,null,null,null,"8. The combined English language and literature GCSE and mathematics linked pair GCSEs (Methods in Mathematics and Applications of Mathematics) were available for the last time in 2016. From 2017, only the new 9 to 1 GCSEs in English language, English literature and mathematics will count towards the performance tables. AS levels will also still count, however these results are excluded from this table."]
[null,null,null,null,"9. Includes pupils who were absent, whose results are pending and results which are ungraded or unclassified."]
[null,null,null,null,"x   Figure has been suppressed due to low numbers (1 or 2 pupils) or where secondary suppression has been applied."]
[null,null,null,null,{"$f":"\"-    No entries for this subject.\"","v":"-    No entries for this subject."}]
[null,null,null,null,".   Not applicable."]
[null,null,null,null,"Notes:"]
[null,null,null,null,"Figures include attempts and achievements by these pupils in previous academic years where only the best grade in each individual subject is counted per pupil. Where subjects have been combined into a group (e.g. Other Modern Languages) and a pupil has two or more entries, each result in each subject is counted."]
[null,null,null,null,"Other science includes Astronomy, Electronics, Environmental Science and Geology."]
[null,null,null,null,"Other Design and Technology includes Design and Technology Engineering and Product Design qualifications."]
[null,null,null,null,"Other Classical Studies includes all other classical languages."]

{"sheet":"Descriptions","index":3,"n_rows":68,"n_cols":20,"rows_kept":68,"cut":false,"hidden":true,"merged":[]}
["Subject Group",null,"Boys",null,null,0,{"$f":"F1+1","v":1},{"$f":"G1+1","v":2},3,4,5,6,7,8,9,10,11,12,13,14]
["English",null,"Girls"]
["Mathematics",null,"All"]
["Core Science"]
["Additional Science"]
["Further Additional Science"]
["Additional Applied Science"]
["Physics"]
["Chemistry"]
["Biological Sciences"]
["Computer Science"]
["Other Sciences"]
["D & T: Electronic Products"]
["D & T: Food Technology"]
["D & T: Graphic Products"]
["D & T: Resistant Materials"]
["D & T: Systems & Control"]
["D & T: Textiles Technology"]
["Other Design and Technology"]
["Applied Engineering"]
["Information Technology"]
["Business Studies"]
["Applied Business"]
["Home Economics"]
["Geography"]
["History"]
["Ancient History"]
["Humanities"]
["Economics"]
["Social Studies"]
["Arabic"]
["Chinese"]
["French"]
["German"]
["Italian"]
["Polish"]
["Spanish"]
["Urdu"]
["Other Modern Languages"]
["Classical Civilisation"]
["Classical Greek"]
["Latin"]
["Other Classical Studies"]
["Applied Art and Design"]
["Applied Physical Education"]
["Art and Design"]
["Communication Studies"]
["Construction"]
["Dance"]
["Drama"]
["English Literature"]
["English Studies"]
["General Studies"]
["Health and Social Care"]
["Hospitality and Catering"]
["Leisure and Tourism"]
["Manufacturing"]
["Media/Film/TV"]
["Media: Communication and Production"]
["Music"]
["Performing Arts"]
["Physical Education"]
["Religious Studies"]
["Statistics"]
["Vocational Studies"]
["All subjects"]
[""]
[""]

{"sheet":"2010","index":4,"n_rows":58,"n_cols":40,"rows_kept":58,"cut":false,"hidden":true,"merged":[]}
[1,2,3,4,5,6,7,8,9,10,11,12,13,14,15,16,17,18,19,20,21,22,23,24,25,26,27,28,29,30,31,32,33,34,35,36,37,38,39,40]
["Subjects",null,"*","A","B","C","D","E","F","G","AstarA","AstarC","AstarG","Total","(No column name)","*","A","B","C","D","E","F","G","AstarA","AstarC","AstarG","Total","(No column name)","*","A","B","C","D","E","F","G","AstarA","AstarC","AstarG","Total"]
["Vocational Studies","Males",2.7,8.9,15.7,30.2,19.3,11,5.7,3,11.6,57.5,96.6,20355,"Females",5.8,13.5,19.2,30.9,15.7,7.5,3.8,1.7,19.3,69.3,98,21321,"All",4.3,11.2,17.5,30.5,17.5,9.1999999999999993,4.7,2.2999999999999998,15.5,63.6,97.3,41676]
["Urdu","Males",10.1,17.8,15.3,20.6,14.3,11.2,6.8,2.6,27.9,63.7,98.6,1759,"Females",17.600000000000001,24,19.7,16,10.6,7,3.3,1.1000000000000001,41.6,77.3,99.2,2791,"All",14.7,21.6,18,17.8,12,8.6,4.5999999999999996,1.7,36.299999999999997,72,99,4550]
["Statistics","Males",7.5,15.4,19.600000000000001,32.799999999999997,13.2,5.4,2.2000000000000002,1.1000000000000001,22.8,75.2,97.2,36900,"Females",7.7,16.5,20,33.799999999999997,11.8,4.9000000000000004,2,0.9,24.2,77.900000000000006,97.6,33838,"All",7.6,15.9,19.8,33.299999999999997,12.6,5.2,2.1,1,23.5,76.5,97.3,70738]
["Spanish","Males",12.9,16.2,17.5,23.1,16.899999999999999,8,3.4,1.3,29.1,69.7,99.3,24744,"Females",16.899999999999999,19.3,19.3,22.1,13.6,5.5,2.1,0.8,36.200000000000003,77.7,99.6,33486,"All",15.2,18,18.600000000000001,22.5,15,6.5,2.7,1,33.200000000000003,74.3,99.5,58230]
["Social Studies","Males",2.4,9.1999999999999993,18.2,27.5,18.7,9.6999999999999993,5.3,3,11.6,57.3,94.1,7301,"Females",4.8,15.2,22.1,27,14.9,7.7,3.3,1.6,20,69.2,96.7,17475,"All",4.0999999999999996,13.4,21,27.2,16,8.3000000000000007,3.9,2,17.5,65.7,96,24776]
["Religious Studies","Males",8.4,16.399999999999999,22.1,20.399999999999999,12.7,8.6999999999999993,5.9,3.3,24.8,67.2,97.9,79364,"Females",14.5,22.8,23.6,17.5,9.5,5.8,3.4,1.8,37.299999999999997,78.400000000000006,99,96986,"All",11.8,19.899999999999999,22.9,18.8,10.9,7.1,4.5,2.5,31.7,73.400000000000006,98.5,176350]
["Polish","Males",14.3,49.3,19.8,8.1999999999999993,2.5,1.2,1.4,2,63.5,91.5,98.6,1234,"Females",28,51.8,11.1,3.7,1.4,1,1,0.9,79.8,94.6,98.9,1143,"All",20.9,50.5,15.6,6,2,1.1000000000000001,1.2,1.5,71.400000000000006,93,98.7,2377]
["Physics","Males",21.6,28.1,26.8,17.899999999999999,4.4000000000000004,0.8,0.2,0.1,49.7,94.4,99.8,61597,"Females",21.6,26.7,26.9,18.399999999999999,5,0.8,0.2,0.1,48.2,93.5,99.7,50675,"All",21.6,27.4,26.8,18.100000000000001,4.7,0.8,0.2,0.1,49,94,99.8,112272]
["Physical Education","Males",5.5,17.100000000000001,24,22.3,21.5,6.9,2.1,0.4,22.5,68.900000000000006,99.8,71108,"Females",9.6,19.100000000000001,22.2,19.3,20.2,6.8,2.2000000000000002,0.5,28.6,70.099999999999994,99.8,38506,"All",6.9,17.8,23.4,21.3,21,6.9,2.1,0.5,24.7,69.3,99.8,109614]
["Performing Arts","Males",4.2,6.8,13,24.4,18.8,14.4,10.5,2.9,11,48.3,94.9,648,"Females",6.1,13.3,20.399999999999999,25.2,17.899999999999999,8.8000000000000007,4.0999999999999996,1.1000000000000001,19.399999999999999,65,96.9,1206,"All",5.4,11,17.8,24.9,18.2,10.7,6.4,1.7,16.5,59.2,96.2,1854]
["Other Sciences","Males",10.199999999999999,13.1,15.8,21.7,13.4,10.6,7.4,3.9,23.3,60.8,96,3612,"Females",5.7,11.5,18.100000000000001,22.6,15.8,12.2,7.5,3.1,17.2,58,96.5,1901,"All",8.6999999999999993,12.6,16.600000000000001,22,14.2,11.2,7.4,3.6,21.2,59.8,96.2,5513]
["Other Modern Languages","Males",26.4,25.6,18.899999999999999,13.6,5.8,3.6,2.8,1.4,52.1,84.5,98.1,4412,"Females",32.799999999999997,28.2,17.2,10.4,5.0999999999999996,3,1.6,0.4,61,88.7,98.9,4733,"All",29.7,27,18,11.9,5.4,3.3,2.2000000000000002,0.9,56.7,86.7,98.5,9145]
["Other Design and Technology","Males",2.1,10.9,17,26.8,19.2,11.1,6,3.3,13,56.8,96.4,22026,"Females",6.8,21.5,21.7,23.4,12.6,6.5,3.5,1.7,28.3,73.400000000000006,97.7,11952,"All",3.7,14.7,18.7,25.6,16.899999999999999,9.5,5.0999999999999996,2.7,18.399999999999999,62.6,96.9,33978]
["Other Classical Studies","Males",10.5,29.6,24.3,15.8,4.5999999999999996,7.9,2,3.9,40.1,80.3,98.7,152,"Females",13.8,31.6,25.7,14.1,5.3,4.2,2.7,1.3,45.4,85.1,98.7,377,"All",12.9,31,25.3,14.6,5.0999999999999996,5.3,2.5,2.1,43.9,83.7,98.7,529]
["Music","Males",7.6,21.4,25.7,20,11.7,6.3,3.6,1.8,29,74.7,98.1,23914,"Females",9.6999999999999993,25.9,26.1,18.899999999999999,10,4.9000000000000004,2.2999999999999998,1.1000000000000001,35.6,80.599999999999994,98.9,21519,"All",8.6,23.5,25.9,19.5,10.9,5.7,3,1.4,32.1,77.5,98.5,45433]
["Media: Communication and Production","Males","x",12.1,25.9,28.2,13.8,6.3,5.2,3.4,13.2,67.2,96,174,"Females","x",25.7,27.5,22.8,9.4,5.8,5.3,1.8,26.9,77.2,99.4,171,"All",1.2,18.8,26.7,25.5,11.6,6.1,5.2,2.6,20,72.2,97.7,345]
["Media/Film/TV","Males",1.9,8.6999999999999993,18.3,29.1,20.9,10.4,4.8,2.2999999999999998,10.5,57.9,96.4,28715,"Females",4.9000000000000004,17.8,25.8,26.6,14.1,5.6,2.2999999999999998,1,22.6,75,98,29871,"All",3.4,13.3,22.1,27.8,17.399999999999999,7.9,3.5,1.7,16.7,66.599999999999994,97.2,58586]
["Mathematics","Males",6.3,13,17.8,27.4,13.6,9.4,7.1,3.5,19.3,64.5,98.2,309181,"Females",6,13.1,18.100000000000001,27.5,13.8,9.3000000000000007,6.9,3.5,19.100000000000001,64.8,98.3,302024,"All",6.1,13.1,18,27.5,13.7,9.3000000000000007,7,3.5,19.2,64.599999999999994,98.2,611205]
["Latin","Males",41.2,25,14.5,10.4,5.6,1.7,0.3,"x",66.099999999999994,91,98.7,4702,"Females",50.6,24.5,12.1,7.8,3.2,0.9,0.2,"x",75.099999999999994,95,99.4,4654,"All",45.8,24.7,13.3,9.1,4.4000000000000004,1.3,0.3,0.1,70.599999999999994,93,99,9356]
["Italian","Males",39.1,17.600000000000001,13.9,14.5,7.6,3.9,1.5,0.9,56.7,85.2,99.1,1396,"Females",38.799999999999997,23.1,16,11.8,7,1.9,0.6,0.5,61.9,89.7,99.7,2160,"All",38.9,21,15.2,12.9,7.2,2.7,0.9,0.7,59.9,87.9,99.5,3556]
["Information Technology","Males",6.8,18,21.4,26,13.4,6.7,3.5,1.9,24.8,72.2,97.7,24186,"Females",10.6,23.8,23.3,22.8,10.4,4.0999999999999996,2.2000000000000002,1.3,34.4,80.5,98.6,19177,"All",8.5,20.6,22.2,24.6,12.1,5.5,2.9,1.6,29.1,75.900000000000006,98.1,43363]
["Humanities","Males",1.4,6,14.9,21.6,17.7,15.1,10.5,6.9,7.5,44,94.2,6239,"Females",3.1,11.5,20.9,21.6,16.399999999999999,11.7,7,4.4000000000000004,14.6,57.1,96.5,6426,"All",2.2999999999999998,8.8000000000000007,18,21.6,17,13.4,8.6999999999999993,5.6,11.1,50.6,95.4,12665]
["Hospitality and Catering","Males","x",4.0999999999999996,20.6,23.9,18.899999999999999,14.2,9.6999999999999993,5.9,4.7,49.3,97.9,339,"Females","x",8.5,25.4,28.6,19.3,7.1,6.2,1.7,9.9,63.9,98.3,646,"All",1.1000000000000001,7,23.8,27,19.2,9.5,7.4,3.1,8.1,58.9,98.2,985]
["Home Economics","Males",1.3,6.3,11.9,28.2,21.6,14.2,9.1999999999999993,4,7.6,47.8,96.9,3117,"Females",3.8,10.199999999999999,16,28.1,19.100000000000001,11.7,6.5,2.6,14,58.1,98,26233,"All",3.5,9.8000000000000007,15.6,28.2,19.3,11.9,6.8,2.8,13.3,57,97.9,29350]
["History","Males",9.1999999999999993,18.8,20.399999999999999,18.7,13.6,8.9,5.4,2.9,28,67,97.8,99674,"Females",14.1,22.2,20.6,16.899999999999999,11.7,7.3,4.0999999999999996,1.9,36.200000000000003,73.7,98.6,98579,"All",11.6,20.5,20.5,17.8,12.6,8.1,4.7,2.4,32.1,70.400000000000006,98.2,198253]
["German","Males",7.7,13.5,19.7,29.7,17.399999999999999,6.9,3.1,1.4,21.2,70.7,99.5,30790,"Females",10.1,17.8,22.7,27.9,14,4.5,1.9,0.7,27.9,78.5,99.6,35032,"All",9,15.8,21.3,28.7,15.6,5.6,2.4,1,24.8,74.8,99.6,65822]
["Geography","Males",9.6999999999999993,15.3,18.100000000000001,23.9,17.2,8.1999999999999993,4,1.9,25,67,98.2,93679,"Females",14.5,19.100000000000001,18.8,21.4,13.7,6.3,3.3,1.5,33.6,73.7,98.6,75593,"All",11.8,17,18.399999999999999,22.8,15.6,7.3,3.7,1.7,28.8,70,98.4,169272]
["General Studies","Males",2.5,6.3,9.6999999999999993,22.1,23.4,12.7,9.6,5.6,8.8000000000000007,40.6,92,3961,"Females",2.2000000000000002,6.9,10.4,23.9,26,11.7,7.9,4.9000000000000004,9.1999999999999993,43.4,93.9,3563,"All",2.4,6.6,10,22.9,24.6,12.2,8.8000000000000007,5.3,9,41.9,92.9,7524]
["French","Males",10.1,13.5,18,25.3,18.2,8.6999999999999993,4.0999999999999996,1.5,23.7,67,99.5,69209,"Females",12,16.8,21.1,25.2,15.1,6.2,2.4,0.9,28.7,75,99.7,91389,"All",11.2,15.4,19.8,25.2,16.399999999999999,7.3,3.1,1.2,26.6,71.599999999999994,99.6,160598]
["English Studies","Males",0.3,1.8,13.2,41.8,19,12.8,6.5,2.1,2.1,57.1,97.5,1778,"Females",0.6,3.8,17.7,46.5,15.8,8.1999999999999993,4.2,1.1000000000000001,4.3,68.599999999999994,97.9,1386,"All",0.4,2.7,15.2,43.9,17.600000000000001,10.8,5.5,1.7,3.1,62.1,97.7,3164]
["English Literature","Males",4.4000000000000004,14.2,24,27.8,16.3,7.1,2.9,1.3,18.7,70.5,98.1,223392,"Females",7.4,21.2,28,25.3,11.1,3.9,1.3,0.5,28.7,82,98.9,244529,"All",6,17.899999999999999,26.1,26.5,13.6,5.5,2.1,0.9,23.9,76.5,98.5,467921]
["English","Males",3.6,10.199999999999999,19.600000000000001,29.9,18.600000000000001,10.1,4.9000000000000004,1.9,13.7,63.1,98.7,301727,"Females",6.6,16.399999999999999,24.7,28.8,13.9,5.7,2.2999999999999998,0.9,23,76.5,99.2,297518,"All",5.0999999999999996,13.3,22.1,29.3,16.3,7.9,3.6,1.4,18.3,69.8,99,599245]
["Economics","Males",10.3,20.2,24.1,25.4,10.8,4,1.7,0.8,30.5,80,97.3,1992,"Females",8.1,18.399999999999999,26.7,24.2,12.2,4.7,1.5,0.6,26.5,77.3,96.3,724,"All",9.6999999999999993,19.7,24.8,25,11.2,4.2,1.6,0.7,29.5,79.3,97,2716]
["Drama","Males",3.2,13.7,26.4,25.8,16.5,8.1999999999999993,3.8,1.4,16.899999999999999,69.2,99.1,31417,"Females",6.6,20.5,30.9,22.4,11.6,4.7,1.9,0.7,27.2,80.5,99.4,49348,"All",5.3,17.899999999999999,29.1,23.7,13.5,6.1,2.6,1,23.2,76.099999999999994,99.3,80765]
["D & T: Textiles Technology","Males",1.6,8.3000000000000007,11.7,25.7,22.9,14.6,8.3000000000000007,3.1,9.9,47.2,96.2,1175,"Females",7.2,22.5,21.1,25.8,14,4.9000000000000004,2.2000000000000002,0.9,29.7,76.599999999999994,98.6,34660,"All",7,22.1,20.8,25.8,14.3,5.2,2.4,1,29,75.599999999999994,98.5,35835]
["D & T: Systems & Control","Males",5.5,15.8,21,26,16.7,7.2,3.2,1.6,21.3,68.400000000000006,97,5200,"Females",4.5999999999999996,30.7,26.5,16.7,11.2,4.0999999999999996,2.2999999999999998,2.1,35.200000000000003,78.5,98.2,437,"All",5.5,17,21.5,25.3,16.2,6.9,3.1,1.6,22.4,69.2,97.1,5637]
["D & T: Resistant Materials","Males",3.1,10.199999999999999,15.5,27.6,22.5,10.8,5.0999999999999996,2.4,13.2,56.3,97.2,56801,"Females",7,20.100000000000001,21,24.9,15,6.5,2.6,1.2,27.1,73,98.2,10601,"All",3.7,11.7,16.399999999999999,27.2,21.4,10.1,4.7,2.2000000000000002,15.4,58.9,97.3,67402]
["D & T: Graphic Products","Males",2.9,10.4,15,25.3,22.5,10.9,5.0999999999999996,2.8,13.2,53.5,94.8,29744,"Females",7.3,19.600000000000001,21.4,24.1,15.8,5.9,2.2999999999999998,1.2,26.9,72.400000000000006,97.5,21611,"All",4.7,14.3,17.7,24.8,19.600000000000001,8.8000000000000007,3.9,2.1,19,61.4,95.9,51355]
["D & T: Food Technology","Males",2.2000000000000002,8.4,13.1,28.6,23.7,11.6,6.4,3.1,10.6,52.3,97.2,22380,"Females",7,17.399999999999999,18.100000000000001,27.8,16.600000000000001,6.9,3.3,1.5,24.3,70.3,98.5,39724,"All",5.2,14.2,16.3,28.1,19.2,8.6,4.4000000000000004,2,19.399999999999999,63.8,98,62104]
["D & T: Electronic Products","Males",6.7,15.1,15.8,26.7,17.5,7.8,4,2.7,21.7,64.2,96.1,10058,"Females",11.8,24,20.8,19.899999999999999,12,4.2,2.4,2.1,35.799999999999997,76.5,97.3,899,"All",7.1,15.8,16.2,26.1,17,7.5,3.9,2.6,22.9,65.2,96.2,10957]
["Core Science","Males",2.2000000000000002,7.9,18,31,18.2,11.6,6.7,3,10.1,59,98.5,201936,"Females",3.3,9.8000000000000007,19.399999999999999,30.3,17.2,10.6,5.9,2.5,13,62.7,98.8,204477,"All",2.7,8.8000000000000007,18.7,30.7,17.7,11.1,6.3,2.7,11.5,60.9,98.7,406413]
["Construction","Males",2,10.8,30.8,23.4,"x","x",5.4,1.7,12.9,67.099999999999994,96.9,295,"Females",0,0,30,40,"x","x",0,0,0,70,100,10,"All",2,10.5,30.8,23.9,12.1,10.8,5.2,1.6,12.5,67.2,97,305]
["Communication Studies","Males",2.5,7.3,14.7,21.2,16.7,15.3,11.9,6.1,9.8000000000000007,45.7,95.6,3554,"Females",6.2,14.4,22.2,22.1,14.7,10,5.7,2.2999999999999998,20.7,64.900000000000006,97.5,5415,"All",4.7,11.6,19.2,21.7,15.5,12.1,8.1999999999999993,3.8,16.399999999999999,57.3,96.8,8969]
["Classical Greek","Males",60.7,22.8,8,4.8,2.5,0.7,"x","x",83.5,96.3,99.7,727,"Females",65,22.2,7.2,2.7,1.8,0.7,"x","x",87.2,97.1,100,446,"All",62.3,22.6,7.7,4,2.2000000000000002,0.7,"x","x",84.9,96.6,99.8,1173]
["Classical Civilisation","Males",11.9,22.6,25.7,19,11.6,4.3,1.5,0.9,34.5,79.2,97.4,2452,"Females",16.899999999999999,24.3,23.9,18.7,9.6,2.8,0.9,0.7,41.2,83.8,97.8,1850,"All",14,23.3,25,18.899999999999999,10.7,3.6,1.2,0.8,37.4,81.2,97.6,4302]
["Chinese","Males",79.8,8.5,5.6,2.1,1.1000000000000001,0.5,0.8,0.6,88.4,96.1,99,1305,"Females",84.8,5.5,3.3,1.9,1.5,0.9,0.3,0.6,90.3,95.5,98.8,1237,"All",82.3,7,4.5,2,1.3,0.7,0.6,0.6,89.3,95.8,98.9,2542]
["Chemistry","Males",20,27.4,27.5,18.5,5,1,0.3,0.1,47.5,93.5,99.8,61890,"Females",24,27.9,26.1,16.399999999999999,4.3,0.8,0.2,0.1,51.9,94.4,99.8,51396,"All",21.8,27.6,26.9,17.600000000000001,4.7,0.9,0.2,0.1,49.5,93.9,99.8,113286]
["Business Studies","Males",5.2,14.1,19.399999999999999,27.7,17.399999999999999,8,3.8,1.9,19.3,66.400000000000006,97.4,40581,"Females",7.5,16.5,19.8,27.2,15.2,7.4,3.2,1.2,24.1,71.099999999999994,98.1,28100,"All",6.1,15.1,19.600000000000001,27.5,16.5,7.8,3.5,1.6,21.2,68.3,97.7,68681]
["Biological Sciences","Males",18,28.4,29.8,17.7,4.4000000000000004,0.9,0.3,0.1,46.3,93.8,99.6,62862,"Females",22.1,29.7,27.4,15.1,3.7,0.9,0.4,0.2,51.8,94.4,99.5,53026,"All",19.899999999999999,29,28.7,16.5,4.0999999999999996,0.9,0.3,0.1,48.9,94.1,99.5,115888]
["Art and Design","Males",4.4000000000000004,11,18.8,32.1,15.7,10.1,4.9000000000000004,1.9,15.4,66.2,98.8,61863,"Females",9.1999999999999993,20.7,25.4,27.8,9.6,4.4000000000000004,1.7,0.6,29.9,83.1,99.4,107435,"All",7.4,17.100000000000001,23,29.4,11.8,6.5,2.9,1.1000000000000001,24.6,76.900000000000006,99.2,169298]
["Arabic","Males",29.9,19.100000000000001,14.6,10.4,6.2,5,3.8,1.9,49,73.900000000000006,90.8,955,"Females",31.2,16.5,14.3,11.6,6,4,4.4000000000000004,2.2999999999999998,47.6,73.5,90.1,1184,"All",30.6,17.600000000000001,14.4,11,6.1,4.4000000000000004,4.0999999999999996,2.1,48.2,73.7,90.4,2139]
["Applied Physical Education","Males",3.2,9.1,26.1,36.299999999999997,14.1,6,2.5,"x",12.2,74.7,97.9,1137,"Females",1.3,7.7,22.2,42,18.2,5.6,1.8,"x",9,73.2,99,908,"All",2.2999999999999998,8.5,24.4,38.799999999999997,15.9,5.8,2.2000000000000002,0.5,10.8,74,98.4,2045]
["All Subjects","Males",6.6,13.7,20.100000000000001,26.6,16,8.5,4.5999999999999996,2.1,20.3,67.099999999999994,98.3,2321259,"Females",9,17.5,22.4,25.5,13.2,6.4,3.3,1.5,26.5,74.400000000000006,98.9,2371428,"All",7.8,15.6,21.3,26,14.6,7.5,4,1.8,23.4,70.8,98.6,4692687]
["Additional Science","Males",3.8,9.3000000000000007,20.100000000000001,32.9,18.8,8.4,4,1.7,13.1,66.099999999999994,99,142935,"Females",5.5,11.4,22,31.6,16.7,7.2,3.3,1.4,16.899999999999999,70.599999999999994,99.1,145841,"All",4.7,10.4,21.1,32.200000000000003,17.7,7.8,3.7,1.5,15,68.400000000000006,99,288776]
["Additional Applied Science","Males",0,0.5,5.2,22.7,30.4,22.3,11.6,4.5,0.5,28.5,97.2,17714,"Females",0.1,1.6,10.7,28.3,29.2,17.5,8.1,2.6,1.7,40.700000000000003,98,20853,"All",0.1,1.1000000000000001,8.1999999999999993,25.7,29.7,19.7,9.6999999999999993,3.5,1.1000000000000001,35.1,97.7,38567]
["Dance","Males",3.6,17.100000000000001,20.9,20.5,19.399999999999999,11.7,4.8,0.8,20.6,62,98.7,901,"Females",4.8,15.1,21.8,21.7,19.399999999999999,10.3,4.5,1.5,19.899999999999999,63.4,99,14386,"All",4.7,15.2,21.7,21.6,19.399999999999999,10.3,4.5,1.4,20,63.3,99,15287]

{"sheet":"2011","index":5,"n_rows":65,"n_cols":40,"rows_kept":65,"cut":false,"hidden":true,"merged":[]}
[1,2,3,4,5,6,7,8,9,10,11,12,13,14,15,16,17,18,19,20,21,22,23,24,25,26,27,28,29,30,31,32,33,34,35,36,37,38,39,40]
["Subjects",null,"*","A","B","C","D","E","F","G","AstarA","AstarC","AstarG","Total","(No column name)","*","A","B","C","D","E","F","G","AstarA","AstarC","AstarG","Total","(No column name)","*","A","B","C","D","E","F","G","AstarA","AstarC","AstarG","Total"]
["Vocational Studies","Males",1.7,8.3000000000000007,18.7,26.1,20.6,12.8,6.6,3.1,9.9,54.8,97.8,16915,"Females",4.2,15,24.7,25.6,15.5,8.1,3.9,1.4,19.2,69.400000000000006,98.4,18287,"All",3,11.8,21.8,25.8,17.899999999999999,10.4,5.2,2.2000000000000002,14.8,62.4,98.1,35202]
["Urdu","Males",7.7,18.3,19.100000000000001,18.399999999999999,16.2,9.5,5.7,2.9,26,63.5,97.7,1454,"Females",14.2,24.4,21.1,19,10.9,5.7,2.6,1,38.6,78.8,99,2437,"All",11.8,22.1,20.399999999999999,18.8,12.9,7.1,3.8,1.7,33.9,73.099999999999994,98.5,3891]
["Statistics","Males",6.4,16.600000000000001,22.7,30.1,12.6,5.3,2.4,1.2,23,75.8,97.3,32464,"Females",7.4,18,23.7,30.2,10.9,4.5,2,1.1000000000000001,25.4,79.2,97.8,29473,"All",6.9,17.3,23.2,30.2,11.8,4.9000000000000004,2.2000000000000002,1.2,24.1,77.5,97.5,61937]
["Spanish","Males",12,15.5,19,22.2,15.2,8.6999999999999993,4.4000000000000004,2,27.6,68.8,99,24538,"Females",16.899999999999999,19.399999999999999,21.2,20.9,12.1,5.5,2.6,0.8,36.299999999999997,78.5,99.5,34143,"All",14.9,17.8,20.3,21.4,13.4,6.9,3.3,1.3,32.700000000000003,74.400000000000006,99.3,58681]
["Social Studies","Males",1.8,9.9,20.5,25,16.7,11.4,7.1,4.0999999999999996,11.7,57.2,96.5,12651,"Females",4.5999999999999996,16,24.9,22.8,13.7,8.5,4.8,2.7,20.6,68.3,98,24570,"All",3.6,13.9,23.4,23.6,14.7,9.4,5.6,3.2,17.600000000000001,64.5,97.5,37221]
["Religious Studies","Males",8.1,16.600000000000001,22.1,20.8,12.5,8.3000000000000007,5.6,3.5,24.7,67.599999999999994,97.6,89188,"Females",15,23.2,23.2,17.5,9.4,5.5,3.2,1.8,38.200000000000003,78.900000000000006,98.8,105921,"All",11.8,20.2,22.7,19,10.8,6.8,4.3,2.6,32,73.8,98.3,195109]
["Polish","Males",15.5,47.5,22,8.9,2.1,1.6,1,0.9,63,93.9,99.4,1262,"Females",29.7,48.3,13.4,5.3,0.7,0.7,0.6,0.6,78,96.6,99.4,1243,"All",22.6,47.9,17.7,7.1,1.4,1.2,0.8,0.8,70.400000000000006,95.2,99.4,2505]
["Physics","Males",21.2,27.6,27.6,17.899999999999999,4.5999999999999996,0.7,0.2,0.1,48.8,94.3,99.9,70307,"Females",22,27.3,26.9,17.600000000000001,5,0.9,0.2,0.1,49.3,93.8,99.9,60831,"All",21.6,27.5,27.3,17.7,4.8,0.8,0.2,0.1,49.1,94.1,99.9,131138]
["Physical Education","Males",5.3,12.3,26.1,27.3,17.100000000000001,8.4,2.5,0.6,17.600000000000001,71,99.7,61255,"Females",9.3000000000000007,15.6,24.1,23.1,16.2,8.1,2.6,0.7,24.9,72.099999999999994,99.7,32579,"All",6.7,13.5,25.4,25.9,16.8,8.3000000000000007,2.5,0.6,20.100000000000001,71.400000000000006,99.7,93834]
["Performing Arts","Males",3.8,6.6,11.7,26.1,18.8,14.7,10.1,5.5,10.4,48.2,97.4,849,"Females",5.3,11,18.899999999999999,26.9,16.100000000000001,10.9,5.8,2.7,16.3,62.1,97.6,1799,"All",4.8,9.6,16.600000000000001,26.7,17,12.1,7.2,3.6,14.4,57.6,97.5,2648]
["Other Sciences","Males",12,13.7,17.5,17.8,14.7,10.1,6.7,4.2,25.7,61,96.7,3618,"Females",5.7,12.6,19.100000000000001,22.5,14.9,11.4,7.3,3.7,18.3,59.9,97.3,1899,"All",9.8000000000000007,13.3,18.100000000000001,19.399999999999999,14.8,10.5,6.9,4.0999999999999996,23.1,60.6,96.9,5517]
["Other Modern Languages","Males",28,24.6,19.3,13.1,6.6,3.7,2,1.2,52.6,85,98.5,4207,"Females",33.5,27.6,18.7,10.199999999999999,4.5999999999999996,2.4,1.2,0.5,61,89.9,98.6,4567,"All",30.8,26.2,19,11.6,5.6,3,1.6,0.8,57,87.6,98.6,8774]
["Other Design and Technology","Males",2.5,9.1999999999999993,18.3,24.2,18.600000000000001,12.8,7.7,3.8,11.8,54.3,97.2,22529,"Females",7.9,20,24,21.6,11.9,6.8,4.0999999999999996,2,28,73.599999999999994,98.3,11982,"All",4.4000000000000004,13,20.3,23.3,16.2,10.7,6.4,3.2,17.399999999999999,61,97.6,34511]
["Other Classical Studies","Males",6.2,24,29.5,14.7,4.7,6.2,7,2.2999999999999998,30.2,74.400000000000006,94.6,129,"Females",13.7,36.9,21.4,12.8,5.7,3.3,1.5,1.8,50.6,84.8,97,336,"All",11.6,33.299999999999997,23.7,13.3,5.4,4.0999999999999996,3,1.9,44.9,81.900000000000006,96.3,465]
["Music","Males",8.8000000000000007,21.8,25.1,18.8,11.2,7.3,3.5,1.9,30.6,74.599999999999994,98.4,22402,"Females",10.8,25.1,26.5,17.2,10.199999999999999,5.7,2.7,1.1000000000000001,35.799999999999997,79.5,99.2,20755,"All",9.8000000000000007,23.4,25.8,18,10.7,6.5,3.1,1.5,33.1,77,98.8,43157]
["Media: Communication and Production","Males",0,0,13.3,36,33.299999999999997,10.7,"x",0,0,49.3,100,75,"Females",0,0,22.5,38.200000000000003,27,11.2,"x",0,0,60.7,100,89,"All",0,0,18.3,37.200000000000003,29.9,11,3.7,0,0,55.5,100,164]
["Media/Film/TV","Males",1.6,8.5,20.2,26.4,19.8,11.2,6.2,3.2,10.1,56.6,97.1,25784,"Females",5.2,19,27.9,23.7,12.4,5.8,2.9,1.5,24.2,75.8,98.4,25999,"All",3.4,13.8,24,25.1,16.100000000000001,8.5,4.5999999999999996,2.2999999999999998,17.100000000000001,66.2,97.7,51783]
["Mathematics","Males",6.9,13.5,17.600000000000001,28.7,12,9,7,3.5,20.399999999999999,66.8,98.3,303211,"Females",6.7,13.9,18.100000000000001,28.6,12.4,8.6999999999999993,6.6,3.3,20.7,67.3,98.4,295368,"All",6.8,13.7,17.8,28.6,12.2,8.8000000000000007,6.8,3.4,20.6,67,98.3,598579]
["Manufacturing","Males",0,3.6,6.5,19.399999999999999,13.7,17.3,20.100000000000001,10.1,3.6,29.5,90.6,139,"Females",0,9.1,9.1,24.2,15.2,12.1,9.1,18.2,9.1,42.4,97,33,"All",0,4.7,7,20.3,14,16.3,18,11.6,4.7,32,91.9,172]
["Leisure and Tourism","Males",0.3,2.1,6.5,15,18.399999999999999,17.899999999999999,15.7,12.6,2.4,23.9,88.5,1180,"Females",2,8.1999999999999993,15.9,21.7,16.600000000000001,14,9.6999999999999993,6.8,10.199999999999999,47.8,94.9,1637,"All",1.3,5.6,12,18.899999999999999,17.3,15.6,12.2,9.3000000000000007,6.9,37.799999999999997,92.2,2817]
["Latin","Males",45.1,26.7,13.3,8,4.0999999999999996,1.7,0.5,0.2,71.8,93.1,99.7,4077,"Females",47.4,27.8,13,6.5,3.2,1.2,0.4,0.1,75.3,94.8,99.7,4135,"All",46.3,27.3,13.2,7.2,3.7,1.5,0.5,0.2,73.5,93.9,99.7,8212]
["Italian","Males",39.700000000000003,18.3,15,13,6.3,2.9,2.7,1.2,58,86,99,1451,"Females",37.4,22.8,17.7,11,5.6,2.5,1.7,0.8,60.2,88.9,99.5,1985,"All",38.4,20.9,16.600000000000001,11.8,5.9,2.7,2.1,1,59.3,87.7,99.3,3436]
["Information Technology","Males",8.4,18.399999999999999,21.8,25.9,13,5.4,3,1.7,26.9,74.5,97.6,19551,"Females",12.3,25.2,24.3,21.6,9.4,3.6,1.5,0.8,37.5,83.4,98.6,16611,"All",10.199999999999999,21.5,22.9,23.9,11.3,4.5999999999999996,2.2999999999999998,1.3,31.7,78.599999999999994,98.1,36162]
["Humanities","Males",1.2,5.5,14.4,20.7,18.100000000000001,14.2,11.9,7.9,6.7,41.8,93.9,7209,"Females",3,10.4,19.100000000000001,22.6,17.100000000000001,12.3,7.4,4.8,13.4,55.2,96.7,7417,"All",2.1,8,16.8,21.7,17.600000000000001,13.2,9.6,6.3,10.1,48.6,95.3,14626]
["Hospitality and Catering","Males","x",1.7,15.5,28,19,18.100000000000001,11.1,5.2,2.2999999999999998,45.8,99.1,343,"Females","x",13.5,23.1,27.2,15.3,8,5.3,2.2000000000000002,18.399999999999999,68.7,99.4,511,"All",3.2,8.8000000000000007,20,27.5,16.7,12.1,7.6,3.4,11.9,59.5,99.3,854]
["Home Economics","Males",0.3,5.2,15,22.9,21.5,16.2,11.3,5.4,5.5,43.4,97.8,3898,"Females",2.9,11.3,20.2,23.5,18.399999999999999,12,6.7,3.1,14.2,57.9,98.1,24546,"All",2.6,10.5,19.5,23.4,18.8,12.6,7.3,3.4,13,55.9,98,28444]
["History","Males",9.1999999999999993,17.600000000000001,21,19.2,13.4,8.4,5.5,3.5,26.8,66.900000000000006,97.8,98087,"Females",14.3,21.4,21.4,17.3,11.2,6.8,4.0999999999999996,2.2000000000000002,35.700000000000003,74.400000000000006,98.6,97120,"All",11.7,19.5,21.2,18.2,12.3,7.6,4.8,2.8,31.2,70.599999999999994,98.2,195207]
["Dance","Males",5.0999999999999996,16.600000000000001,17.100000000000001,22.1,18.100000000000001,10.9,5.9,2.9,21.6,60.9,98.6,869,"Females",6.4,14.1,18.899999999999999,21.3,19.3,11.4,5.3,2,20.5,60.7,98.7,12308,"All",6.3,14.3,18.8,21.3,19.2,11.4,5.3,2,20.6,60.7,98.7,13177]
["Health and Social Care","Males","x",2,12.3,17.899999999999999,17.5,18.5,15.2,10.3,2.6,32.799999999999997,94.4,302,"Females","x",9.4,19,23.3,17.100000000000001,12.2,8.5,5.6,11.3,53.6,97,5570,"All",1.9,9,18.7,23,17.100000000000001,12.5,8.8000000000000007,5.8,10.9,52.6,96.8,5872]
["German","Males",7.8,13.6,22.2,26.8,16.8,7.5,3.2,1.4,21.4,70.400000000000006,99.3,27383,"Females",10.6,18.2,25.8,25.6,12.5,4.4000000000000004,1.8,0.8,28.8,80.2,99.7,30916,"All",9.3000000000000007,16.100000000000001,24.1,26.1,14.5,5.9,2.5,1.1000000000000001,25.3,75.599999999999994,99.5,58299]
["Geography","Males",8.4,15.9,19.2,22.7,16.5,8.6999999999999993,4.8,2.6,24.4,66.3,98.8,89338,"Females",13.9,20.8,20.5,19.899999999999999,12.4,6.4,3.5,1.7,34.700000000000003,75.099999999999994,99.1,72208,"All",10.9,18.100000000000001,19.8,21.4,14.7,7.7,4.2,2.2000000000000002,29,70.2,99,161546]
["General Studies","Males",1.8,7.5,12.4,17.600000000000001,19.399999999999999,15.7,11,6.9,9.3000000000000007,39.4,92.5,3373,"Females",2.1,7.7,15.7,20.8,20.8,15.3,7.8,4.9000000000000004,9.8000000000000007,46.3,95.1,3149,"All",2,7.6,14,19.2,20.100000000000001,15.5,9.4,5.9,9.6,42.7,93.7,6522]
["French","Males",8.6999999999999993,13.8,19.5,24.6,17.600000000000001,9.1,4.5,1.6,22.5,66.5,99.4,59640,"Females",11.9,17.8,23,23.3,14.3,6.1,2.4,0.8,29.7,76,99.6,82109,"All",10.6,16.100000000000001,21.5,23.9,15.7,7.4,3.3,1.2,26.7,72,99.5,141749]
["English Studies","Males",0.2,2.2000000000000002,14.6,45.9,15.1,11.4,5.8,3,2.4,63,98.4,1840,"Females",0.4,3.5,18.7,47.8,13,9.4,4,1.9,3.9,70.5,98.8,1462,"All",0.3,2.8,16.399999999999999,46.8,14.2,10.5,5,2.5,3.1,66.3,98.5,3302]
["English Literature","Males",4.5,14.9,26.6,26.5,15.3,6.6,2.6,1.2,19.399999999999999,72.5,98.2,212726,"Females",8.1,22.7,30.5,22.9,9.9,3.3,1.1000000000000001,0.5,30.8,84.2,99,236510,"All",6.4,19,28.7,24.6,12.4,4.9000000000000004,1.8,0.8,25.4,78.7,98.6,449236]
["English","Males",3.8,10.7,19.899999999999999,31.4,17.899999999999999,9.1999999999999993,4.2,1.6,14.5,65.8,98.9,296070,"Females",7.1,17.2,25.2,29.3,12.8,5.0999999999999996,1.9,0.7,24.3,78.8,99.3,291391,"All",5.5,13.9,22.5,30.3,15.4,7.2,3.1,1.2,19.399999999999999,72.3,99.1,587461]
["Economics","Males",5,24.4,30.4,20.2,9.5,4.7,2.7,1.2,29.4,80,98.1,2353,"Females",3.5,20.8,33,20.100000000000001,8.6999999999999993,5.5,4.5999999999999996,1.8,24.3,77.400000000000006,97.9,897,"All",4.5999999999999996,23.4,31.1,20.2,9.3000000000000007,4.9000000000000004,3.2,1.4,28,79.3,98,3250]
["Drama","Males",3.6,14.1,23.7,26,17.399999999999999,8.4,4.0999999999999996,1.6,17.7,67.3,98.9,28731,"Females",6.4,20.7,29.1,23.2,11.9,5,2.1,0.9,27.1,79.400000000000006,99.3,46024,"All",5.3,18.100000000000001,27,24.3,14,6.3,2.9,1.2,23.5,74.8,99.1,74755]
["D & T: Textiles Technology","Males",2.8,6.4,12.5,19.899999999999999,19.2,14,12.2,6.8,9.1999999999999993,41.6,93.8,1043,"Females",10.6,19.100000000000001,24.3,21,11.6,6.6,3.7,1.7,29.8,75.099999999999994,98.7,32614,"All",10.4,18.8,23.9,21,11.8,6.9,4,1.9,29.2,74.099999999999994,98.6,33657]
["D & T: Systems & Control","Males",5.3,14.4,21.7,22.6,15,10.1,6.2,3.1,19.7,64,98.4,4014,"Females",8,28,25.2,19.399999999999999,9.1999999999999993,2.5,4.5,1.6,36,80.599999999999994,98.4,314,"All",5.5,15.4,22,22.3,14.6,9.5,6.1,3,20.9,65.2,98.4,4328]
["D & T: Resistant Materials","Males",3.5,9.4,19.100000000000001,23.9,18.5,12.6,7.3,3.5,12.9,55.9,97.7,49560,"Females",9.4,18.3,23.7,20.3,13,7.5,4.3,2.1,27.7,71.7,98.7,8889,"All",4.4000000000000004,10.7,19.8,23.4,17.7,11.8,6.8,3.3,15.1,58.3,97.9,58449]
["D & T: Graphic Products","Males",3,9,17.5,21.9,18.3,12.4,8.4,5.3,12,51.4,95.8,25664,"Females",8.4,18.399999999999999,23.3,21.3,12.9,7.6,4.3,2,26.8,71.400000000000006,98.3,18114,"All",5.3,12.9,19.899999999999999,21.6,16.100000000000001,10.4,6.7,3.9,18.100000000000001,59.7,96.8,43778]
["D & T: Food Technology","Males",2,7.7,17.3,24.4,19.8,13.6,8.1999999999999993,4.0999999999999996,9.6999999999999993,51.4,97.2,20079,"Females",7.7,16.8,23.5,22.2,14.2,8.1999999999999993,4.0999999999999996,1.9,24.5,70.099999999999994,98.6,33970,"All",5.6,13.4,21.2,23,16.3,10.199999999999999,5.6,2.8,19,63.2,98,54049]
["D & T: Electronic Products","Males",7,14.8,21.7,21.2,14.8,8.6999999999999993,5.4,3.8,21.8,64.599999999999994,97.2,9080,"Females",15.7,24.6,21.9,15.8,9.6999999999999993,6.2,4.4000000000000004,0.6,40.200000000000003,77.900000000000006,98.8,773,"All",7.7,15.6,21.7,20.7,14.4,8.5,5.3,3.5,23.2,65.7,97.3,9853]
["Core Science","Males",1.9,7.6,18.3,32.799999999999997,17.899999999999999,11,6.4,2.7,9.5,60.6,98.7,173632,"Females",2.9,10.1,20.399999999999999,32,16.600000000000001,9.5,5.2,2.2000000000000002,13,65.400000000000006,98.9,176542,"All",2.4,8.9,19.399999999999999,32.4,17.3,10.199999999999999,5.8,2.5,11.3,63,98.8,350174]
["Construction","Males",0,"x",29.4,26.5,29.4,8.8000000000000007,0,0,"x",61.8,100,34,"Females",0,0,0,0,0,0,0,0,0,0,0,0,"All",0,"x",29.4,26.5,29.4,8.8000000000000007,0,0,"x",61.8,100,34]
["Ancient History","Males",16,29.8,24.5,4.3,"x",5.3,"x","x",45.7,74.5,98.9,94,"Females",20.5,17.899999999999999,33.299999999999997,7.7,"x",7.7,"x","x",38.5,79.5,100,39,"All",17.3,26.3,27.1,5.3,6,6,8.3000000000000007,3,43.6,75.900000000000006,99.2,133]
["Communication Studies","Males",2.2000000000000002,7.2,14.4,18.600000000000001,18.399999999999999,15.2,11.3,6.5,9.4,42.4,93.7,4072,"Females",6.4,14.1,20.5,21.6,14.8,9.6,6.4,2.8,20.5,62.6,96.3,5386,"All",4.5999999999999996,11.1,17.899999999999999,20.3,16.399999999999999,12,8.5,4.4000000000000004,15.7,53.9,95.2,9458]
["Classical Greek","Males",60.4,23.1,9.1999999999999993,4.4000000000000004,1.5,"x","x",0,83.5,97.1,100,619,"Females",65.099999999999994,21.9,7.5,2.5,2.8,"x","x",0,86.9,97,100,398,"All",62.2,22.6,8.6,3.6,2,0.8,"x",0,84.9,97.1,100,1017]
["Classical Civilisation","Males",10.3,24.7,24.1,21.9,11.4,4.0999999999999996,1.8,1,34.9,80.900000000000006,99.2,2201,"Females",17.399999999999999,25.5,23.9,17.3,9.1,3.8,1.6,1,42.9,84.1,99.6,1684,"All",13.4,25,24,19.899999999999999,10.4,4,1.7,1,38.4,82.3,99.4,3885]
["Chinese","Males",73.099999999999994,9.4,7,5.0999999999999996,3,1.2,"x","x",82.5,94.6,99.5,1305,"Females",79.7,10,4.5,3.1,1.4,0.9,"x","x",89.6,97.2,99.7,1175,"All",76.2,9.6999999999999993,5.8,4.2,2.2000000000000002,1.1000000000000001,0.3,0.1,85.9,95.8,99.6,2480]
["Chemistry","Males",20.399999999999999,27,26.5,18.8,5.7,1,0.3,0.1,47.4,92.8,99.9,70552,"Females",24.8,28.6,25,15.8,4.7,0.8,0.2,0.1,53.4,94.2,99.9,61466,"All",22.5,27.8,25.8,17.399999999999999,5.2,0.9,0.2,0.1,50.2,93.4,99.9,132018]
["Business Studies","Males",3.8,14.5,24.5,24.3,15.2,8.6,4.8,2.7,18.2,67.099999999999994,98.4,36281,"Females",5,17.5,25,23.1,14,7.9,4.2,2.1,22.5,70.599999999999994,98.8,24754,"All",4.3,15.7,24.7,23.8,14.7,8.3000000000000007,4.5,2.5,19.899999999999999,68.5,98.5,61035]
["Biological Sciences","Males",18,28.4,29.6,17.8,4.7,0.9,0.3,0.1,46.4,93.8,99.8,71285,"Females",23,30.6,26.5,14.7,3.8,0.8,0.2,0.1,53.7,94.9,99.8,62501,"All",20.399999999999999,29.5,28.1,16.399999999999999,4.3,0.8,0.3,0.1,49.8,94.3,99.8,133786]
["Art and Design","Males",5.3,9.6999999999999993,19.100000000000001,30.6,16.2,9.8000000000000007,5.3,2.2999999999999998,15,64.7,98.4,57387,"Females",11.2,18.5,26.6,26.1,9.8000000000000007,4.3,2,0.7,29.7,82.4,99.2,104955,"All",9.1,15.4,23.9,27.7,12.1,6.2,3.2,1.3,24.5,76.2,98.9,162342]
["Arabic","Males",29.8,22.3,15.2,8.5,5.9,5.7,3.1,2.9,52,75.7,93.3,930,"Females",31.3,20.7,13.9,10.7,7,5.5,4.3,3.1,52,76.599999999999994,96.5,1208,"All",30.6,21.4,14.5,9.6999999999999993,6.5,5.6,3.8,3,52,76.2,95.1,2138]
["Applied Physical Education","Males",1.4,6.3,19.8,41.4,21.9,6.5,1.6,"x",7.7,68.900000000000006,99,572,"Females",2,8.1,18.600000000000001,38,21.7,7.6,2,"x",10.1,66.7,98,447,"All",1.7,7.1,19.2,39.9,21.8,7,1.8,"x",8.6999999999999993,67.900000000000006,98.5,1019]
["Applied Engineering","Males",1.2,6.3,12.8,21.5,22.4,14.4,10.8,6.6,7.5,41.8,96.1,1241,"Females",0,8.5,18.600000000000001,33.9,16.899999999999999,6.8,6.8,5.0999999999999996,8.5,61,96.6,59,"All",1.2,6.4,13.1,22.1,22.2,14.1,10.6,6.5,7.5,42.7,96.1,1300]
["Applied Business","Males",1.6,9,19.899999999999999,22.5,14.9,11.2,8.6,6.7,10.6,53,94.4,2142,"Females",6.7,16.399999999999999,20.3,22.9,13,7.9,6.1,3.8,23.1,66.400000000000006,97.1,1373,"All",3.6,11.9,20.100000000000001,22.7,14.1,9.9,7.7,5.5,15.5,58.2,95.4,3515]
["Applied Art and Design","Males",1.9,7.2,19.100000000000001,36,16.399999999999999,12.4,4.8,1.4,9.1999999999999993,64.3,99.3,566,"Females",5.3,15.7,30.5,30.8,9.6,4.5,2,0.5,21,82.3,98.9,910,"All",4,12.5,26.2,32.799999999999997,12.2,7.5,3,0.9,16.5,75.400000000000006,99.1,1476]
["All Subjects","Males",6.9,14,21.2,26.4,14.9,8.3000000000000007,4.5999999999999996,2.2000000000000002,20.9,68.400000000000006,98.5,2220810,"Females",9.6999999999999993,18.2,23.6,24.6,12.1,6.1,3.2,1.5,27.9,76.099999999999994,99,2290185,"All",8.3000000000000007,16.100000000000001,22.4,25.5,13.5,7.2,3.9,1.8,24.4,72.3,98.7,4510995]
["Additional Science","Males",3.7,9.1999999999999993,20.6,33.299999999999997,19.399999999999999,8,3.4,1.4,12.9,66.900000000000006,99.1,123625,"Females",5.8,12.1,23,31.3,16.5,6.6,2.8,1.1000000000000001,17.8,72.099999999999994,99.2,128169,"All",4.8,10.7,21.8,32.299999999999997,17.899999999999999,7.3,3.1,1.3,15.4,69.599999999999994,99.2,251794]
["Additional Applied Science","Males","x",0.7,5.2,22.9,32,21.2,11.1,4.2,0.7,28.8,97.4,13434,"Females","x",2,10.7,29.1,30.2,16.5,7.2,2.4,2.1,41.9,98.2,15628,"All",0.1,1.4,8.1999999999999993,26.3,31,18.7,9,3.2,1.4,35.799999999999997,97.8,29062]

{"sheet":"2012","index":6,"n_rows":65,"n_cols":40,"rows_kept":65,"cut":false,"hidden":true,"merged":[]}
[1,2,3,4,5,6,7,8,9,10,11,12,13,14,15,16,17,18,19,20,21,22,23,24,25,26,27,28,29,30,31,32,33,34,35,36,37,38,39,40]
["Subjects",null,"*","A","B","C","D","E","F","G","AstarA","AstarC","AstarG","Total","(No column name)","*","A","B","C","D","E","F","G","AstarA","AstarC","AstarG","Total","(No column name)","*","A","B","C","D","E","F","G","AstarA","AstarC","AstarG","Total"]
["English","Males",2.5,9.4,18.899999999999999,31.5,20.3,10.4,4.7,1.5,11.9,62.2,99.2,286477,"Females",5.2,16.3,25.3,29.7,14.5,5.7,2.1,0.7,21.5,76.5,99.5,282134,"All",3.8,12.8,22.1,30.6,17.399999999999999,8.1,3.4,1.1000000000000001,16.600000000000001,69.3,99.4,568611]
["Mathematics","Males",7.5,12.8,17.8,32.5,10.7,7.5,6.2,3.5,20.3,70.599999999999994,98.4,301640,"Females",7,13.3,18.399999999999999,32.5,11,7.2,5.8,3.3,20.3,71.2,98.6,292726,"All",7.2,13.1,18.100000000000001,32.5,10.9,7.4,6,3.4,20.3,70.900000000000006,98.5,594366]
["Core Science","Males",1.7,6.8,18.2,35.200000000000003,18.899999999999999,10.1,5.7,2.4,8.5,61.9,98.9,154001,"Females",2.6,9.3000000000000007,20.9,34.1,17.100000000000001,8.6999999999999993,4.5,1.9,11.9,67,99.2,157230,"All",2.2000000000000002,8.1,19.5,34.700000000000003,18,9.4,5.0999999999999996,2.2000000000000002,10.3,64.5,99.1,311231]
["Additional Science","Males",3.1,8.4,20.7,33.700000000000003,20.3,8.1,3.5,1.4,11.5,65.900000000000006,99.2,119763,"Females",4.5999999999999996,11.5,23.7,31.8,17.2,6.8,2.7,1.1000000000000001,16.100000000000001,71.599999999999994,99.3,124941,"All",3.8,10,22.2,32.700000000000003,18.7,7.4,3.1,1.2,13.8,68.8,99.3,244704]
["Additional Applied Science","Males",0.1,0.9,5,20.399999999999999,32.700000000000003,22.7,11.7,3.8,1.1000000000000001,26.4,97.3,8181,"Females",0.2,2.8,10.6,26.9,30.5,17.100000000000001,7.8,2.2999999999999998,3,40.5,98.2,9468,"All",0.2,1.9,8,23.9,31.5,19.7,9.6,3,2.1,34,97.8,17649]
["Physics","Males",19.5,27.4,28.1,18.899999999999999,4.9000000000000004,0.9,0.2,0.1,46.8,93.8,99.9,77821,"Females",19.7,27.4,28.1,18.2,5.3,0.9,0.2,0,47.1,93.5,99.9,68671,"All",19.600000000000001,27.4,28.1,18.600000000000001,5.0999999999999996,0.9,0.2,0.1,47,93.7,99.9,146492]
["Chemistry","Males",19.399999999999999,26.6,27.8,18.8,6,1,0.2,0.1,46,92.7,99.9,78220,"Females",23.2,28.6,26.4,16.100000000000001,4.7,0.8,0.1,0,51.8,94.2,99.9,69244,"All",21.2,27.5,27.1,17.5,5.4,0.9,0.2,0,48.7,93.4,99.9,147464]
["Biological Sciences","Males",16.3,28,30.2,18.600000000000001,5.3,0.9,0.3,0.1,44.4,93.2,99.8,78707,"Females",21.3,30.8,27.7,14.9,4.0999999999999996,0.7,0.2,0.1,52.1,94.7,99.8,70315,"All",18.7,29.4,29,16.8,4.7,0.8,0.3,0.1,48,93.9,99.8,149022]
["Other Sciences","Males",12,15.8,18.600000000000001,16.7,13.2,9.1,6.4,4.0999999999999996,27.7,63,95.9,3788,"Females",6.3,15.4,19.7,19.600000000000001,14,10.4,6.1,3.9,21.7,61.1,95.4,2079,"All",10,15.6,19,17.7,13.5,9.6,6.3,4,25.6,62.3,95.7,5867]
["D & T: Electronic Products","Males",8.4,14.5,21.7,20.5,14,8.8000000000000007,6,3.5,22.9,65.099999999999994,97.4,8453,"Females",19.2,24.6,21.8,16.3,6.3,6.3,3.3,1.5,43.8,82,99.3,687,"All",9.1999999999999993,15.3,21.7,20.2,13.5,8.6,5.8,3.4,24.5,66.400000000000006,97.6,9140]
["D & T: Food Technology","Males",2.4,7.1,16.8,25.1,22.3,13.7,7.6,3.4,9.5,51.3,98.2,18752,"Females",8.5,16.8,23.8,23,14.5,7.5,3.6,1.5,25.2,72.099999999999994,99.1,30772,"All",6.2,13.1,21.2,23.8,17.399999999999999,9.8000000000000007,5.0999999999999996,2.2000000000000002,19.3,64.2,98.8,49524]
["D & T: Graphic Products","Males",3.4,9.3000000000000007,16.7,21.8,19.5,12.7,8.3000000000000007,4.4000000000000004,12.8,51.3,96.2,24294,"Females",9.4,18.2,22.8,20.7,13.7,7.8,4.0999999999999996,1.8,27.7,71.2,98.5,16512,"All",5.9,12.9,19.2,21.4,17.100000000000001,10.7,6.6,3.3,18.8,59.4,97.1,40806]
["D & T: Resistant Materials","Males",3.3,9.6999999999999993,19.100000000000001,24.1,18.2,12,7.4,3.8,13,56.2,97.6,46098,"Females",8.1999999999999993,18.600000000000001,23.7,22.3,13.1,6.8,4.0999999999999996,1.7,26.8,72.8,98.6,8206,"All",4,11,19.8,23.8,17.399999999999999,11.2,6.9,3.5,15.1,58.7,97.7,54304]
["D & T: Systems & Control","Males",6.4,14,20,24,16.7,8.9,5.8,2.5,20.399999999999999,64.400000000000006,98.4,3767,"Females",10.9,30.7,24.2,15,8.9,4.8,3.4,1.4,41.6,80.900000000000006,99.3,293,"All",6.7,15.2,20.3,23.4,16.2,8.6,5.7,2.4,21.9,65.599999999999994,98.5,4060]
["D & T: Textiles Technology","Males",3.1,7,14.1,18,20.7,13.4,11.9,7.4,10.1,42.2,95.5,891,"Females",10.6,18.7,24.3,21.1,12.5,6.7,3.4,1.7,29.3,74.599999999999994,98.9,31093,"All",10.4,18.399999999999999,24,21,12.7,6.9,3.7,1.8,28.7,73.7,98.8,31984]
["Other Design and Technology","Males",2.5,8.4,17.7,24.7,19.899999999999999,12.7,7.7,4,10.9,53.3,97.6,22445,"Females",6.9,17.3,23.4,23,14.3,7.7,3.9,1.9,24.2,70.599999999999994,98.5,11244,"All",3.9,11.4,19.600000000000001,24.1,18.100000000000001,11,6.4,3.3,15.3,59.1,97.9,33689]
["Applied Engineering","Males",1.4,4.5,17.2,23.4,19.2,15.7,10.1,"x",5.9,46.5,96.2,1410,"Females",18.100000000000001,22.4,25,13.8,6,7.8,5.2,"x",40.5,79.3,100,116,"All",2.7,5.8,17.8,22.7,18.2,15.1,9.6999999999999993,4.4000000000000004,8.5,49,96.5,1526]
["Information Technology","Males",5.2,18,25.8,22,12.3,7,4.8,3.1,23.2,71,98.1,21476,"Females",9.1999999999999993,25.1,27.2,19.100000000000001,9.1999999999999993,4.5,2.7,1.7,34.299999999999997,80.599999999999994,98.8,17737,"All",7,21.2,26.4,20.7,10.9,5.9,3.9,2.5,28.2,75.3,98.4,39213]
["Business Studies","Males",3.1,14.7,24.8,24.6,16.2,8.4,4.5999999999999996,2.4,17.8,67.099999999999994,98.8,34976,"Females",4.5,17.7,25.9,23,14.8,7.4,4,1.8,22.1,71,99,23546,"All",3.6,15.9,25.2,24,15.6,8,4.4000000000000004,2.2000000000000002,19.5,68.7,98.9,58522]
["Applied Business","Males",2.2999999999999998,11.5,19.899999999999999,24.9,15.7,10.1,6.9,4.3,13.7,58.5,95.5,2220,"Females",5.6,18.100000000000001,22.5,23.7,12.3,7.4,4.5,2.6,23.7,70,96.8,1647,"All",3.7,14.3,21,24.4,14.2,9,5.9,3.6,18,63.4,96.1,3867]
["Arabic","Males",30.1,20.8,14.6,11.1,6.6,4.7,3.7,3.2,50.9,76.599999999999994,94.8,1035,"Females",29.7,22.1,14.3,11.5,7.7,3.6,3.3,2.5,51.8,77.5,94.6,1263,"All",29.9,21.5,14.4,11.3,7.2,4.0999999999999996,3.5,2.8,51.4,77.099999999999994,94.7,2298]
["Chinese","Males",62,12.6,10.3,9,2.9,1.8,0.8,"x",74.599999999999994,93.9,99.6,1188,"Females",72.7,13,6.3,4.3,2,0.8,0.4,"x",85.8,96.3,99.6,1119,"All",67.2,12.8,8.3000000000000007,6.7,2.5,1.3,0.6,0.1,80,95.1,99.6,2307]
["French","Males",8.5,13.5,19.2,25.3,18.600000000000001,8.9,4.2,1.3,22,66.5,99.5,57046,"Females",12,17.3,22.1,24.5,15,5.9,2.2000000000000002,0.7,29.4,76,99.7,78501,"All",10.5,15.7,20.9,24.9,16.5,7.2,3,1,26.3,72,99.6,135547]
["German","Males",8,13.4,21.6,27.4,17.5,7.3,3.1,1.2,21.4,70.400000000000006,99.6,25917,"Females",10.7,18,25,26.2,13.1,4.5999999999999996,1.7,0.6,28.7,79.8,99.8,28876,"All",9.4,15.8,23.4,26.7,15.2,5.9,2.4,0.9,25.2,75.400000000000006,99.7,54793]
["Home Economics","Males",0.8,6.2,16,24,20.9,15.5,9.6999999999999993,4.7,6.9,46.9,97.7,3901,"Females",3,11.2,20.3,23.4,18.600000000000001,12.2,6.6,2.9,14.2,58,98.3,23481,"All",2.7,10.5,19.7,23.5,18.899999999999999,12.6,7.1,3.1,13.2,56.4,98.2,27382]
["Italian","Males",39.799999999999997,17.3,15.4,13.6,7.2,3.8,1.6,1,57.1,86.1,99.6,1698,"Females",38.799999999999997,21.8,17.3,11.8,5.6,3,0.9,0.4,60.6,89.7,99.6,2153,"All",39.299999999999997,19.8,16.5,12.6,6.3,3.3,1.2,0.7,59,88.1,99.6,3851]
["Polish","Males",17.399999999999999,48,20,6.6,3.2,2.2000000000000002,0.5,1.2,65.400000000000006,92,99.1,1399,"Females",33.200000000000003,45,13.2,4.4000000000000004,1.2,1,0.4,0.9,78.2,95.8,99.3,1349,"All",25.1,46.5,16.7,5.5,2.2000000000000002,1.6,0.5,1.1000000000000001,71.7,93.9,99.2,2748]
["Spanish","Males",11.9,15.2,19.2,22.5,16.7,8.4,3.8,1.6,27.1,68.8,99.3,26500,"Females",16.2,18.8,21.3,21.2,13.6,5.5,2.2000000000000002,0.8,35.1,77.599999999999994,99.6,36845,"All",14.4,17.3,20.399999999999999,21.7,14.9,6.7,2.9,1.1000000000000001,31.7,73.900000000000006,99.5,63345]
["Urdu","Males",7.6,17.5,19.2,22.2,14.7,10.1,4.8,2,25.2,66.599999999999994,98.2,1283,"Females",13.8,22.5,22.2,19.600000000000001,10.8,6.9,2.8,0.7,36.299999999999997,78.099999999999994,99.3,2421,"All",11.7,20.8,21.2,20.5,12.2,8,3.5,1.1000000000000001,32.5,74.099999999999994,98.9,3704]
["Other Modern Languages","Males",27.6,26.7,18.600000000000001,12.9,6.5,3.4,1.7,1,54.3,85.9,98.6,4295,"Females",34.1,28.6,17.600000000000001,10.6,4.3,2.2999999999999998,1,0.6,62.7,90.9,99.1,4597,"All",30.9,27.7,18.100000000000001,11.7,5.4,2.8,1.4,0.8,58.6,88.5,98.8,8892]
["Classical Civilisation","Males",8.6999999999999993,23.2,25.5,20.8,13,5.8,2.1,0.5,31.9,78.2,99.6,2414,"Females",15.3,30.6,24.8,15.9,8.1,2.7,1.4,0.6,46,86.7,99.6,1806,"All",11.6,26.4,25.2,18.7,10.9,4.5,1.8,0.5,37.9,81.8,99.6,4220]
["Classical Greek","Males",62.6,20.2,9.6,3.5,2.2999999999999998,"x","x","x",82.7,95.8,99.7,649,"Females",64.599999999999994,20.7,9.4,1.8,"x","x","x",0,85.3,96.4,100,449,"All",63.4,20.399999999999999,9.5,2.8,2.6,0.5,0.4,"x",83.8,96.1,99.8,1098]
["Geography","Males",7.5,16.7,19.8,22.4,16.5,9.1,4.7,2.2000000000000002,24.2,66.400000000000006,98.9,91248,"Females",13.3,21.6,21.1,19.5,12.1,6.4,3.5,1.7,34.9,75.5,99.3,73839,"All",10.1,18.899999999999999,20.399999999999999,21.1,14.6,7.9,4.0999999999999996,2,29,70.5,99.1,165087]
["Latin","Males",42.7,27.7,13.7,7.8,4.2,1.9,0.8,0.5,70.3,91.9,99.3,4141,"Females",48,27.3,12.9,6.6,3,1.3,0.6,0.3,75.3,94.7,99.9,4240,"All",45.4,27.5,13.3,7.2,3.6,1.6,0.7,0.4,72.8,93.3,99.6,8381]
["Other Classical Studies","Males",13.6,32.200000000000003,24.6,12.7,7.6,2.5,2.5,0,45.8,83.1,95.8,118,"Females",12.7,31.8,27,14.1,6.2,2,1.1000000000000001,1.7,44.5,85.6,96.6,355,"All",12.9,31.9,26.4,13.7,6.6,2.1,1.5,1.3,44.8,85,96.4,473]
["History","Males",8.8000000000000007,17.3,21,19.7,13.8,8.5,5.5,3.3,26.1,66.8,97.9,99769,"Females",13.5,21.4,21.6,17.600000000000001,11.4,6.9,4.2,2.2000000000000002,34.9,74.2,98.8,98106,"All",11.2,19.3,21.3,18.7,12.6,7.7,4.8,2.7,30.5,70.5,98.3,197875]
["Ancient History","Males",20,23,23,13.3,10.9,6.1,"x","x",43,79.400000000000006,98.2,165,"Females",11.4,20.3,26.6,16.5,13.9,6.3,"x","x",31.6,74.7,98.7,79,"All",17.2,22.1,24.2,14.3,11.9,6.1,2,"x",39.299999999999997,77.900000000000006,98.4,244]
["Humanities","Males",1.2,5.5,13.4,21.7,19.5,14.9,11,7.5,6.7,41.9,94.8,7557,"Females",2.5,9.5,18.8,23.1,17.7,13.1,7.6,4.5,12,53.8,96.8,7754,"All",1.9,7.5,16.2,22.4,18.600000000000001,14,9.3000000000000007,6,9.4,47.9,95.8,15311]
["Economics","Males",9.4,24.9,27.9,17.899999999999999,8.3000000000000007,5,3.4,1.6,34.299999999999997,80.099999999999994,98.4,2436,"Females",8.6999999999999993,23.4,26.6,20,9.9,4.8,3.1,2,32,78.7,98.5,993,"All",9.1999999999999993,24.5,27.5,18.5,8.8000000000000007,4.9000000000000004,3.3,1.7,33.700000000000003,79.7,98.4,3429]
["Social Studies","Males",1.9,9.9,20,24.9,17.7,11.4,7.2,4.3,11.8,56.7,97.2,15141,"Females",4.2,16.7,25.6,22.5,13.7,8,4.8,2.8,20.9,69,98.3,27310,"All",3.4,14.2,23.6,23.4,15.1,9.1999999999999993,5.7,3.3,17.600000000000001,64.599999999999994,97.9,42451]
["Music","Males",9,22.1,25.1,19.3,11.9,6.7,3,1.5,31.1,75.599999999999994,98.7,20943,"Females",10.6,25.1,26.7,17.8,10.6,5.2,2.2999999999999998,1,35.799999999999997,80.2,99.3,19818,"All",9.8000000000000007,23.6,25.9,18.600000000000001,11.3,6,2.7,1.2,33.4,77.8,99,40761]
["Applied Art and Design","Males",3.6,6.3,18.600000000000001,27.9,20,13.6,7.7,1.1000000000000001,10,56.5,98.9,441,"Females",6.8,16.7,27.4,28.6,12.3,4.8,2.2000000000000002,0.7,23.6,79.599999999999994,99.6,730,"All",5.6,12.8,24.1,28.4,15.2,8.1,4.3,0.9,18.399999999999999,70.900000000000006,99.3,1171]
["Applied Physical Education","Males","x",13.5,24,49,7.3,4.2,0,0,15.6,88.5,100,96,"Females","x",18,38.200000000000003,29.2,11.2,0,0,0,21.3,88.8,100,89,"All",2.7,15.7,30.8,39.5,9.1999999999999993,2.2000000000000002,0,0,18.399999999999999,88.6,100,185]
["Art and Design","Males",5.6,9.3000000000000007,19.100000000000001,30.9,15.9,9.6999999999999993,5.5,2.4,14.8,64.900000000000006,98.4,54643,"Females",12.2,17.5,26.7,26.8,9.6,4.0999999999999996,1.8,0.6,29.7,83.2,99.3,104369,"All",10,14.7,24.1,28.2,11.8,6,3.1,1.2,24.6,76.900000000000006,99,159012]
["Communication Studies","Males",2,7,15.7,22.1,18.600000000000001,14.8,10,5.4,9,46.7,95.5,4581,"Females",6.6,17.600000000000001,22.1,22,14.2,8.4,4.7,2.2000000000000002,24.2,68.3,97.8,5240,"All",4.5,12.7,19.100000000000001,22,16.2,11.4,7.2,3.7,17.100000000000001,58.2,96.7,9821]
["Construction","Males",0,0,"x","x",47.5,7.5,0,0,0,"x","x","x","Females",0,0,"x","x",0,0,0,0,0,"x","x","x","All",0,0,16.7,31,45.2,7.1,0,0,0,47.6,100,42]
["Dance","Males",4.9000000000000004,16,16.899999999999999,24.5,18.100000000000001,10.4,4.0999999999999996,2.4,20.9,62.3,97.4,799,"Females",5.5,14.6,20.3,23.5,18.8,10.1,4.5,1.6,20.100000000000001,63.9,98.9,11143,"All",5.4,14.7,20,23.6,18.8,10.1,4.5,1.6,20.2,63.8,98.8,11942]
["Drama","Males",3.4,13.6,23.3,26,17.8,9,4.0999999999999996,1.8,17,66.3,99,27528,"Females",6,20.5,28.4,23.4,12.7,5.3,2.1,0.9,26.6,78.3,99.4,42843,"All",5,17.8,26.4,24.4,14.7,6.7,2.9,1.2,22.8,73.599999999999994,99.2,70371]
["English Literature","Males",4.2,13.5,25.6,27,16.7,7.3,3.2,1.4,17.7,70.400000000000006,98.9,201888,"Females",7.6,20.9,30.5,23.5,11,3.8,1.4,0.6,28.6,82.5,99.4,224027,"All",6,17.399999999999999,28.2,25.2,13.7,5.4,2.2999999999999998,1,23.4,76.8,99.1,425915]
["English Studies","Males",0.3,1.9,10.1,28.7,25.7,17.7,9.1999999999999993,4.4000000000000004,2.1,41,98,1908,"Females",1,5.7,14.2,32.700000000000003,22.7,13.2,5.0999999999999996,3.8,6.7,53.5,98.4,1398,"All",0.6,3.5,11.8,30.4,24.5,15.8,7.5,4.0999999999999996,4.0999999999999996,46.3,98.2,3306]
["General Studies","Males",1.5,7,12.6,16.7,20.5,14.8,10.199999999999999,7.4,8.6,37.799999999999997,90.6,2491,"Females",0.9,9,14.6,21,21.3,15.1,8.6999999999999993,4.5999999999999996,10,45.5,95.2,2559,"All",1.2,8,13.6,18.899999999999999,20.9,14.9,9.4,6,9.3000000000000007,41.7,92.9,5050]
["Health and Social Care","Males",0,3.2,8.4,17.399999999999999,20.100000000000001,16.899999999999999,16.399999999999999,11.9,3.2,29,94.2,379,"Females",1.9,9.1999999999999993,18.899999999999999,25.1,17.7,12.2,7.9,4.7,11.1,55.1,97.7,5800,"All",1.8,8.8000000000000007,18.3,24.6,17.899999999999999,12.5,8.4,5.0999999999999996,10.6,53.5,97.5,6179]
["Hospitality and Catering","Males","x",6.9,17.899999999999999,25.6,26.8,12.6,6.1,2.2000000000000002,7.1,50.6,98.4,492,"Females","x",16.2,27.1,24.3,18.5,6.3,1.6,1.3,20.7,72.2,99.7,704,"All",2.8,12.4,23.3,24.8,21.9,8.9,3.4,1.7,15.1,63.3,99.2,1196]
["Leisure and Tourism","Males","x",2.8,7.6,17.2,18.8,17,15.6,11.6,3,27.8,90.8,1132,"Females","x",7.4,15.3,22.4,18.100000000000001,14.1,10.9,6.9,9.5,47.1,97.1,1492,"All",1.2,5.4,12,20.2,18.399999999999999,15.3,12.9,8.9,6.7,38.799999999999997,94.4,2624]
["Manufacturing","Males",4.2,6.8,10.199999999999999,28.8,15.3,"x","x","x",11,50,95.8,118,"Females",0,14.3,19,23.8,19,"x","x","x",14.3,57.1,100,21,"All",3.6,7.9,11.5,28.1,15.8,15.8,5.8,7.9,11.5,51.1,96.4,139]
["Media/Film/TV","Males",1.5,7.9,19.2,27.5,20.3,11.6,6.3,3.1,9.4,56.1,97.4,24466,"Females",5.5,18.8,28.1,24.7,12.2,5.6,2.6,1.4,24.3,77.099999999999994,98.8,25012,"All",3.6,13.4,23.7,26.1,16.2,8.6,4.5,2.2000000000000002,16.899999999999999,66.7,98.1,49478]
["Media: Communication and Production","Males",0,0,7.1,35.700000000000003,34.299999999999997,11.4,10,0,0,42.9,98.6,70,"Females",0,0,26.6,49.4,15.2,5.0999999999999996,3.8,0,0,75.900000000000006,100,79,"All",0,0,17.399999999999999,43,24.2,8.1,6.7,0,0,60.4,99.3,149]
["Performing Arts","Males",4.5999999999999996,6.8,15.9,28.5,18,14.2,7.7,3.2,11.4,55.8,98.8,755,"Females",9.1999999999999993,13.5,23.4,23.8,14.3,8.1999999999999993,3.9,2,22.8,70,98.5,1515,"All",7.7,11.3,20.9,25.4,15.6,10.199999999999999,5.2,2.4,19,65.3,98.6,2270]
["Physical Education","Males",2.6,16.2,26.2,26.2,17.100000000000001,8.4,2.5,0.5,18.8,71.3,99.7,57174,"Females",5.4,19,24.5,23.7,15.9,8,2.8,0.6,24.3,72.5,99.7,30253,"All",3.6,17.2,25.6,25.3,16.7,8.3000000000000007,2.6,0.5,20.7,71.7,99.7,87427]
["Religious Studies","Males",7.9,16.5,22,21.2,12.7,8.5,5.5,3.3,24.4,67.599999999999994,97.7,96450,"Females",15.4,23.3,23.7,17.3,9.1,5.4,3.1,1.6,38.700000000000003,79.7,98.9,114152,"All",11.9,20.2,22.9,19.100000000000001,10.8,6.8,4.2,2.4,32.200000000000003,74.2,98.4,210602]
["Statistics","Males",5,17.600000000000001,25,28.7,13.4,5.0999999999999996,1.9,1,22.6,76.3,97.8,27732,"Females",7,20.2,27,27.1,10.8,3.9,1.6,0.7,27.2,81.3,98.3,24817,"All",5.9,18.8,25.9,28,12.2,4.5999999999999996,1.8,0.9,24.8,78.7,98,52549]
["Vocational Studies","Males",1.4,7.7,18.899999999999999,26.5,22.2,12.9,5.9,2.6,9.1,54.4,98.1,15129,"Females",3.7,15.5,25.8,24.7,16.5,8.3000000000000007,3.2,1.2,19.2,69.7,98.9,16873,"All",2.6,11.8,22.5,25.5,19.2,10.5,4.4000000000000004,1.8,14.4,62.5,98.5,32002]
["All Subjects","Males",6.6,13.8,21.2,27,15.3,8.1,4.5,2.1,20.399999999999999,68.7,98.7,2180535,"Females",9.4,18,24,25.3,12.3,5.8,3,1.4,27.4,76.7,99.2,2247133,"All",8,16,22.6,26.1,13.8,7,3.7,1.7,24,72.7,99,4427668]

{"sheet":"2013","index":7,"n_rows":64,"n_cols":42,"rows_kept":64,"cut":false,"hidden":true,"merged":[]}
[1,2,3,4,5,6,7,8,9,10,11,12,13,14,15,16,17,18,19,20,21,22,23,24,25,26,27,28,29,30,31,32,33,34,35,36,37,38,39,40]
["Subjects",null,"*","A","B","C","D","E","F","G","AstarA","AstarC","AstarG","Total","(No column name)","*","A","B","C","D","E","F","G","AstarA","AstarC","AstarG","Total","(No column name)","*","A","B","C","D","E","F","G","AstarA","AstarC","AstarG","Total",null,"Count of supressions"]
["English","Males",2.5,9.1999999999999993,19.7,32,19.600000000000001,10.199999999999999,4.5999999999999996,1.5,11.7,63.4,99.2,274738,"Females",5.6,16.8,26.7,28.9,13.6,5.4,2,0.6,22.4,78,99.6,276063,"All",4,13,23.2,30.5,16.600000000000001,7.8,3.3,1.1000000000000001,17.100000000000001,70.7,99.4,550801]
["Mathematics","Males",7.1,12.6,19.399999999999999,33.200000000000003,10.3,6.5,5.4,3.6,19.7,72.3,98.1,305315,"Females",6.7,13,20.3,33.200000000000003,10.5,6.3,5,3.4,19.7,73.2,98.3,297858,"All",6.9,12.8,19.899999999999999,33.200000000000003,10.4,6.4,5.2,3.5,19.7,72.8,98.2,603173]
["Core Science","Males",0.9,5,16.2,34.700000000000003,20.5,12,6.4,2.7,5.9,56.7,98.3,158387,"Females",1.6,8,19.8,34.1,18.2,10.1,5,2,9.6,63.4,98.7,163577,"All",1.2,6.5,18,34.4,19.3,11.1,5.7,2.2999999999999998,7.8,60.1,98.5,321964]
["Additional Science","Males",1.8,7.6,18.8,33.700000000000003,21.7,9.4,4.3,1.7,9.4,61.9,99,119596,"Females",3.1,10.4,22.1,32.700000000000003,18.899999999999999,7.7,3.2,1.2,13.5,68.3,99.3,128934,"All",2.5,9.1,20.5,33.200000000000003,20.2,8.5,3.7,1.4,11.5,65.2,99.1,248530]
["Additional Applied Science","Males",0.1,1.3,5.5,20.3,29.8,22.6,11.7,4.9000000000000004,1.4,27.2,96.2,5669,"Females",0.1,2,8.9,27.4,28.7,19.2,8.4,3.2,2.2000000000000002,38.4,97.9,6141,"All",0.1,1.7,7.2,24,29.2,20.9,10,4,1.8,33,97.1,11810]
["Physics","Males",15.6,25.9,28,21.6,7.2,1.2,0.3,0.1,41.5,91.1,99.9,76223,"Females",17.100000000000001,25.5,27.9,21.2,6.8,1.2,0.3,0.1,42.5,91.6,99.9,73173,"All",16.3,25.7,28,21.4,7,1.2,0.3,0.1,42,91.4,99.9,149396]
["Chemistry","Males",15.3,24.7,27.5,22.1,8.3000000000000007,1.7,0.4,0.1,40,89.5,99.9,77132,"Females",19.100000000000001,27.5,26.7,19.2,6.1,1.1000000000000001,0.3,0.1,46.6,92.4,99.9,73637,"All",17.2,26.1,27.1,20.6,7.2,1.4,0.3,0.1,43.2,90.9,99.9,150769]
["Biological Sciences","Males",12.5,25.3,29.4,22.9,7.8,1.5,0.4,0.2,37.799999999999997,90.1,99.8,77657,"Females",18.399999999999999,29.2,27.5,18,5.2,1,0.3,0.1,47.6,93.1,99.8,74767,"All",15.4,27.2,28.5,20.5,6.5,1.2,0.3,0.1,42.6,91.6,99.8,152424]
["Computer Science","Males",6.9,20.2,23.9,18.399999999999999,12.4,7.5,5,2.7,27.1,69.400000000000006,97,3434,"Females",8.9,19.8,26.2,18.100000000000001,13.8,6.1,3.6,1.9,28.6,72.900000000000006,98.3,587,"All",7.2,20.100000000000001,24.3,18.3,12.6,7.3,4.8,2.6,27.3,69.900000000000006,97.2,4021]
["Other Sciences","Males",10.9,15.1,19.3,18.100000000000001,13.1,9.9,7.5,3.1,26,63.4,97.1,3895,"Females",4.7,14.8,18.899999999999999,21.3,17.7,10.5,6.5,3.4,19.5,59.8,97.8,2090,"All",8.6999999999999993,15,19.100000000000001,19.2,14.7,10.1,7.2,3.2,23.7,62.1,97.3,5985]
["D & T: Electronic Products","Males",8.1999999999999993,13.8,20.6,21.1,15.2,9.1999999999999993,6,3.3,22.1,63.7,97.4,7852,"Females",22.6,24.1,21.5,13.5,8.4,5.0999999999999996,2.6,0.8,46.7,81.7,98.6,646,"All",9.3000000000000007,14.6,20.7,20.5,14.7,8.9,5.7,3.1,23.9,65.099999999999994,97.5,8498]
["D & T: Food Technology","Males",2,6.3,15.3,25.5,22.9,14.9,7.7,3.5,8.3000000000000007,49.1,98.2,16119,"Females",7.8,16.399999999999999,23.5,23,15,8.1,3.8,1.5,24.2,70.7,99.2,27307,"All",5.6,12.7,20.399999999999999,24,18,10.7,5.2,2.2999999999999998,18.3,62.7,98.8,43426]
["D & T: Graphic Products","Males",2.8,8.4,16.899999999999999,22.5,19.7,13,8.4,4.8,11.3,50.7,96.5,22244,"Females",8.6999999999999993,19.100000000000001,22.7,21.5,13.9,7,3.7,2,27.8,72,98.7,13994,"All",5.0999999999999996,12.5,19.100000000000001,22.1,17.5,10.7,6.6,3.7,17.600000000000001,58.9,97.4,36238]
["D & T: Resistant Materials","Males",3.6,9.5,18.7,24.5,19.3,12.2,7.1,3.4,13.1,56.2,98.2,44851,"Females",9.3000000000000007,19.2,23.5,20.5,13.6,7.2,3.6,1.9,28.6,72.599999999999994,98.9,7575,"All",4.4000000000000004,10.9,19.399999999999999,23.9,18.5,11.4,6.5,3.2,15.3,58.6,98.3,52426]
["D & T: Systems & Control","Males",6.2,13.9,20.9,22.3,18.100000000000001,10.3,4.2,2.5,20.100000000000001,63.3,98.4,3250,"Females",8.1999999999999993,23.6,24.9,22.7,12,4.3,2.1,1.7,31.8,79.400000000000006,99.6,233,"All",6.3,14.6,21.1,22.4,17.7,9.9,4.0999999999999996,2.4,20.9,64.400000000000006,98.5,3483]
["D & T: Textiles Technology","Males",2.4,6.5,13.7,15.9,20.7,15.7,13.7,7.2,8.9,38.6,95.8,765,"Females",10.199999999999999,18.600000000000001,24,22.1,12.7,6.6,3.5,1.5,28.8,74.900000000000006,99.1,26995,"All",10,18.3,23.7,21.9,12.9,6.9,3.7,1.6,28.2,73.900000000000006,99,27760]
["Other Design and Technology","Males",2.9,8.1,17.600000000000001,25.2,19.600000000000001,12.5,7.8,3.9,11,53.8,97.6,23396,"Females",8.8000000000000007,17.3,23.9,22,13.4,7.7,4,1.8,26.1,72,98.9,10358,"All",4.7,10.9,19.5,24.2,17.7,11,6.6,3.3,15.6,59.4,98,33754]
["Applied Engineering","Males",0.8,4.2,13.5,22.5,23.2,16.7,10.8,5.8,5,40.9,97.5,1959,"Females",8.6999999999999993,17.3,19.7,17.3,16.2,13.3,3.5,2.9,26,63,98.8,173,"All",1.4,5.3,14,22.1,22.6,16.5,10.199999999999999,5.6,6.7,42.7,97.6,2132]
["Information Technology","Males",5.6,16.3,23.7,23.9,12.8,7,5.2,3.3,22,69.599999999999994,97.9,29983,"Females",9.1999999999999993,21.7,25.6,20.7,10,5.6,3.4,2.2999999999999998,31,77.3,98.5,23753,"All",7.2,18.7,24.5,22.5,11.6,6.4,4.4000000000000004,2.8,25.9,73,98.2,53736]
["Business Studies","Males",3.2,14.1,24.6,24.2,15.6,9.1,5.0999999999999996,2.8,17.3,66.099999999999994,98.7,38383,"Females",4.5999999999999996,17.2,25.4,23,14.4,7.8,4.5,2,21.8,70.3,99,26063,"All",3.7,15.4,25,23.7,15.1,8.6,4.8,2.5,19.100000000000001,67.8,98.8,64446]
["Applied Business","Males",2,10.4,20.5,24.7,17.600000000000001,9.6,6.4,4.0999999999999996,12.4,57.6,95.3,2908,"Females",4.5,17.100000000000001,24.8,21.9,14.8,7.2,4.5,2.8,21.6,68.400000000000006,97.7,1837,"All",3,13,22.2,23.6,16.5,8.6999999999999993,5.6,3.6,16,61.8,96.2,4745]
["Home Economics","Males",0.6,5.9,15.4,23.8,21.8,15.5,10.7,4.3,6.5,45.7,98,3668,"Females",2.8,11.4,20.3,24,19.5,11.7,6,2.6,14.2,58.5,98.5,22582,"All",2.5,10.6,19.600000000000001,24,19.899999999999999,12.3,6.7,2.8,13.1,56.7,98.4,26250]
["Geography","Males",7.4,15.5,19.600000000000001,22.9,16.7,9.4,5,2.5,22.9,65.5,99,107293,"Females",12.8,20.100000000000001,21.2,20.2,12.7,6.9,3.7,1.7,32.9,74.400000000000006,99.4,92953,"All",9.9,17.600000000000001,20.399999999999999,21.7,14.8,8.1999999999999993,4.4000000000000004,2.1,27.6,69.599999999999994,99.1,200246]
["History","Males",7.8,16.3,20.7,20.3,14.7,9,5.6,3.5,24.2,65.2,97.9,115848,"Females",12.7,21,21.6,18.2,11.9,7,4.2,2.2000000000000002,33.6,73.400000000000006,98.8,118860,"All",10.3,18.7,21.1,19.2,13.3,8,4.9000000000000004,2.8,29,69.3,98.3,234708]
["Ancient History","Males",15.2,21,18.2,18.399999999999999,12.1,7.3,4.2,2,36.200000000000003,72.900000000000006,98.4,505,"Females",11.5,22.4,19,18.7,13.5,9.1999999999999993,4,1,33.9,71.599999999999994,99.3,401,"All",13.6,21.6,18.5,18.5,12.7,8.1999999999999993,4.0999999999999996,1.5,35.200000000000003,72.3,98.8,906]
["Humanities","Males",1,4.5,13.2,20.8,19.600000000000001,16.2,11.6,8.1999999999999993,5.6,39.5,95,6290,"Females",1.8,7.8,17.600000000000001,22.6,18.600000000000001,14.1,9.1999999999999993,5.0999999999999996,9.6,49.8,96.9,6138,"All",1.4,6.2,15.4,21.7,19.100000000000001,15.2,10.4,6.7,7.6,44.6,96,12428]
["Economics","Males",6.8,23.7,27.8,21.2,9.6,5.2,3.2,1.3,30.5,79.5,98.9,2971,"Females",6.4,25.6,28.9,18.8,9.5,5,2.9,1.1000000000000001,32,79.8,98.3,1311,"All",6.7,24.3,28.1,20.5,9.6,5.2,3.1,1.3,31,79.599999999999994,98.7,4282]
["Social Studies","Males",1.9,9,20,25.4,18,11.8,7.1,4.2,10.9,56.3,97.4,15456,"Females",4.3,16.600000000000001,25.5,22.8,14.1,7.9,4.7,2.6,20.8,69.099999999999994,98.4,28684,"All",3.4,13.9,23.6,23.7,15.5,9.3000000000000007,5.6,3.2,17.3,64.599999999999994,98.1,44140]
["Music","Males",8.1,21.3,25.1,19.600000000000001,12.8,7.1,3.1,1.6,29.4,74.099999999999994,98.7,20680,"Females",10,24.5,26,18.399999999999999,11,5.7,2.5,1.2,34.6,79,99.3,20576,"All",9.1,22.9,25.5,19,11.9,6.4,2.8,1.4,32,76.5,99,41256]
["Arabic","Males",24.9,21.3,17.100000000000001,12.2,8.3000000000000007,5.2,3.7,3.3,46.2,75.5,95.9,1183,"Females",30.4,21.3,15.8,11.5,6,5.2,3.3,3.5,51.7,79,97,1447,"All",27.9,21.3,16.399999999999999,11.8,7,5.2,3.5,3.4,49.2,77.400000000000006,96.5,2630]
["Chinese","Males",58.2,15.7,12.1,9.4,2.9,1.1000000000000001,"x","x",73.900000000000006,95.4,99.6,1229,"Females",70.099999999999994,15.7,9.3000000000000007,3,1.3,0.4,"x","x",85.8,98,99.8,1112,"All",63.8,15.7,10.8,6.3,2.1,0.7,"x","x",79.5,96.6,99.7,2341]
["French","Males",7.6,12.1,17.8,26.4,20.9,9.1999999999999993,4,1.4,19.7,64,99.4,68953,"Females",11.3,16.3,21.3,25.9,16.2,6,2.2000000000000002,0.7,27.6,74.7,99.7,92868,"All",9.6999999999999993,14.5,19.8,26.1,18.2,7.3,2.9,1,24.2,70.099999999999994,99.6,161821]
["German","Males",7.1,12.6,21.9,28.5,18.2,7.5,2.8,0.9,19.8,70.2,99.7,28938,"Females",10.6,17,24.8,27.2,14,4.4000000000000004,1.4,0.4,27.6,79.599999999999994,99.8,31382,"All",8.9,14.9,23.4,27.8,16,5.9,2.1,0.6,23.8,75.099999999999994,99.7,60320]
["Italian","Males",39,17.7,16.100000000000001,14.6,7.6,2.5,"x","x",56.7,87.3,99.4,1766,"Females",38.5,20.3,17.8,13.5,6.7,2.1,"x","x",58.9,90.1,99.9,2314,"All",38.799999999999997,19.2,17,14,7.1,2.2999999999999998,1.1000000000000001,0.3,57.9,88.9,99.7,4080]
["Polish","Males",21.7,42.8,20.3,8.5,2.2000000000000002,1.7,0.7,1,64.5,93.3,98.9,1456,"Females",38,40.9,12.5,4.5999999999999996,1.4,0.8,0.5,0.9,78.8,96,99.5,1488,"All",29.9,41.8,16.3,6.6,1.8,1.3,0.6,1,71.7,94.6,99.2,2944]
["Spanish","Males",10,14.1,17.8,24.1,18.399999999999999,8.6999999999999993,4.0999999999999996,1.9,24.1,65.900000000000006,98.9,35325,"Females",14.5,18.2,20.6,22.8,14.2,5.8,2.2999999999999998,0.9,32.799999999999997,76.2,99.4,47408,"All",12.6,16.5,19.399999999999999,23.4,16,7,3.1,1.3,29.1,71.8,99.2,82733]
["Urdu","Males",6,17.600000000000001,23.6,21.8,14.7,9.3000000000000007,4.3,1.4,23.5,68.900000000000006,98.7,1487,"Females",11,25.9,22.6,19.899999999999999,11.5,5.4,2.2000000000000002,1.1000000000000001,36.9,79.400000000000006,99.5,2606,"All",9.1999999999999993,22.8,22.9,20.6,12.7,6.8,3,1.2,32,75.599999999999994,99.2,4093]
["Other Modern Languages","Males",28.5,26.5,19.5,12,5.9,3.4,1.6,1.2,55,86.5,98.7,4465,"Females",34.6,26.7,18.3,11,5.0999999999999996,1.8,0.9,0.6,61.3,90.6,99.1,4856,"All",31.7,26.6,18.899999999999999,11.5,5.5,2.6,1.2,0.9,58.3,88.7,98.9,9321]
["Classical Civilisation","Males",9.6,23.5,25.7,21.6,10.7,5.0999999999999996,2.1,1.1000000000000001,33.1,80.400000000000006,99.4,2047,"Females",14.3,30.6,25.2,14.7,9.3000000000000007,3.9,1,0.6,44.9,84.9,99.7,1805,"All",11.8,26.8,25.5,18.399999999999999,10.1,4.5999999999999996,1.6,0.9,38.6,82.5,99.6,3852]
["Classical Greek","Males",61.9,22.4,8,4.3,2.2000000000000002,"x",0.6,"x",84.4,96.6,100,678,"Females",64.099999999999994,25.3,5.4,2.9,1.1000000000000001,"x",0,"x",89.5,97.8,99.8,446,"All",62.8,23.6,6.9,3.7,1.8,"x",0.4,"x",86.4,97.1,99.9,1124]
["Latin","Males",42,28.6,14.2,7.2,3.8,2.2000000000000002,0.7,0.5,70.599999999999994,92,99.3,4334,"Females",46.4,26.6,13.2,6.8,3.6,1.6,0.9,0.5,73,93,99.7,4659,"All",44.2,27.6,13.7,7,3.7,1.9,0.8,0.5,71.8,92.5,99.5,8993]
["Other Classical Studies","Males",4.2,25.2,26.9,12.6,8.4,3.4,2.5,"x",29.4,68.900000000000006,84,119,"Females",13.1,30.3,23.6,16.600000000000001,6.4,1.9,3.5,"x",43.3,83.4,97.5,314,"All",10.6,28.9,24.5,15.5,6.9,2.2999999999999998,3.2,1.8,39.5,79.400000000000006,93.8,433]
["Applied Art and Design","Males",1.3,4.5,20.7,30.6,17.8,11.8,8.6,3.7,5.8,57.1,99,382,"Females",7.5,13.2,28.6,30.5,12.1,4.3,1.9,1.2,20.6,79.7,99.3,669,"All",5.2,10,25.7,30.5,14.2,7,4.4000000000000004,2.1,15.2,71.5,99.1,1051]
["Art and Design","Males",5.4,8.4,18.8,32,16.5,9.5,5.5,2.4,13.7,64.5,98.3,54309,"Females",12.1,16.5,26.7,27.3,9.8000000000000007,4.2,2,0.7,28.6,82.7,99.3,110201,"All",9.9,13.8,24.1,28.9,12,5.9,3.1,1.2,23.7,76.7,99,164510]
["Communication Studies","Males",1.7,8.5,17.3,21.5,20.100000000000001,13.6,8.8000000000000007,4.9000000000000004,10.199999999999999,49,96.5,4125,"Females",6.8,15.6,24.8,23.5,14.6,8.1,3.7,1.4,22.4,70.8,98.6,4940,"All",4.5,12.4,21.4,22.6,17.100000000000001,10.6,6,3,16.899999999999999,60.9,97.7,9065]
["Construction","Males",0,"x",14,32.6,34.9,"x","x","x","x",51.2,97.7,43,"Females",0,0,0,0,0,0,0,0,0,0,0,0,"All",0,"x",14,32.6,34.9,"x","x","x","x",51.2,97.7,43]
["Dance","Males",5.0999999999999996,17.399999999999999,18.3,21.1,19.399999999999999,10.1,5.9,1.6,22.5,61.9,98.9,743,"Females",4.5999999999999996,15.5,20.8,24.6,18.600000000000001,9.3000000000000007,4.2,1.3,20.2,65.5,99,10797,"All",4.7,15.6,20.6,24.4,18.7,9.4,4.3,1.3,20.3,65.3,99,11540]
["Drama","Males",3.4,13.5,22.5,26.5,18.2,9.1,4.0999999999999996,1.7,16.899999999999999,65.900000000000006,98.9,27145,"Females",6.3,20.100000000000001,27.9,23.5,12.9,5.7,2.2000000000000002,0.9,26.4,77.8,99.5,42609,"All",5.2,17.5,25.8,24.7,14.9,7,2.9,1.2,22.7,73.2,99.3,69754]
["English Literature","Males",3.8,13.2,26.5,27.6,16.7,7,2.9,1.2,17,71,98.9,197831,"Females",7.4,21.5,31.4,23.1,10.6,3.5,1.3,0.5,28.9,83.5,99.4,223967,"All",5.7,17.600000000000001,29.1,25.2,13.5,5.2,2,0.9,23.3,77.599999999999994,99.1,421798]
["English Studies","Males","x","x",8.6999999999999993,27,31.4,20.100000000000001,5.4,4.5,1.3,37,98.3,1112,"Females","x","x",16.8,31.6,27.1,12.3,5.4,3.1,2.4,50.7,98.6,978,"All","x","x",12.5,29.1,29.4,16.399999999999999,5.4,3.8,1.8,43.4,98.4,2090]
["General Studies","Males",2.2000000000000002,6.2,11.6,18.399999999999999,20.5,14,8.8000000000000007,6.9,8.4,38.5,88.6,2473,"Females",4.2,10.6,17.2,20.9,21.4,12.1,5.3,3.1,14.7,52.8,94.8,2383,"All",3.2,8.3000000000000007,14.3,19.7,20.9,13.1,7.1,5.0999999999999996,11.5,45.5,91.7,4856]
["Health and Social Care","Males","x","x",10.199999999999999,17.8,19.8,18,11.7,10.199999999999999,2.8,30.7,90.4,394,"Females","x","x",19.2,25.8,19.2,11,7.4,5.0999999999999996,9.9,54.9,97.7,7356,"All",1.6,8,18.7,25.4,19.3,11.4,7.7,5.4,9.5,53.7,97.3,7750]
["Hospitality and Catering","Males","x",3.5,14.5,24.6,27.6,19,8.1,"x",3.6,42.8,99.5,743,"Females","x",11.6,22.7,27,18.3,10,3.6,"x",16.7,66.400000000000006,99.5,1294,"All",3.3,8.6,19.7,26.1,21.7,13.3,5.3,1.5,11.9,57.8,99.5,2037]
["Leisure and Tourism","Males",0.4,3.5,8.4,16.899999999999999,21.2,16.399999999999999,13.9,10.7,3.9,29.2,91.3,1148,"Females",2,7.5,18.600000000000001,23.4,19.2,10.9,9.9,4.2,9.5,51.5,95.7,1368,"All",1.3,5.6,14,20.399999999999999,20.100000000000001,13.4,11.7,7.2,7,41.3,93.7,2516]
["Manufacturing","Males",0,"x",4.7,20,21.2,"x","x","x","x",30.6,97.6,85,"Females",0,"x",0,21.4,28.6,"x","x","x","x",28.6,92.9,14,"All",0,6.1,4,20.2,22.2,18.2,17.2,9.1,6.1,30.3,97,99]
["Media/Film/TV","Males",1.6,7.7,19.3,27.2,21,11.7,6.3,3,9.3000000000000007,55.9,97.9,24111,"Females",5,17.7,27.5,25.3,13.2,6.1,2.8,1.4,22.7,75.5,99,24587,"All",3.3,12.8,23.5,26.3,17.100000000000001,8.9,4.5,2.2000000000000002,16.100000000000001,65.8,98.5,48698]
["Performing Arts","Males",3.1,5.2,15.2,23.4,22.6,15.2,8.9,3.6,8.1999999999999993,46.8,97,948,"Females",8.9,12.2,20.8,24.9,16.100000000000001,8.6,5.5,1.4,21.2,66.900000000000006,98.6,2131,"All",7.1,10.1,19.100000000000001,24.5,18.100000000000001,10.7,6.6,2,17.2,60.7,98.1,3079]
["Physical Education","Males",2.4,14.8,26,27.3,17.5,8.8000000000000007,2.4,0.4,17.3,70.599999999999994,99.7,60323,"Females",5.5,20.399999999999999,25,22.2,15.6,8,2.6,0.5,25.9,73.099999999999994,99.7,31257,"All",3.5,16.7,25.7,25.6,16.8,8.5,2.5,0.4,20.2,71.400000000000006,99.7,91580]
["Religious Studies","Males",7.5,16.100000000000001,22.3,20.9,12.8,8.5,5.7,3.6,23.7,66.900000000000006,97.5,104900,"Females",15,23.1,23.6,17.5,9.1,5.4,3.1,1.9,38.1,79.3,98.8,124109,"All",11.6,19.899999999999999,23,19.100000000000001,10.8,6.9,4.3,2.6,31.5,73.599999999999994,98.2,229009]
["Statistics","Males",4.8,18.100000000000001,26.7,26,13.6,5.4,2.1,1.1000000000000001,22.9,75.5,97.7,23230,"Females",6,20.399999999999999,27.8,26.4,11.3,3.7,1.5,0.8,26.4,80.5,97.9,21244,"All",5.3,19.2,27.2,26.2,12.5,4.5999999999999996,1.8,1,24.5,77.900000000000006,97.8,44474]
["Vocational Studies","Males",1,6.8,17.5,27.4,22.5,13.4,6.7,2.7,7.8,52.7,98,16022,"Females",3.7,15.2,25.5,25.2,16.8,8.1999999999999993,3.4,1.1000000000000001,18.899999999999999,69.599999999999994,99.1,17307,"All",2.4,11.2,21.6,26.3,19.600000000000001,10.7,5,1.9,13.6,61.5,98.6,33329]
["All Subjects","Males",5.9,13.1,21.2,27.6,15.8,8.3000000000000007,4.5,2.2000000000000002,19,67.8,98.6,2238514,"Females",9,17.7,24.2,25.6,12.5,5.8,2.9,1.4,26.7,76.5,99.1,2347182,"All",7.5,15.5,22.7,26.6,14.1,7,3.7,1.8,22.9,72.2,98.9,4585696]

{"sheet":"2014","index":8,"n_rows":132,"n_cols":40,"rows_kept":132,"cut":false,"hidden":true,"merged":[]}
[1,2,3,4,5,6,7,8,9,10,11,12,13,14,15,16,17,18,19,20,21,22,23,24,25,26,27,28,29,30,31,32,33,34,35,36,37,38,39,40]
["Subjects",null,"*","A","B","C","D","E","F","G","AstarA","AstarC","AstarG","Total","(No column name)","*","A","B","C","D","E","F","G","AstarA","AstarC","AstarG","Total","(No column name)","*","A","B","C","D","E","F","G","AstarA","AstarC","AstarG","Total"]
["English","Males",2.7,9.5,21.1,31.5,19.7,9.1,3.8,1.5,12.1,64.7,98.8,229932,"Females",5.9,17,28.1,28.8,13,4.4000000000000004,1.5,0.6,22.9,79.8,99.3,234257,"All",4.3,13.3,24.6,30.1,16.3,6.7,2.7,1,17.600000000000001,72.400000000000006,99.1,464189]
["Mathematics","Males",7.2,11.5,18.5,30.1,12.3,6.2,4.8,3.9,18.7,67.3,94.5,303147,"Females",6.5,11.8,19.5,31,12.4,5.9,4.5,3.5,18.3,68.7,95.1,293691,"All",6.8,11.7,19,30.5,12.4,6.1,4.5999999999999996,3.7,18.5,68,94.8,596838]
["Core Science","Males",1,5.8,17,34.9,19.899999999999999,11.2,5.9,2.5,6.8,58.8,98.2,175051,"Females",1.7,8.5,20.6,34.4,17.5,9.3000000000000007,4.5999999999999996,1.8,10.199999999999999,65.2,98.5,177855,"All",1.4,7.2,18.8,34.6,18.7,10.199999999999999,5.3,2.1,8.5,62,98.3,352906]
["Additional Science","Males",2,8.1,20.399999999999999,32.4,21.8,9.1,3.9,1.5,10,62.8,99.2,131575,"Females",2.7,10.199999999999999,23.4,32.299999999999997,19.399999999999999,7.3,2.9,1.1000000000000001,12.9,68.7,99.4,139627,"All",2.2999999999999998,9.1999999999999993,22,32.4,20.6,8.1999999999999993,3.4,1.3,11.5,65.8,99.3,271202]
["Further Additional Science","Males",10,20.7,27.1,25.1,12.2,3.6,0.8,0.2,30.7,82.9,99.7,10607,"Females",11.6,22.5,28,23.7,10.6,2.8,0.5,0.2,34,85.7,99.8,10429,"All",10.8,21.6,27.5,24.4,11.4,3.2,0.6,0.2,32.4,84.3,99.8,21036]
["Additional Applied Science","Males",0,0.9,5.2,20,29.3,23.5,13,5.0999999999999996,0.9,26.1,97,6616,"Females",0.1,1.2,9.8000000000000007,26.4,30.7,18.5,8.5,2.9,1.4,37.5,98.1,6697,"All",0.1,1.1000000000000001,7.5,23.2,30,21,10.7,4,1.1000000000000001,31.8,97.5,13313]
["Physics","Males",14.5,27.3,29.2,20.5,6.8,1.2,0.3,0.1,41.8,91.5,99.9,65148,"Females",15.9,27.2,28.9,20.100000000000001,6.4,1.2,0.2,0.1,43.1,92,99.9,63604,"All",15.2,27.3,29.1,20.3,6.6,1.2,0.2,0.1,42.4,91.8,99.9,128752]
["Chemistry","Males",13.1,26.6,29.1,21.1,7.7,1.7,0.4,0.1,39.700000000000003,90,99.9,65818,"Females",16.7,29.3,28.4,17.899999999999999,5.9,1.2,0.3,0.1,46.1,92.4,99.9,63841,"All",14.9,28,28.8,19.5,6.8,1.5,0.3,0.1,42.9,91.2,99.9,129659]
["Biological Sciences","Males",11.2,26.3,30.2,21.8,7.5,1.7,0.6,0.3,37.5,89.5,99.7,67270,"Females",16.7,29.9,28.6,17.100000000000001,5.5,1.2,0.5,0.2,46.6,92.4,99.8,65698,"All",13.9,28.1,29.4,19.5,6.5,1.5,0.6,0.2,42,91,99.7,132968]
["Computer Science","Males",6,16.600000000000001,21.3,20.399999999999999,14,8.8000000000000007,5.4,3.4,22.6,64.400000000000006,96.1,13428,"Females",8.3000000000000007,19.399999999999999,21.7,21.2,13.6,7.4,3.7,1.7,27.7,70.599999999999994,97,2374,"All",6.4,17,21.4,20.5,14,8.6,5.2,3.2,23.4,65.3,96.2,15802]
["Other Sciences","Males",10.199999999999999,14.3,16.100000000000001,16.7,15.3,11.7,8.3000000000000007,4.8,24.5,57.2,97.3,4288,"Females",4.4000000000000004,9.6,18,21.6,17.3,12.8,8.1999999999999993,5.3,14,53.6,97.1,2580,"All",8,12.6,16.8,18.5,16,12.1,8.1999999999999993,5,20.6,55.9,97.2,6868]
["D & T: Electronic Products","Males",6.9,14.5,21.4,20.9,14.8,9.9,6.1,3.4,21.5,63.8,98,7692,"Females",17,26.1,24.5,13.2,9.6,5.9,1.6,1.3,43.2,80.900000000000006,99.2,628,"All",7.7,15.4,21.7,20.399999999999999,14.4,9.6,5.8,3.2,23.1,65.099999999999994,98.1,8320]
["D & T: Food Technology","Males",1.5,5.8,14.1,24.3,23.2,15.7,9.1,4.0999999999999996,7.4,45.8,97.9,14951,"Females",7.2,16.899999999999999,23.7,23.2,14.9,8,3.8,1.5,24.1,70.900000000000006,99.1,25639,"All",5.0999999999999996,12.8,20.2,23.6,18,10.8,5.8,2.5,17.899999999999999,61.7,98.7,40590]
["D & T: Graphic Products","Males",2.8,8.6,16.8,22.7,19.8,12.9,8.1999999999999993,5,11.3,50.9,96.8,20953,"Females",7.8,18.5,23.5,21.3,14,7.5,4,2.1,26.4,71.2,98.8,12921,"All",4.7,12.4,19.3,22.2,17.600000000000001,10.8,6.6,3.9,17.100000000000001,58.6,97.6,33874]
["D & T: Resistant Materials","Males",2.9,8.8000000000000007,18.2,24.4,19.7,12.7,7.6,3.7,11.7,54.4,98,45024,"Females",8.6999999999999993,18.399999999999999,23.9,21.2,13.8,7.3,3.7,2.1,27.2,72.2,99.1,7760,"All",3.7,10.199999999999999,19.100000000000001,24,18.8,11.9,7,3.4,14,57,98.2,52784]
["D & T: Systems & Control","Males",8.1,13.2,20.399999999999999,22,16.600000000000001,9.5,6,"x",21.3,63.8,98.6,3091,"Females",4.7,20,19.3,22.7,20.7,6.7,4,"x",24.7,66.7,98.7,150,"All",8,13.5,20.399999999999999,22.1,16.8,9.4,5.9,2.7,21.5,63.9,98.6,3241]
["D & T: Textiles Technology","Males",2.9,4,9.6,19.8,20,17.600000000000001,14.6,5.9,7,36.299999999999997,94.4,820,"Females",10,17.100000000000001,23,22.5,14,7.5,3.4,1.6,27.1,72.599999999999994,99.1,24773,"All",9.8000000000000007,16.7,22.6,22.4,14.1,7.8,3.8,1.7,26.5,71.5,98.9,25593]
["Other Design and Technology","Males",2.8,7.9,16.899999999999999,24.3,20.399999999999999,13.3,8,3.9,10.8,52,97.6,26092,"Females",9.1,18.3,23.5,21.2,13.5,7.5,3.9,2,27.4,72.099999999999994,99,10761,"All",4.7,11,18.899999999999999,23.4,18.399999999999999,11.6,6.8,3.3,15.6,57.9,98,36853]
["Applied Engineering","Males","x",3.9,11.3,21.9,22.1,17.600000000000001,10.3,6.3,5,38.200000000000003,94.5,3863,"Females","x",10.1,21.5,22.8,21.5,14.9,4.8,3.1,11,55.3,99.6,228,"All",1,4.3,11.9,22,22.1,17.399999999999999,10,6.1,5.3,39.200000000000003,94.7,4091]
["Information Technology","Males",4.4000000000000004,14.4,22.8,23.5,14.4,8.1,5.6,4,18.8,65.099999999999994,97.2,46552,"Females",7.5,18.8,23.8,22.4,12.3,6.6,3.8,2.7,26.3,72.5,97.9,35324,"All",5.8,16.3,23.2,23,13.5,7.4,4.8,3.4,22.1,68.3,97.5,81876]
["Business Studies","Males",3.1,13.7,23.8,23.9,16.2,9.1999999999999993,5.3,3,16.7,64.5,98.2,43774,"Females",4.5,17.5,25.6,22.8,13.9,7.8,4.3,2.2000000000000002,22,70.400000000000006,98.7,30552,"All",3.6,15.2,24.5,23.5,15.3,8.6999999999999993,4.9000000000000004,2.7,18.899999999999999,66.900000000000006,98.4,74326]
["Applied Business","Males",1.8,9.1,18.7,23.5,16.8,12,7.4,4.9000000000000004,10.9,53.1,94.2,4852,"Females",3.6,16.8,23.3,20.100000000000001,13.9,9.5,5.5,3.6,20.399999999999999,63.8,96.2,3185,"All",2.6,12.2,20.5,22.1,15.7,11,6.6,4.4000000000000004,14.7,57.4,95,8037]
["Home Economics","Males",0.6,4,13.1,23.1,22.6,17.8,10.9,5.0999999999999996,4.5999999999999996,40.9,97.3,3594,"Females",3,10.7,19.600000000000001,23.6,19.7,12.5,6.5,2.8,13.7,56.9,98.4,24583,"All",2.7,9.9,18.8,23.6,20,13.1,7.1,3.1,12.5,54.9,98.2,28177]
["Ancient History","Males",15.5,20.8,19.5,14.2,9.4,9.1,4.3,2.9,36.299999999999997,70.099999999999994,95.8,625,"Females",14.8,24.3,18.5,19.7,11.4,6.7,1.8,1.8,39.1,77.3,99,507,"All",15.2,22.3,19.100000000000001,16.7,10.3,8,3.2,2.4,37.5,73.3,97.3,1132]
["Geography","Males",7.3,15,19.7,23.3,16.399999999999999,9.5,5.0999999999999996,2.6,22.3,65.3,98.9,112281,"Females",12.2,19.7,21.2,20.399999999999999,12.6,7.3,4,1.9,31.9,73.599999999999994,99.3,96959,"All",9.6,17.2,20.399999999999999,22,14.6,8.5,4.5999999999999996,2.2999999999999998,26.8,69.099999999999994,99.1,209240]
["History","Males",7.7,16.5,20.7,19.8,14.2,9.3000000000000007,5.8,3.7,24.2,64.7,97.6,115413,"Females",12.4,20.399999999999999,21.1,17.8,12.1,7.6,4.5,2.6,32.799999999999997,71.7,98.5,122846,"All",10.1,18.5,20.9,18.8,13.1,8.4,5.0999999999999996,3.1,28.6,68.3,98.1,238259]
["Humanities","Males",1.2,5,13.5,19.899999999999999,18.399999999999999,16.100000000000001,12.1,7.6,6.2,39.6,93.7,5150,"Females",3.1,9.1999999999999993,18.600000000000001,20.7,18.3,13.6,8.9,4.8,12.3,51.6,97.2,4916,"All",2.1,7.1,16,20.3,18.3,14.9,10.5,6.2,9.1999999999999993,45.5,95.4,10066]
["Economics","Males",6.7,23.8,30,18.7,9.5,5.4,3,1.5,30.5,79.2,98.5,3481,"Females",5.3,26.3,28.8,18.600000000000001,10.4,5.3,2.1,1.7,31.6,79,98.5,1445,"All",6.3,24.5,29.6,18.7,9.8000000000000007,5.4,2.7,1.5,30.8,79.099999999999994,98.5,4926]
["Social Studies","Males",1.5,8.5,19.600000000000001,23.9,18.2,12.1,7.8,4.7,10,53.5,96.3,20556,"Females",3.9,16.899999999999999,25.3,22.6,13.7,8.3000000000000007,4.9000000000000004,2.4,20.8,68.7,98.2,36435,"All",3,13.9,23.3,23.1,15.3,9.6999999999999993,6,3.3,16.899999999999999,63.2,97.5,56991]
["Other Classical Studies","Males",11.1,30.6,28.5,12.5,9,3.5,2.1,"x",41.7,82.6,98.6,144,"Females",14.5,30.4,23.3,14.5,5.4,3.1,2,"x",44.9,82.7,94.9,352,"All",13.5,30.4,24.8,13.9,6.5,3.2,2,1.6,44,82.7,96,496]
["Arabic","Males",32.700000000000003,20.6,12.8,10.8,6.4,5,4,2.9,53.4,77,95.3,1368,"Females",36.200000000000003,20.100000000000001,13.3,9.4,5.6,4.5,4.5999999999999996,2.8,56.3,78.900000000000006,96.4,1598,"All",34.6,20.3,13,10,6,4.7,4.3,2.8,54.9,78,95.9,2966]
["Chinese","Males",57.4,17.3,10.9,8.3000000000000007,4.5999999999999996,1,0.2,"x",74.7,93.9,99.6,1470,"Females",66.7,15,8.8000000000000007,6.1,2.2999999999999998,0.5,0.2,"x",81.7,96.6,99.8,1360,"All",61.9,16.2,9.9,7.2,3.5,0.7,0.2,"x",78.099999999999994,95.2,99.7,2830]
["French","Males",7.3,11.2,16.8,27.2,22.1,9.9,3.6,1.3,18.5,62.5,99.5,69121,"Females",11,15.4,20.5,27.1,17.3,5.9,1.9,0.6,26.4,74,99.7,91834,"All",9.4,13.6,18.899999999999999,27.1,19.399999999999999,7.6,2.6,0.9,23,69,99.6,160955]
["German","Males",6.8,12.1,20.399999999999999,29.1,20,7.6,2.7,0.8,18.899999999999999,68.400000000000006,99.5,28070,"Females",9.6999999999999993,16.7,24.8,27.3,14.8,4.5999999999999996,1.4,0.4,26.4,78.5,99.7,30450,"All",8.3000000000000007,14.5,22.7,28.2,17.3,6,2,0.6,22.8,73.7,99.6,58520]
["Italian","Males",39.5,18.600000000000001,15.5,12.5,7.8,3.4,1.4,0.5,58.2,86.1,99.1,1740,"Females",40.200000000000003,19.8,17.3,12.5,6.7,2.1,1.1000000000000001,0.3,60,89.7,100,2328,"All",39.9,19.3,16.5,12.5,7.2,2.6,1.2,0.4,59.2,88.2,99.6,4068]
["Polish","Males",23.1,43.1,18.100000000000001,7.3,3.5,1.6,0.3,1,66.2,91.5,98,1860,"Females",41.2,38.799999999999997,12,4,1.2,0.7,0.2,0.5,80,96.1,98.7,2088,"All",32.700000000000003,40.799999999999997,14.9,5.5,2.2999999999999998,1.1000000000000001,0.3,0.7,73.5,93.9,98.4,3948]
["Spanish","Males",9.3000000000000007,13,18.399999999999999,24.3,18.7,9,4.4000000000000004,2,22.3,65,99,38078,"Females",13.9,18.3,20.8,22.9,14.3,5.9,2.4,1,32.200000000000003,75.900000000000006,99.5,49475,"All",11.9,16,19.7,23.5,16.2,7.3,3.2,1.4,27.9,71.2,99.3,87553]
["Urdu","Males",5.6,17.899999999999999,21.3,20,17.2,9.4,5.3,1.6,23.5,64.7,98.3,1614,"Females",14.5,27.2,24.1,17.600000000000001,8.9,4.2,1.6,1.1000000000000001,41.6,83.4,99.2,2497,"All",11,23.5,23,18.5,12.2,6.2,3.1,1.3,34.5,76.099999999999994,98.8,4111]
["Other Modern Languages","Males",32,26.2,18.399999999999999,11.3,5.8,2.8,1.7,0.6,58.2,87.9,98.9,4791,"Females",36.5,29.8,16.399999999999999,8.6,4.2,2,0.9,0.6,66.3,91.3,98.9,5563,"All",34.4,28.1,17.3,9.8000000000000007,5,2.4,1.3,0.6,62.5,89.7,98.9,10354]
["Classical Civilisation","Males",8.5,23.7,25.3,20.2,11.7,5.5,2.6,1.5,32.299999999999997,77.8,99.1,2145,"Females",17.399999999999999,27.7,22.7,15.7,9.1,4.0999999999999996,1.9,0.8,45.2,83.6,99.5,1972,"All",12.8,25.6,24,18.100000000000001,10.5,4.8,2.2999999999999998,1.1000000000000001,38.5,80.599999999999994,99.3,4117]
["Classical Greek","Males",59,22,9.9,4.5,2.1,0.6,0.7,"x",81,95.5,99.4,705,"Females",66.7,19.899999999999999,7.1,2.1,1.3,1.1000000000000001,1.1000000000000001,"x",86.5,95.7,99.4,468,"All",62.1,21.1,8.8000000000000007,3.6,1.8,0.8,0.9,0.4,83.2,95.6,99.4,1173]
["Latin","Males",40.6,27.6,15,8.3000000000000007,4.5999999999999996,2,1,0.6,68.2,91.5,99.6,4302,"Females",46.6,27.3,12.5,7.6,3.4,1.5,0.7,0.2,73.900000000000006,94,99.7,4566,"All",43.7,27.4,13.7,7.9,4,1.7,0.8,0.4,71.099999999999994,92.8,99.7,8868]
["Applied Art and Design","Males",1.4,5.2,16.899999999999999,37.299999999999997,21,8.6999999999999993,5.2,2.5,6.5,60.8,98.1,367,"Females",3.1,14.7,27.4,33.9,13.5,4.3,1.6,0,17.8,79.099999999999994,98.6,489,"All",2.2999999999999998,10.6,22.9,35.4,16.7,6.2,3.2,1.1000000000000001,13,71.3,98.4,856]
["Art and Design","Males",4.7,8,18.100000000000001,32.6,17.2,9.8000000000000007,5.3,2.5,12.7,63.5,98.2,58109,"Females",11.2,16.7,27.1,27.7,10,4.0999999999999996,1.8,0.7,27.9,82.7,99.3,112969,"All",9,13.7,24,29.4,12.5,6,3,1.3,22.7,76.2,98.9,171078]
["Communication Studies","Males",2,8.1,16.5,24.5,19.7,13,8.1,4.4000000000000004,10.1,51.1,96.2,4785,"Females",8.1999999999999993,16.399999999999999,23,21.6,14.1,7.7,4.7,2.4,24.7,69.3,98.2,5058,"All",5.2,12.4,19.899999999999999,23,16.8,10.3,6.3,3.4,17.600000000000001,60.4,97.2,9843]
["Dance","Males",4.9000000000000004,18.2,20.100000000000001,19.5,16.899999999999999,12.3,4.9000000000000004,2.2999999999999998,23.2,62.8,99.3,811,"Females",4.5999999999999996,16.399999999999999,21.1,24.7,18.2,9.1,3.8,1.4,21,66.8,99.4,11136,"All",4.5999999999999996,16.5,21.1,24.4,18.100000000000001,9.3000000000000007,3.9,1.5,21.1,66.5,99.4,11947]
["Drama","Males",3.5,13.3,22.7,25.9,18.100000000000001,9.4,4.3,1.8,16.8,65.400000000000006,99,27225,"Females",6.4,19.899999999999999,27.5,23.7,13.2,5.6,2.2999999999999998,0.9,26.3,77.5,99.4,43759,"All",5.3,17.399999999999999,25.6,24.5,15.1,7,3,1.2,22.7,72.900000000000006,99.2,70984]
["English Literature","Males",3.7,13.1,26.1,27.5,17,7.5,3,1.1000000000000001,16.8,70.400000000000006,98.9,193518,"Females",7.6,21.6,31.7,23.2,10.3,3.5,1.2,0.4,29.2,84,99.4,214587,"All",5.7,17.600000000000001,29,25.2,13.4,5.4,2,0.7,23.3,77.5,99.2,408105]
["English Studies","Males",0,1.6,9.4,26.5,22.7,19.100000000000001,11.9,6.1,1.6,37.5,97.3,445,"Females",0,3.6,16.899999999999999,30.8,17.8,10.9,11.8,4.7,3.6,51.2,96.4,338,"All",0,2.4,12.6,28.4,20.6,15.6,11.9,5.5,2.4,43.4,96.9,783]
["General Studies","Males",1.6,6,11.4,16,18.100000000000001,15.2,12.5,9.9,7.6,34.9,90.6,4595,"Females",2.7,9.5,14.1,19.5,20.6,14.3,9.3000000000000007,4.5999999999999996,12.1,45.7,94.5,4421,"All",2.1,7.7,12.7,17.7,19.3,14.8,10.9,7.3,9.8000000000000007,40.200000000000003,92.5,9016]
["Health and Social Care","Males","x",3.2,8.1999999999999993,14.4,21.7,17.5,11.6,10.7,3.5,26.2,87.7,741,"Females","x",8.8000000000000007,19.100000000000001,24.2,18.600000000000001,11.8,7.7,4.0999999999999996,11.3,54.7,96.8,12910,"All",2.4,8.5,18.5,23.7,18.7,12.1,7.9,4.5,10.9,53.1,96.3,13651]
["Hospitality and Catering","Males","x",4.8,15.7,24.9,28.8,15.3,8.1,1.1000000000000001,5,45.6,98.9,880,"Females","x",13.8,25.1,24.8,16.600000000000001,10.5,3.8,0.5,17,66.900000000000006,98.5,1358,"All",2,10.3,21.4,24.8,21.4,12.4,5.5,0.8,12.3,58.5,98.6,2238]
["Leisure and Tourism","Males",0.3,2.2000000000000002,6.2,13.6,16.600000000000001,18.899999999999999,14.4,12.7,2.5,22.3,85,3241,"Females",1.7,8.4,13.7,18.2,18.2,13.7,10.3,8.3000000000000007,10.1,42.1,92.7,3185,"All",1,5.3,9.9,15.9,17.399999999999999,16.3,12.4,10.5,6.3,32.1,88.8,6426]
["Manufacturing","Males",0,"x",10.7,15.6,"x",22.1,15.6,8.1999999999999993,"x",27.9,98.4,122,"Females",0,"x",21.4,42.9,"x",0,21.4,0,"x",71.400000000000006,100,14,"All",0,2.2000000000000002,11.8,18.399999999999999,22.8,19.899999999999999,16.2,7.4,2.2000000000000002,32.4,98.5,136]
["Media/Film/TV","Males",1.5,7.3,19.100000000000001,27.1,21,12,6.8,3,8.8000000000000007,55,97.8,26290,"Females",5,18.2,27.6,25,13.6,5.8,2.6,1.3,23.2,75.8,99.1,25038,"All",3.2,12.6,23.3,26.1,17.399999999999999,9,4.7,2.2000000000000002,15.8,65.2,98.4,51328]
["Music","Males",8.6,20.5,23.6,19.5,12.8,7.8,3.6,2,29.1,72.3,98.5,20902,"Females",9.3000000000000007,23.7,26.7,19.100000000000001,11.1,5.6,2.4,1.2,33.1,78.900000000000006,99.2,21544,"All",9,22.2,25.2,19.3,11.9,6.7,3,1.6,31.1,75.599999999999994,98.8,42446]
["Performing Arts","Males",3.7,6.8,14,23.5,17.3,14.5,12,5.0999999999999996,10.5,47.9,96.9,1362,"Females",9.4,11.6,21.7,24.6,17,8.3000000000000007,4.0999999999999996,2,21,67.3,98.7,3142,"All",7.7,10.1,19.399999999999999,24.2,17.100000000000001,10.199999999999999,6.5,3,17.8,61.4,98.2,4504]
["Physical Education","Males",2.8,13.9,24.8,27,18.3,9.1,3,0.7,16.7,68.5,99.7,67810,"Females",6.2,18.8,24.4,22.6,15.8,8.1,3,0.8,25,72,99.6,34784,"All",3.9,15.6,24.7,25.5,17.5,8.8000000000000007,3,0.7,19.5,69.7,99.7,102594]
["Religious Studies","Males",7,15.3,21.8,20.3,13.4,9.1,5.9,3.9,22.2,64.400000000000006,96.7,120566,"Females",14.8,22.8,23.4,16.8,9.6,5.8,3.3,1.9,37.6,77.900000000000006,98.4,138793,"All",11.2,19.3,22.7,18.5,11.4,7.3,4.5,2.9,30.4,71.599999999999994,97.6,259359]
["Statistics","Males",4.8,16.5,22.7,27.6,15.4,5.9,2.8,1.7,21.3,71.599999999999994,97.4,26152,"Females",5.3,17.7,24.5,29.4,12.9,4.8,2.2000000000000002,1.1000000000000001,23.1,77,98,22902,"All",5,17.100000000000001,23.5,28.4,14.2,5.4,2.5,1.4,22.1,74.099999999999994,97.7,49054]
["Vocational Studies","Males",1,5.8,16.399999999999999,27.3,24.5,14.1,6.5,2.6,6.8,50.5,98.3,19028,"Females",3.4,13.6,24.2,26.3,17.899999999999999,8.8000000000000007,3.6,1.3,17,67.5,99.2,21043,"All",2.2999999999999998,9.9,20.5,26.7,21.1,11.3,5,2,12.2,59.4,98.7,40071]
["All Subjects","Males",5.6,12.8,21.1,26.8,16.3,8.4,4.5,2.4,18.399999999999999,66.3,97.9,2284001,"Females",8.6,17.399999999999999,24.2,25.2,12.9,5.9,2.9,1.5,25.9,75.400000000000006,98.6,2372286,"All",7.1,15.1,22.7,26,14.6,7.1,3.7,1.9,22.3,70.900000000000006,98.3,4656287]
[]
[null,null,null,null,null,null," "]
[null,null,null,null,null,null,null,null," "]
[]
["DISC3B"]
["Subject","(No column name)","*","A","B","C","D","E","F","G","AstarA","AstarC","AstarG","Total","(No column name)","*","A","B","C","D","E","F","G","AstarA","AstarC","AstarG","Total","(No column name)","*","A","B","C","D","E","F","G","AstarA","AstarC","AstarG","Total"]
["English","Males",6112,21803,48427,72530,45407,20850,8737,3385,27915,148872,227251,229932,"Females",13897,39858,65906,67352,30373,10355,3583,1376,53755,187013,232700,234257,"All",20009,61661,114333,139882,75780,31205,12320,4761,81670,335885,459951,464189]
["Mathematics","Males",21690,34860,56181,91311,37250,18835,14628,11817,56550,204042,286572,303147,"Females",18973,34730,57214,90975,36556,17371,13072,10290,53703,201892,279181,293691,"All",40663,69590,113395,182286,73806,36206,27700,22107,110253,405934,565753,596838]
["Core Science","Males",1804,10172,29826,61059,34771,19561,10300,4337,11976,102861,171830,175051,"Females",3038,15101,36589,61211,31193,16599,8232,3232,18139,115939,175195,177855,"All",4842,25273,66415,122270,65964,36160,18532,7569,30115,218800,347025,352906]
["Additional Science","Males",2566,10592,26870,42608,28740,11974,5139,2000,13158,82636,130489,131575,"Females",3705,14289,32714,45164,27147,10249,4027,1468,17994,95872,138763,139627,"All",6271,24881,59584,87772,55887,22223,9166,3468,31152,178508,269252,271202]
["Further Additional Science","Males",1065,2192,2873,2660,1297,383,81,26,3257,8790,10577,10607,"Females",1208,2342,2920,2468,1103,289,55,24,3550,8938,10409,10429,"All",2273,4534,5793,5128,2400,672,136,50,6807,17728,20986,21036]
["Additional Applied Science","Males",0,59,344,1324,1940,1554,858,339,59,1727,6418,6616,"Females",10,81,653,1768,2053,1236,570,197,91,2512,6568,6697,"All",10,140,997,3092,3993,2790,1428,536,150,4239,12986,13313]
["Physics","Males",9460,17797,19025,13347,4401,802,187,65,27257,59629,65084,65148,"Females",10091,17292,18378,12771,4080,749,132,48,27383,58532,63541,63604,"All",19551,35089,37403,26118,8481,1551,319,113,54640,118161,128625,128752]
["Chemistry","Males",8614,17537,19173,13913,5070,1100,253,86,26151,59237,65746,65818,"Females",10693,18734,18121,11415,3781,793,178,51,29427,58963,63766,63841,"All",19307,36271,37294,25328,8851,1893,431,137,55578,118200,129512,129659]
["Biological Sciences","Males",7521,17709,20331,14679,5053,1152,426,186,25230,60240,67057,67270,"Females",10953,19676,18814,11254,3608,792,319,137,30629,60697,65553,65698,"All",18474,37385,39145,25933,8661,1944,745,323,55859,120937,132610,132968]
["Computer Science","Males",812,2229,2866,2738,1885,1185,728,462,3041,8645,12905,13428,"Females",197,460,516,503,322,176,88,40,657,1676,2302,2374,"All",1009,2689,3382,3241,2207,1361,816,502,3698,10321,15207,15802]
["Other Sciences","Males",437,614,689,714,655,502,354,206,1051,2454,4171,4288,"Females",113,248,464,557,446,329,212,137,361,1382,2506,2580,"All",550,862,1153,1271,1101,831,566,343,1412,3836,6677,6868]
["D & T: Electronic Products","Males",534,1116,1648,1611,1141,762,469,261,1650,4909,7542,7692,"Females",107,164,154,83,60,37,10,8,271,508,623,628,"All",641,1280,1802,1694,1201,799,479,269,1921,5417,8165,8320]
["D & T: Food Technology","Males",226,874,2106,3637,3468,2347,1364,613,1100,6843,14635,14951,"Females",1850,4321,6073,5941,3827,2044,980,384,6171,18185,25420,25639,"All",2076,5195,8179,9578,7295,4391,2344,997,7271,25028,40055,40590]
["D & T: Graphic Products","Males",583,1795,3515,4765,4157,2699,1728,1040,2378,10658,20282,20953,"Females",1012,2395,3037,2750,1815,971,523,266,3407,9194,12769,12921,"All",1595,4190,6552,7515,5972,3670,2251,1306,5785,19852,33051,33874]
["D & T: Resistant Materials","Males",1296,3973,8216,11007,8864,5728,3405,1648,5269,24492,44137,45024,"Females",676,1431,1851,1644,1072,569,287,160,2107,5602,7690,7760,"All",1972,5404,10067,12651,9936,6297,3692,1808,7376,30094,51827,52784]
["D & T: Systems & Control","Males",251,408,631,681,512,294,185,87,659,1971,3049,3091,"Females",7,30,29,34,31,10,6,1,37,100,148,150,"All",258,438,660,715,543,304,191,88,696,2071,3197,3241]
["D & T: Textiles Technology","Males",24,33,79,162,164,144,120,48,57,298,774,820,"Females",2475,4243,5695,5581,3456,1854,850,390,6718,17994,24544,24773,"All",2499,4276,5774,5743,3620,1998,970,438,6775,18292,25318,25593]
["Other Design and Technology","Males",740,2066,4417,6349,5320,3460,2095,1006,2806,13572,25453,26092,"Females",977,1970,2531,2283,1456,805,417,215,2947,7761,10654,10761,"All",1717,4036,6948,8632,6776,4265,2512,1221,5753,21333,36107,36853]
["Applied Engineering","Males",40,152,438,846,854,678,399,242,192,1476,3649,3863,"Females",2,23,49,52,49,34,11,7,25,126,227,228,"All",42,175,487,898,903,712,410,249,217,1602,3876,4091]
["Information Technology","Males",2056,6699,10596,10960,6726,3751,2609,1856,8755,30311,45253,46552,"Females",2660,6643,8419,7896,4330,2323,1359,953,9303,25618,34583,35324,"All",4716,13342,19015,18856,11056,6074,3968,2809,18058,55929,79836,81876]
["Business Studies","Males",1336,5989,10422,10474,7105,4041,2332,1303,7325,28221,43002,43774,"Females",1372,5336,7821,6971,4253,2392,1320,684,6708,21500,30149,30552,"All",2708,11325,18243,17445,11358,6433,3652,1987,14033,49721,73151,74326]
["Applied Business","Males",89,442,908,1138,816,581,360,237,531,2577,4571,4852,"Females",116,535,742,640,443,301,174,114,651,2033,3065,3185,"All",205,977,1650,1778,1259,882,534,351,1182,4610,7636,8037]
["Home Economics","Males",21,145,471,832,814,639,393,183,166,1469,3498,3594,"Females",734,2634,4819,5809,4831,3063,1596,695,3368,13996,24181,24583,"All",755,2779,5290,6641,5645,3702,1989,878,3534,15465,27679,28177]
["Ancient History","Males",97,130,122,89,59,57,27,18,227,438,599,625,"Females",75,123,94,100,58,34,9,9,198,392,502,507,"All",172,253,216,189,117,91,36,27,425,830,1101,1132]
["Geography","Males",8243,16787,22096,26147,18415,10722,5778,2908,25030,73273,111096,112281,"Females",11822,19122,20580,19793,12238,7036,3861,1852,30944,71317,96304,96959,"All",20065,35909,42676,45940,30653,17758,9639,4760,55974,144590,207400,209240]
["History","Males",8941,19025,23853,22889,16334,10703,6705,4244,27966,74708,112694,115413,"Females",15241,25028,25944,21919,14846,9323,5520,3237,40269,88132,121058,122846,"All",24182,44053,49797,44808,31180,20026,12225,7481,68235,162840,233752,238259]
["Humanities","Males",62,259,694,1023,947,831,621,390,321,2038,4827,5150,"Females",154,453,914,1018,899,669,436,236,607,2539,4779,4916,"All",216,712,1608,2041,1846,1500,1057,626,928,4577,9606,10066]
["Economics","Males",234,828,1044,650,331,187,104,51,1062,2756,3429,3481,"Females",77,380,416,269,150,77,31,24,457,1142,1424,1445,"All",311,1208,1460,919,481,264,135,75,1519,3898,4853,4926]
["Social Studies","Males",300,1750,4024,4916,3744,2486,1611,971,2050,10990,19802,20556,"Females",1422,6152,9235,8231,5000,3040,1794,888,7574,25040,35762,36435,"All",1722,7902,13259,13147,8744,5526,3405,1859,9624,36030,55564,56991]
["Other Classical Studies","Males",16,44,41,18,13,5,3,2,60,119,142,144,"Females",51,107,82,51,19,11,7,6,158,291,334,352,"All",67,151,123,69,32,16,10,8,218,410,476,496]
["Arabic","Males",448,282,175,148,88,68,55,40,730,1053,1304,1368,"Females",578,321,212,150,89,72,74,44,899,1261,1540,1598,"All",1026,603,387,298,177,140,129,84,1629,2314,2844,2966]
["Chinese","Males",844,254,160,122,67,14,3,0,1098,1380,1464,1470,"Females",907,204,120,83,31,7,3,2,1111,1314,1357,1360,"All",1751,458,280,205,98,21,6,2,2209,2694,2821,2830]
["French","Males",5067,7752,11585,18782,15303,6826,2519,928,12819,43186,68762,69121,"Females",10106,14165,18785,24868,15916,5440,1731,551,24271,67924,91562,91834,"All",15173,21917,30370,43650,31219,12266,4250,1479,37090,111110,160324,160955]
["German","Males",1922,3389,5738,8159,5600,2127,767,221,5311,19208,27923,28070,"Females",2939,5097,7556,8317,4504,1409,424,110,8036,23909,30356,30450,"All",4861,8486,13294,16476,10104,3536,1191,331,13347,43117,58279,58520]
["Italian","Males",688,324,269,217,136,59,24,8,1012,1498,1725,1740,"Females",936,460,402,291,156,48,26,8,1396,2089,2327,2328,"All",1624,784,671,508,292,107,50,16,2408,3587,4052,4068]
["Polish","Males",429,802,336,135,65,30,6,19,1231,1702,1822,1860,"Females",861,810,251,84,26,14,5,10,1671,2006,2061,2088,"All",1290,1612,587,219,91,44,11,29,2902,3708,3883,3948]
["Spanish","Males",3533,4958,7002,9259,7113,3434,1657,753,8491,24752,37709,38078,"Females",6890,9041,10287,11341,7098,2921,1170,481,15931,37559,49229,49475,"All",10423,13999,17289,20600,14211,6355,2827,1234,24422,62311,86938,87553]
["Urdu","Males",91,289,343,322,278,152,86,26,380,1045,1587,1614,"Females",361,679,603,440,222,104,40,27,1040,2083,2476,2497,"All",452,968,946,762,500,256,126,53,1420,3128,4063,4111]
["Other Modern Languages","Males",1533,1254,881,542,279,136,80,31,2787,4210,4736,4791,"Females",2032,1656,912,477,234,109,50,32,3688,5077,5502,5563,"All",3565,2910,1793,1019,513,245,130,63,6475,9287,10238,10354]
["Classical Civilisation","Males",183,509,542,434,252,118,56,32,692,1668,2126,2145,"Females",344,547,448,310,180,80,38,15,891,1649,1962,1972,"All",527,1056,990,744,432,198,94,47,1583,3317,4088,4117]
["Classical Greek","Males",416,155,70,32,15,4,5,4,571,673,701,705,"Females",312,93,33,10,6,5,5,1,405,448,465,468,"All",728,248,103,42,21,9,10,5,976,1121,1166,1173]
["Latin","Males",1747,1188,647,355,197,85,41,25,2935,3937,4285,4302,"Females",2128,1245,571,347,155,67,31,9,3373,4291,4553,4566,"All",3875,2433,1218,702,352,152,72,34,6308,8228,8838,8868]
["Applied Art and Design","Males",5,19,62,137,77,32,19,9,24,223,360,367,"Females",15,72,134,166,66,21,8,0,87,387,482,489,"All",20,91,196,303,143,53,27,9,111,610,842,856]
["Art and Design","Males",2759,4638,10526,18969,9981,5702,3052,1428,7397,36892,57055,58109,"Females",12664,18830,30594,31327,11324,4639,2035,750,31494,93415,112163,112969,"All",15423,23468,41120,50296,21305,10341,5087,2178,38891,130307,169218,171078]
["Communication Studies","Males",94,389,790,1170,945,620,387,209,483,2443,4604,4785,"Females",416,832,1164,1094,713,389,237,121,1248,3506,4966,5058,"All",510,1221,1954,2264,1658,1009,624,330,1731,5949,9570,9843]
["Dance","Males",40,148,163,158,137,100,40,19,188,509,805,811,"Females",512,1822,2353,2752,2022,1017,428,159,2334,7439,11065,11136,"All",552,1970,2516,2910,2159,1117,468,178,2522,7948,11870,11947]
["Drama","Males",953,3616,6174,7050,4936,2566,1166,481,4569,17793,26942,27225,"Females",2806,8721,12029,10370,5760,2429,993,382,11527,33926,43490,43759,"All",3759,12337,18203,17420,10696,4995,2159,863,16096,51719,70432,70984]
["English Literature","Males",7158,25356,50488,53169,32849,14472,5722,2156,32514,136171,191370,193518,"Females",16296,46357,67935,49704,22005,7579,2500,899,62653,180292,213275,214587,"All",23454,71713,118423,102873,54854,22051,8222,3055,95167,316463,404645,408105]
["English Studies","Males",0,7,42,118,101,85,53,27,7,167,433,445,"Females",0,12,57,104,60,37,40,16,12,173,326,338,"All",0,19,99,222,161,122,93,43,19,340,759,783]
["General Studies","Males",73,275,522,733,831,697,574,457,348,1603,4162,4595,"Females",119,418,623,862,911,634,409,203,537,2022,4179,4421,"All",192,693,1145,1595,1742,1331,983,660,885,3625,8341,9016]
["Health and Social Care","Males",2,24,61,107,161,130,86,79,26,194,650,741,"Females",322,1138,2469,3130,2396,1523,991,533,1460,7059,12502,12910,"All",324,1162,2530,3237,2557,1653,1077,612,1486,7253,13152,13651]
["Hospitality and Catering","Males",2,42,138,219,253,135,71,10,44,401,870,880,"Females",43,188,341,337,226,143,52,7,231,909,1337,1358,"All",45,230,479,556,479,278,123,17,275,1310,2207,2238]
["Leisure and Tourism","Males",11,71,202,440,539,613,468,411,82,724,2755,3241,"Females",55,268,437,581,581,435,329,265,323,1341,2951,3185,"All",66,339,639,1021,1120,1048,797,676,405,2065,5706,6426]
["Manufacturing","Males",0,2,13,19,30,27,19,10,2,34,120,122,"Females",0,1,3,6,1,0,3,0,1,10,14,14,"All",0,3,16,25,31,27,22,10,3,44,134,136]
["Media/Film/TV","Males",390,1921,5021,7135,5534,3148,1777,790,2311,14467,25716,26290,"Females",1259,4554,6915,6255,3399,1455,659,318,5813,18983,24814,25038,"All",1649,6475,11936,13390,8933,4603,2436,1108,8124,33450,50530,51328]
["Music","Males",1796,4293,4941,4086,2674,1623,751,422,6089,15116,20586,20902,"Females",2013,5114,5752,4113,2388,1206,520,255,7127,16992,21361,21544,"All",3809,9407,10693,8199,5062,2829,1271,677,13216,32108,41947,42446]
["Performing Arts","Males",50,93,190,320,236,197,164,70,143,653,1320,1362,"Females",296,363,682,772,535,261,128,64,659,2113,3101,3142,"All",346,456,872,1092,771,458,292,134,802,2766,4421,4504]
["Physical Education","Males",1881,9455,16821,18290,12430,6177,2056,477,11336,46447,67587,67810,"Females",2162,6542,8472,7870,5486,2813,1050,267,8704,25046,34662,34784,"All",4043,15997,25293,26160,17916,8990,3106,744,20040,71493,102249,102594]
["Religious Studies","Males",8405,18393,26288,24517,16186,10941,7133,4733,26798,77603,116596,120566,"Females",20591,31583,32545,23361,13305,7981,4570,2693,52174,108080,136629,138793,"All",28996,49976,58833,47878,29491,18922,11703,7426,78972,185683,253225,259359]
["Statistics","Males",1244,4319,5934,7227,4031,1552,727,439,5563,18724,25473,26152,"Females",1219,4063,5616,6727,2959,1108,512,251,5282,17625,22455,22902,"All",2463,8382,11550,13954,6990,2660,1239,690,10845,36349,47928,49054]
["Vocational Studies","Males",196,1097,3122,5189,4669,2691,1235,500,1293,9604,18699,19028,"Females",710,2869,5092,5526,3775,1852,759,283,3579,14197,20866,21043,"All",906,3966,8214,10715,8444,4543,1994,783,4872,23801,39565,40071]
["All Subjects","Males",127130,293393,481172,612637,372246,192574,102798,54831,420523,1514332,2236781,2284001,"Females",203600,411966,574167,598278,306024,139329,69479,35885,615566,1788011,2338728,2372286,"All",330730,705359,1055339,1210915,678270,331903,172277,90716,1036089,3302343,4575509,4656287]

{"sheet":"2015","index":9,"n_rows":132,"n_cols":40,"rows_kept":132,"cut":false,"hidden":true,"merged":[]}
[1,2,3,4,5,6,7,8,9,10,11,12,13,14,15,16,17,18,19,20,21,22,23,24,25,26,27,28,29,30,31,32,33,34,35,36,37,38,39,40]
["Subjects",null,"*","A","B","C","D","E","F","G","AstarA","AstarC","AstarG","Total","(No column name)","*","A","B","C","D","E","F","G","AstarA","AstarC","AstarG","Total","(No column name)","*","A","B","C","D","E","F","G","AstarA","AstarC","AstarG","Total"]
["English","Males",2.4,10.1,23.4,31.3,19.2,8,3.3,1.4,12.5,67.2,99.1,176842,"Females",5.7,18.399999999999999,30.3,27.6,12.1,3.8,1.3,0.5,24.1,82,99.6,186560,"All",4.0999999999999996,14.4,26.9,29.4,15.5,5.8,2.2000000000000002,0.9,18.399999999999999,74.8,99.3,363402]
["Mathematics","Males",8,12.3,19.600000000000001,29.9,13.6,5.5,3.7,3.1,20.3,69.8,95.6,290391,"Females",7,12.3,20.6,30.8,14.1,5.0999999999999996,3.4,2.8,19.3,70.7,96.1,281881,"All",7.5,12.3,20.100000000000001,30.4,13.9,5.3,3.5,3,19.8,70.2,95.9,572272]
["Core Science","Males",0.9,6,17.899999999999999,31,22.4,11.4,6.1,2.4,6.9,55.8,98.2,183841,"Females",1.6,8.8000000000000007,21.2,30.9,20.3,9.6999999999999993,4.5,1.7,10.4,62.5,98.7,185357,"All",1.3,7.4,19.600000000000001,31,21.4,10.5,5.3,2.1,8.6999999999999993,59.2,98.5,369198]
["Additional Science","Males",1.6,8,20,32.1,22.2,9.5,4.2,1.6,9.6999999999999993,61.8,99.2,148776,"Females",2.4,10.4,22.9,31.6,20.100000000000001,8,3,1,12.8,67.400000000000006,99.4,156188,"All",2,9.3000000000000007,21.5,31.8,21.1,8.8000000000000007,3.6,1.3,11.3,64.599999999999994,99.3,304964]
["Further Additional Science","Males",11.7,19.2,23.6,23.7,15.2,4.9000000000000004,1.3,0.3,31,78.2,99.9,11420,"Females",15.3,20.9,24.4,21.5,12.7,4,0.8,0.2,36.200000000000003,82.1,99.8,11474,"All",13.5,20.100000000000001,24,22.6,14,4.5,1,0.2,33.6,80.2,99.8,22894]
["Additional Applied Science","Males",0.1,0.9,5.3,21,29.2,24,12,4.9000000000000004,1.1000000000000001,27.4,97.4,6554,"Females",0,1.5,9.1,26.4,31.3,18,8.9,3.3,1.5,37,98.5,6378,"All",0.1,1.2,7.2,23.7,30.3,21,10.5,4.0999999999999996,1.3,32.1,98,12932]
["Physics","Males",14.8,28.2,29.1,20.100000000000001,6.4,1,0.2,0.1,43,92.2,99.9,62238,"Females",15.6,28.2,28.7,19.899999999999999,6.4,0.9,0.2,0.1,43.8,92.4,99.9,60374,"All",15.2,28.2,28.9,20,6.4,1,0.2,0.1,43.4,92.3,99.9,122612]
["Chemistry","Males",13.9,26.2,29.2,21.2,7.6,1.5,0.3,0.1,40,90.4,99.9,62852,"Females",18.399999999999999,28.5,27.8,18,5.9,1,0.2,0.1,46.9,92.7,99.9,60538,"All",16.100000000000001,27.3,28.5,19.600000000000001,6.8,1.3,0.2,0.1,43.4,91.5,99.9,123390]
["Biological Sciences","Males",10.8,26.9,30.9,21.5,7.4,1.5,0.4,0.2,37.700000000000003,90.2,99.7,63877,"Females",16.5,31.3,28.5,16.8,5.2,1.1000000000000001,0.3,0.2,47.8,93,99.8,62252,"All",13.6,29,29.7,19.2,6.3,1.3,0.4,0.2,42.7,91.6,99.8,126129]
["Computer Science","Males",6.1,14.8,21.2,22,14.9,8.8000000000000007,5.5,3.6,20.9,64.2,97,28101,"Females",8.8000000000000007,19.100000000000001,23.6,21.1,13.2,7.2,3.4,1.7,27.9,72.599999999999994,98.1,5432,"All",6.5,15.5,21.6,21.9,14.6,8.5,5.0999999999999996,3.3,22.1,65.5,97.2,33533]
["Other Sciences","Males",11.1,14.1,15.3,18.2,14.2,12.3,7.8,4.0999999999999996,25.2,58.7,97.1,3971,"Females",4.4000000000000004,12.7,18.100000000000001,24.1,16.5,11.5,6.8,3.7,17.100000000000001,59.2,97.7,2252,"All",8.6,13.6,16.3,20.3,15.1,12,7.4,4,22.2,58.9,97.3,6223]
["D & T: Electronic Products","Males",6.6,15.8,21.9,20,15.5,9.9,5.4,2.8,22.4,64.3,97.9,7327,"Females",15.7,27.3,24.3,15.7,9,3.3,2.2999999999999998,1.9,43,82.9,99.5,568,"All",7.3,16.600000000000001,22,19.7,15,9.5,5.2,2.7,23.9,65.599999999999994,98,7895]
["D & T: Food Technology","Males",1.5,5.6,14.5,24,23.2,15.2,9.4,4.0999999999999996,7.1,45.6,97.6,14091,"Females",7.1,16.7,23.4,23.3,15.2,8.1,3.9,1.4,23.8,70.5,99.2,24332,"All",5,12.6,20.2,23.5,18.2,10.7,6,2.4,17.7,61.4,98.6,38423]
["D & T: Graphic Products","Males",3,8.8000000000000007,16.100000000000001,22.9,19.3,13.7,8,4.8,11.8,50.8,96.6,19958,"Females",9.6,17.600000000000001,22.5,22,13.7,7.8,3.9,1.7,27.2,71.599999999999994,98.8,11901,"All",5.5,12.1,18.399999999999999,22.6,17.2,11.5,6.5,3.6,17.600000000000001,58.6,97.4,31859]
["D & T: Resistant Materials","Males",3.2,8.6,17.399999999999999,24.7,20,12.8,7.5,3.6,11.8,53.9,97.7,43489,"Females",9,18.3,22.1,22.1,14.1,7.6,3.8,1.8,27.3,71.5,98.9,7608,"All",4.0999999999999996,10.1,18.100000000000001,24.4,19.2,12,6.9,3.3,14.1,56.5,97.9,51097]
["D & T: Systems & Control","Males",7.4,12.6,20.399999999999999,23.8,17.8,10,4.5999999999999996,2.4,20,64.2,98.9,2811,"Females",6.5,23.8,20.2,23.8,15.5,6,1.8,1.8,30.4,74.400000000000006,99.4,168,"All",7.4,13.2,20.399999999999999,23.8,17.600000000000001,9.8000000000000007,4.4000000000000004,2.4,20.5,64.8,99,2979]
["D & T: Textiles Technology","Males",1.3,5.5,12.5,19.100000000000001,19.8,18.8,13.2,6.1,6.8,38.4,96.3,752,"Females",9.5,17.7,24.4,21.1,13.9,7.4,3.6,1.5,27.2,72.599999999999994,99.2,23450,"All",9.3000000000000007,17.3,24,21,14.1,7.8,3.9,1.7,26.6,71.599999999999994,99.1,24202]
["Other Design and Technology","Males",2.6,7.9,17.600000000000001,24.6,19.7,12.9,8.4,4,10.4,52.6,97.6,27501,"Females",7.5,18.2,25.2,21.2,13.4,7.4,3.8,1.9,25.6,72.099999999999994,98.6,10722,"All",3.9,10.8,19.7,23.6,17.899999999999999,11.4,7.1,3.5,14.7,58.1,97.9,38223]
["Applied Engineering","Males",0.8,4,11.4,21.5,21.6,15.9,12,7.6,4.8,37.700000000000003,94.8,5817,"Females",3.8,18,18.399999999999999,21.1,16.5,10.4,6.1,3.6,21.8,61.3,97.9,473,"All",1,5.0999999999999996,11.9,21.5,21.2,15.5,11.6,7.3,6.1,39.5,95,6290]
["Information Technology","Males",3.2,13.3,23.6,24.6,15,8.4,5.7,3.7,16.5,64.599999999999994,97.5,57010,"Females",5.7,18.100000000000001,24.6,22.5,13.6,7.1,4.0999999999999996,2.5,23.8,70.900000000000006,98.2,42551,"All",4.3,15.3,24,23.7,14.4,7.8,5,3.2,19.600000000000001,67.3,97.8,99561]
["Business Studies","Males",2.7,12.9,23.9,24.6,16.100000000000001,9.4,5.5,3.2,15.6,64,98.2,42806,"Females",4.2,16.399999999999999,25.2,23.2,14.8,8.1999999999999993,4.5,2.2999999999999998,20.6,69.099999999999994,98.9,31215,"All",3.3,14.4,24.4,24,15.6,8.9,5.0999999999999996,2.8,17.7,66.2,98.5,74021]
["Applied Business","Males",1.7,9.1999999999999993,19.2,22.6,16.7,12.6,7,4.8,10.9,52.6,93.6,6829,"Females",2.8,15,22.6,21.3,15.5,11,5,3.4,17.8,61.8,96.6,4815,"All",2.1,11.6,20.6,22.1,16.2,11.9,6.1,4.2,13.7,56.4,94.8,11644]
["Home Economics","Males",0.7,4.2,11.3,22.8,23.9,18.3,11.5,4.7,4.9000000000000004,39,97.4,3307,"Females",3.1,10.8,19.5,23.9,19.899999999999999,12,6.4,3,13.9,57.3,98.5,23847,"All",2.8,10,18.5,23.7,20.399999999999999,12.8,7,3.2,12.8,55,98.4,27154]
["Ancient History","Males",17,21.3,19.899999999999999,14.9,10.9,6.5,3.3,2.7,38.299999999999997,73.2,96.6,522,"Females",13.8,22.8,24.1,16.399999999999999,12.5,5,2.6,1.8,36.6,77.2,99.1,456,"All",15.5,22,21.9,15.6,11.7,5.8,3,2.2000000000000002,37.5,75.099999999999994,97.8,978]
["Geography","Males",7.3,15.5,20,22.9,16.2,9.6,5.0999999999999996,2.5,22.8,65.7,98.9,113351,"Females",12.3,20,21.4,20.100000000000001,12.8,7.3,3.8,1.7,32.299999999999997,73.7,99.3,98046,"All",9.6,17.600000000000001,20.6,21.6,14.6,8.5,4.5,2.1,27.2,69.400000000000006,99.1,211397]
["History","Males",7.3,16.600000000000001,21.2,19.7,13.8,9,6,3.7,23.9,64.900000000000006,97.3,110702,"Females",12.1,21.3,22,17.600000000000001,11.3,7.3,4.5,2.5,33.4,72.900000000000006,98.6,118367,"All",9.8000000000000007,19,21.6,18.600000000000001,12.5,8.1,5.2,3.1,28.8,69,98,229069]
["Humanities","Males",1.1000000000000001,5.3,13.4,20.3,19,15.8,10.8,8.3000000000000007,6.4,40.1,93.9,4362,"Females",2.8,11.3,18.5,22.2,17.5,11.5,7.8,4.5,14.1,54.8,96.2,4038,"All",1.9,8.1999999999999993,15.9,21.2,18.3,13.7,9.4,6.5,10.1,47.2,95,8400]
["Economics","Males",6.3,22.2,28.9,19.5,11.4,5.6,2.9,1.6,28.5,77,98.6,6378,"Females",5.6,23.2,28.5,20,11.2,5.9,2.9,1.3,28.8,77.3,98.6,3076,"All",6.1,22.5,28.8,19.7,11.3,5.7,2.9,1.5,28.6,77.099999999999994,98.6,9454]
["Social Studies","Males",1.6,9.1999999999999993,20.100000000000001,24.3,18.100000000000001,11.5,7.2,4.3,10.8,55.2,96.3,21916,"Females",4.0999999999999996,16.3,25.8,22.5,14.2,8.4,4.4000000000000004,2.5,20.399999999999999,68.7,98.2,38414,"All",3.2,13.7,23.7,23.1,15.7,9.5,5.4,3.2,16.899999999999999,63.8,97.5,60330]
["Other Classical Studies","Males",11.5,20.9,25,14.9,6.8,6.8,6.8,3.4,32.4,72.3,95.9,148,"Females",11.3,36.700000000000003,24,10.5,7.5,3.6,2.2000000000000002,2.2000000000000002,48.1,82.6,98.1,362,"All",11.4,32.200000000000003,24.3,11.8,7.3,4.5,3.5,2.5,43.5,79.599999999999994,97.5,510]
["Arabic","Males",31.3,20.6,13.2,11.5,6.5,4.9000000000000004,3.2,3.5,52,76.599999999999994,94.6,1395,"Females",35,19,14.1,11.1,6.6,4.5999999999999996,3.9,3,54.1,79.3,97.5,1806,"All",33.4,19.7,13.7,11.3,6.6,4.7,3.6,3.2,53.2,78.2,96.2,3201]
["Chinese","Males",58.7,16.899999999999999,10.7,7.8,3.9,1.1000000000000001,0.5,"x",75.599999999999994,94.1,99.7,1761,"Females",70,13,8.3000000000000007,6.6,1.4,0.5,0,"x",83,97.9,99.9,1525,"All",63.9,15.1,9.6,7.2,2.7,0.9,0.3,"x",79,95.9,99.8,3286]
["French","Males",7.4,10.8,17,28.2,22.2,9.3000000000000007,3.6,1.1000000000000001,18.2,63.4,99.5,64214,"Females",11.4,15.3,20.6,27.4,17.3,5.4,1.8,0.5,26.8,74.8,99.8,86881,"All",9.6999999999999993,13.4,19.100000000000001,27.8,19.399999999999999,7.1,2.5,0.8,23.1,69.900000000000006,99.7,151095]
["German","Males",6.8,12.1,20.9,29.6,20.399999999999999,6.9,2.2999999999999998,0.8,18.899999999999999,69.3,99.7,25466,"Females",9.6999999999999993,16.600000000000001,24.8,28.1,15.1,3.9,1.2,0.4,26.4,79.3,99.8,27280,"All",8.3000000000000007,14.4,22.9,28.8,17.7,5.3,1.7,0.6,22.7,74.5,99.8,52746]
["Italian","Males",40.799999999999997,18.3,13.5,13.4,8.6,3.1,1.1000000000000001,0.5,59.1,86,99.3,1752,"Females",42.4,19.3,14.8,13.2,7,2.1,0.6,0.2,61.7,89.7,99.7,2252,"All",41.7,18.899999999999999,14.2,13.3,7.7,2.5,0.8,0.3,60.6,88.1,99.5,4004]
["Polish","Males",24.1,41.7,18.3,8.1999999999999993,3.9,1.1000000000000001,0.5,0.9,65.8,92.3,98.7,1923,"Females",41.5,38.799999999999997,11.6,4.0999999999999996,1.4,0.9,0.2,0.5,80.3,96,99,2152,"All",33.299999999999997,40.1,14.7,6,2.6,1,0.3,0.7,73.5,94.3,98.8,4075]
["Spanish","Males",10.3,12.9,17.600000000000001,25.6,19.3,8.1999999999999993,3.7,1.5,23.2,66.400000000000006,99.2,36821,"Females",15.5,16.7,20.3,24,14.9,5.4,2,0.7,32.200000000000003,76.599999999999994,99.6,48521,"All",13.3,15,19.2,24.7,16.8,6.6,2.7,1.1000000000000001,28.3,72.2,99.4,85342]
["Urdu","Males",8.4,19.100000000000001,22.4,22.3,13.2,7.9,4.5999999999999996,1.4,27.5,72.099999999999994,99.2,1626,"Females",14.7,24.5,24.1,18.399999999999999,10.5,4.7,2,0.5,39.200000000000003,81.7,99.4,2559,"All",12.3,22.4,23.4,19.899999999999999,11.5,5.9,3,0.8,34.700000000000003,78,99.3,4185]
["Other Modern Languages","Males",30.3,26.7,18.7,11,5.7,3.9,1.8,0.7,56.9,86.6,98.7,4987,"Females",37.1,29.3,16.7,8.6999999999999993,4.4000000000000004,1.9,0.5,0.4,66.400000000000006,91.8,99.1,5542,"All",33.9,28,17.600000000000001,9.8000000000000007,5,2.9,1.1000000000000001,0.6,61.9,89.3,98.9,10529]
["Classical Civilisation","Males",10.1,22.4,25.3,21.6,11.4,5.4,2.2000000000000002,0.9,32.5,79.400000000000006,99.4,2068,"Females",18.2,28.8,22.1,15.6,8.6999999999999993,4.0999999999999996,1.3,1,47,84.7,99.7,1899,"All",14,25.5,23.7,18.7,10.1,4.8,1.8,1,39.5,81.900000000000006,99.5,3967]
["Classical Greek","Males",72,17.7,6.2,2.4,0.8,0.6,"x","x",89.7,98.3,99.9,711,"Females",68.8,17.3,6.9,3.5,2,1,"x","x",86.1,96.5,100,490,"All",70.7,17.600000000000001,6.5,2.8,1.3,0.7,"x","x",88.3,97.6,99.9,1201]
["Latin","Males",47.8,23.6,13.2,8.1999999999999993,4,1.8,0.7,0.3,71.400000000000006,92.8,99.6,4150,"Females",52.7,24.4,12,5.9,2.6,1.5,0.6,0.3,77.099999999999994,94.9,99.8,4211,"All",50.3,24,12.6,7,3.3,1.6,0.6,0.3,74.3,93.9,99.7,8361]
["Applied Art and Design","Males",2.2999999999999998,6,14.8,38.299999999999997,15.5,12,7,2.2999999999999998,8.3000000000000007,61.4,98.2,399,"Females",7.8,13.7,22.4,32.5,13.4,7.1,1.4,0.9,21.5,76.400000000000006,99.3,424,"All",5.0999999999999996,10,18.7,35.4,14.5,9.5,4.0999999999999996,1.6,15.1,69.099999999999994,98.8,823]
["Art and Design","Males",4.8,8,17.399999999999999,33.6,17.5,9.4,5.4,2.4,12.8,63.8,98.5,59965,"Females",11.1,16.8,25.6,28.9,10.3,4,1.8,0.7,27.9,82.5,99.3,116222,"All",9,13.8,22.8,30.5,12.7,5.8,3,1.3,22.8,76.099999999999994,99,176187]
["Communication Studies","Males",2.1,7.7,16.899999999999999,23.2,20.2,13.5,8.1999999999999993,4.4000000000000004,9.8000000000000007,49.9,96.2,4584,"Females",6.3,15.4,23,22.5,15.3,8.6,4.4000000000000004,2.2999999999999998,21.7,67.2,97.7,4828,"All",4.2,11.6,20,22.8,17.7,11,6.3,3.3,15.9,58.8,97,9412]
["Dance","Males",2.7,15.3,18.2,25.1,18.8,12.6,4.5,1.7,18.100000000000001,61.3,98.8,842,"Females",5.4,16.8,20.8,23.9,17.3,9.4,3.9,1.5,22.2,67,99,11164,"All",5.2,16.7,20.6,24,17.399999999999999,9.6,3.9,1.5,21.9,66.599999999999994,99,12006]
["Drama","Males",3.9,13.1,22.5,25.9,18.8,9,4.0999999999999996,1.7,17.100000000000001,65.5,99,27237,"Females",6.7,20.2,27.3,23.8,13.2,5.4,2.1,0.8,26.9,78.099999999999994,99.5,43614,"All",5.6,17.5,25.5,24.6,15.3,6.8,2.9,1.1000000000000001,23.1,73.2,99.3,70851]
["English Literature","Males",3.2,12.3,26.1,26.8,17.399999999999999,8.3000000000000007,3.4,1.3,15.6,68.400000000000006,98.8,195575,"Females",6.8,21.2,31.5,22.9,11,4,1.4,0.5,28,82.4,99.3,211491,"All",5.0999999999999996,17,28.9,24.8,14,6.1,2.4,0.9,22,75.7,99,407066]
["English Studies","Males",0,1.4,14.7,29.2,24.9,20.100000000000001,7.6,1.7,1.4,45.3,99.7,353,"Females",0.8,3.8,24.5,28.3,27.7,9.8000000000000007,4.0999999999999996,0.8,4.5999999999999996,57.3,99.7,368,"All",0.4,2.6,19.7,28.7,26.4,14.8,5.8,1.2,3.1,51.5,99.7,721]
["General Studies","Males",1.7,6.6,11.5,16.3,18.600000000000001,16,11.5,8.6,8.3000000000000007,36.200000000000003,90.9,4961,"Females",2.2999999999999998,7.7,13.7,19.3,22.8,14.8,8.8000000000000007,5.0999999999999996,10,43,94.5,4562,"All",2,7.1,12.6,17.7,20.6,15.4,10.199999999999999,6.9,9.1,39.5,92.6,9523]
["Health and Social Care","Males","x",2.5,8.6,17.100000000000001,19.600000000000001,17.8,15,10.4,2.6,28.3,91.1,1200,"Females","x",9.5,19.7,25.5,18.7,11.3,6.7,4.0999999999999996,11.3,56.5,97.3,17170,"All",1.7,9,19,24.9,18.7,11.8,7.2,4.5,10.8,54.7,96.9,18370]
["Hospitality and Catering","Males","x",2,11.5,25.6,25.8,18.899999999999999,11.5,2.5,2.1,39.1,97.7,1055,"Females","x",11.3,22.1,26.8,19.7,10.8,3.3,1.1000000000000001,14.3,63.3,98.2,1394,"All",1.8,7.3,17.5,26.3,22.3,14.3,6.8,1.7,9.1,52.9,98,2449]
["Leisure and Tourism","Males",0.5,3.3,8.9,16.100000000000001,19.100000000000001,17.3,13.7,11.6,3.8,28.9,90.6,2917,"Females",2.6,8.4,15.6,20,18.8,14.3,9.1999999999999993,6.6,11.1,46.7,95.5,3107,"All",1.6,5.9,12.4,18.100000000000001,19,15.7,11.4,9,7.6,38.1,93.1,6024]
["Manufacturing","Males","x",5.3,16,19.100000000000001,19.100000000000001,21.3,13.8,4.3,6.4,41.5,100,94,"Females","x",12.5,27.5,30,20,7.5,0,0,15,72.5,100,40,"All","x",7.5,19.399999999999999,22.4,19.399999999999999,17.2,9.6999999999999993,3,9,50.7,100,134]
["Media/Film/TV","Males",1.5,7.2,18.7,27.8,21,12,6.4,3,8.6999999999999993,55.2,97.6,26234,"Females",5.4,17.8,27.8,25.1,13,5.9,2.5,1.2,23.2,76.2,98.8,25368,"All",3.4,12.4,23.2,26.5,17.100000000000001,9,4.5,2.1,15.8,65.5,98.2,51602]
["Music","Males",8.9,19.7,23.8,19.7,13,7.8,3.6,1.9,28.6,72.099999999999994,98.5,20393,"Females",9.1999999999999993,23,26.1,19.600000000000001,11.3,6.1,2.6,1.3,32.200000000000003,78,99.2,23305,"All",9.1,21.5,25,19.7,12.1,6.9,3.1,1.6,30.5,75.2,98.9,43698]
["Performing Arts","Males",3.5,6.1,15.9,24,23.4,12.6,8.4,3.4,9.6,49.5,97.3,1665,"Females",8.8000000000000007,12.3,20.5,25.7,16.899999999999999,9.1999999999999993,3.9,1.5,21.2,67.400000000000006,98.8,4333,"All",7.3,10.6,19.2,25.2,18.7,10.1,5.0999999999999996,2,18,62.4,98.4,5998]
["Physical Education","Males",2.8,13.7,23.5,28.5,18.600000000000001,8.9,2.8,0.8,16.5,68.5,99.6,73377,"Females",6.8,19.100000000000001,22.8,24,15.9,7.6,2.5,0.8,25.9,72.8,99.5,37413,"All",4.2,15.5,23.3,27,17.7,8.5,2.7,0.8,19.7,70,99.6,110790]
["Religious Studies","Males",6.9,15,22.3,20.8,13.8,9.1,5.7,3.5,22,65.099999999999994,97.1,125085,"Females",14.7,22.4,24.1,17.100000000000001,9.6,5.7,3.3,1.8,37.1,78.2,98.6,144426,"All",11.1,19,23.3,18.8,11.6,7.2,4.4000000000000004,2.6,30.1,72.099999999999994,97.9,269511]
["Statistics","Males",4.0999999999999996,15.1,20.6,27.9,17.100000000000001,7.2,3.7,2,19.2,67.7,97.8,28134,"Females",4.3,16.100000000000001,22.8,29.6,14.8,6.1,2.7,1.5,20.5,72.900000000000006,98,23924,"All",4.2,15.6,21.6,28.7,16,6.7,3.3,1.8,19.8,70.099999999999994,97.9,52058]
["Vocational Studies","Males",1.1000000000000001,6.4,16.5,27.1,23.2,14.6,6.8,2.5,7.5,51.1,98.2,19950,"Females",3.4,14.9,25.5,25.9,16.7,8.1999999999999993,3.4,1.2,18.3,69.7,99.2,22372,"All",2.2999999999999998,10.9,21.3,26.4,19.8,11.2,5,1.8,13.2,60.9,98.7,42322]
["All Subjects","Males",5.6,12.9,21.4,26.5,16.7,8.4,4.4000000000000004,2.2999999999999998,18.399999999999999,66.3,98.1,2268834,"Females",8.5,17.399999999999999,24.4,24.9,13.5,5.9,2.8,1.4,26,75.2,98.8,2343738,"All",7.1,15.2,22.9,25.7,15.1,7.1,3.6,1.8,22.3,70.8,98.5,4612572]
[]
[]
[]
[" ",null,null,null,null,null,null,null,null,null,null,null,null,null,null,null,null,null,null,null,null,null,null,null,null,null,null,null,null,null,null,null,null,null," "]
["DISC3B"]
["Subject","(No column name)","*","A","B","C","D","E","F","G","AstarA","AstarC","AstarG","Total","(No column name)","*","A","B","C","D","E","F","G","AstarA","AstarC","AstarG","Total","(No column name)","*","A","B","C","D","E","F","G","AstarA","AstarC","AstarG","Total"]
["English","Males",4284,17793,41422,55388,33933,14135,5823,2397,22077,118887,175175,176842,"Females",10560,34393,56502,51458,22561,7002,2350,963,44953,152913,185789,186560,"All",14844,52186,97924,106846,56494,21137,8173,3360,67030,271800,360964,363402]
["Mathematics","Males",23228,35710,56796,86861,39497,15877,10695,9023,58938,202595,277687,290391,"Females",19709,34659,57976,86952,39786,14449,9575,7920,54368,199296,271026,281881,"All",42937,70369,114772,173813,79283,30326,20270,16943,113306,401891,548713,572272]
["Core Science","Males",1726,11034,32864,57037,41248,20957,11184,4485,12760,102661,180535,183841,"Females",2962,16296,39365,57239,37662,17907,8408,3154,19258,115862,182993,185357,"All",4688,27330,72229,114276,78910,38864,19592,7639,32018,218523,363528,369198]
["Additional Science","Males",2423,11957,29736,47761,33003,14199,6253,2321,14380,91877,147653,148776,"Females",3711,16296,35830,49363,31359,12555,4644,1562,20007,105200,155320,156188,"All",6134,28253,65566,97124,64362,26754,10897,3883,34387,197077,302973,304964]
["Further Additional Science","Males",1340,2197,2690,2702,1737,561,147,29,3537,8929,11403,11420,"Females",1751,2402,2797,2471,1461,458,87,26,4153,9421,11453,11474,"All",3091,4599,5487,5173,3198,1019,234,55,7690,18350,22856,22894]
["Additional Applied Science","Males",9,60,346,1379,1915,1572,786,319,69,1794,6386,6554,"Females",3,93,581,1682,1999,1147,566,210,96,2359,6281,6378,"All",12,153,927,3061,3914,2719,1352,529,165,4153,12667,12932]
["Physics","Males",9218,17526,18133,12513,3988,631,141,40,26744,57390,62190,62238,"Females",9423,17019,17329,12011,3860,560,94,39,26442,55782,60335,60374,"All",18641,34545,35462,24524,7848,1191,235,79,53186,113172,122525,122612]
["Chemistry","Males",8706,16436,18375,13324,4766,960,180,53,25142,56841,62800,62852,"Females",11130,17252,16851,10889,3589,634,106,44,28382,56122,60495,60538,"All",19836,33688,35226,24213,8355,1594,286,97,53524,112963,123295,123390]
["Biological Sciences","Males",6917,17177,19759,13746,4743,960,287,123,24094,57599,63712,63877,"Females",10283,19460,17712,10433,3260,695,179,106,29743,57888,62128,62252,"All",17200,36637,37471,24179,8003,1655,466,229,53837,115487,125840,126129]
["Computer Science","Males",1713,4169,5963,6189,4193,2471,1539,1023,5882,18034,27260,28101,"Females",476,1040,1280,1147,715,392,183,94,1516,3943,5327,5432,"All",2189,5209,7243,7336,4908,2863,1722,1117,7398,21977,32587,33533]
["Other Sciences","Males",439,561,608,722,565,488,309,164,1000,2330,3856,3971,"Females",99,285,407,543,372,259,153,83,384,1334,2201,2252,"All",538,846,1015,1265,937,747,462,247,1384,3664,6057,6223]
["D & T: Electronic Products","Males",486,1157,1602,1463,1137,729,396,206,1643,4708,7176,7327,"Females",89,155,138,89,51,19,13,11,244,471,565,568,"All",575,1312,1740,1552,1188,748,409,217,1887,5179,7741,7895]
["D & T: Food Technology","Males",214,785,2046,3376,3274,2140,1330,582,999,6421,13747,14091,"Females",1721,4073,5702,5666,3700,1981,959,345,5794,17162,24147,24332,"All",1935,4858,7748,9042,6974,4121,2289,927,6793,23583,37894,38423]
["D & T: Graphic Products","Males",600,1755,3204,4573,3849,2736,1601,953,2355,10132,19271,19958,"Females",1139,2099,2673,2614,1625,934,466,203,3238,8525,11753,11901,"All",1739,3854,5877,7187,5474,3670,2067,1156,5593,18657,31024,31859]
["D & T: Resistant Materials","Males",1384,3757,7548,10762,8714,5545,3252,1545,5141,23451,42507,43489,"Females",686,1390,1685,1681,1073,580,289,139,2076,5442,7523,7608,"All",2070,5147,9233,12443,9787,6125,3541,1684,7217,28893,50030,51097]
["D & T: Systems & Control","Males",208,353,573,670,499,281,129,68,561,1804,2781,2811,"Females",11,40,34,40,26,10,3,3,51,125,167,168,"All",219,393,607,710,525,291,132,71,612,1929,2948,2979]
["D & T: Textiles Technology","Males",10,41,94,144,149,141,99,46,51,289,724,752,"Females",2235,4140,5711,4948,3259,1747,854,357,6375,17034,23251,23450,"All",2245,4181,5805,5092,3408,1888,953,403,6426,17323,23975,24202]
["Other Design and Technology","Males",704,2166,4831,6762,5419,3551,2311,1110,2870,14463,26854,27501,"Females",803,1947,2705,2271,1439,793,410,209,2750,7726,10577,10722,"All",1507,4113,7536,9033,6858,4344,2721,1319,5620,22189,37431,38223]
["Applied Engineering","Males",45,234,664,1252,1254,924,699,442,279,2195,5514,5817,"Females",18,85,87,100,78,49,29,17,103,290,463,473,"All",63,319,751,1352,1332,973,728,459,382,2485,5977,6290]
["Information Technology","Males",1830,7562,13446,14010,8551,4773,3264,2128,9392,36848,55564,57010,"Females",2422,7710,10465,9559,5783,3030,1757,1060,10132,30156,41786,42551,"All",4252,15272,23911,23569,14334,7803,5021,3188,19524,67004,97350,99561]
["Business Studies","Males",1149,5519,10212,10533,6909,4010,2358,1355,6668,27413,42045,42806,"Females",1322,5115,7880,7246,4633,2551,1410,703,6437,21563,30860,31215,"All",2471,10634,18092,17779,11542,6561,3768,2058,13105,48976,72905,74021]
["Applied Business","Males",113,630,1309,1540,1141,860,475,327,743,3592,6395,6829,"Females",134,723,1089,1028,744,528,240,163,857,2974,4649,4815,"All",247,1353,2398,2568,1885,1388,715,490,1600,6566,11044,11644]
["Home Economics","Males",24,138,373,755,790,606,379,155,162,1290,3220,3307,"Females",731,2581,4655,5688,4736,2872,1524,707,3312,13655,23494,23847,"All",755,2719,5028,6443,5526,3478,1903,862,3474,14945,26714,27154]
["Ancient History","Males",89,111,104,78,57,34,17,14,200,382,504,522,"Females",63,104,110,75,57,23,12,8,167,352,452,456,"All",152,215,214,153,114,57,29,22,367,734,956,978]
["Geography","Males",8313,17561,22642,25915,18312,10834,5748,2815,25874,74431,112140,113351,"Females",12021,19601,20946,19687,12552,7183,3678,1690,31622,72255,97358,98046,"All",20334,37162,43588,45602,30864,18017,9426,4505,57496,146686,209498,211397]
["History","Males",8080,18428,23515,21823,15234,9952,6602,4116,26508,71846,107750,110702,"Females",14361,25155,26033,20775,13368,8637,5376,2980,39516,86324,116685,118367,"All",22441,43583,49548,42598,28602,18589,11978,7096,66024,158170,224435,229069]
["Humanities","Males",46,231,586,884,827,688,473,362,277,1747,4097,4362,"Females",113,456,749,896,706,464,316,183,569,2214,3883,4038,"All",159,687,1335,1780,1533,1152,789,545,846,3961,7980,8400]
["Economics","Males",405,1415,1845,1246,727,360,186,103,1820,4911,6287,6378,"Females",173,713,876,615,343,183,89,40,886,2377,3032,3076,"All",578,2128,2721,1861,1070,543,275,143,2706,7288,9319,9454]
["Social Studies","Males",356,2021,4396,5334,3976,2521,1569,935,2377,12107,21108,21916,"Females",1588,6256,9911,8628,5467,3215,1698,967,7844,26383,37730,38414,"All",1944,8277,14307,13962,9443,5736,3267,1902,10221,38490,58838,60330]
["Other Classical Studies","Males",17,31,37,22,10,10,10,5,48,107,142,148,"Females",41,133,87,38,27,13,8,8,174,299,355,362,"All",58,164,124,60,37,23,18,13,222,406,497,510]
["Arabic","Males",437,288,184,160,90,68,44,49,725,1069,1320,1395,"Females",633,344,255,201,120,83,70,54,977,1433,1760,1806,"All",1070,632,439,361,210,151,114,103,1702,2502,3080,3201]
["Chinese","Males",1034,297,189,137,68,20,9,1,1331,1657,1755,1761,"Females",1067,199,127,100,22,8,0,1,1266,1493,1524,1525,"All",2101,496,316,237,90,28,9,2,2597,3150,3279,3286]
["French","Males",4782,6913,10889,18117,14226,5983,2281,727,11695,40701,63918,64214,"Females",9918,13330,17906,23815,15049,4694,1541,424,23248,64969,86677,86881,"All",14700,20243,28795,41932,29275,10677,3822,1151,34943,105670,150595,151095]
["German","Males",1727,3075,5313,7535,5196,1756,589,209,4802,17650,25400,25466,"Females",2650,4539,6767,7668,4119,1064,333,97,7189,21624,27237,27280,"All",4377,7614,12080,15203,9315,2820,922,306,11991,39274,52637,52746]
["Italian","Males",715,320,236,235,151,54,19,9,1035,1506,1739,1752,"Females",955,435,334,297,158,48,14,4,1390,2021,2245,2252,"All",1670,755,570,532,309,102,33,13,2425,3527,3984,4004]
["Polish","Males",464,801,352,158,75,21,10,17,1265,1775,1898,1923,"Females",894,835,249,88,30,20,4,10,1729,2066,2130,2152,"All",1358,1636,601,246,105,41,14,27,2994,3841,4028,4075]
["Spanish","Males",3788,4750,6480,9440,7123,3035,1353,569,8538,24458,36538,36821,"Females",7544,8083,9868,11663,7206,2601,979,359,15627,37158,48303,48521,"All",11332,12833,16348,21103,14329,5636,2332,928,24165,61616,84841,85342]
["Urdu","Males",136,311,364,362,214,129,75,22,447,1173,1613,1626,"Females",377,627,616,471,269,119,51,13,1004,2091,2543,2559,"All",513,938,980,833,483,248,126,35,1451,3264,4156,4185]
["Other Modern Languages","Males",1510,1330,933,548,284,193,88,37,2840,4321,4923,4987,"Females",2057,1622,925,481,244,108,30,24,3679,5085,5491,5542,"All",3567,2952,1858,1029,528,301,118,61,6519,9406,10414,10529]
["Classical Civilisation","Males",209,464,523,446,236,112,46,19,673,1642,2055,2068,"Females",346,546,419,297,165,77,24,19,892,1608,1893,1899,"All",555,1010,942,743,401,189,70,38,1565,3250,3948,3967]
["Classical Greek","Males",512,126,44,17,6,4,1,0,638,699,710,711,"Females",337,85,34,17,10,5,1,1,422,473,490,490,"All",849,211,78,34,16,9,2,1,1060,1172,1200,1201]
["Latin","Males",1985,979,548,341,164,73,30,13,2964,3853,4133,4150,"Females",2219,1026,505,247,110,62,24,11,3245,3997,4204,4211,"All",4204,2005,1053,588,274,135,54,24,6209,7850,8337,8361]
["Applied Art and Design","Males",9,24,59,153,62,48,28,9,33,245,392,399,"Females",33,58,95,138,57,30,6,4,91,324,421,424,"All",42,82,154,291,119,78,34,13,124,569,813,823]
["Art and Design","Males",2872,4790,10447,20130,10511,5623,3225,1443,7662,38239,59041,59965,"Females",12905,19534,29772,33642,11952,4666,2133,824,32439,95853,115428,116222,"All",15777,24324,40219,53772,22463,10289,5358,2267,40101,134092,174469,176187]
["Communication Studies","Males",94,354,774,1064,928,617,378,200,448,2286,4409,4584,"Females",305,742,1112,1085,739,415,211,110,1047,3244,4719,4828,"All",399,1096,1886,2149,1667,1032,589,310,1495,5530,9128,9412]
["Dance","Males",23,129,153,211,158,106,38,14,152,516,832,842,"Females",605,1877,2324,2669,1929,1045,432,167,2482,7475,11048,11164,"All",628,2006,2477,2880,2087,1151,470,181,2634,7991,11880,12006]
["Drama","Males",1071,3580,6121,7062,5112,2457,1105,452,4651,17834,26960,27237,"Females",2912,8823,11928,10388,5746,2342,923,343,11735,34051,43405,43614,"All",3983,12403,18049,17450,10858,4799,2028,795,16386,51885,70365,70851]
["English Literature","Males",6316,24112,50995,52352,33973,16174,6652,2610,30428,133775,193184,195575,"Females",14311,44903,66549,48413,23176,8519,2990,1152,59214,174176,210013,211491,"All",20627,69015,117544,100765,57149,24693,9642,3762,89642,307951,403197,407066]
["English Studies","Males",0,5,52,103,88,71,27,6,5,160,352,353,"Females",3,14,90,104,102,36,15,3,17,211,367,368,"All",3,19,142,207,190,107,42,9,22,371,719,721]
["General Studies","Males",85,329,572,808,925,793,569,428,414,1794,4509,4961,"Females",106,349,626,882,1041,673,403,232,455,1963,4312,4562,"All",191,678,1198,1690,1966,1466,972,660,869,3757,8821,9523]
["Health and Social Care","Males",1,30,103,205,235,214,180,125,31,339,1093,1200,"Females",316,1629,3386,4372,3205,1948,1151,700,1945,9703,16707,17170,"All",317,1659,3489,4577,3440,2162,1331,825,1976,10042,17800,18370]
["Hospitality and Catering","Males",1,21,121,270,272,199,121,26,22,413,1031,1055,"Females",42,158,308,374,274,151,46,16,200,882,1369,1394,"All",43,179,429,644,546,350,167,42,222,1295,2400,2449]
["Leisure and Tourism","Males",16,95,261,471,558,504,400,337,111,843,2642,2917,"Females",82,262,484,622,584,443,285,204,344,1450,2966,3107,"All",98,357,745,1093,1142,947,685,541,455,2293,5608,6024]
["Manufacturing","Males",1,5,15,18,18,20,13,4,6,39,94,94,"Females",1,5,11,12,8,3,0,0,6,29,40,40,"All",2,10,26,30,26,23,13,4,12,68,134,134]
["Media/Film/TV","Males",400,1888,4894,7288,5511,3144,1684,788,2288,14470,25597,26234,"Females",1380,4510,7063,6370,3294,1509,639,301,5890,19323,25066,25368,"All",1780,6398,11957,13658,8805,4653,2323,1089,8178,33793,50663,51602]
["Music","Males",1824,4012,4853,4022,2654,1595,739,385,5836,14711,20084,20393,"Females",2145,5365,6091,4566,2626,1424,611,295,7510,18167,23123,23305,"All",3969,9377,10944,8588,5280,3019,1350,680,13346,32878,43207,43698]
["Performing Arts","Males",58,102,264,400,390,209,140,57,160,824,1620,1665,"Females",382,535,890,1113,732,399,167,65,917,2920,4283,4333,"All",440,637,1154,1513,1122,608,307,122,1077,3744,5903,5998]
["Physical Education","Males",2070,10068,17250,20894,13614,6550,2087,565,12138,50282,73098,73377,"Females",2560,7141,8534,8994,5961,2849,920,281,9701,27229,37240,37413,"All",4630,17209,25784,29888,19575,9399,3007,846,21839,77511,110338,110790]
["Religious Studies","Males",8658,18820,27930,26030,17210,11328,7122,4318,27478,81438,121416,125085,"Females",21208,32320,34748,24733,13935,8168,4776,2581,53528,113009,142469,144426,"All",29866,51140,62678,50763,31145,19496,11898,6899,81006,194447,263885,269511]
["Statistics","Males",1151,4245,5800,7858,4817,2029,1053,567,5396,19054,27520,28134,"Females",1040,3861,5462,7087,3530,1449,652,360,4901,17450,23441,23924,"All",2191,8106,11262,14945,8347,3478,1705,927,10297,36504,50961,52058]
["Vocational Studies","Males",222,1274,3293,5403,4634,2920,1356,498,1496,10192,19600,19950,"Females",758,3331,5707,5791,3728,1828,761,279,4089,15587,22183,22372,"All",980,4605,9000,11194,8362,4748,2117,777,5585,25779,41783,42322]
["All Subjects","Males",126247,292052,485731,601002,379920,189555,99704,51748,418299,1505032,2225959,2268834,"Females",199869,408759,571351,582532,316412,137656,65668,32928,608628,1762511,2315175,2343738,"All",326116,700811,1057082,1183534,696332,327211,165372,84676,1026927,3267543,4541134,4612572]

{"sheet":"2016","index":10,"n_rows":68,"n_cols":40,"rows_kept":68,"cut":false,"hidden":true,"merged":[]}
[1,2,3,4,5,6,7,8,9,10,11,12,13,14,15,16,17,18,19,20,21,22,23,24,25,26,27,28,29,30,31,32,33,34,35,36,37,38,39,40]
["Subjects",null,"*","A","B","C","D","E","F","G","AstarA","AstarC","AstarG","Total","(No column name)","*","A","B","C","D","E","F","G","AstarA","AstarC","AstarG","Total","(No column name)","*","A","B","C","D","E","F","G","AstarA","AstarC","AstarG","Total"]
["English","Males",2.8,9.6,21.9,30.8,20.2,8.6,3.7,1.5,12.4,65,99.1,164981,"Females",6.4,17.600000000000001,28.7,27.5,13.2,4.2,1.4,0.6,24,80.2,99.6,173087,"All",4.7,13.7,25.4,29.1,16.600000000000001,6.3,2.5,1.1000000000000001,18.399999999999999,72.8,99.3,338068]
["Mathematics","Males",8.1,12.8,20.100000000000001,29.8,13.8,5.2,3.4,2.8,20.9,70.8,96,275819,"Females",7.5,13.5,21.4,30.2,13.7,4.9000000000000004,3.1,2.5,21,72.599999999999994,96.8,268274,"All",7.8,13.1,20.7,30,13.8,5.0999999999999996,3.2,2.6,21,71.7,96.4,544093]
["Core Science","Males",0.5,4.8,16.5,29.7,23.7,13.2,7.2,2.9,5.3,51.5,98.4,198136,"Females",1,7.5,20.3,29.9,21.4,11.3,5.7,2,8.4,58.6,98.9,196165,"All",0.7,6.1,18.399999999999999,29.8,22.5,12.2,6.5,2.5,6.9,55,98.7,394301]
["Additional Science","Males",1.3,6.7,18.8,30,21.3,11.6,6.4,2.6,8,56.7,98.7,172685,"Females",1.9,8.9,21.9,30.2,19.8,10.1,4.8,1.6,10.8,62.9,99.2,176353,"All",1.6,7.8,20.3,30.1,20.6,10.9,5.6,2.1,9.4,59.8,99,349038]
["Further Additional Science","Males",14.6,19,22.1,20,14.2,7.3,2.2000000000000002,0.5,33.6,75.599999999999994,99.8,8568,"Females",16.8,21,21.5,20.100000000000001,12.8,5.6,1.7,0.4,37.700000000000003,79.3,99.8,8408,"All",15.7,20,21.8,20,13.5,6.5,2,0.5,35.6,77.400000000000006,99.8,16976]
["Additional Applied Science","Males",0,0.2,4.2,19.7,30.8,24.5,12.3,5.9,0.2,24.1,97.6,1765,"Females",0.2,0.8,7.7,24.4,31.8,21,10,2.4,1,33.200000000000003,98.4,1652,"All",0.1,0.5,5.9,22,31.3,22.8,11.2,4.2,0.6,28.5,98,3417]
["Physics","Males",15.1,26.9,28.4,20.6,7.1,1.4,0.3,0.1,42,91,99.9,65070,"Females",15.3,26.8,28.5,20.5,7.2,1.4,0.2,0.1,42,91.1,99.9,64373,"All",15.2,26.8,28.5,20.6,7.1,1.4,0.3,0.1,42,91,99.9,129443]
["Chemistry","Males",12.6,26.3,28.6,21.7,8.3000000000000007,1.8,0.5,0.1,38.9,89.3,99.9,65409,"Females",16.7,29.4,27.8,18,6.4,1.3,0.3,0.1,46,91.9,99.9,64836,"All",14.6,27.8,28.2,19.899999999999999,7.3,1.5,0.4,0.1,42.5,90.6,99.9,130245]
["Biological Sciences","Males",11.2,26.5,30.8,21.1,7.8,1.6,0.5,0.2,37.700000000000003,89.7,99.8,66082,"Females",15.9,30.5,28.9,17.100000000000001,5.7,1.3,0.4,0.1,46.4,92.3,99.8,65982,"All",13.6,28.5,29.9,19.100000000000001,6.7,1.5,0.4,0.2,42.1,91,99.8,132064]
["Computer Science","Males",5.3,14.2,19.8,20.2,15,10,6.8,4.4000000000000004,19.5,59.5,95.7,49462,"Females",7.5,16.899999999999999,19.2,18.7,13.9,9.6,6.3,4.0999999999999996,24.3,62.3,96.3,12673,"All",5.7,14.8,19.7,19.899999999999999,14.8,9.9,6.7,4.4000000000000004,20.5,60.1,95.9,62135]
["Other Sciences","Males",13.9,15.9,19,16.899999999999999,11.3,10.199999999999999,6.2,3.7,29.8,65.8,97.1,3200,"Females",7,13.8,19.899999999999999,20.399999999999999,16.5,11.6,5.7,2.6,20.8,61.2,97.5,1589,"All",11.6,15.2,19.3,18,13,10.6,6,3.3,26.9,64.2,97.2,4789]
["D & T: Electronic Products","Males",6.9,15.1,20.2,21.9,14.6,10,5.8,3.3,22,64.099999999999994,97.8,6125,"Females",16,27.3,23.8,16.3,7.7,5,2.5,0.8,43.3,83.3,99.4,480,"All",7.6,16,20.399999999999999,21.5,14.1,9.6,5.6,3.1,23.6,65.5,97.9,6605]
["D & T: Food Technology","Males",1.1000000000000001,5.5,13.6,24.2,23.7,16.600000000000001,8.9,4.2,6.6,44.4,97.8,12143,"Females",7.1,17.2,23.6,22.8,15.3,8,3.8,1.4,24.3,70.7,99.2,21305,"All",4.9000000000000004,12.9,20,23.3,18.399999999999999,11.1,5.6,2.4,17.899999999999999,61.2,98.7,33448]
["D & T: Graphic Products","Males",2.4,8.6999999999999993,16.399999999999999,22,19.8,14,8.6999999999999993,4.8,11.1,49.4,96.7,16159,"Females",8.9,19.600000000000001,23.6,21.1,13.8,6.9,3.4,1.7,28.4,73.099999999999994,98.9,9714,"All",4.8,12.8,19.100000000000001,21.6,17.5,11.3,6.7,3.6,17.600000000000001,58.3,97.5,25873]
["D & T: Resistant Materials","Males",2.9,8.9,17.600000000000001,24.3,20,13.1,7.6,3.6,11.9,53.8,98.1,40346,"Females",9.1,19.100000000000001,24,21.2,13,7.3,3.8,1.7,28.2,73.400000000000006,99.1,7183,"All",3.9,10.5,18.600000000000001,23.8,18.899999999999999,12.3,7,3.3,14.3,56.8,98.2,47529]
["D & T: Systems & Control","Males",6.7,16.899999999999999,21.1,22.4,16.3,10,4,"x",23.6,67.099999999999994,99.2,2323,"Females",8.3000000000000007,22.4,31.3,19.3,11.5,3.1,3.1,"x",30.7,81.3,99.5,192,"All",6.8,17.3,21.9,22.1,15.9,9.5,4,1.7,24.1,68.2,99.2,2515]
["D & T: Textiles Technology","Males",2.9,6.1,12.3,16.3,20.9,15.8,13.6,7.6,9,37.5,95.3,767,"Females",9.5,18.3,24.1,21.9,13.3,6.8,3.7,1.6,27.9,73.900000000000006,99.2,20831,"All",9.3000000000000007,17.899999999999999,23.7,21.7,13.6,7.1,4,1.8,27.2,72.599999999999994,99.1,21598]
["Other Design and Technology","Males",2.4,8.4,17.399999999999999,23.8,20.7,13,7.8,4.0999999999999996,10.7,51.9,97.5,27343,"Females",8.4,18.100000000000001,24,22.1,13.6,7.4,3.8,1.4,26.5,72.599999999999994,98.9,10152,"All",4,11,19.2,23.3,18.8,11.5,6.7,3.4,15,57.5,97.9,37495]
["Applied Engineering","Males",0.7,4.4000000000000004,11,22.9,23.1,16.600000000000001,10.1,7.1,5.2,39,95.9,6242,"Females",6.5,14.7,20.2,24.2,16.600000000000001,8.1,5.6,3,21.2,65.599999999999994,98.8,604,"All",1.2,5.3,11.8,23,22.5,15.8,9.6999999999999993,6.7,6.6,41.4,96.2,6846]
["Information Technology","Males",2.9,13,23.4,23.8,15.1,8.8000000000000007,5.8,4,16,63.2,97,43189,"Females",6.1,18.899999999999999,25.3,21.9,12.9,6.8,3.9,2.4,25,72.2,98.2,29673,"All",4.2,15.4,24.2,23,14.2,8,5.0999999999999996,3.4,19.600000000000001,66.8,97.5,72862]
["Business Studies","Males",2.8,12.6,23.5,23.9,16.2,9.6999999999999993,5.9,3.4,15.4,62.7,97.9,42858,"Females",4.3,15.6,24.4,22,15.6,9.3000000000000007,4.8,2.6,19.899999999999999,66.3,98.6,30206,"All",3.4,13.8,23.9,23.1,15.9,9.5,5.4,3.1,17.3,64.2,98.2,73064]
["Applied Business","Males",0.9,9.3000000000000007,20.399999999999999,22.8,16.899999999999999,12,6.6,4.8,10.199999999999999,53.5,93.8,6125,"Females",2.2000000000000002,15.8,24.7,20.7,14.9,10.7,4.9000000000000004,3.2,18,63.5,97,4366,"All",1.5,12,22.2,22,16,11.5,5.9,4.0999999999999996,13.5,57.6,95.2,10491]
["Home Economics","Males",0.5,4.3,12.9,22.1,23.4,18.899999999999999,11.4,4,4.7,39.700000000000003,97.3,2959,"Females",2.7,11.2,19.8,23.9,19.8,12.2,6.3,2.6,14,57.6,98.6,21328,"All",2.4,10.4,18.899999999999999,23.7,20.2,13,6.9,2.8,12.8,55.5,98.4,24287]
["Ancient History","Males",13.5,20,18.3,19.600000000000001,11,8.8000000000000007,4.3,1.9,33.5,71.400000000000006,97.4,535,"Females",15,15.2,22.7,18,13.8,8.5,3.2,2.5,30.1,70.8,98.9,528,"All",14.2,17.600000000000001,20.5,18.8,12.4,8.6999999999999993,3.8,2.2000000000000002,31.8,71.099999999999994,98.1,1063]
["Geography","Males",6.1,13.9,19.2,22.7,16.7,10.4,6.1,3.2,20.100000000000001,62,98.4,120921,"Females",11.1,18.600000000000001,20.7,20,13.3,8.1,4.9000000000000004,2.4,29.7,70.400000000000006,99.1,107697,"All",8.5,16.100000000000001,19.899999999999999,21.5,15.1,9.3000000000000007,5.5,2.8,24.6,66,98.7,228618]
["History","Males",6.7,15.3,20.2,19.399999999999999,14.4,9.6,6.6,4.4000000000000004,22,61.6,96.6,116276,"Females",10.9,19.7,21.4,17.600000000000001,12.3,8.1999999999999993,5.3,2.9,30.5,69.5,98.2,126802,"All",8.9,17.600000000000001,20.8,18.399999999999999,13.3,8.9,5.9,3.6,26.5,65.7,97.4,243078]
["Humanities","Males",0.7,6.3,14.4,20,19,13.2,10.9,8.3000000000000007,7,41.4,92.9,2829,"Females",2.6,9.3000000000000007,19.8,22.5,17.600000000000001,12.5,7.5,4.8,11.9,54.3,96.7,2464,"All",1.6,7.7,16.899999999999999,21.2,18.399999999999999,12.9,9.3000000000000007,6.7,9.3000000000000007,47.4,94.6,5293]
["Economics","Males",6.7,21,28,20.5,11.5,5.9,2.9,2,27.7,76.3,98.5,6459,"Females",7,21.1,30.3,20,10.5,5.9,3.1,1.3,28,78.400000000000006,99.2,3039,"All",6.8,21,28.8,20.399999999999999,11.2,5.9,3,1.8,27.8,77,98.8,9498]
["Social Studies","Males",1.5,9.1,20.5,23.9,18.100000000000001,12.4,7.1,4.0999999999999996,10.6,54.9,96.7,19975,"Females",3.8,17.600000000000001,25.3,21.6,14.7,8.6,4.7,2.2999999999999998,21.4,68.3,98.5,36508,"All",3,14.6,23.6,22.4,15.9,9.9,5.5,2.9,17.600000000000001,63.6,97.9,56483]
["Other Classical Studies","Males",9.8000000000000007,30.3,26.5,18.2,12.1,"x",0,0,40.200000000000003,84.8,98.5,132,"Females",13.9,36.299999999999997,24.6,11.2,4.5999999999999996,"x",2,1.2,50.2,86.1,96.8,410,"All",12.9,34.9,25.1,12.9,6.5,2.6,1.5,0.9,47.8,85.8,97.2,542]
["Arabic","Males",31.4,21.8,12.7,10,7.2,4.3,3.6,4.2,53.2,75.900000000000006,95.1,1549,"Females",36.9,20.8,14.7,8.4,6.6,5.5,3.1,2.2000000000000002,57.7,80.8,98.2,1932,"All",34.4,21.3,13.8,9.1,6.9,5,3.3,3.1,55.7,78.599999999999994,96.8,3481]
["Chinese","Males",57.5,17.5,11.3,8.1999999999999993,3.5,1.1000000000000001,0.7,"x",74.900000000000006,94.4,99.8,1844,"Females",67.7,14.7,9,4.7,2.1,1.1000000000000001,0.4,"x",82.4,96.1,99.8,1731,"All",62.4,16.100000000000001,10.199999999999999,6.5,2.8,1.1000000000000001,0.5,0.2,78.5,95.2,99.8,3575]
["French","Males",7.6,10.4,16.5,28.1,23.1,9.1,3.4,1.2,18,62.6,99.5,56939,"Females",11.5,14.5,19.899999999999999,27.9,17.8,5.6,1.9,0.6,26.1,73.900000000000006,99.7,79922,"All",9.9,12.8,18.5,28,20,7,2.5,0.8,22.7,69.2,99.6,136861]
["German","Males",6.3,12.1,20.8,29.2,20.6,7.5,2.4,0.8,18.5,68.5,99.7,22884,"Females",9.5,16.8,24.9,27.5,15.1,4.5,1.2,0.3,26.3,78.7,99.8,25255,"All",8,14.6,23,28.3,17.7,5.9,1.8,0.5,22.6,73.8,99.8,48139]
["Italian","Males",45.3,16.3,14.6,12.3,7.2,2.7,0.9,0.4,61.6,88.5,99.7,1835,"Females",47.1,17.600000000000001,13.9,13.2,5.0999999999999996,2.2999999999999998,0.4,0.2,64.7,91.8,99.8,2246,"All",46.3,17.100000000000001,14.2,12.8,6.1,2.5,0.6,0.3,63.3,90.3,99.7,4081]
["Polish","Males",25.4,41.9,17.7,7.7,3.3,2,0.6,0.7,67.3,92.7,99.3,2296,"Females",43.5,38,10.7,3.9,1,1.1000000000000001,0.4,0.6,81.5,96.1,99.2,2430,"All",34.700000000000003,39.9,14.1,5.7,2.1,1.6,0.5,0.7,74.599999999999994,94.4,99.2,4726]
["Spanish","Males",9.6999999999999993,11.7,17.100000000000001,25.4,19.899999999999999,9.1999999999999993,4.2,1.9,21.5,63.9,99.1,37601,"Females",14.7,15.9,20.399999999999999,23.8,15.7,5.9,2.2999999999999998,0.9,30.5,74.7,99.6,49918,"All",12.6,14.1,19,24.5,17.5,7.3,3.1,1.3,26.6,70.099999999999994,99.4,87519]
["Urdu","Males",9.1999999999999993,17.600000000000001,19,22.4,15.4,8.6999999999999993,5.3,1.2,26.8,68.2,98.8,1451,"Females",15.9,24.6,24.4,16.7,9.9,5.5,1.9,0.5,40.6,81.599999999999994,99.5,2554,"All",13.5,22.1,22.4,18.8,11.9,6.6,3.1,0.8,35.6,76.8,99.2,4005]
["Other Modern Languages","Males",29.3,28.6,18.600000000000001,10,5.6,3.4,1.9,1.2,58,86.6,98.8,4993,"Females",38.6,30,16,8.1,3.6,1.6,1.1000000000000001,0.4,68.599999999999994,92.7,99.4,5714,"All",34.299999999999997,29.3,17.2,9,4.5,2.5,1.5,0.8,63.6,89.9,99.1,10707]
["Classical Civilisation","Males",11.5,21.5,25.6,21.8,11.5,4.8,2.5,0.7,33,80.400000000000006,99.8,1930,"Females",16.8,28.2,23.7,15.7,9.1,3.9,1.7,0.5,45,84.4,99.7,2104,"All",14.3,25,24.6,18.600000000000001,10.199999999999999,4.4000000000000004,2.1,0.6,39.299999999999997,82.5,99.8,4034]
["Classical Greek","Males",74.8,15.8,5.0999999999999996,2.4,0.8,0.8,"x",0,90.5,98.1,99.7,622,"Females",75.599999999999994,13.1,5.0999999999999996,2.4,1.9,1.5,"x",0,88.7,96.1,99.8,467,"All",75.099999999999994,14.6,5.0999999999999996,2.4,1.3,1.1000000000000001,"x",0,89.7,97.2,99.7,1089]
["Latin","Males",52.1,22.7,11.7,7.7,3.3,1.9,0.3,0.2,74.8,94.2,99.9,3915,"Females",57.1,23,9.8000000000000007,5.7,2.7,0.8,0.5,0.2,80.099999999999994,95.7,99.9,4060,"All",54.6,22.9,10.7,6.7,3,1.4,0.4,0.2,77.5,94.9,99.9,7975]
["Applied Art and Design","Males",1.6,3.4,16.7,34.700000000000003,20.6,13.3,5.5,"x",5,56.4,97.4,383,"Females",4.8,10.4,31.4,32.799999999999997,10.4,6,2.5,"x",15.2,79.400000000000006,98.8,433,"All",3.3,7.1,24.5,33.700000000000003,15.2,9.4,3.9,1,10.4,68.599999999999994,98.2,816]
["Art and Design","Males",4.5999999999999996,8,18.399999999999999,32.200000000000003,18,10.1,5.2,2.1,12.6,63.2,98.6,55719,"Females",11.1,16.899999999999999,26.9,27.1,10.7,4.3,1.8,0.6,28,82,99.4,110945,"All",8.9,13.9,24,28.8,13.1,6.3,2.9,1.1000000000000001,22.8,75.7,99.1,166664]
["Communication Studies","Males",1.7,8.5,16.100000000000001,24.4,22.2,13.5,6.8,3.8,10.199999999999999,50.7,96.9,3213,"Females",7.5,18.399999999999999,24.8,20.7,14.3,6.8,4.3,1.7,25.9,71.400000000000006,98.4,3199,"All",4.5999999999999996,13.4,20.399999999999999,22.6,18.2,10.1,5.6,2.7,18.100000000000001,61,97.7,6412]
["Dance","Males",3.7,13.7,18.899999999999999,25.2,19.3,10.199999999999999,6.5,1.5,17.399999999999999,61.4,98.8,679,"Females",5.8,16.899999999999999,22.6,24.3,16.5,8.1,3.4,1.4,22.7,69.599999999999994,99,9860,"All",5.7,16.7,22.4,24.3,16.7,8.1999999999999993,3.6,1.4,22.3,69,99,10539]
["Drama","Males",3.2,12.5,21.7,26.7,19.5,9.9,4.0999999999999996,1.5,15.7,64.099999999999994,99,26211,"Females",6,20.6,27.7,24,13,5.3,2.1,0.8,26.6,78.3,99.5,41679,"All",4.9000000000000004,17.5,25.4,25,15.5,7.1,2.9,1.1000000000000001,22.4,72.8,99.3,67890]
["English Literature","Males",3,11.2,24.3,27.7,18.7,9,3.6,1.4,14.2,66.099999999999994,98.8,198793,"Females",6.9,19.899999999999999,30.3,24.3,11.8,4.2,1.4,0.5,26.8,81.400000000000006,99.4,210048,"All",5,15.7,27.4,25.9,15.1,6.5,2.5,1,20.7,74,99.1,408841]
["English Studies","Males",0,"x",17.899999999999999,23.2,35.700000000000003,12.5,8,0,"x",42,98.2,112,"Females",0,"x",23.2,38.700000000000003,25.4,9.9,0,0,"x",64.8,100,142,"All",0,2,20.9,31.9,29.9,11,3.5,0,2,54.7,99.2,254]
["General Studies","Males",1.4,6.1,10.3,16.2,19.2,15.2,12.5,9,7.4,34,89.9,4079,"Females",1.9,9,16.2,17.2,21.1,14.7,8.6,5.5,10.9,44.3,94.3,3764,"All",1.6,7.5,13.1,16.7,20.100000000000001,14.9,10.6,7.4,9.1,39,92,7843]
["Health and Social Care","Males",0.7,2.2000000000000002,7.9,16.399999999999999,23.3,16.399999999999999,13,11.4,2.9,27.2,91.4,1274,"Females",2.8,8.6999999999999993,19,24.8,19.3,11.8,7,4,11.5,55.3,97.5,18452,"All",2.6,8.3000000000000007,18.3,24.3,19.5,12.1,7.4,4.5,10.9,53.5,97.1,19726]
["Hospitality and Catering","Males","x",3.1,12,25.3,25.2,21.1,9.6999999999999993,2.6,3.3,40.6,99.2,1098,"Females","x",13.6,22.1,23.8,16.7,13.1,5.0999999999999996,1.2,17.3,63.2,99.4,1445,"All",2.2000000000000002,9,17.7,24.5,20.399999999999999,16.600000000000001,7.1,1.8,11.2,53.4,99.3,2543]
["Leisure and Tourism","Males",0.6,3,7.9,14.9,16.899999999999999,18,16.100000000000001,12.1,3.6,26.4,89.5,2124,"Females",2.2000000000000002,9.4,16.5,20.6,16.399999999999999,13.4,10.5,6.8,11.6,48.7,95.7,2400,"All",1.4,6.4,12.4,17.899999999999999,16.600000000000001,15.6,13.1,9.1999999999999993,7.8,38.200000000000003,92.7,4524]
["Manufacturing","Males","x","x",11.3,9.6999999999999993,14.5,32.299999999999997,19.399999999999999,"x","x",24.2,98.4,62,"Females","x","x",19.100000000000001,25,13.2,8.8000000000000007,7.4,"x","x",67.599999999999994,98.5,68,"All","x",12.3,15.4,17.7,13.8,20,13.1,4.5999999999999996,13.8,46.9,98.5,130]
["Media/Film/TV","Males",1.5,7.5,20.2,27.8,20.6,11.7,6,2.8,8.9,56.9,98,24241,"Females",5.4,19.3,28.7,24,12.4,5.8,2.6,1,24.7,77.400000000000006,99.3,22589,"All",3.4,13.2,24.3,26,16.600000000000001,8.9,4.4000000000000004,2,16.600000000000001,66.8,98.6,46830]
["Music","Males",8.4,19.7,23.2,19.3,14,8.1,3.8,2.1,28.1,70.599999999999994,98.6,18902,"Females",9.4,22.6,25.4,19.600000000000001,11.4,6.6,2.8,1.3,32.1,77,99.2,22748,"All",9,21.3,24.4,19.399999999999999,12.6,7.3,3.3,1.6,30.3,74.099999999999994,98.9,41650]
["Performing Arts","Males",5.3,6.1,16.5,26.9,22.6,12.6,5.4,3,11.3,54.7,98.3,1454,"Females",11,11.6,22.9,25.8,15.9,7.4,3.1,0.7,22.6,71.3,98.4,3854,"All",9.4,10.1,21.1,26.1,17.8,8.8000000000000007,3.7,1.3,19.5,66.8,98.4,5308]
["Physical Education","Males",3.2,11.7,22,29.3,20.3,9.5,2.9,0.6,14.9,66.2,99.7,74881,"Females",7.3,16.899999999999999,23,24.8,16.899999999999999,7.8,2.2999999999999998,0.6,24.2,72,99.7,39067,"All",4.5999999999999996,13.5,22.3,27.8,19.2,9,2.7,0.6,18.100000000000001,68.2,99.7,113948]
["Religious Studies","Males",6.8,14.9,22.3,20.2,13.9,9,5.9,3.8,21.7,64.2,96.8,124356,"Females",14.2,22.6,24.2,17,9.9,5.6,3.2,1.8,36.700000000000003,78,98.6,144403,"All",10.8,19,23.3,18.5,11.7,7.2,4.5,2.7,29.8,71.599999999999994,97.8,268759]
["Statistics","Males",3.7,14.7,22,28.7,16.399999999999999,7.2,3.4,1.8,18.399999999999999,69.099999999999994,97.8,26007,"Females",3.7,15.9,24,30.2,14.6,5.9,2.7,1.2,19.600000000000001,73.8,98.3,22952,"All",3.7,15.3,22.9,29.4,15.5,6.6,3.1,1.5,18.899999999999999,71.3,98,48959]
["Vocational Studies","Males",1,6,16.600000000000001,25.5,23.8,15.2,7.3,2.7,7.1,49.2,98.3,18220,"Females",2.9,14.2,24.8,25.3,17.8,9.1999999999999993,3.8,1.2,17.100000000000001,67.2,99.1,21009,"All",2,10.4,21,25.4,20.6,12,5.4,1.9,12.5,58.9,98.8,39229]
["All Subjects","Males",5.4,12.3,20.9,26.1,17.2,8.9,4.8,2.5,17.7,64.7,98.1,2264550,"Females",8.4,17,24.1,24.5,13.9,6.4,3.1,1.5,25.4,74,98.9,2324264,"All",6.9,14.7,22.5,25.3,15.5,7.6,3.9,2,21.6,69.400000000000006,98.5,4588814]
[]
[]
[]
[null,null,null,null,null,null,null,null,null,null,null,null,null,null,null,null,null,null,null,null,null,null,null,null,null,null,null,null,null,null,null,null,null,null," "]

{"sheet":"2017","index":11,"n_rows":78,"n_cols":46,"rows_kept":78,"cut":false,"hidden":true,"merged":[]}
[1,2,3,4,5,6,7,8,9,10,11,12,13,14,15,16,17,18,19,20,21,22,23,24,25,26,27,28,29,30,31,32,33,34,35,36,37,38,39,40]
["Subjects",null,"*","A","B","C","D","E","F","G","AstarA","AstarC","AstarG","Total","(No column name)","*","A","B","C","D","E","F","G","AstarA","AstarC","AstarG","Total","(No column name)","*","A","B","C","D","E","F","G","AstarA","AstarC","AstarG","Total"]
["Core Science","Males",0.5,4.8,16.2,28.2,23.7,14.4,7.7,3,5.3,49.8,98.6,195913,"Females",0.9,7,19.7,28.9,21.8,12.5,6.2,2.1,7.9,56.5,99.1,193014,"All",0.7,5.9,17.899999999999999,28.6,22.7,13.5,7,2.6,6.6,53.1,98.8,388927]
["Additional Science","Males",1,6.6,18.3,28.6,22.2,12.7,6.7,2.6,7.6,54.5,98.7,178363,"Females",1.7,9.1,22.3,28.9,20.3,10.6,4.8,1.6,10.8,62,99.2,179758,"All",1.4,7.9,20.3,28.7,21.3,11.6,5.8,2.1,9.1999999999999993,58.2,99,358121]
["Further Additional Science","Males",15.5,17.3,20.5,20.9,15,7.4,2.6,0.5,32.700000000000003,74.2,99.8,7070,"Females",17.899999999999999,18.5,20.399999999999999,20,14.4,6.7,1.7,0.1,36.4,76.8,99.8,7092,"All",16.7,17.899999999999999,20.399999999999999,20.5,14.7,7.1,2.2000000000000002,0.3,34.6,75.5,99.8,14162]
["Additional Applied Science","Males",0,0.6,3.6,15.6,26.8,28.2,13.8,6.6,0.6,19.8,95.2,724,"Females",0,1,7.3,30.9,29.5,18.7,9.1,2,1,39.200000000000003,98.5,715,"All",0,0.8,5.4,23.2,28.1,23.5,11.5,4.3,0.8,29.4,96.8,1439]
["Physics","Males",15.4,26.6,27.6,21.1,7.4,1.4,0.4,0.1,42,90.6,99.9,65975,"Females",15.2,26.3,28,21.7,7.2,1.3,0.3,0.1,41.5,91.2,100,66758,"All",15.3,26.5,27.8,21.4,7.3,1.3,0.3,0.1,41.8,90.9,99.9,132733]
["Chemistry","Males",13.4,25.4,27.6,21.9,8.6999999999999993,2.2000000000000002,0.5,0.2,38.9,88.4,99.9,66467,"Females",17.5,28.3,27.2,18.8,6.4,1.5,0.3,0.1,45.8,91.7,100,67000,"All",15.5,26.9,27.4,20.3,7.5,1.8,0.4,0.1,42.4,90.1,99.9,133467]
["Biological Sciences","Males",10.8,27.5,30.5,20.8,7.8,1.8,0.5,0.2,38.299999999999997,89.5,99.8,66799,"Females",15.5,30.9,28.8,17.2,5.7,1.3,0.4,0.2,46.4,92.3,99.9,67869,"All",13.2,29.2,29.6,18.899999999999999,6.7,1.5,0.5,0.2,42.4,90.9,99.8,134668]
["Computer Science","Males",5,13.6,19.3,19.2,14.6,9.9,6.9,4.7,18.600000000000001,57,93.2,55005,"Females",7.4,16.7,20.2,18.3,13,8.6,5.8,3.7,24.1,62.6,93.8,14098,"All",5.5,14.2,19.5,19,14.3,9.6,6.7,4.5,19.7,58.2,93.3,69103]
["Other Sciences","Males",14,19.2,17.5,16.8,11.8,9,5.5,3.2,33.200000000000003,67.5,97,2300,"Females",7.3,16.5,24.2,19.3,13.1,9.9,5.7,2.8,23.8,67.3,98.9,1167,"All",11.8,18.3,19.7,17.7,12.3,9.3000000000000007,5.6,3.1,30.1,67.400000000000006,97.7,3467]
["D & T: Electronic Products","Males",8.8000000000000007,16.399999999999999,21.6,20.6,14.9,8.5,4.9000000000000004,2.6,25.1,67.3,98.2,4982,"Females",15.4,28.8,21.7,14.9,9,5.4,2.9,1.2,44.1,80.7,99.3,410,"All",9.3000000000000007,17.3,21.6,20.2,14.4,8.3000000000000007,4.7,2.5,26.6,68.400000000000006,98.3,5392]
["D & T: Food Technology","Males",1,5.5,14.5,23.2,23.2,16.5,9.9,4.2,6.5,44.2,98.1,10711,"Females",6.5,16.600000000000001,23.3,23.6,15.4,8.1999999999999993,4.2,1.5,23.2,70,99.3,19051,"All",4.5999999999999996,12.6,20.100000000000001,23.4,18.2,11.2,6.2,2.5,17.2,60.7,98.9,29762]
["D & T: Graphic Products","Males",2.5,8.5,16.600000000000001,22.3,20,13.3,8.4,5,11,49.9,96.6,13850,"Females",8.6999999999999993,19.399999999999999,24,20.2,14.3,7.1,3.4,1.7,28.1,72.3,98.9,8351,"All",4.9000000000000004,12.6,19.399999999999999,21.5,17.899999999999999,11,6.5,3.8,17.399999999999999,58.4,97.5,22201]
["D & T: Resistant Materials","Males",2.9,9.1,17.8,24.5,20.399999999999999,12.4,7.2,3.6,12,54.3,97.9,36355,"Females",8.9,19.7,25.3,20.6,12.8,6.7,3.2,1.8,28.6,74.5,99,7032,"All",3.9,10.8,19,23.8,19.2,11.5,6.5,3.3,14.7,57.6,98.1,43387]
["D & T: Systems & Control","Males",8.3000000000000007,15.9,20.8,21.6,15,10.4,"x","x",24.2,66.5,98.4,1840,"Females",8.3000000000000007,26.8,29.3,18.5,10.199999999999999,4.5,"x","x",35,82.8,100,157,"All",8.3000000000000007,16.7,21.4,21.3,14.6,9.9,4.0999999999999996,2.1,25,67.8,98.5,1997]
["D & T: Textiles Technology","Males",3.2,4.0999999999999996,12.3,17.399999999999999,21,16.899999999999999,14.4,5.6,7.3,37.1,94.9,682,"Females",10.8,17.899999999999999,23.2,22.1,13.7,6.9,3.3,1.3,28.7,74,99.1,17335,"All",10.5,17.399999999999999,22.8,21.9,14,7.3,3.7,1.5,27.9,72.599999999999994,99,18017]
["Other Design and Technology","Males",2.4,8.4,17.7,23.6,20.7,13.4,7.6,3.9,10.9,52.2,97.7,26173,"Females",7.4,19.5,24,22,14.1,7.5,3.1,1.4,26.9,72.900000000000006,99.1,9675,"All",3.8,11.4,19.399999999999999,23.2,18.899999999999999,11.8,6.4,3.2,15.2,57.8,98.1,35848]
["Applied Engineering","Males",0.9,4.8,11.8,22.3,22.5,16,11.3,6.6,5.8,39.9,96.3,5939,"Females",4.0999999999999996,9.5,21.8,28.3,15.9,10.199999999999999,5.9,2.7,13.6,63.8,98.5,660,"All",1.2,5.3,12.8,22.9,21.8,15.4,10.8,6.2,6.5,42.3,96.5,6599]
["Information Technology","Males",2.8,12.7,23.3,23.4,15.4,9.1,6.1,4,15.5,62.2,96.9,37251,"Females",4.9000000000000004,18,24.8,21.8,14.1,7.6,3.9,2.6,22.9,69.5,97.7,23856,"All",3.6,14.8,23.9,22.8,14.9,8.5,5.2,3.5,18.399999999999999,65.099999999999994,97.2,61107]
["Business Studies","Males",2.6,12,22.8,23.8,17.399999999999999,10.3,6,3.3,14.6,61.2,98.2,43303,"Females",4.3,15.1,23.4,22.7,15.9,9.9,5,2.5,19.399999999999999,65.5,98.8,30278,"All",3.3,13.2,23,23.4,16.8,10.1,5.6,3,16.600000000000001,63,98.4,73581]
["Applied Business","Males",1,9.6999999999999993,21.1,22.3,16.600000000000001,12.4,7.1,4.3,10.7,54.1,94.5,5425,"Females",2,16.3,24.5,20.8,15.6,9.3000000000000007,5.3,2.7,18.399999999999999,63.7,96.5,3879,"All",1.4,12.5,22.5,21.7,16.2,11.1,6.4,3.6,13.9,58.1,95.3,9304]
["Home Economics","Males",0.4,4.0999999999999996,12.1,22.2,23.2,19.5,11.3,4.5999999999999996,4.5,38.799999999999997,97.4,2565,"Females",2.5,10.9,19.3,24.3,20.7,12.3,6.1,2.5,13.4,57,98.7,17916,"All",2.2000000000000002,10,18.399999999999999,24.1,21,13.2,6.8,2.8,12.3,54.7,98.5,20481]
["Ancient History","Males",14.7,21.9,18.600000000000001,16.7,10.1,9.6999999999999993,3.9,2.5,36.6,71.900000000000006,98.1,484,"Females",16.2,18,20.2,18.5,12,7.7,5,1.7,34.200000000000003,72.8,99.3,401,"All",15.4,20.100000000000001,19.3,17.5,11,8.8000000000000007,4.4000000000000004,2.1,35.5,72.3,98.6,885]
["Geography","Males",6.1,13,18.600000000000001,22.5,17.2,11,6.6,3.3,19.100000000000001,60.2,98.3,123396,"Females",10.5,17.2,20.3,20.3,14.3,8.8000000000000007,5.0999999999999996,2.5,27.7,68.3,99,109738,"All",8.1,15,19.399999999999999,21.5,15.8,10,5.9,2.9,23.2,64,98.6,233134]
["History","Males",6,14.6,19.8,19.600000000000001,15,10,6.8,4.5,20.6,60,96.3,114907,"Females",10.3,19.100000000000001,21,17.8,12.8,8.6999999999999993,5.4,3,29.4,68.2,98.2,126845,"All",8.3000000000000007,17,20.399999999999999,18.7,13.8,9.3000000000000007,6,3.8,25.2,64.3,97.3,241752]
["Humanities","Males",1.8,7.1,15.6,20,18,13.2,11.3,7.3,8.9,44.5,94.2,1302,"Females",2.7,12.8,21.7,22.7,16.899999999999999,9.8000000000000007,6.4,4.7,15.5,59.9,97.6,1137,"All",2.2999999999999998,9.6999999999999993,18.5,21.2,17.5,11.6,9,6.1,12,51.7,95.8,2439]
["Economics","Males",7.1,22.1,27.8,20.3,11,6.1,3.2,1.4,29.2,77.2,98.8,5807,"Females",5.7,21.1,28.4,21.1,11,6,3.8,1.8,26.8,76.400000000000006,99,2716,"All",6.6,21.8,28,20.5,11,6,3.4,1.5,28.4,77,98.9,8523]
["Social Studies","Males",1.5,9.4,20.3,23.8,18.8,12.3,6.8,4,10.9,55,96.9,17687,"Females",4,17.399999999999999,25.3,21.7,14.7,8.8000000000000007,4.5,2.2000000000000002,21.3,68.3,98.6,33340,"All",3.1,14.6,23.6,22.4,16.100000000000001,10,5.3,2.8,17.7,63.7,98,51027]
["Other Classical Studies","Males",10.8,32.4,27,12.8,7.4,2,3.4,"x",43.2,83.1,96.6,148,"Females",13.6,30.5,24,12,5.5,4.7,2.2999999999999998,"x",44.1,80.2,95,383,"All",12.8,31.1,24.9,12.2,6,4,2.6,1.9,43.9,81,95.5,531]
["Arabic","Males",33.299999999999997,20.8,13,8.3000000000000007,8.1999999999999993,6.1,3.2,2.4,54.1,75.5,95.4,1656,"Females",35.4,21.1,14,10.4,8.1999999999999993,3.7,3,2.5,56.4,80.8,98.2,1931,"All",34.4,21,13.5,9.4,8.1999999999999993,4.8,3.1,2.4,55.4,78.3,96.9,3587]
["Chinese","Males",58.8,14.8,12.1,8.6,3.3,1.7,0.6,"x",73.599999999999994,94.3,99.9,1918,"Females",66.2,13.3,9.5,6.3,2.9,1.2,0.4,"x",79.5,95.3,99.9,1738,"All",62.3,14.1,10.9,7.5,3.1,1.4,0.5,"x",76.400000000000006,94.8,99.9,3656]
["French","Males",7.4,10.8,16.399999999999999,28,22.8,9.1,3.7,1.2,18.2,62.6,99.5,50645,"Females",11.2,14.4,19.899999999999999,27.5,18,5.9,2,0.7,25.7,73.099999999999994,99.7,73248,"All",9.6,13,18.5,27.7,20,7.2,2.7,0.9,22.6,68.8,99.6,123893]
["German","Males",6.5,12.9,21.4,28.8,19.8,7.5,2.1,0.6,19.5,69.7,99.8,20428,"Females",9.1,16.899999999999999,25.1,27.7,15.4,4.2,1.2,0.3,25.9,78.7,99.8,22161,"All",7.8,15,23.3,28.2,17.5,5.8,1.7,0.5,22.8,74.400000000000006,99.8,42589]
["Italian","Males",47.9,16.8,13.2,10.8,6.8,2.6,1.1000000000000001,0.5,64.7,88.7,99.7,1968,"Females",50.1,16.899999999999999,14.7,10.8,5,1.6,0.4,0.2,67,92.6,99.8,2537,"All",49.2,16.8,14.1,10.8,5.8,2.1,0.7,0.3,66,90.9,99.8,4505]
["Polish","Males",25.5,41.3,17.7,7.8,3.4,2,0.4,0.7,66.8,92.4,98.9,2305,"Females",42.2,38.4,10.9,3.9,1.8,1,0.4,0.4,80.7,95.5,99.1,2486,"All",34.200000000000003,39.799999999999997,14.2,5.8,2.6,1.5,0.4,0.5,74,94,99,4791]
["Spanish","Males",10.1,12,17.100000000000001,25.2,19.7,9.1,4.2,1.8,22.1,64.400000000000006,99.2,37025,"Females",15.3,15.3,18.899999999999999,24.4,16.100000000000001,6.1,2.5,1,30.6,73.900000000000006,99.5,49316,"All",13.1,13.9,18.100000000000001,24.8,17.600000000000001,7.4,3.2,1.4,26.9,69.8,99.4,86341]
["Urdu","Males",9,14.9,18.399999999999999,24,17.899999999999999,8.3000000000000007,4.5999999999999996,1.5,23.9,66.3,98.5,1444,"Females",18.399999999999999,22.4,21.2,18.100000000000001,11.6,4.5999999999999996,2.1,0.5,40.799999999999997,80.099999999999994,99,2357,"All",14.8,19.600000000000001,20.2,20.3,14,6,3.1,0.8,34.4,74.900000000000006,98.8,3801]
["Other Modern Languages","Males",31.3,27.3,19.2,9.6,5.8,3,1.5,1,58.6,87.4,98.8,5049,"Females",38.5,31,16.3,7.7,3.4,1.8,0.6,0.4,69.5,93.4,99.5,5554,"All",35.1,29.2,17.7,8.6,4.5,2.4,1,0.7,64.3,90.6,99.2,10603]
["Classical Civilisation","Males",9.9,22.2,26.4,19.399999999999999,13.3,5.5,2,0.9,32.1,77.900000000000006,99.6,1842,"Females",17.899999999999999,26.8,24.5,15.1,9,3.7,2.1,0.6,44.8,84.4,99.7,1990,"All",14.1,24.6,25.4,17.2,11.1,4.5999999999999996,2,0.7,38.700000000000003,81.3,99.7,3832]
["Classical Greek","Males",75,14.2,6,2.2999999999999998,1.4,0.9,0,"x",89.2,97.5,100,649,"Females",77.8,13,4.5999999999999996,1.5,1.1000000000000001,0.7,0.7,"x",90.8,96.9,99.8,455,"All",76.2,13.7,5.4,2,1.3,0.8,0.3,0.3,89.9,97.3,99.9,1104]
["Latin","Males",57.6,21.9,10.4,6.2,2,1.2,0.4,0.2,79.5,96.1,99.9,3631,"Females",59.8,20.399999999999999,9.6999999999999993,6.1,2.2000000000000002,1,0.5,0.2,80.2,96,99.8,3815,"All",58.7,21.2,10.1,6.1,2.1,1.1000000000000001,0.4,0.2,79.8,96,99.8,7446]
["Applied Art and Design","Males",2,4.0999999999999996,13.9,30.1,19.899999999999999,10.1,12.5,4.7,6.1,50,97.3,296,"Females",5.8,16.3,18.3,24.5,19.100000000000001,8.9,4.7,1.9,22.2,65,99.6,257,"All",3.8,9.8000000000000007,15.9,27.5,19.5,9.6,8.9,3.4,13.6,57,98.4,553]
["Art and Design","Males",4.8,8,18.100000000000001,31.3,18.3,10.4,5.7,2.2999999999999998,12.8,62.2,98.7,53302,"Females",11.3,16.600000000000001,26.3,27.1,11,4.5999999999999996,2,0.7,27.9,81.3,99.5,108066,"All",9.1999999999999993,13.7,23.6,28.5,13.4,6.5,3.2,1.2,22.9,75,99.3,161368]
["Communication Studies","Males",1.9,7.7,17,25.1,22.6,12.4,7.1,3.2,9.6,51.7,97.1,3006,"Females",7.7,18.3,23,21.6,15.8,7.4,3.7,1.3,26,70.5,98.7,2914,"All",4.7,12.9,19.899999999999999,23.4,19.2,9.9,5.4,2.2999999999999998,17.7,61,97.9,5920]
["Dance","Males",5.0999999999999996,14.3,19.600000000000001,23.8,20,10.9,3.6,1.2,19.399999999999999,62.8,98.5,669,"Females",6.1,17.399999999999999,23.6,25,15.4,7.6,2.9,1.2,23.4,72.099999999999994,99.2,8710,"All",6,17.2,23.3,24.9,15.7,7.9,3,1.2,23.2,71.400000000000006,99.1,9379]
["Drama","Males",3.2,12.9,21.8,26.1,19.8,9.4,4.2,1.6,16.100000000000001,64,99.1,23633,"Females",6.5,20.2,28.5,24,12.8,5,1.9,0.6,26.6,79.2,99.6,38201,"All",5.2,17.399999999999999,25.9,24.8,15.5,6.7,2.8,1,22.6,73.400000000000006,99.4,61834]
["English Studies","Males",0,"x",10.199999999999999,27.3,41.4,13.3,3.1,"x","x",39.1,97.7,128,"Females",0,"x",20.9,38.5,30.8,7.7,0,"x","x",61.5,100,91,"All",0,1.8,14.6,32,37,11,1.8,"x",1.8,48.4,98.6,219]
["General Studies","Males",1.2,8.3000000000000007,12.7,17.2,18.399999999999999,14,11.2,9.1999999999999993,9.5,39.299999999999997,92.1,2314,"Females",1.9,7.6,15,19.5,21.6,14.8,9,4.5999999999999996,9.5,44.1,94,2333,"All",1.5,7.9,13.8,18.399999999999999,20,14.4,10.1,6.9,9.5,41.7,93.1,4647]
["Health and Social Care","Males",0.8,2.7,7,16.100000000000001,22,19.100000000000001,11.5,10.6,3.5,26.5,89.7,1158,"Females",2.4,8.9,18.399999999999999,25.1,19.399999999999999,12,7.4,4,11.3,54.8,97.7,17292,"All",2.2999999999999998,8.5,17.7,24.6,19.5,12.5,7.7,4.4000000000000004,10.8,53,97.2,18450]
["Hospitality and Catering","Males",0.4,4,14.6,23.7,27.7,19.3,8.4,1.6,4.3,42.6,99.5,810,"Females",2.7,13.7,24.9,24.3,18.600000000000001,10,4.5999999999999996,0.9,16.399999999999999,65.599999999999994,99.7,1202,"All",1.7,9.8000000000000007,20.7,24.1,22.3,13.7,6.1,1.2,11.5,56.3,99.6,2012]
["Leisure and Tourism","Males",1.1000000000000001,5.2,11.8,16.399999999999999,15.5,17.600000000000001,14.4,9,6.3,34.6,90.9,1519,"Females",2.4,10.4,16.7,18.8,17.899999999999999,13.5,10.1,6.1,12.8,48.3,95.9,1781,"All",1.8,8,14.5,17.7,16.8,15.4,12.1,7.4,9.8000000000000007,42,93.6,3300]
["Manufacturing","Males","x",4,18.2,10.1,15.2,"x",22.2,13.1,4,32.299999999999997,93.9,99,"Females","x",18.8,14.6,18.8,20.8,"x",8.3000000000000007,8.3000000000000007,20.8,54.2,95.8,48,"All","x",8.8000000000000007,17,12.9,17,8.8000000000000007,17.7,11.6,9.5,39.5,94.6,147]
["Media/Film/TV","Males",1.7,7.4,18.899999999999999,27.8,21.7,11.8,6,2.7,9.1,55.8,98.1,20983,"Females",5.8,18.3,28.1,25,12.8,5.7,2.6,1.1000000000000001,24.1,77.099999999999994,99.3,19851,"All",3.7,12.7,23.3,26.4,17.399999999999999,8.8000000000000007,4.3,1.9,16.399999999999999,66.2,98.7,40834]
["Music","Males",7.9,20.100000000000001,22.6,19.7,14,8.1999999999999993,3.9,1.8,28,70.400000000000006,98.3,17502,"Females",9.1,22.9,25.5,19.2,12.2,6.4,2.7,1.3,31.9,76.599999999999994,99.2,21222,"All",8.5,21.6,24.2,19.5,13,7.2,3.3,1.5,30.2,73.8,98.8,38724]
["Performing Arts","Males",4.9000000000000004,8.5,17.899999999999999,25.7,22.3,12.5,5.3,2.2999999999999998,13.4,56.9,99.5,1108,"Females",11.8,12.8,22.6,24.1,17.7,7,2.9,0.7,24.6,71.400000000000006,99.6,2962,"All",9.9,11.6,21.3,24.6,18.899999999999999,8.5,3.6,1.1000000000000001,21.5,67.400000000000006,99.6,4070]
["Physical Education","Males",3.5,10.8,22.4,28.8,20.100000000000001,10.1,3.2,0.7,14.4,65.599999999999994,99.7,72841,"Females",8.5,16.2,23,24.8,16.7,7.8,2.2999999999999998,0.5,24.7,72.400000000000006,99.7,38753,"All",5.2,12.7,22.6,27.4,18.899999999999999,9.3000000000000007,2.9,0.6,17.899999999999999,68,99.7,111594]
["Religious Studies","Males",6.2,15.1,22.6,20.100000000000001,14.4,9.1,5.8,3.7,21.3,64,97,122029,"Females",13.2,23.1,24,17,10.199999999999999,5.8,3.4,1.8,36.299999999999997,77.400000000000006,98.6,142079,"All",10,19.399999999999999,23.4,18.399999999999999,12.1,7.3,4.5,2.7,29.4,71.2,97.9,264108]
["Statistics","Males",3.2,14.3,22.7,27.8,16.5,7.1,3.4,2.2000000000000002,17.5,67.900000000000006,97.2,15833,"Females",3.3,15.5,24.4,29.3,14.9,6,3,1.6,18.8,72.5,97.9,13339,"All",3.3,14.9,23.5,28.4,15.8,6.6,3.2,1.9,18.100000000000001,70,97.5,29172]
["Vocational Studies","Males",1.2,5.7,16.100000000000001,27.4,24.5,14.9,6.6,2.2999999999999998,6.9,50.3,98.7,14981,"Females",3.3,13.4,22.9,28.3,18.7,8.9,3.2,0.8,16.600000000000001,67.8,99.4,18276,"All",2.2999999999999998,9.9,19.8,27.8,21.3,11.6,4.7,1.5,12.2,59.9,99.1,33257]
[]
[]
[]
[]
[]
[1,2,3,4,5,6,7,8,9,10,11,12,13,14,15,16,17,18,19,20,21,22,23,24,25,26,27,28,29,30,31,32,33,34,35,36,37,38,39,40,41,42,43,44,45,46]
["Subject","(No column name)","Grade_9","Grade_8","Grade_7","Grade_6","Grade_5","Grade_4","Grade_3","Grade_2","Grade_1","Grades_9to7","Grades_9to5","Grades_9to4","Grades_9to1","Total","(No column name)","Grade_9","Grade_8","Grade_7","Grade_6","Grade_5","Grade_4","Grade_3","Grade_2","Grade_1","Grades_9to7","Grades_9to5","Grades_9to4","Grades_9to1","Total","(No column name)","Grade_9","Grade_8","Grade_7","Grade_6","Grade_5","Grade_4","Grade_3","Grade_2","Grade_1","Grades_9to7","Grades_9to5","Grades_9to4","Grades_9to1","Total"]
["English","Males",1.5,3.4,6.5,13.6,18.7,17.600000000000001,22.1,10.199999999999999,4.0999999999999996,11.4,43.7,61.3,97.7,270897,"Females",3.7,7,11.5,19.399999999999999,20.8,15.5,14.9,4.9000000000000004,1.5,22.2,62.4,77.900000000000006,99.1,267202,"All",2.6,5.2,9,16.5,19.8,16.5,18.5,7.6,2.8,16.8,53,69.599999999999994,98.4,538099]
["Mathematics","Males",4.0999999999999996,6.9,9.5,10.8,18.5,20.3,12,8.8000000000000007,6.4,20.5,49.7,70.099999999999994,97.3,272080,"Females",3,6.5,9.8000000000000007,11.3,18.7,21.4,12.6,8.8000000000000007,5.8,19.3,49.3,70.7,97.9,265523,"All",3.5,6.7,9.6,11,18.600000000000001,20.9,12.3,8.8000000000000007,6.1,19.899999999999999,49.5,70.400000000000006,97.6,537603]
["English Literature","Males",1.9,4.2,7.3,14.5,18.7,18.399999999999999,15.7,10.199999999999999,5.9,13.5,46.7,65,96.8,263311,"Females",4.5999999999999996,8.1999999999999993,11.9,19.100000000000001,19.8,15.8,11,5.8,2.6,24.6,63.6,79.3,98.7,262913,"All",3.3,6.2,9.6,16.8,19.2,17.100000000000001,13.4,8,4.2,19.100000000000001,55.1,72.2,97.7,526224]
["English & Maths","Males",2.5,4.8,7.8,12.9,18.600000000000001,18.8,16.600000000000001,9.6999999999999993,5.5,15.1,46.7,65.5,97.3,806288,"Females",3.8,7.2,11,16.600000000000001,19.8,17.5,12.8,6.5,3.3,22,58.4,76,98.6,795638,"All",3.1,6,9.4,14.8,19.2,18.2,14.7,8.1,4.4000000000000004,18.600000000000001,52.5,70.7,97.9,1601926]
[]
[]
[]
[]
[1,2,3,4,5,6,7,8,9,10,11,12,13,14,15,16]
[null,null,"Grades_9to7_A*A","Grades_9to4_A*C","Grades_9to1_A*G","Total",null,"Grades_9to7_A*A","Grades_9to4_A*C","Grades_9to1_A*G","Total",null,"Grades_9to7_A*A","Grades_9to4_A*C","Grades_9to1_A*G","Total"]
["All Subjects","Males",17.100000000000001,63.6,97.9,2378482,"Females",24.6,73.3,98.9,2411234,"All",20.9,68.5,98.4,4789716]

{"sheet":"Subject grouping composition","index":12,"n_rows":203,"n_cols":2,"rows_kept":203,"cut":false,"hidden":false,"merged":[[0,0,0,4],[202,0,202,1]]}
["PLEASE NOTE: The following list contains subject information for some qualifications that no longer count in secondary school performance tables. These qualifications have been included below as they are relevant in earlier years where results have fed into a subject grouping to form the totals shown in the time-series table. "]
["Subject group","Subjects"]
["English1","English Language & Literature"]
[null,"English Language"]
[]
["Mathematics1","Use of Mathematics"]
[null,"Mathematics"]
[null,"Applications of Mathematics"]
[null,"Methods in Mathematics"]
[null,"Mathematics (Mechanics)"]
[null,"Mathematics (Pure)"]
[null,"Mathematics (Statistics)"]
[null,"Mathematics (Further)"]
[null,"Additional Mathematics"]
[null,"Mathematical Studies"]
[]
["Core Science","Science (Core)"]
[null,"Science SA"]
[]
["Additional Science","Additional Science"]
[]
["Further Additional Science","AQA, Pearson and OCR Level 1/Level 2 GCSEs in Further Additional Science"]
[]
["Additional Applied Science","Additional Applied Science"]
[]
["Physics","Physics"]
[]
["Chemistry","Chemistry"]
[]
["Biological Sciences","Biology"]
[null,"Biology: Human"]
[]
["Computer Science","Computer Studies/Computing"]
[]
["Other Sciences","Applied Science"]
[null,"Science: Double Award"]
[null,"Astronomy"]
[null,"Electronics"]
[null,"Environmental Science"]
[null,"Geology"]
[null,"Science in Society"]
[null,"Science for Public Understanding"]
[null,"Other Science"]
[]
["D & T: Electronic Products","D&T Electronic Products"]
[]
["D & T: Food Technology","D&T Food Technology"]
[]
["D & T: Graphic Products","D&T Graphic Products"]
[]
["D & T: Resistant Materials","D&T Resistant Materials"]
[]
["D & T: Systems & Control","D&T Systems & Control"]
[]
["D & T: Textiles Technology","D&T Textiles Technology"]
[]
["Other Design and Technology","Graphics"]
[null,"Motor Vehicle Studies"]
[null,"Design & Technology"]
[null,"D&T Engineering"]
[null,"D&T Product Design"]
[]
["Applied Engineering","Applied Engineering"]
[]
["Information Technology","Information & Communications Technology"]
[]
["Business Studies","Business  Studies:Single"]
[null,"Business Studies & Economics"]
[]
["Applied Business","Applied Business"]
[]
[]
["Home Economics","Home Economics"]
[null,"Home Economics: Child Development"]
[null,"Home Economics: Food"]
[null,"Home Economics: Textiles"]
[]
["Geography","Geography"]
[null,"World Development"]
[]
["History","History"]
[]
["Humanities","Humanities: Single"]
[]
["Economics","Economics"]
[]
["Social Studies","Social Science"]
[null,"Archaeology"]
[null,"Philosophy & Theology"]
[null,"Law"]
[null,"Logic/ Philosophy"]
[null,"Personal & Social Education"]
[null,"Government & Politics"]
[null,"Psychology"]
[null,"Sociology"]
[null,"Anthropology"]
[null,"Social Science: Citizenship"]
[]
["Arabic","Arabic"]
[]
["Chinese","Chinese"]
[]
["French","French"]
[]
["German","German"]
[]
["Italian","Italian"]
[]
["Polish","Polish"]
[]
["Spanish","Spanish"]
[]
["Urdu","Urdu"]
[]
["Other Modern Languages","Welsh Language"]
[null,"Welsh (Second Language)"]
[null,"Welsh Literature"]
[null,"Irish"]
[null,"Dutch"]
[null,"Modern Greek"]
[null,"Portuguese"]
[null,"Bengali"]
[null,"Gujarati"]
[null,"Japanese"]
[null,"Modern Hebrew"]
[null,"Punjabi"]
[null,"Russian"]
[null,"Turkish"]
[null,"Persian"]
[null,"Other Languages"]
[]
["Classical Civilisation","Classical Civilisation"]
[]
["Classical Greek","Classical Greek"]
[]
["Latin","Latin"]
[]
["Other Classical Studies","Ancient History"]
[null,"Other Classical Languages"]
[]
["Applied Art and Design","Art & Design"]
[null,"History of Art"]
[]
["Applied Physical Education","Applied Physical Education"]
[]
["Art and Design","Art & Design"]
[null,"Art & Design (Graphics)"]
[null,"Art & Design (Photography)"]
[null,"Art & Design (Textiles)"]
[null,"Art & Design (3D Studies)"]
[null,"Art & Design (Critical Studies)"]
[null,"Art & Design (Fine Art)"]
[null,"Art"]
[null,"History of Art"]
[]
["Communication Studies","Communication Studies"]
[null,"Expressive Arts & Performance Studies"]
[null,"Film Studies"]
[null,"Theatre Studies"]
[]
["Construction","Construction & the Built Environment"]
[]
["Drama","Drama & Theatre Studies"]
[null,"Creative Writing"]
[]
["English Literature","English Literature"]
[]
["English Studies","English Studies"]
[]
["General Studies","General Studies"]
[]
["Health and Social Care","Health & Social Care"]
[]
["Hospitality and Catering","Hospitality & Catering"]
[]
["Leisure and Tourism","Leisure & Tourism"]
[]
["Manufacturing","Manufacturing"]
[]
["Media/Film/TV","Media/Film/Tv Studies"]
[]
["Media: Communication and Production","Media: Communication & Production"]
[]
["Music","Music"]
[null,"Music Technology"]
[]
["Performing Arts","Performing Arts"]
[]
["Physical Education","Physical Education/Sports Studies"]
[null,"Dance"]
[]
["Religious Studies","Religious Studies"]
[null,"Religious Education"]
[]
["Statistics","Statistics"]
[]
["Vocational Studies","Accounting/Finance"]
[null,"Catering Studies"]
[null,"Commerce/Office Studies"]
[null,"Office Technology"]
[null,"Keyboarding Applications"]
[]
["1. The combined English language and literature GCSE was available for the last time in 2016. Mathematics linked pair GCSEs (Methods in Mathematics and Applications of Mathematics) counted for the last time in performance tables in 2016. From 2017, only the new GCSEs (9-1) in English language and English literature, AS English language, AS English literature, AS English language and literature, GCSEs in mathematics or AS levels in mathematics or further mathematics will count towards the performance tables. "]