{"text_format":"1","workbook":"xlsx","n_sheets":10,"sheets":["FrontScreen","Instructions","1. Trust Info.","2. Reconciliation","3. Data Input","4. Summary","5. Sign-off","Field Definitions","Admin","2. Reconciliation (old style)"],"not_rendered":{"charts":0,"images":1,"macros":1,"external_links":0,"defined_names":122,"comments":3,"pivot_tables":0},"unopened":[],"bounds":{"document_bytes":16777216,"sheet_cells":100000,"rows_first":2000,"rows_last":500,"rows_between":2000,"halvings":0,"cell_chars":16384,"cell_head_chars":4096},"cells_cut":0,"cells_raw":0,"read":"whole","date_system":"1900"}

{"sheet":"FrontScreen","index":0,"n_rows":13,"n_cols":2,"rows_kept":13,"cut":false,"hidden":false,"merged":[]}
["note: PLEASE ENSURE MACRO CONTENT IS ENABLED!"]
[]
[]
[]
[]
[]
[]
[]
[]
[]
[]
[]
[null,"[click on Monitor logo for sheet admin access]"]

{"sheet":"Instructions","index":1,"n_rows":24,"n_cols":2,"rows_kept":24,"cut":false,"hidden":false,"merged":[[8,1,8,18],[10,1,10,14],[11,1,11,14],[13,1,13,14],[24,1,24,14],[19,1,19,14],[20,1,20,14],[30,1,30,17],[31,1,31,17],[14,1,14,14],[16,1,16,14],[17,1,17,14],[25,1,25,14],[22,1,22,14],[23,1,23,14]]}
[]
[]
[]
[]
[]
[]
[]
[]
[]
[]
[null,"Stage 1"]
[null,"Complete the required information on the  \"1. Trust Info\"  worksheet."]
[]
[null,"Stage 2"]
[null,"Go to the \"2. Reconciliation\" worksheet and review the intended PLICS quantum ahead of starting PLICS data collection. Reconciliation of the PLICS costs to the final audited accounts and of PLICS activity to SUS data should take place subsequent to data input. Please also complete the overheads cost breakdown for the admitted patient care PLICS data."]
[]
[null,"Stage 3"]
[null,"Go to the \"3. Data Input\" worksheet and input your data. Guidance on the field definitions can be found in the \"Field Definitions\"  worksheet and in Chapter 4 of the Approved Costing Guidance published by Monitor and  available at:  https://www.gov.uk/government/publications"]
[]
[null,"Stage 4"]
{"$rows_left_out":5}
{"sheet":"1. Trust Info.","index":2,"n_rows":33,"n_cols":6,"rows_kept":33,"cut":false,"hidden":false,"merged":[[8,1,8,5]]}
[]
[]
[]
[]
[]
[]
[]
[]
[]
[]
[null,"Please complete the following information:"]
[]
[]
[null,"Organisation Code:"]
[null,"(please select)"]
[]
[null,"Organisation Name:",null,{"$f":"IF(NOT(fp_org_code=\"\"),VLOOKUP(fp_org_code,org_code,2,FALSE),\"\")","v":""}]
[]
[null,"Primary Contact Name:"]
[null,"Primary Contact Email:"]
{"$rows_left_out":14}
{"sheet":"2. Reconciliation","index":3,"n_rows":157,"n_cols":10,"rows_kept":157,"cut":false,"hidden":false,"merged":[[65,3,65,4],[65,5,65,6],[67,5,67,6],[68,5,68,6],[69,5,69,6],[70,5,70,6],[71,5,71,6],[72,5,72,6],[73,5,73,6],[74,5,74,6],[75,5,75,6],[76,5,76,6],[77,5,77,6],[78,5,78,6],[79,5,79,6],[90,5,90,6],[91,5,91,6],[94,1,103,7],[80,5,80,6],[81,5,81,6],[82,5,82,6],[83,5,83,6],[84,5,84,6],[85,5,85,6],[86,5,86,6],[87,5,87,6],[88,5,88,6],[89,5,89,6]]}
[]
[]
[]
[]
[]
[]
[]
[]
[]
[]
[]
[]
[]
[]
[]
[null,"Section 1 - Cost Reconciliation"]
[]
[null,"Section 1.1: Final Audited Accounts to PLICS Collection Patient Care Cost"]
[]
[null,null,null,"£ COST","Notes: FTs","Notes: NHS Trusts"]
{"$rows_left_out":138}
{"sheet":"3. Data Input","index":4,"n_rows":11,"n_cols":92,"rows_kept":11,"cut":false,"hidden":false,"merged":[]}
[]
[]
[]
[]
[]
[]
[]
[]
[]
[]
["Commissioner","Anonymised Local Patient ID","Spell ID","Spell-Episode ID","Episode Start Date & Time","Episode End Date & Time","Anonymised Consultant/Care Provider Code","Admission Date & Time","Discharge Date & Time","Admission Method Code","Source of Admission Code","Discharge Method Code","Discharge Destination Code","Patient Gender","Patient Age","Patient Classification","Treatment Function Code","Main Specialty Code","Point of Delivery (POD)","FCE HRG (RC)","Spell HRG (RC)","Dominant Procedure Code","OPCS 1","OPCS 2","OPCS 3","OPCS 4","OPCS 5","OPCS 6","OPCS 7","OPCS 8","OPCS 9","OPCS 10","OPCS 11","OPCS 12","OPCS 13","ICD10 1","ICD10 2","ICD10 3","ICD10 4","ICD10 5","ICD10 6","ICD10 7","ICD10 8","ICD10 9","ICD10 10","ICD10 11","ICD10 12","ICD10 13","Critical Care LoS in Hours","Theatre Time in Minutes","Endoscopy Time in Minutes","Specialist Service Code","Fixed Costs","Semi-fixed Costs","Variable Costs","Education and training costs (non-patient care activity costs)","Research and development costs (non-patient care activity costs)","Other costs including commercial (non-patient care activity costs)","Other Income","Total Cost (Inclusive of Columns BI-CJ only)","Blood and Blood Products","CNST","Critical Care","High Cost Drugs","Chemotherapy Drugs ","All Other Drugs","Emergency Department","Imaging - Medical Staffing","Imaging - All Other Costs","Medical Staffing (excluding Imaging, Pathology & Other Diagnostics)","Operating Theatres","Other Clinical Supplies and Services","Other Diagnostics Tests -  Medical Staffing","Other Diagnostics Tests- All Other Costs","Outpatients","Pathology- Medical Staffing","Pathology- All Other Costs","Pharmacy Services","Prostheses/Implants/Devices","Radiotherapy","Secondary Commissioning Costs","Specialist Procedure Suites excluding Endoscopy Units","Specialist Procedure Suite - Endoscopy Units Only","Specialist Nursing Staff","Therapies","Wards","Overheads","Impairments","Non NHS patient flag","WIP Partial Episode Flag","Contracted Out/In Flag","Contracted Full or Part Cost"]

{"sheet":"4. Summary","index":5,"n_rows":58,"n_cols":5,"rows_kept":58,"cut":false,"hidden":false,"merged":[]}
[]
[]
[]
[]
[]
[]
[]
[]
[]
[null,"Validation checks:"]
[null,"Does the sum of the total cost (C15) equal the sum of fixed/variable elements(C26) (within £100)?",null,null,{"$f":"IF(ABS(C26-summary_total_cost_sum)>100,\"Fail\",\"Pass\")","v":"Pass"}]
[null,"Does the sum of the total cost (C15) equal the sum of cost pool elements(C57) (within £100)?",null,null,{"$f":"IF(ABS(C58-summary_total_cost_sum)>100,\"Fail\",\"Pass\")","v":"Pass"}]
[]
[null,"Key summary statistics (considers Data Input column BH)"]
[null,"Total costs of FCEs with costs greater than 0",{"$f":"SUMIF('3. Data Input'!BH:BH,\">0\")","v":0}]
[null,"Count of FCEs with costs greater than 0",{"$f":"COUNTIF('3. Data Input'!BH:BH,\">0\")","v":0}]
[null,"Count of FCEs with costs equal or less than 0",{"$f":"COUNTIF('3. Data Input'!BH:BH,\"<=0\")","v":0},"(there should not be any of these)"]
[null,"Count of FCEs (all)",{"$f":"COUNT('3. Data Input'!BH:BH)","v":0}]
[null,"Average cost per FCE with costs greater than 0",{"$f":"IF(summary_total_cost_sum>0,summary_total_cost_sum/summary_total_FCEs,\"\")","v":""}]
[]
{"$rows_left_out":39}
{"sheet":"5. Sign-off","index":6,"n_rows":41,"n_cols":29,"rows_kept":41,"cut":false,"hidden":false,"merged":[[28,2,28,16],[29,2,29,16],[30,2,30,16],[9,1,9,18],[23,1,23,17],[19,13,19,17],[20,1,20,18]]}
[]
[]
[]
[]
[]
[]
[]
[]
[]
[null,{"$f":"IF(sign_off_subready=1,W35,W34)","v":"Template not ready for submission. Please complete the above steps."}]
[]
[null,"Template completion steps"]
[]
[null,null,"'1. Trust Info'  worksheet completed.",null,null,null,null,null,null,null,null,null,null,null,null,null,null,null,null,null,null,false,{"$f":"V14*1","v":0}]
[null,null,"'2. Reconciliation' worksheet reviewed to clarify correct PLICS quantum ahead of PLICS system running.",null,null,null,null,null,null,null,null,null,null,null,null,null,null,null,null,null,null,false,{"$f":"V15*1","v":0}]
[null,null,"'3. Data Input' worksheet populated but contains NO patient identifiable data such as NHS number, DOB, patient name, address or postcode.",null,null,null,null,null,null,null,null,null,null,null,null,null,null,null,null,null,null,false,0]
[null,null,"'4. Summary' reviewed for validation errors and sense-check of costs and both validation checks register a 'pass'.",null,null,null,null,null,null,null,null,null,null,null,null,null,null,null,null,null,null,false,{"$f":"V17*1","v":0}]
[null,null,"'2. Reconciliation' worksheet completed and reviewed in concert with '3. Data Input'. ",null,null,null,null,null,null,null,null,null,null,null,null,null,null,null,null,null,null,false,0]
[null,null,"Materiality and Quality Scores (MAQS) template has been completed",null,null,null,null,null,null,null,null,null,null,null,null,null,null,null,null,null,null,false,0]
[null,null,"Submission is reviewed and signed off by the Director of Finance",null,null,null,null,null,null,null,null,null,"Please enter Director of Finance Name:",null,null,null,null,null,null,null,null,false,{"$f":"V20*COUNTA(sign_off_DOFname)","v":0}]
{"$rows_left_out":22}
{"sheet":"Field Definitions","index":7,"n_rows":103,"n_cols":4,"rows_kept":103,"cut":false,"hidden":false,"merged":[]}
[]
[]
[]
[]
[]
[]
[]
[]
[]
[]
[null,"Field Name","Description","Format"]
[null,"Commissioner","Three-digit organisation code of the commissioner. For non-NHS patients (see definition below) please use “X98” as the Commissioner code.\n","Text"]
[null,"Anonymised Local Patient ID","Consistently anonymised local patient ID. Participating organisations should not include any patient identifiable data, such as NHS numbers, in this data field. \n","Free Text (excluding !”^&}/])"]
[null,"Spell ID","Local spell ID. Any patient identifiable data should not be included in this data field.  \n","Free Text (excluding !”^&}/])"]
[null,"Spell-Episode ID","Local episode ID. Any patient identifiable data should not be included in this data field. Please note this should be the spell ID and the episode order number concatenated. For example 5000001.1 would mean the is the first episode within the spell 5000001 .\n","Free Text (excluding !”^&}/])"]
[null,"Episode Start Date & Time","The start date and time of the finished consultant episode (FCE). \nIf your costing system or feeds are not able to supply time please provide date here and do not construct a 'dummy' time.\n","Serial DateTime\n[dd/mm/yyyy hh:mm]"]
[null,"Episode End Date & Time","The end date and time of the finished consultant episode (FCE). \nIf your costing system or feeds are not able to supply time please provide date here and do not construct a 'dummy' time.\n","Serial DateTime\n[dd/mm/yyyy hh:mm]"]
[null,"Anonymised Consultant/Care Provider Code","The consultant or care provider code for the finished consultant episode.\n","Text"]
[null,"Admission Date & Time","The admission date and time for the spell. \nIf your costing system or feeds are not able to supply time please provide date here and do not construct a 'dummy' time.\n","Serial DateTime\n[dd/mm/yyyy hh:mm]"]
[null,"Discharge Date & Time","The discharge date and time for the spell. \nIf your costing system or feeds are not able to supply time please provide date here and do not construct a 'dummy' time.\n","Serial DateTime\n[dd/mm/yyyy hh:mm]"]
{"$rows_left_out":84}
{"sheet":"Admin","index":8,"n_rows":245,"n_cols":241,"rows_kept":245,"cut":false,"hidden":true,"merged":[]}
[null,null,null,null,null,"POD Code",null,"Org.Code","Organisation Name",null,null,"File","TI_Org_Code","TI_Org_Name","TI_Pri_Con_Name","TI_Pri_Con_Email","TI_Pri_Con_Tel","TI_Alt_Con_Name","TI_Alt_Con_Email","TI_Alt_Con_Tel","TI_Fin_Year","TI_PLICS_Supplier","Sum_TCvFVe","Sum_TCvCPe","Sum_KSS_TC_pos","Sum_KSS_Cnt_pos","Sum_KSS_Cnt_low","Sum_KSS_Cnt_all","Sum_KSS_AC_pos","Sum_Fve_Fixed","Sum_Fve_SemiFix","Sum_Fve_Variable","Sum_Fve_All","Sum_CPG1_BBP","Sum_CPG2_CNST","Sum_CPG3_CC","Sum_CPG4_DrugsHC","Sum_CPG5_DrugsChemo","Sum_CPG6_DrugsOther","Sum_CPG7_ED","Sum_CPG8_ImgStaff","Sum_CPG9_ImgOther","Sum_CPG10_MedStaffexc","Sum_CPG11_OpT","Sum_CPG12_SnS","Sum_CPG13_OtherDxStaff","Sum_CPG14_OtherDxOther","Sum_CPG15_Outpatients","Sum_CPG16_PathStaff","Sum_CPG17_PathOther","Sum_CPG18_Pharmacy","Sum_CPG19_PID","Sum_CPG20_Radio","Sum_CPG21_SCC","Sum_CPG22_SPSexcE","Sum_CPG23_SPS_E","Sum_CPG24_SNStaff","Sum_CPG25_Therapies","Sum_CPG26_Wards","Sum_CPG27_Overheads","Sum_CPG_TC","Rec_1_1A_1_V","Rec_1_1A_2_V","Rec_1_1A_3_V","Rec_1_1A_4_V","Rec_1_1A_5_V","Rec_1_1A_6_V","Rec_1_1A_7_V","Rec_1_1A_8a_V","Rec_1_1A_8b_V","Rec_1_1A_8c_V","Rec_1_1A_9_V","Rec_1_1B_10a_V","Rec_1_1B_10b_V","Rec_1_1B_10c_V","Rec_1_1B_10d_V","Rec_1_1B_10e_V","Rec_1_1B_10f_V","Rec_1_1B_10g_V","Rec_1_1B_10h_V","Rec_1_1B_10i_V","Rec_1_1B_10j_V","Rec_1_1B_10k_V","Rec_1_1B_10l_V","Rec_1_1B_10m_V","Rec_1_1B_11_V","Rec_1_1B_10f_D","Rec_1_1B_10g_D","Rec_1_1B_10h_D","Rec_1_1B_10i_D","Rec_1_1B_10j_D","Rec_1_1B_10k_D","Rec_1_1B_10l_D","Rec_1_1B_10m_D","Rec_1_2_1_V","Rec_1_2_2_V","Rec_1_2_3_V","Rec_1_2_4_V","Rec_1_2_5_V","Rec_1_2_6_V","Rec_1_2_Var1_V","Rec_1_2_Var2_V","Rec_1_2_Var3_V","Rec_1_2_Var4_V","Rec_1_2_Var5_V","Rec_1_2_Var6_V","Rec_1_2_Var7_V","Rec_1_2_Var8_V","Rec_1_2_Var9_V","Rec_1_2_Var10_V","Rec_1_2_Var11_V","Rec_1_2_Var12_V","Rec_1_2_Var13_V","Rec_1_2_Var14_V","Rec_1_2_Var15_V","Rec_1_2_Var16_V","Rec_1_2_Var17_V","Rec_1_2_Var18_V","Rec_1_2_Var19_V","Rec_1_2_Var20_V","Rec_1_2_Var21_V","Rec_1_2_Var22_V","Rec_1_2_Var23_V","Rec_1_2_Var24_V","Rec_1_2_Var25_V","Rec_1_2_Var1_C","Rec_1_2_Var2_C","Rec_1_2_Var3_C","Rec_1_2_Var4_C","Rec_1_2_Var5_C","Rec_1_2_Var6_C","Rec_1_2_Var7_C","Rec_1_2_Var8_C","Rec_1_2_Var9_C","Rec_1_2_Var10_C","Rec_1_2_Var11_C","Rec_1_2_Var12_C","Rec_1_2_Var13_C","Rec_1_2_Var14_C","Rec_1_2_Var15_C","Rec_1_2_Var16_C","Rec_1_2_Var17_C","Rec_1_2_Var18_C","Rec_1_2_Var19_C","Rec_1_2_Var20_C","Rec_1_2_Var21_C","Rec_1_2_Var22_C","Rec_1_2_Var23_C","Rec_1_2_Var24_C","Rec_1_2_Var25_C","Rec_1_2_Var1_D","Rec_1_2_Var2_D","Rec_1_2_Var3_D","Rec_1_2_Var4_D","Rec_1_2_Var5_D","Rec_1_2_Var6_D","Rec_1_2_Var7_D","Rec_1_2_Var8_D","Rec_1_2_Var9_D","Rec_1_2_Var10_D","Rec_1_2_Var11_D","Rec_1_2_Var12_D","Rec_1_2_Var13_D","Rec_1_2_Var14_D","Rec_1_2_Var15_D","Rec_1_2_Var16_D","Rec_1_2_Var17_D","Rec_1_2_Var18_D","Rec_1_2_Var19_D","Rec_1_2_Var20_D","Rec_1_2_Var21_D","Rec_1_2_Var22_D","Rec_1_2_Var23_D","Rec_1_2_Var24_D","Rec_1_2_Var25_D","Rec_2_Act_CoE1","Rec_2_Act_CoE2","Rec_2_Act_CoE3","Rec_2_Act_CoE4","Rec_2_Act_CoE5","Rec_2_Act_EIS1","Rec_2_Act_EIS2","Rec_2_Act_EIS3","Rec_2_Act_EIS4","Rec_2_Act_EIS5","Rec_2_Act_pyFCE1","Rec_2_Act_pyFCE2","Rec_2_Act_pyFCE3","Rec_2_Act_pyFCE4","Rec_2_Act_pyFCE5","Rec_2_Act_SUS1","Rec_2_Act_SUS2","Rec_2_Act_SUS3","Rec_2_Act_SUS4","Rec_2_Act_SUS5","Rec_2_Act_Var1","Rec_2_Act_Var2","Rec_2_Act_Var3","Rec_2_Act_Var4","Rec_2_Act_Var5","Rec_2_Act_VarComment1","Rec_2_Act_VarComment2","Rec_2_Act_VarComment3","Rec_2_Act_VarComment4","Rec_3_OH_1a","Rec_3_OH_1b","Rec_3_OH_1c","Rec_3_OH_1d","Rec_3_OH_1e","Rec_3_OH_2a","Rec_3_OH_2b","Rec_3_OH_2c","Rec_3_OH_2d","Rec_3_OH_2e","Rec_3_OH_2f","Rec_3_OH_2g","Rec_3_OH_2h","Rec_3_OH_2i","Rec_3_OH_2j","Rec_3_OH_2k","Rec_3_OH_2l","Rec_3_OH_2m","Rec_3_OH_2n","Rec_3_OH_2o","Rec_3_OH_2p","Rec_3_OH_2q","Rec_3_OH_2r","Rec_3_OH_2s","Rec_3_OH_2t","Rec_3_OH_3","SO_1done","SO_2done","SO_3done","SO_4done","SO_MAQSdone","SO_DOFSign","SO_DOFName","SO_HFMAnullyesno","SO_NoComments","SO_WIP","SO_Verdict"]
[null,null,null,null,null,"EL",null,"R1A","Worcestershire Health and Care NHS Trust",null,null,{"$f":"CELL(\"filename\")","v":"W:\\PLICS\\Template work\\Received from AR (finals)\\[PLICS_Collection_Template_201516_rv7.xlsm]FrontScreen"},{"$f":"fp_org_code","v":0},{"$f":"fp_org_name","v":""},{"$f":"fp_prim_contact_name","v":0},{"$f":"fp_prim_contact_email","v":0},{"$f":"fp_prim_contact_phone","v":0},{"$f":"fp_alt_contact_name","v":0},{"$f":"fp_alt_contact_email","v":0},{"$f":"fp_alt_contact_phone","v":0},{"$f":"fp_finyear","v":"2015/16"},{"$f":"fp_PLICS_supplier","v":0},{"$f":"'4. Summary'!E11","v":"Pass"},{"$f":"'4. Summary'!E12","v":"Pass"},{"$f":"summary_total_cost_sum","v":0},{"$f":"summary_total_FCEs","v":0},{"$f":"'4. Summary'!C17","v":0},{"$f":"'4. Summary'!C18","v":0},{"$f":"summary_avg_cost_fce","v":""},{"$f":"'4. Summary'!C23","v":0},{"$f":"'4. Summary'!C24","v":0},{"$f":"'4. Summary'!C25","v":0},{"$f":"'4. Summary'!C26","v":0},{"$f":"'4. Summary'!C30","v":0},{"$f":"'4. Summary'!C31","v":0},{"$f":"'4. Summary'!C32","v":0},{"$f":"'4. Summary'!C33","v":0},{"$f":"'4. Summary'!C34","v":0},{"$f":"'4. Summary'!C35","v":0},{"$f":"'4. Summary'!C36","v":0},{"$f":"'4. Summary'!C37","v":0},{"$f":"'4. Summary'!C38","v":0},{"$f":"'4. Summary'!C39","v":0},{"$f":"'4. Summary'!C40","v":0},{"$f":"'4. Summary'!C41","v":0},{"$f":"'4. Summary'!C42","v":0},{"$f":"'4. Summary'!C43","v":0},{"$f":"'4. Summary'!C44","v":0},{"$f":"'4. Summary'!C45","v":0},{"$f":"'4. Summary'!C46","v":0},{"$f":"'4. Summary'!C47","v":0},{"$f":"'4. Summary'!C48","v":0},{"$f":"'4. Summary'!C49","v":0},{"$f":"'4. Summary'!C50","v":0},{"$f":"'4. Summary'!C51","v":0},{"$f":"'4. Summary'!C52","v":0},{"$f":"'4. Summary'!C53","v":0},{"$f":"'4. Summary'!C54","v":0},{"$f":"'4. Summary'!C55","v":0},{"$f":"'4. Summary'!C56","v":0},{"$f":"'4. Summary'!C58","v":0},{"$f":"'2. Reconciliation'!H18","v":0},{"$f":"'2. Reconciliation'!H19","v":0},{"$f":"'2. Reconciliation'!H20","v":0},{"$f":"'2. Reconciliation'!H21","v":0},{"$f":"'2. Reconciliation'!H22","v":0},{"$f":"'2. Reconciliation'!H23","v":0},{"$f":"'2. Reconciliation'!H24","v":0},{"$f":"'2. Reconciliation'!H27","v":0},{"$f":"'2. Reconciliation'!H28","v":0},{"$f":"'2. Reconciliation'!H29","v":0},{"$f":"'2. Reconciliation'!H30","v":0},{"$f":"'2. Reconciliation'!#REF!","v":{"$error":"#REF!"}},{"$f":"'2. Reconciliation'!H34","v":"(by NonEnglishNHS and NonNHS: private patients, overseas (non-reciprocal), armed forces,"},{"$f":"'2. Reconciliation'!H35","v":0},{"$f":"'2. Reconciliation'!H36","v":0},{"$f":"'2. Reconciliation'!H60","v":0},{"$f":"'2. Reconciliation'!H61","v":0},{"$f":"'2. Reconciliation'!H62","v":0},{"$f":"'2. Reconciliation'!H63","v":0},{"$f":"'2. Reconciliation'!#REF!","v":{"$error":"#REF!"}},{"$f":"'2. Reconciliation'!H64","v":0},{"$f":"'2. Reconciliation'!#REF!","v":{"$error":"#REF!"}},{"$f":"'2. Reconciliation'!#REF!","v":{"$error":"#REF!"}},{"$f":"'2. Reconciliation'!#REF!","v":{"$error":"#REF!"}},{"$f":"'2. Reconciliation'!#REF!","v":{"$error":"#REF!"}},{"$f":"'2. Reconciliation'!#REF!","v":{"$error":"#REF!"}},{"$f":"'2. Reconciliation'!#REF!","v":{"$error":"#REF!"}},{"$f":"'2. Reconciliation'!#REF!","v":{"$error":"#REF!"}},{"$f":"'2. Reconciliation'!#REF!","v":{"$error":"#REF!"}},{"$f":"'2. Reconciliation'!#REF!","v":{"$error":"#REF!"}},{"$f":"'2. Reconciliation'!#REF!","v":{"$error":"#REF!"}},{"$f":"'2. Reconciliation'!#REF!","v":{"$error":"#REF!"}},{"$f":"'2. Reconciliation'!#REF!","v":{"$error":"#REF!"}},{"$f":"'2. Reconciliation'!#REF!","v":{"$error":"#REF!"}},{"$f":"'2. Reconciliation'!#REF!","v":{"$error":"#REF!"}},{"$f":"'2. Reconciliation'!#REF!","v":{"$error":"#REF!"}},{"$f":"'2. Reconciliation'!#REF!","v":{"$error":"#REF!"}},{"$f":"'2. Reconciliation'!#REF!","v":{"$error":"#REF!"}},{"$f":"'2. Reconciliation'!#REF!","v":{"$error":"#REF!"}},{"$f":"TRANSPOSE('2. Reconciliation'!H68:H92)","v":0},0,0,0,0,0,0,0,0,0,0,0,0,0,0,0,0,0,0,0,0,0,0,0,0,{"$f":"TRANSPOSE('2. Reconciliation'!F68:G92)","v":0},0,0,0,0,0,0,0,0,0,0,0,0,0,0,0,0,0,0,0,0,0,0,0,0,{"$f":"TRANSPOSE('2. Reconciliation'!C68:C92)","v":"[Insert description of variance factor]"},"[Insert description of variance factor]","[Insert description of variance factor]","[Insert description of variance factor]","[Insert description of variance factor]","[Insert description of variance factor]","[Insert description of variance factor]","[Insert description of variance factor]","[Insert description of variance factor]","[Insert description of variance factor]","[Insert description of variance factor]","[Insert description of variance factor]","[Insert description of variance factor]","[Insert description of variance factor]","[Insert description of variance factor]","[Insert description of variance factor]","[Insert description of variance factor]","[Insert description of variance factor]","[Insert description of variance factor]","[Insert description of variance factor]","[Insert description of variance factor]","[Insert description of variance factor]","[Insert description of variance factor]","[Insert description of variance factor]","[Insert description of variance factor]",{"$f":"'2. Reconciliation'!D112","v":0},{"$f":"'2. Reconciliation'!D113","v":0},{"$f":"'2. Reconciliation'!D114","v":0},{"$f":"'2. Reconciliation'!D115","v":0},{"$f":"'2. Reconciliation'!D117","v":0},{"$f":"'2. Reconciliation'!E112","v":0},{"$f":"'2. Reconciliation'!E113","v":0},{"$f":"'2. Reconciliation'!E114","v":0},{"$f":"'2. Reconciliation'!E115","v":0},{"$f":"'2. Reconciliation'!E117","v":0},{"$f":"'2. Reconciliation'!F112","v":0},{"$f":"'2. Reconciliation'!F113","v":0},{"$f":"'2. Reconciliation'!F114","v":0},{"$f":"'2. Reconciliation'!F115","v":0},{"$f":"'2. Reconciliation'!F117","v":0},{"$f":"'2. Reconciliation'!H112","v":0},{"$f":"'2. Reconciliation'!H113","v":0},{"$f":"'2. Reconciliation'!H114","v":0},{"$f":"'2. Reconciliation'!H115","v":0},{"$f":"'2. Reconciliation'!G117","v":0},{"$f":"'2. Reconciliation'!I112","v":0},{"$f":"'2. Reconciliation'!I113","v":0},{"$f":"'2. Reconciliation'!I114","v":0},{"$f":"'2. Reconciliation'!I115","v":0},{"$f":"'2. Reconciliation'!H117","v":0},{"$f":"'2. Reconciliation'!J112","v":0},{"$f":"'2. Reconciliation'!J113","v":0},{"$f":"'2. Reconciliation'!J114","v":0},{"$f":"'2. Reconciliation'!J115","v":0},{"$f":"'2. Reconciliation'!D125","v":0},{"$f":"'2. Reconciliation'!D126","v":0},{"$f":"'2. Reconciliation'!D127","v":0},{"$f":"'2. Reconciliation'!D128","v":0},{"$f":"'2. Reconciliation'!D129","v":0},{"$f":"'2. Reconciliation'!D132","v":0},{"$f":"'2. Reconciliation'!D133","v":0},{"$f":"'2. Reconciliation'!D134","v":0},{"$f":"'2. Reconciliation'!D135","v":0},{"$f":"'2. Reconciliation'!D136","v":0},{"$f":"'2. Reconciliation'!D137","v":0},{"$f":"'2. Reconciliation'!D138","v":0},{"$f":"'2. Reconciliation'!D139","v":0},{"$f":"'2. Reconciliation'!D140","v":0},{"$f":"'2. Reconciliation'!D141","v":0},{"$f":"'2. Reconciliation'!D142","v":0},{"$f":"'2. Reconciliation'!D143","v":0},{"$f":"'2. Reconciliation'!D144","v":0},{"$f":"'2. Reconciliation'!D145","v":0},{"$f":"'2. Reconciliation'!D146","v":0},{"$f":"'2. Reconciliation'!D147","v":0},{"$f":"'2. Reconciliation'!D148","v":0},{"$f":"'2. Reconciliation'!D149","v":0},{"$f":"'2. Reconciliation'!D150","v":0},{"$f":"'2. Reconciliation'!D151","v":0},{"$f":"'2. Reconciliation'!D153","v":0},{"$f":"'5. Sign-off'!W14","v":0},{"$f":"'5. Sign-off'!W16","v":0},{"$f":"'5. Sign-off'!W17","v":0},{"$f":"'5. Sign-off'!W18","v":0},{"$f":"'5. Sign-off'!W19","v":0},{"$f":"'5. Sign-off'!V20*1","v":0},{"$f":"'5. Sign-off'!N20","v":0},{"$f":"'5. Sign-off'!V22","v":0},{"$f":"'5. Sign-off'!B24","v":0},{"$f":"'5. Sign-off'!V29","v":0},{"$f":"'5. Sign-off'!B10","v":"Template not ready for submission. Please complete the above steps."}]
[null,null,null,null,null,"NE",null,"R1C","Solent NHS Trust"]
[null,null,null,null,null,"DC",null,"R1D","Shropshire Community Health NHS Trust"]
[null,null,null,null,null,"RP",null,"R1E","Staffordshire and Stoke On Trent Partnership NHS Trust"]
[null,null,null,null,null,null,null,"R1F","Isle of Wight NHS Trust"]
[null,null,null,null,null,null,null,"R1G","Torbay and Southern Devon Health and Care NHS Trust"]
[null,null,null,null,null,null,null,"R1H","Barts Health NHS Trust"]
[null,null,null,null,null,null,null,"RA2","Royal Surrey County Hospital NHS Foundation Trust"]
[null,null,null,null,null,null,null,"RA3","Weston Area Health NHS Trust"]
[null,null,null,null,null,null,null,"RA4","Yeovil District Hospital NHS Foundation Trust"]
[null,null,null,null,null,null,null,"RA7","University Hospitals Bristol NHS Foundation Trust"]
[null,"sysHeadline","PLICS Data Collection Template 2015-16",null,null,null,null,"RA9","South Devon Healthcare NHS Foundation Trust"]
[null,"SysYear",201516,null,null,null,null,"RAE","Bradford Teaching Hospitals NHS Foundation Trust"]
[null,"SysType","PLA",null,null,null,null,"RAJ","Southend University Hospital NHS Foundation Trust"]
[null,"SysVersion",1,null,null,null,null,"RAL","Royal Free London NHS Foundation Trust"]
[null,"SysNACSCode",null,null,null,null,null,"RAN","Royal National Orthopaedic Hospital NHS Trust"]
[null,"sysSavedDate",null,null,null,null,null,"RAP","North Middlesex University Hospital NHS Trust"]
[null,"sysSavedByUser",null,null,null,null,null,"RAS","The Hillingdon Hospitals NHS Foundation Trust"]
[null,null,null,null,null,null,null,"RAT","North East London NHS Foundation Trust"]
{"$rows_left_out":226}
{"sheet":"2. Reconciliation (old style)","index":9,"n_rows":152,"n_cols":9,"rows_kept":152,"cut":false,"hidden":false,"merged":[[88,5,88,6],[89,5,89,6],[90,5,90,6],[91,5,91,6],[94,1,103,7],[87,5,87,6],[76,5,76,6],[77,5,77,6],[78,5,78,6],[79,5,79,6],[80,5,80,6],[81,5,81,6],[82,5,82,6],[83,5,83,6],[84,5,84,6],[85,5,85,6],[86,5,86,6],[75,5,75,6],[54,3,54,4],[65,3,65,4],[65,5,65,6],[67,5,67,6],[68,5,68,6],[69,5,69,6],[70,5,70,6],[71,5,71,6],[72,5,72,6],[73,5,73,6],[74,5,74,6]]}
[]
[]
[]
[]
[]
[]
[]
[]
[]
[]
[]
[]
[]
[]
[]
[null,"Section 1 - Cost Reconciliation"]
[]
[null,"Section 1.1: Final Audited Accounts to Admitted Patient Care Quantum"]
[]
[null,"Line","Description",null,null,"Notes: FTs","Notes: NHS Trusts","£"]
{"$rows_left_out":132}