{"text_format":"1","workbook":"xlsx","n_sheets":6,"sheets":["FTs 3 months - OLD","Cover Sheet","Corporate Governance Statement","Other certifications","Finance Risk Indicators","Lookups"],"not_rendered":{"charts":0,"images":1,"macros":1,"external_links":1,"defined_names":15,"comments":3,"pivot_tables":0},"unopened":[],"bounds":{"document_bytes":16777216,"sheet_cells":100000,"rows_first":2000,"rows_last":500,"rows_between":2000,"halvings":0,"cell_chars":16384,"cell_head_chars":4096},"cells_cut":0,"cells_raw":0,"read":"whole","date_system":"1900"}

{"sheet":"FTs 3 months - OLD","index":0,"n_rows":69,"n_cols":16,"rows_kept":69,"cut":false,"hidden":true,"merged":[[18,4,18,8],[8,4,8,8],[10,4,10,8],[12,4,12,8],[14,4,14,8],[16,4,16,8],[36,4,36,8],[19,4,19,8],[20,4,20,8],[22,4,22,8],[24,4,24,8],[26,4,26,8],[27,4,27,8],[28,4,28,8],[30,4,30,8],[32,4,32,8],[33,4,33,8],[34,4,34,8],[53,4,53,8],[38,4,38,8],[52,4,52,8],[68,3,68,12],[54,4,54,8],[57,4,57,8],[59,4,59,8],[61,4,61,10],[63,4,63,10],[65,4,65,10]]}
[]
[null,null,null,"Worksheet \"Corporate Governance Statement\""]
[null,null,null,"Click to go to index"]
[null,null,null,"Corporate Governance Statement from the Board of [Foundation Trust]"]
[]
[]
[null,null,null,null,"The board are required to respond \"Confirmed\" or \"Not confirmed\" to the following statements, setting out any risks and mitigating actions planned for each (see notes below)"]
[null,null,null,null,"For quality, that:",null,null,null,null,"Response","Risks and mitigating actions","Historical or prospective","Timing of declaration"]
["CERT","CERT20",null,1,"The board is satisfied that, to the best of its knowledge and using its own processes and having assessed against Monitor’s Quality Governance Framework (supported by Care Quality Commission information, its own information on serious incidents, patterns of complaints, and including any further metrics it chooses to adopt), its NHS foundation trust has, and will keep in place, effective arrangements for the purpose of monitoring and continually improving the quality of healthcare provided to its patients.",null,null,null,null,null,null,"Prospective (applies as at date of certification and the current/[upcoming] financial year)","Three months from FT's year end (30 June deadline)",null,null,"Confirmed"]
[null,null,null,null,null,null,null,null,null,null,null,null,null,null,null,"Not confirmed"]
["CERT","CERT21",null,2,"The board is satisfied that plans in place are sufficient to ensure ongoing compliance with the Care Quality Commission’s registration requirements."]
[]
["CERT","CERT22",null,3,"The board is satisfied that processes and procedures are in place to ensure all medical practitioners providing care on behalf of the trust have met the relevant registration and revalidation requirements."]
[null,null,null,null,"For finance, that:"]
["CERT","CERT23",null,4,"The board anticipates that the trust will continue to maintain a financial risk rating of at least 3, as defined in Monitor's Compliance Framework, over the next 12 months"]
[]
["CERT","CERT24",null,5,"The board is satisfied that the trust shall at all times remain a going concern, as defined by relevant accounting standards in force from time to time."]
[null,null,null,null,"For governance, that:"]
["CERT","CERT25",null,6,"The board will ensure that the trust remains at all times compliant with its licence and has regard to the NHS Constitution"]
[]
["CERT","CERT26",null,7,"All current key risks to compliance with the trust’s licence have been identified (raised either internally or by external audit and assessment bodies) and addressed – or there are appropriate action plans in place to address the issues – in a timely manner"]
[]
["CERT","CERT27",null,8,"The board has considered all likely future risks to compliance with its licence and has reviewed appropriate evidence regarding the level of severity, likelihood of a breach occurring and the plans for mitigation of these risks to ensure continued compliance."]
[]
["CERT","CERT28",null,9,"The necessary planning, performance management and corporate and clinical risk management processes and mitigation plans are in place to deliver the annual plan, including that all audit committee recommendations accepted by the board are implemented satisfactorily."]
[]
["CERT","CERT29",null,10,"An Annual Governance Statement is in place pursuant to the requirements of the NHS Foundation Trust Annual Reporting Manual, and the trust is compliant with the risk management and assurance framework requirements that support the Statement pursuant to the most up to date guidance from HM Treasury (www.hm-treasury.gov.uk)."]
[]
["CERT","CERT30",null,11," The board is satisfied that plans in place are sufficient to ensure: ongoing compliance with all existing targets (after the application of thresholds) as set out in Appendix B; and a commitment to comply with all known targets going forwards."]
[]
{"$rows_left_out":40}
{"sheet":"Cover Sheet","index":1,"n_rows":32,"n_cols":8,"rows_kept":32,"cut":false,"hidden":false,"merged":[[1,7,1,8],[22,1,22,9],[30,1,30,9],[31,1,31,9],[8,1,8,9],[10,2,10,9],[11,2,11,9],[12,2,12,9],[13,2,13,9],[16,1,16,9],[20,1,20,9],[18,1,18,9]]}
[]
[null,null,null,null,null,null,null,"Self-Certification Template"]
[]
[]
[null,null,null,null,null,null,null,"FT Name:"]
[]
[null,null,null,null,null,null,null,"Organisation Name:"]
[]
[null,"NHS Foundation Trusts are required to make the following declarations to NHS Improvement:"]
[]
[null,"1 & 2","Systems for compliance with licence conditions - in accordance with General condition 6 of the NHS provider licence"]
[null,3,"Availability of resources and accompanying statement - in accordance with Continuity of Services condition 7 of the NHS provider licence"]
[null,4,"Corporate Governance Statement - in accordance with the Risk Assessment Framework"]
[null,5,"Certification on AHSCs and governance - in accordance with Appendix E of the Risk Assessment Framework"]
[null,6,"Certification on training of Governors - in accordance with s151(5) of the Health and Social Care Act"]
[]
[null,"Declarations 1 and 2 above are set out in a separate template, which is required to be returned to NHS Improvement by 31 May 2016.  "]
[null,"Declaration 3 is included in the APR 2015/16 Final Financial Template, which is required to be returned to NHS Improvement  per communications on final operational plan submissions."]
[null,"Declarations 4, 5 and 6 above are set out in this template, which is required to be returned to NHS Improvement by 30 June 2016.  "]
[]
[null,"Templates should be returned via the Trust portal, marked as a Trust Return with the activity type set to Annual Plan Review."]
[]
[null,"How to use this template"]
[null,"1) Copy this file to your Local Network or Computer."]
[null,"2) Select the name of your organisation from the drop-down box at the top of this worksheet."]
[null,"3) In the Corporate Governance Statement and Other Certifications worksheets, enter responses and information into the yellow data-entry cells as appropriate."]
[null,"4) Once the data has been entered, add signatures to the document, as described below."]
[null,"5) Use the Save File button at the top of this worksheet to save the file to your Network or Computer - note that the name of the saved file is set automatically - please do not change this name."]
[null,"6) Copy the saved file to your outbox in your NHS Improvement Portal."]
[]
{"$rows_left_out":3}
{"sheet":"Corporate Governance Statement","index":2,"n_rows":37,"n_cols":11,"rows_kept":37,"cut":false,"hidden":false,"merged":[[32,4,32,10],[34,4,34,10],[36,4,36,10],[30,4,30,9],[21,4,21,8],[11,4,11,8],[13,4,13,8],[15,4,15,8],[17,4,17,8],[19,4,19,8]]}
[]
[null,null,null,"Worksheet \"Corporate Governance Statement\""]
[]
[null,null,null,"Corporate Governance Statement"]
[]
[]
[null,null,null,null,"The Board are required to respond \"Confirmed\" or \"Not confirmed\" to the following statements, setting out any risks and mitigating actions planned for each one"]
[]
[]
[null,null,null,4,"Corporate Governance Statement",null,null,null,null,"Response","Risks and mitigating actions"]
[]
["CERT","CERT20",null,1,"The Board is satisfied that the Trust applies those principles, systems and standards of good corporate governance which reasonably would be regarded as appropriate for a supplier of health care services to the NHS.",null,null,null,null,null,"[including where the Board is able to respond \"Confirmed\"] "]
[]
["CERT","CERT21",null,2,"The Board has regard to such guidance on good corporate governance as may be issued by NHS Improvement from time to time"]
[]
["CERT","CERT22",null,3,"The Board is satisfied that the Trust implements: \n(a) Effective board and committee structures;\n(b) Clear responsibilities for its Board, for committees reporting to the Board and for staff reporting to the Board and those committees; and\n(c) Clear reporting lines and accountabilities throughout its organisation.\n"]
[]
["CERT","CERT23",null,4,"The Board is satisfied that the Trust effectively implements systems and/or processes:\n\n(a) To ensure compliance with the Licensee’s duty to operate efficiently, economically and effectively;\n(b) For timely and effective scrutiny and oversight by the Board of the Licensee’s operations; \n(c) To ensure compliance with health care standards binding on the Licensee including but not restricted to standards specified by the Secretary of State, the Care Quality Commission, the NHS Commissioning Board and statutory regulators of health care professions;\n(d) For effective financial decision-making, management and control (including but not restricted to appropriate systems and/or processes to ensure the Licensee’s ability to continue as a going concern); \n(e) To obtain and disseminate accurate, comprehensive, timely and up to date information for Board and Committee decision-making;\n(f) To identify and manage (including but not restricted to manage through forward plans) material risks to compliance with the Conditions of its Licence;\n(g) To generate and monitor delivery of business plans (including any changes to such plans) and to receive internal and where appropriate external assurance on such plans and their delivery; and\n(h) To ensure compliance with all applicable legal requirements.\n"]
[]
["CERT","CERT24",null,5,"The Board is satisfied that the systems and/or processes referred to in paragraph 4 (above) should include but not be restricted to systems and/or processes to ensure:\n\n(a) That there is sufficient capability at Board level to provide effective organisational leadership on the quality of care provided;   \n(b) That the Board’s planning and decision-making processes take timely and appropriate account of quality of care considerations;\n(c) The collection of accurate, comprehensive, timely and up to date information on quality of care;\n(d) That the Board receives and takes into account accurate, comprehensive, timely and up to date information on quality of care;\n(e) That the Trust, including its Board, actively engages on quality of care with patients, staff and other relevant stakeholders and takes into account as appropriate views and information from these sources; and\n(f) That there is clear accountability for quality of care throughout the Trust including but not restricted to systems and/or processes for escalating and resolving quality issues including escalating them to the Board where appropriate.\n"]
[]
["CERT","CERT25",null,6,"The Board is satisfied that there are systems to ensure that the Trust has in place personnel on the Board, reporting to the Board and within the rest of the organisation who are sufficient in number and appropriately qualified to ensure compliance with the conditions of its NHS provider licence."]
[]
[null,null,null,null,"Signed on behalf of the board of directors, and having regard to the views of the governors"]
[]
[null,null,null,null,"Signature",null,null,"Signature"]
[]
["CERT","CERTSIG",null,null,"Name",null,null,"Name"]
[]
[]
{"$rows_left_out":8}
{"sheet":"Other certifications","index":3,"n_rows":38,"n_cols":10,"rows_kept":38,"cut":false,"hidden":false,"merged":[[37,4,37,9],[11,4,11,8],[15,4,15,8],[6,4,6,9],[10,4,10,8],[29,4,29,9],[31,4,31,9],[33,4,33,9],[35,4,35,9]]}
[]
[null,null,null,"Worksheet \"Other declarations\""]
[]
[null,null,null,"Certification on AHSCs and governance and training of governors"]
[]
[]
[null,null,null,null,"The Board are required to respond \"Confirmed\" or \"Not confirmed\" to the following statements.  Explanatory information should be provided where required."]
[]
[null,null,null,5,"Certification on AHSCs and governance",null,null,null,null,"Response"]
[]
[null,null,null,null,"For NHS foundation trusts:\n• that are part of a major Joint Venture or Academic Health Science Centre (AHSC); or\n• whose Boards are considering entering into either a major Joint Venture or an AHSC."]
["CERT","CERT35",null,null,"The Board is satisfied it has or continues to:\n• ensure that the partnership will not inhibit the trust from remaining at all times compliant with the conditions of its licence;\n• have appropriate governance structures in place to maintain the decision making autonomy of the trust;\n• conduct an appropriate level of due diligence relating to the partners when required;\n• consider implications of the partnership on the trust’s financial risk rating having taken full account of any contingent liabilities arising and reasonable downside sensitivities;\n• consider implications of the partnership on the trust’s governance processes;\n• conduct appropriate inquiry about the nature of services provided by the partnership, especially clinical, research and education services, and consider reputational risk;\n• comply with any consultation requirements;\n• have in place the organisational and management capacity to deliver the benefits of the partnership;\n• involve senior clinicians at appropriate levels in the decision-making process and receive assurance from them that there are no material concerns in relation to the partnership, including consideration of any re-configuration of clinical, research or education services;\n• address any relevant legal and regulatory issues (including any relevant to staff, intellectual property and compliance of the partners with their own regulatory and legal framework);\n• ensure appropriate commercial risks are reviewed;\n• maintain the register of interests and no residual material conflicts identified; and\n• engage the governors of the trust in the development of plans and give them an opportunity to express a view on these plans."]
[]
[null,null,null,6,"Training of Governors"]
[]
["CERT","CERT37",null,null,"The Board is satisfied that during the financial year most recently ended the Trust has provided the necessary training to its Governors, as required in s151(5) of the Health and Social Care Act, to ensure they are equipped with the skills and knowledge they need to undertake their role."]
[]
[]
[null,null,null,null,"Signed on behalf of the Board of directors, and having regard to the views of the governors"]
[]
[null,null,null,null,"Signature",null,null,"Signature"]
[]
["CERT","CERTSIG",null,null,"Name",null,null,"Name"]
[]
["CERT","CERTJOB",null,null,"Capacity","[job title here]",null,"Capacity","[job title here]"]
[]
["CERT","CERTDATE",null,null,"Date",null,null,"Date"]
[]
[]
[null,null,null,null,"Where boards are unable to self-certify, they should make an alternative declaration by amending the self-certification as necessary, and including any significant prospective risks and concerns the foundation trust has in respect of delivering quality services and effective quality governance"]
{"$rows_left_out":9}
{"sheet":"Finance Risk Indicators","index":4,"n_rows":26,"n_cols":10,"rows_kept":26,"cut":false,"hidden":true,"merged":[[21,4,21,7],[7,4,7,7],[8,4,8,7],[9,4,9,7],[16,4,16,9],[19,4,19,7],[20,4,20,7]]}
["[Needed??]"]
[null,null,null,{"$f":"\"Worksheet \"\"\"&MID(CELL(\"filename\",D2),FIND(\"]\",CELL(\"filename\",D2))+1,99)&\"\"\"\"","v":"Worksheet \"Finance Risk Indicators\""}]
[null,null,null,"Click to go to index"]
[null,null,null,"Finance Risk Indicators for Happy Hospitals"]
[]
[null,null,null,null,"Please respond \"True\" or \"False\" to the following statements"]
[null,null,null,null,"Finance Risk Indicators",null,null,null,null,"Response"]
["CERT","FRI02",null,1,"Finance Declaration 2 signed (Trust unable to certify that Board anticipates that the Quarterly FRR will be at least 3 over the next 12 months)"]
["CERT","FRI03",null,2,"Planned FRR 2 (or less) for any one quarter in 13/14"]
["CERT","FRI04",null,3,"Working capital facility (WCF) was used at any point in 13/14 financial year"]
["CERT","FRI07",null,4,"Two or more changes in Finance Director in a twelve month period"]
["CERT","FRI08",null,5,"Interim Finance Director in place over more than one quarter end"]
["CERT","FRI09",null,6,"Quarter end cash balance <10 days of (annualised) operating expenses"]
[null,null,null,null,null,null,null,null,{"$f":"IF(J14>0,\"Indicators with no response :\",\"\")","v":"Indicators with no response :"},{"$f":"6-COUNTA(J8:J10,J11:J13)","v":6}]
[]
[]
[null,null,null,"Notes:","As set out in Monitor's Compliance Framework 2012-13, Monitor will separately consider this limited set of indicators to highlight the potential for any future material financial risk. Where Monitor believes that one or more of these indicators are present at an NHS foundation trust, Monitor will consider whether an earlier meeting with the trust to discuss them is appropriate. Following this meeting, Monitor may request the preparation of plans, or the provision of other assurances as to an NHS foundation trust’s capacity to mitigate any potential risk. The use of these indicators will not form part of the formal regulatory framework or Monitor’s approach to the potential use of its statutory powers of intervention.\n               \n"]
[]
[null,null,null,null,"Other indicators for Risk",null,null,null,null,"Response"]
["CERT","FRI11",null,1,"How many interim (voting) Directors are there on your Board at 31 May 2013"]
["CERT","FRI12",null,2,"How many acting (voting) Directors are there on your Board at 31 May 2013"]
["CERT","FRI13",null,3,"How many of the following posts are interim or acting or both ( Chair, CEO, Finance Dir, Medical Dir) at 31 May  2013"]
["CERT","FRI14",null,4,"How many changes in Finance Director have you had in the twelve month period to 31 May 2013"]
["CERT","FRI15",null,5,"How many governors posts (filled and unfilled) does your FT have (i.e in constitution)"]
["CERT","FRI16",null,6,"How many governors posts are vacant (unfilled) at 31 May 2013"]
[null,null,null,null,null,null,null,null,{"$f":"IF(J26>0,\"Indicators with no response :\",\"\")","v":"Indicators with no response :"},{"$f":"6-COUNT(J20:J25)","v":6}]

{"sheet":"Lookups","index":5,"n_rows":160,"n_cols":10,"rows_kept":160,"cut":false,"hidden":true,"merged":[]}
["Settings:",null,null,"Organisation Name","MARSID",null,"Organisation Name","ID",null,"Confirmed"]
[null,null,null,"5 Boroughs Partnership NHS Foundation Trust","5BOROUGHSPART",null,"Acorn Care Limited","1-101634337",null,"Not confirmed"]
["Organisation Type:","FT",null,"Aintree University Hospitals NHS Foundation Trust","AINTREE",null,"Affinity Healthcare Limited","1-118166459",null,"N/A"]
["Return Date:","2014-12-31",null,"Airedale NHS Foundation Trust","AIREDALE",null,"Air Liquide (Homecare) Ltd","1-421190153"]
["SQL Server:","IRNREP2012",null,"Alder Hey Children's NHS Foundation Trust","ALDERHEY",null,"Alliance Medical Limited","1-125892620"]
["SQL Database:","PRODS",null,"Ashford and St Peter's Hospitals NHS Foundation Trust","ASHFORD",null,"Alpha Hospitals (NW) Limited","1-124699983"]
[null,null,null,"Barnsley Hospital NHS Foundation Trust","BARNSLEY",null,"Alpha Hospitals Limited","1-101726680"]
[null,null,null,"Basildon & Thurrock University Hospitals NHS Foundation Trust","BASILDON",null,"Anglian Community Enterprise Community Interest Company (ACE CIC)","1-165291700"]
[null,null,null,"Hampshire Hospitals NHS Foundation Trust","BASINGSTOKE",null,"Arriva Transport Solutions Limited","1-252077400"]
[null,null,null,"Birmingham Children's Hospital NHS Foundation Trust","BCH",null,"Aspen Health Care Limited","1-101635235"]
[null,null,null,"Berkshire Healthcare NHS Foundation Trust","BERKSHIREHEALTH",null,"Barchester Healthcare Homes Limited","1-102642955"]
["Selected MARSID:",{"$f":"IFERROR(IF(LEN(FTCoverName)=0,VLOOKUP('Cover Sheet'!I7,IndependentList,2,FALSE),VLOOKUP('Cover Sheet'!I5,FTList,2,FALSE)),\"\")","v":""},null,"Birmingham Community Healthcare NHS Foundation Trust","BIRMCOMM",null,"Baywater Healthcare UK Limited","1-1150381619"]
[null,null,null,"Birmingham and Solihull Mental Health NHS Foundation Trust","BIRMSOLIHULL",null,"BMI Healthcare Limited","1-102643500"]
[null,null,null,"Birmingham Women's NHS Foundation Trust","BIRMWOMEN",null,"Bristol Community Health CIC","1-296908348"]
[null,null,null,"Blackpool Teaching Hospitals NHS Foundation Trust","BLACKPOOL",null,"British Pregnancy Advisory Service","1-116992830"]
[null,null,null,"Bolton NHS Foundation Trust","BOLTON",null,"Bromley Healthcare Community Interest Company","1-216234545"]
[null,null,null,"The Royal Bournemouth and Christchurch Hospitals NHS Foundation Trust","BOURNEMOUTH",null,"Cambian Healthcare Limited","1-116865881"]
[null,null,null,"Bradford Teaching Hospitals NHS Foundation Trust","BRADFORD",null,"Cambian Learning Disabilities Limited","1-101725130"]
[null,null,null,"Bradford District Care NHS Foundation Trust","BRADFORDCARE",null,"Cambian Learning Disability Midlands Limited","1-119237494"]
[null,null,null,"Bridgewater Community Healthcare NHS Foundation Trust","BRIDGEWATER",null,"Care & Support Partnership Community Interest Company Limited","1-284354890"]
[null,null,null,"University Hospitals Bristol NHS Foundation Trust","BRISTOL",null,"Care UK (H4H) Limited","1-670023572"]
[null,null,null,"Burton Hospitals NHS Foundation Trust","BURTON",null,"Care UK Clinical Services Limited","1-116865921"]
[null,null,null,"Calderdale & Huddersfield NHS Foundation Trust","CALDERDALE",null,"Care UK Community Diagnostics Limited","1-101727966"]
[null,null,null,"Calderstones Partnership NHS Foundation Trust","CALDERSTONES",null,"Care UK Mental Health Partnerships Limited","1-116865897"]
[null,null,null,"Cambridgeshire and Peterborough NHS Foundation Trust","CAMBPETER",null,"Care UK Practices Ltd","1-199690454"]
[null,null,null,"Cambridge University Hospitals NHS Foundation Trust","CAMBRIDGE",null,"Central Essex Community Services C.I.C.","1-168055209"]
[null,null,null,"Camden and Islington NHS Foundation Trust","CAMDEN",null,"Central Surrey Health Limited","1-199797673"]
[null,null,null,"Chelsea and Westminster NHS Foundation Trust","CHELSEA",null,"Chas A Blatchford & Sons Limited","1-127887832"]
[null,null,null,"Countess of Chester Hospital NHS Foundation Trust","CHESTER",null,"Circle Hospital (Bath) Limited","1-101727364"]
[null,null,null,"Chesterfield Royal Hospital NHS Foundation Trust","CHESTERFIELD",null,"Circle Hospital (Reading) Limited","1-425255541"]
{"$rows_left_out":130}