{"text_format":"1","workbook":"xlsx","n_sheets":13,"sheets":["GENERAL GUIDANCE","Section A notes","names of lists","Section A Example","Section A","Section B notes","Section B","Section C notes","Section C","Section D notes","Section D","Working","Sheet1"],"not_rendered":{"charts":0,"images":2,"macros":0,"external_links":0,"defined_names":43,"comments":0,"pivot_tables":0},"unopened":[],"bounds":{"document_bytes":16777216,"sheet_cells":100000,"rows_first":2000,"rows_last":500,"rows_between":2000,"halvings":0,"cell_chars":16384,"cell_head_chars":4096},"cells_cut":0,"cells_raw":0,"read":"whole","date_system":"1900"}

{"sheet":"GENERAL GUIDANCE","index":0,"n_rows":26,"n_cols":1,"rows_kept":26,"cut":false,"hidden":false,"merged":[[8,0,8,12],[7,0,7,12],[4,0,4,12],[5,0,5,12],[6,0,6,12]]}
[]
[]
["   Round 6 PROJECT Application Form - Part 2  [WITHDRAWN]"]
[]
["●    The Regional Growth Fund (RGF) application form consists of two parts.  Part 2 (this Excel workbook) is made up of four sections (A, B, C and D) to capture the key data relating to the project.  THIS SHOULD BE SUBMITTED IN EXCEL FORMAT ALONGSIDE PART 1 OF THE APPLICATION AND THE ACCOMPANYING DOCUMENTATION (see Part 1 of the application form)."]
["●    THIS PART OF THE APPLICATION IS SPECIFIC TO PROJECTS.  A SEPARATE FORM IS PROVIDED FOR PROGRAMMES."]
["●    Guidance, technical notes and examples are provided to help you complete this form correctly.  Please read this information carefully."]
["●    Please complete these spreadsheets as fully as possible as they form an essential part of the appraisal process. The information you provide will be scrutinised in detail and you should be prepared to explain the basis of their contents as part of the Due Diligence stage if you receive a conditional offer. It is therefore recommended that all working papers etc relating to the completion of these forms be retained until the RGF process is completed."]
[]
["© Crown copyright 2014"]
[]
[]
[]
[]
[]
{"$rows_left_out":12}
{"sheet":"Section A notes","index":1,"n_rows":70,"n_cols":5,"rows_kept":70,"cut":false,"hidden":false,"merged":[[29,1,36,1],[18,2,18,4],[19,2,19,4],[20,2,20,4],[29,2,31,2],[29,4,30,4],[21,2,21,4],[22,2,22,4],[23,2,23,4],[24,2,24,4],[25,2,25,4],[3,1,3,4],[1,1,1,3],[12,1,12,4],[13,1,13,4],[14,1,14,4],[7,1,7,4],[8,1,8,4],[9,1,9,4],[10,1,10,4],[11,1,11,4],[66,1,69,1],[66,2,69,2],[66,4,68,4],[5,1,5,4],[6,1,6,4],[58,1,65,1],[58,4,61,4],[62,4,63,4],[37,1,46,1],[37,2,38,2],[37,3,38,3],[37,4,39,4],[47,1,57,1],[47,3,48,3],[47,4,50,4],[16,1,16,3]]}
[]
[null,"How to fill in Section A [WITHDRAWN]"]
[]
[null,"Section A definitions gives a guide to the terms used in this section;"]
[]
[null,"1. All job figures should be expressed in full time equivalent terms (see definitions below)."]
[null,"2. Jobs are considered direct where you are willing to contract for their delivery. This will include a clawback provision whereby the RGF funding becomes repayable if the jobs are not delivered and maintained for the period for which they are included in Table 1a."]
[null,"3. Please refer to Section A examples before completing your employment estimates."]
[null,"4. Direct and indirect jobs should be separated into created and safeguarded.  Construction jobs should be clearly separated and included within indirect jobs, unless you are willing to contract for their delivery."]
[null,"5. Types of jobs should be listed separately. However, please do not add any further lines to the spreadsheet or change the formatting in any other way. If there are more than 15 types of job in any given section please group them sensibly into a maximum of 15 categories."]
[null,"6. Where insufficient detail of employment impacts to complete Section A is known applicants should provide as much detail as possible in the notes section, including why it is not possible to provide more detail."]
[null,"7. Please comment in the notes section in column S on the means of forecasting the employment impacts e.g. modelled on past experience/expected sales,  modelled using a particular benchmark (if so include brief details) etc."]
[null,"8. The notes section in column S can also be used to provide other information which you think is relevant."]
[null,"9. Do not change the formulas included, this will delay the processing of your application."]
[null,"10. You should only provide information on skills and training activities which are likely to add value. E.g. productivity improvements or addressing skills gaps. Where appropriate, please set out the expected increase in salary, if any, which employees are expected to earn as a result of skills and training development opportunities.  Training and related costs that organisations are already required to meet such as health and safety or professional membership fees are unlikely to be able to demonstrate additional value-added from public funding and should not be included in the spreadsheet."]
{"$rows_left_out":56}
{"sheet":"names of lists","index":2,"n_rows":108,"n_cols":4,"rows_kept":108,"cut":false,"hidden":true,"merged":[]}
[]
[]
[]
[]
[]
[]
[null,"sectorcb",null,"Manufacturing – Auto"]
[null,null,null,"Manufacturing – Aero"]
[null,null,null,"Manufacturing – Chemicals"]
[null,null,null,"Manufacturing – Electronics"]
[null,null,null,"Manufacturing – Food"]
[null,null,null,"Manufacturing – Waste"]
[null,null,null,"Manufacturing – Low Carbon/ Renewables/ Energy"]
[null,null,null,"Manufacturing – Transport/ telecoms/ utilities/ ports/ infrastructure"]
[null,null,null,"Manufacturing – Materials"]
{"$rows_left_out":94}
{"sheet":"Section A Example","index":3,"n_rows":98,"n_cols":19,"rows_kept":98,"cut":false,"hidden":false,"merged":[[90,18,91,18],[90,12,91,12],[90,13,91,13],[90,14,91,14],[90,15,91,15],[90,16,91,16],[90,17,91,17],[90,11,91,11],[90,0,91,0],[90,1,91,1],[90,2,91,2],[90,3,91,3],[90,4,91,4],[90,5,91,5],[90,6,91,6],[90,7,91,7],[90,8,91,8],[90,9,91,9],[90,10,91,10],[5,5,6,5],[25,0,26,0],[25,5,26,5],[25,1,26,1],[5,3,6,3],[25,2,26,2],[5,4,6,4],[5,0,6,0],[5,2,6,2],[47,2,48,2],[25,18,26,18],[25,17,26,17],[47,18,48,18],[47,10,48,10],[47,9,48,9],[47,3,48,3],[47,4,48,4],[47,5,48,5],[47,15,48,15],[47,14,48,14],[47,16,48,16],[25,4,26,4],[25,6,26,6],[5,18,6,18],[47,17,48,17],[68,17,69,17],[5,17,6,17],[68,18,69,18],[47,0,48,0],[47,13,48,13],[5,6,6,6],[47,7,48,7],[47,6,48,6],[47,12,48,12],[47,11,48,11],[25,11,26,11],[25,12,26,12],[47,1,48,1],[25,7,26,7],[25,8,26,8],[25,9,26,9],[25,10,26,10],[47,8,48,8],[25,3,26,3],[68,16,69,16],[68,7,69,7],[68,10,69,10],[68,8,69,8],[68,9,69,9],[68,13,69,13],[68,11,69,11],[68,12,69,12],[68,14,69,14],[68,15,69,15],[68,0,69,0],[68,2,69,2],[68,5,69,5],[68,6,69,6],[68,3,69,3],[68,4,69,4],[68,1,69,1],[5,16,6,16],[25,15,26,15],[25,16,26,16],[25,13,26,13],[25,14,26,14],[5,15,6,15]]}
[]
["Employment impacts [WITHDRAWN]"]
[]
[]
["Table 1a: Direct, Contractable Jobs - Created"]
["Job Title","Location (Local Authority)","Employer","Company Size","Sector","NVQ Qualification Level","2014 Salary £ \n(if range use average)","FY 2014/15","FY 2015/16","FY 2016/17","FY 2017/18","FY 2018/19","FY 2019/20","FY 2020/21","FY 2021/22","FY 2022/23","FY 2023/24",null,"Notes"]
[null,"Local Authority"]
["Machine operatives","Rotherham","Company Z (Applicant)","Medium","Manufacturing – Auto",3,25000,null,null,100,150,150,150,150,null,null,null,null,"Machine operatives directly employed in the new production.  Capacity will be at 2/3 in year 3 and reach full capacity in year 4."]
["Support staff","Rotherham","Company Z (Applicant)","Medium","Manufacturing – Auto",2,18000,3,5,5,7,7,7,7,null,null,null,null,"Support staff directly contracted.  These will come on stream in year 1 to manage systems related to the project."]
[]
["Company Z is a medium sized manufacturing firm in the car industry.  Their project involves increasing the capacity of the current factory.  This will create 150 new machines operative roles, directly employed by the company.  It will also create 7 new support staff roles directly employed by the company.  Company X is willing to guarantee these jobs until 2020/21. "]
[]
[]
[]
[]
{"$rows_left_out":84}
{"sheet":"Section A","index":4,"n_rows":100,"n_cols":19,"rows_kept":100,"cut":false,"hidden":false,"merged":[[92,18,93,18],[92,0,93,0],[92,1,93,1],[92,14,93,14],[92,15,93,15],[92,7,93,7],[92,8,93,8],[92,9,93,9],[92,2,93,2],[92,16,93,16],[92,10,93,10],[92,11,93,11],[92,12,93,12],[92,13,93,13],[92,17,93,17],[92,5,93,5],[92,6,93,6],[70,11,71,11],[70,12,71,12],[92,3,93,3],[92,4,93,4],[70,8,71,8],[70,9,71,9],[70,7,71,7],[70,10,71,10],[49,2,50,2],[49,9,50,9],[49,0,50,0],[49,1,50,1],[27,12,28,12],[49,8,50,8],[49,3,50,3],[49,4,50,4],[49,7,50,7],[49,6,50,6],[27,6,28,6],[49,5,50,5],[70,0,71,0],[70,2,71,2],[70,5,71,5],[70,6,71,6],[70,3,71,3],[70,1,71,1],[70,4,71,4],[49,13,50,13],[5,4,6,4],[27,13,28,13],[49,12,50,12],[49,11,50,11],[49,10,50,10],[70,13,71,13],[27,10,28,10],[5,15,6,15],[27,18,28,18],[49,17,50,17],[5,17,6,17],[49,14,50,14],[27,14,28,14],[5,16,6,16],[27,15,28,15],[27,16,28,16],[49,15,50,15],[5,18,6,18],[27,17,28,17],[49,18,50,18],[70,18,71,18],[70,14,71,14],[70,15,71,15],[70,16,71,16],[49,16,50,16],[70,17,71,17],[5,0,6,0],[27,11,28,11],[27,0,28,0],[27,5,28,5],[27,1,28,1],[27,7,28,7],[27,2,28,2],[5,6,6,6],[27,3,28,3],[27,4,28,4],[5,5,6,5],[27,8,28,8],[5,2,6,2],[27,9,28,9],[5,3,6,3]]}
[]
["Section A: Employment impacts [WITHDRAWN]"]
[]
[]
["Table 1a: Direct, Contractable Jobs - Created"]
["Job Title","Location (Local Authority)","Employer","Company Size","Sector","NVQ Qualification Level","2014 Salary £ \n(if range use average)","FY 2014/15","FY 2015/16","FY 2016/17","FY 2017/18","FY 2018/19","FY 2019/20","FY 2020/21","FY 2021/22","FY 2022/23","FY 2023/24",null,"Notes"]
[null,"Local Authority"]
[]
[]
[]
[]
[]
[]
[]
[]
{"$rows_left_out":86}
{"sheet":"Section B notes","index":5,"n_rows":5,"n_cols":2,"rows_kept":5,"cut":false,"hidden":false,"merged":[[1,1,1,4],[2,1,2,4],[3,1,3,4],[4,1,4,4]]}
[]
[null,"How to fill in Section B [WITHDRAWN]"]
[]
[null,"1. Use column B in the table to show the estimated spread of direct employment impacts (both created and safeguarded) – this must sum to 100%; and"]
[null,"2. Use the values in cells C5, C6, C7 and C8 to answer question C12 in Part 1."]

{"sheet":"Section B","index":6,"n_rows":348,"n_cols":6,"rows_kept":348,"cut":false,"hidden":false,"merged":[[7,0,7,1],[7,2,7,4],[4,0,4,1],[4,2,4,4],[5,0,5,1],[5,2,5,4],[6,0,6,1],[6,2,6,4]]}
[]
["Section B: Distribution of employment impacts [WITHDRAWN]"]
[]
[]
["Q. C12a - Proportion of resident population aged 16-64 claiming out of work benefits",null,{"$f":"IF($B$348=1,C$348,\"ERROR, Your employment impacts do not sum to 100%\")","v":"ERROR, Your employment impacts do not sum to 100%"},null,null,{"$f":"IF(C5=\"Error, Your employment impacts do not sum to 100%\",\"\", SUM(IF(Working!$E$2:$E$327>=C5,1,0)) & \"/326\")","v":""}]
["Q. C12b - Public sector employee job share",null,{"$f":"IF($B$348=1,D$348,\"ERROR, Your employment impacts do not sum to 100%\")","v":"ERROR, Your employment impacts do not sum to 100%"},null,null,{"$f":"IF(C6=\"Error, Your employment impacts do not sum to 100%\",\"\", SUM(IF(Working!$H$2:$H$327>=C6,1,0)) &\"/326\")","v":""}]
["Q. C12c - Private sector employee job growth",null,{"$f":"IF($B$348=1,E$348,\"ERROR, Your employment impacts do not sum to 100%\")","v":"ERROR, Your employment impacts do not sum to 100%"},null,null,{"$f":"IF(C7=\"Error, Your employment impacts do not sum to 100%\",\"\",SUM(IF(Working!$K$2:$K$327>=C7,1,0))& \"/326\")","v":""}]
["Q. C12d - Number of active enterprises per 1,000 resident population",null,{"$f":"IF($B$348=1,F$348,\"ERROR, Your employment impacts do not sum to 100%\")","v":"ERROR, Your employment impacts do not sum to 100%"},null,null,{"$f":"IF(C8=\"Error, Your employment impacts do not sum to 100%\",\"\",SUM(IF(Working!$N$2:$N$327 <=C8,1,0)) & \"/326\")","v":""}]
[]
["Geographic Area \n(Local Authority District or Region)","Approximate proportion of direct employment impacts (%)","WEIGHTED - Proportion of resident population aged 16-64 claiming out of work benefits February 2012","WEIGHTED - Public sector employee job share 2009","WEIGHTED - Private sector employee job growth 2003-2008","WEIGHTED - Number of active enterprises per 1,000 resident population 2011"]
["Adur",0,{"$f":"VLOOKUP($A11,Working!$B$2:$O$339,4,FALSE)*($B11/(1-$B$347))","v":0},{"$f":"VLOOKUP($A11,Working!$B$2:$O$339,7,FALSE)*($B11/(1-$B$347))","v":0},{"$f":"VLOOKUP($A11,Working!$B$2:$L$339,10,FALSE)*($B11/(1-$B$347))","v":0},{"$f":"(VLOOKUP($A11,Working!$B$2:$O$339,11,FALSE)/(VLOOKUP($A11,Working!$B$2:$O$339,12,FALSE)/1000))*($B11/(1-$B$347))","v":0}]
["Allerdale",0,{"$f":"VLOOKUP($A12,Working!$B$2:$O$339,4,FALSE)*($B12/(1-$B$347))","v":0},{"$f":"VLOOKUP($A12,Working!$B$2:$O$339,7,FALSE)*($B12/(1-$B$347))","v":0},{"$f":"VLOOKUP($A12,Working!$B$2:$L$339,10,FALSE)*($B12/(1-$B$347))","v":0},{"$f":"(VLOOKUP($A12,Working!$B$2:$O$339,11,FALSE)/(VLOOKUP($A12,Working!$B$2:$O$339,12,FALSE)/1000))*($B12/(1-$B$347))","v":0}]
["Amber Valley",0,{"$f":"VLOOKUP($A13,Working!$B$2:$O$339,4,FALSE)*($B13/(1-$B$347))","v":0},{"$f":"VLOOKUP($A13,Working!$B$2:$O$339,7,FALSE)*($B13/(1-$B$347))","v":0},{"$f":"VLOOKUP($A13,Working!$B$2:$L$339,10,FALSE)*($B13/(1-$B$347))","v":0},{"$f":"(VLOOKUP($A13,Working!$B$2:$O$339,11,FALSE)/(VLOOKUP($A13,Working!$B$2:$O$339,12,FALSE)/1000))*($B13/(1-$B$347))","v":0}]
["Arun",0,{"$f":"VLOOKUP($A14,Working!$B$2:$O$339,4,FALSE)*($B14/(1-$B$347))","v":0},{"$f":"VLOOKUP($A14,Working!$B$2:$O$339,7,FALSE)*($B14/(1-$B$347))","v":0},{"$f":"VLOOKUP($A14,Working!$B$2:$L$339,10,FALSE)*($B14/(1-$B$347))","v":0},{"$f":"(VLOOKUP($A14,Working!$B$2:$O$339,11,FALSE)/(VLOOKUP($A14,Working!$B$2:$O$339,12,FALSE)/1000))*($B14/(1-$B$347))","v":0}]
["Ashfield",0,{"$f":"VLOOKUP($A15,Working!$B$2:$O$339,4,FALSE)*($B15/(1-$B$347))","v":0},{"$f":"VLOOKUP($A15,Working!$B$2:$O$339,7,FALSE)*($B15/(1-$B$347))","v":0},{"$f":"VLOOKUP($A15,Working!$B$2:$L$339,10,FALSE)*($B15/(1-$B$347))","v":0},{"$f":"(VLOOKUP($A15,Working!$B$2:$O$339,11,FALSE)/(VLOOKUP($A15,Working!$B$2:$O$339,12,FALSE)/1000))*($B15/(1-$B$347))","v":0}]
{"$rows_left_out":334}
{"sheet":"Section C notes","index":7,"n_rows":54,"n_cols":2,"rows_kept":54,"cut":false,"hidden":false,"merged":[[39,1,39,11],[40,1,40,11],[32,1,32,11],[33,1,33,11],[34,1,34,11],[35,1,35,11]]}
[]
[null,"How to fill in Section C [WITHDRAWN]"]
[]
[null,"1. Section C must be completed by all applicants."]
[null,"2. Do not add additional lines or make any changes to the formatting or locked cells. Doing so will delay the processing of applications."]
[null,"3. Enter all amounts in £m, to 3 decimal places."]
[null,"4. Please ensure source and use of funding totals are identical (i.e. B5 = B6). Total cost over the length of the project cell in Table 1 should equal total use of funding over the length of the project cell in Table 2 (i.e. E22  = E40). "]
[null,"5. The funding and costs included should be all those unlocked by the provision of RGF funding."]
[]
[null,"Table 1 - All Sources of Funding"]
[null,"6. The source of the funding should be identified i.e. name of provider. You should also provide the funding type using the following categories:"]
[null,"RGF;"]
[null,"Public funding"]
[null,"     UK-based funding (please specify in comments box)"]
[null,"     European Regional Development Fund (ERDF)"]
{"$rows_left_out":40}
{"sheet":"Section C","index":8,"n_rows":126,"n_cols":63,"rows_kept":126,"cut":false,"hidden":false,"merged":[[2,0,2,7]]}
["Section C: Sources and use of funding"]
["Please complete Tables 1 to 7"]
["Please ensure source and use of funding totals are identical (i.e. B5 = B6). Total cost over the length of the project cell in Table 1 should equal total use of funding over the length of the project cell in Table 2 (i.e. E22  = E40).  Please also ensure that the use of funding total in Table 2 is equal to the sum of the totals in Tables 3, 4, 5 and 6 (i.e. E40 = E59 + E75 + E91 + E107). "]
[]
["Total sources of funding",{"$f":"E22","v":0}]
["Total uses of funding",{"$f":"E40","v":0},{"$f":"IF(B6=B5,\"\",\"ERROR - FUNDING SOURCES AND USES DO NOT MATCH\")","v":""}]
[]
["Sources of funding"]
[]
["Table 1 - All sources of funding "]
["Specify the sources of all public, private and RGF funding."]
[]
["Funding Type - Public, Private funding","Source of funding","Is the funding confirmed?","Is this funding cash/In-kind?","Total Contribution (£m)","FY 2014/15","FY 2015/16","FY 2016/17","FY 2017/18","FY 2018/19","FY 2019/20","FY 2020/21","FY 2021/22","FY 2022/23","FY 2023/24","Comments"]
[null,null,null,null,{"$f":"SUM(F14:O14)","v":0}]
[null,null,null,null,{"$f":"SUM(F15:O15)","v":0}]
{"$rows_left_out":112}
{"sheet":"Section D notes","index":9,"n_rows":15,"n_cols":2,"rows_kept":15,"cut":false,"hidden":false,"merged":[]}
[]
[null,"How to fill in Section D [WITHDRAWN]"]
[]
[null,"1. Section D is an optional section for additional benefits and costs."]
[null,"2. Do not add additional lines or make any changes to the formatting or locked cells. Doing so will delay the processing of applications."]
[null,"3. Please enter monetised environmental and health benefits/costs in Table 1, and all other additional benefits/costs in Table 2. "]
[]
[null,"Table 1 - Quantified environmental and health benefits"]
[null,"4. Please enter environmental benefits/costs in Tonnes of Carbon Dioxide Equivalent (tCO2e).  Guidelines for calculating this can be found at:  http://www.ukconversionfactorscarbonsmart.co.uk/  "]
[null,"5. Please enter health benefits/costs in Quality Adjusted Life Years (QALYs).  Please see the application guidance document for information on calculating QALYs."]
[null,"6. Enter benefits as positive numbers and costs as negative numbers."]
[null,"7. If you cannot calculate these benefits in the required units, please enter them in Table 2 instead.  "]
[]
[null,"Table 2 - Other costs and benefits"]
[null,"8. All other benefits should be included in Table 2.  This includes any environmental and health benefits/costs that have NOT been included in Table 1."]
{"$rows_left_out":1}
{"sheet":"Section D","index":10,"n_rows":29,"n_cols":15,"rows_kept":29,"cut":false,"hidden":false,"merged":[[8,0,9,0],[8,3,9,3],[24,4,24,8],[26,4,26,8],[27,4,27,8],[17,4,17,8],[19,4,19,8],[20,4,20,8],[21,4,21,8]]}
[]
["Section D: Wider impacts [WITHDRAWN]"]
[]
["  If relevant, please use the tables below to set out the wider (i.e. non-employment) costs / benefits associated with this project. "]
[]
["Table 1:  Quantified environmental and health impacts."]
["ENTER BENEFITS AS POSITIVE NUMBERS AND COSTS AS NEGATIVE NUMBERS"]
[]
["Quantified environmental and health impacts",null,"Unit","Description","FY 2014/15","FY 2015/16","FY 2016/17","FY 2017/18","FY 2018/19","FY 2019/20","FY 2020/21","FY 2021/22","FY 2022/23","FY 2023/24","Comments"]
[null,"Local Authority"]
["Environmental Benefits / (Costs)",null,"Tonnes of Carbon Dioxide Equivalent (tCO2e)"]
["Health Benefits / (Costs)",null,"Quality Adjusted Life Years (QALYs)"]
[]
[]
["Table 2:  Other costs and benefits"]
{"$rows_left_out":15}
{"sheet":"Working","index":11,"n_rows":339,"n_cols":15,"rows_kept":339,"cut":false,"hidden":true,"merged":[]}
["ONS Code Local Authority Districts (Post 2009 Boundaries)","Local Authority Districts (Post-2009 Boundaries)","Working age client group : out-of-work benefits : Feb 2012","Working age population (16-64) 2011","Proportion of resident population aged 16-64 claiming out of work benefits Aug 2013","Public Sector Employees 2012","All Employees 2012","Public sector employee job share 2012","Private sector employees 2009","Private sector employees 2012","Private sector employee job growth 2009-2012","Number of active enterprises 2012","Mid-year population 2012","Number of active enterprises per 1,000 resident population 2011","Region"]
["E07000223","Adur",null,null,9.4,3429,19306,{"$f":"F2*100/G2","v":17.761317725059566},15930,16067,{"$f":"((J2/I2)-1)*100","v":0.8600125549278026},1985,61900,{"$f":"L2/(M2*0.001)","v":32.067851373182556},"South East"]
["E07000026","Allerdale",null,null,10.8,7710,37837,20.376879773766419,30389,31788,4.6036394748099729,3990,96300,41.433021806853581,"North West"]
["E07000032","Amber Valley",null,null,9.1999999999999993,10505,50667,20.73341622752482,42782,40024,-6.4466364358842458,3905,122700,31.825590872045638,"East Midlands"]
["E07000224","Arun",null,null,9.1,6607,42046,15.713742091994483,34495,36637,6.2095955935642877,4665,151400,30.812417437252311,"South East"]
["E07000170","Ashfield",null,null,13.3,11428,48156,23.731206910872995,36678,37653,2.6582692622280302,2430,120100,20.233139050791006,"East Midlands"]
["E07000105","Ashford",null,null,8.6,10063,52444,19.188086339714744,42641,41936,-1.6533383363429577,5065,120100,42.173189009159032,"South East"]
["E07000004","Aylesbury Vale",null,null,5.7,15459,69925,22.107972828030032,52438,57634,9.9088447309203289,8230,177800,46.287964004499436,"South East"]
["E07000200","Babergh",null,null,6.7,4165,30598,13.612000784364991,26935,27213,1.0321143493595697,3805,87900,43.287827076222975,"East of England"]
["E09000002","Barking and Dagenham",null,null,15.4,12494,48337,25.847694312845231,35031,38384,9.5715223659044835,3700,190600,19.412381951731376,"London"]
["E09000003","Barnet",null,null,8.4,26063,115750,22.516630669546437,91065,95463,4.8295173776972566,17065,364000,46.881868131868131,"London"]
["E08000016","Barnsley",null,null,15.5,19834,72432,27.382924674177158,54806,54435,-0.67693318249826273,5015,233700,21.459135643988017,"Yorkshire and The Humber"]
["E07000027","Barrow-in-Furness",null,null,14.8,6803,29370,23.163091590057881,23235,22620,-2.646868947708203,1645,68400,24.049707602339179,"North West"]
["E07000066","Basildon",null,null,11.4,16526,76728,21.538421436763631,63514,65161,2.5931290739049651,5760,176500,32.634560906515581,"East of England"]
["E07000084","Basingstoke and Deane",null,null,6.5,12666,84659,14.961197273768885,73694,71573,-2.8781176215159965,6515,170500,38.211143695014663,"South East"]
{"$rows_left_out":325}
{"sheet":"Sheet1","index":12,"n_rows":0,"n_cols":0,"rows_kept":0,"cut":false,"hidden":true,"merged":[]}