{"text_format":"1","workbook":"xlsx","n_sheets":10,"sheets":["Viewer","Statistics","Quantitative","Qualitative","Data","Graph","Error Report","GraphData","System Data","Discouting"],"not_rendered":{"charts":1,"images":0,"macros":1,"external_links":1,"defined_names":10,"comments":0,"pivot_tables":0},"unopened":[],"bounds":{"document_bytes":16777216,"sheet_cells":100000,"rows_first":2000,"rows_last":500,"rows_between":2000,"halvings":0,"cell_chars":16384,"cell_head_chars":4096},"cells_cut":0,"cells_raw":0,"read":"whole","date_system":"1900"}

{"sheet":"Viewer","index":0,"n_rows":19,"n_cols":6,"rows_kept":19,"cut":false,"hidden":false,"merged":[[18,5,18,9],[1,2,3,10],[14,5,14,9],[15,5,15,9],[16,5,16,9],[17,5,17,9]]}
[]
[null,null,"Multiple Scenarios Reviewer"]
[]
[]
[]
[]
[]
[]
[]
[]
[]
[]
[]
[]
[null,null,null,"Version","Date","Description"]
[null,null,null,1,"2014-07-09","First release of Aggregated Outputs Module"]
[null,null,null,1.01,"2014-08-11","Updated labelling and NPV calculations on Quantitative sheet"]
[null,null,null,1.02,"2014-08-20","Updated graphing for discounted and undiscounted costs"]
[null,null,null,1.03,"2014-08-27","Updated protection levels"]

{"sheet":"Statistics","index":1,"n_rows":3,"n_cols":12,"rows_kept":3,"cut":false,"hidden":false,"merged":[[2,11,3,11],[2,6,3,6],[2,7,3,7],[2,8,3,8],[2,9,3,9],[2,10,3,10],[2,1,3,1],[2,2,3,2],[2,3,3,3],[2,4,3,4],[2,5,3,5]]}
[]
[]
[null,"Check","Workbook Number","Workbook Name","Start Year","Analysis Period","Number of Condition Bands","Number of Asset Groups","Number of Treatment Types","Number of Stategies","Number of Budgets","Number of Targets"]

{"sheet":"Quantitative","index":2,"n_rows":61,"n_cols":32,"rows_kept":61,"cut":false,"hidden":false,"merged":[[22,1,22,29],[23,1,23,29],[27,1,27,29],[31,1,31,29],[54,1,54,31],[34,1,34,29],[39,1,39,29],[38,1,38,29],[49,1,49,31],[43,1,43,29],[44,1,44,29],[46,1,46,29],[13,1,13,29],[6,1,6,29],[3,1,5,1],[3,2,4,2],[3,5,4,5],[3,8,4,8],[3,11,4,11],[3,14,4,14],[3,17,4,17],[3,20,4,20],[3,23,4,23],[3,26,4,26],[3,29,4,29]]}
[null,null,null,null,null,null,null,null,"Discounted",null,null,"Undiscounted"]
[null,null,"Cost Basis:",null,null,"Discounted",null,null,"Undiscounted"]
[]
[null,null,"Scenario",null,null,"Scenario",null,null,"Scenario",null,null,"Scenario",null,null,"Scenario",null,null,"Scenario",null,null,"Scenario",null,null,"Scenario",null,null,"Scenario",null,null,"Scenario"]
[null,null,null,"Disc","Undisc",null,"Disc","Undisc",null,"Disc","Undisc",null,"Disc","Undisc",null,"Disc","Undisc",null,"Disc","Undisc",null,"Disc","Undisc",null,"Disc","Undisc",null,"Disc","Undisc",null,"Disc","Undisc"]
[null,null,"#1. Scenario",{"$f":"IF(SUM(D8:D11,D15:D20,D25:D27,D29:D31,D33:D34,D36:D37,D41:D42)>0, 1, 0)","v":0},{"$f":"IF(SUM(E8:E11,E15:E20,E25:E27,E29:E31,E33:E34,E36:E37,E41:E42)>0, 1, 0)","v":0},"#2. Scenario",{"$f":"IF(SUM(G8:G11,G15:G20,G25:G27,G29:G31,G33:G34,G36:G37,G41:G42)>0, 1, 0)","v":0},{"$f":"IF(SUM(H8:H11,H15:H20,H25:H27,H29:H31,H33:H34,H36:H37,H41:H42)>0, 1, 0)","v":0},"#3. Scenario",{"$f":"IF(SUM(J8:J11,J15:J20,J25:J27,J29:J31,J33:J34,J36:J37,J41:J42)>0, 1, 0)","v":0},{"$f":"IF(SUM(K8:K11,K15:K20,K25:K27,K29:K31,K33:K34,K36:K37,K41:K42)>0, 1, 0)","v":0},"#4. Scenario",{"$f":"IF(SUM(M8:M11,M15:M20,M25:M27,M29:M31,M33:M34,M36:M37,M41:M42)>0, 1, 0)","v":0},{"$f":"IF(SUM(N8:N11,N15:N20,N25:N27,N29:N31,N33:N34,N36:N37,N41:N42)>0, 1, 0)","v":0},"#5. Scenario",{"$f":"IF(SUM(P8:P11,P15:P20,P25:P27,P29:P31,P33:P34,P36:P37,P41:P42)>0, 1, 0)","v":0},{"$f":"IF(SUM(Q8:Q11,Q15:Q20,Q25:Q27,Q29:Q31,Q33:Q34,Q36:Q37,Q41:Q42)>0, 1, 0)","v":0},"#6. Scenario",{"$f":"IF(SUM(S8:S11,S15:S20,S25:S27,S29:S31,S33:S34,S36:S37,S41:S42)>0, 1, 0)","v":0},{"$f":"IF(SUM(T8:T11,T15:T20,T25:T27,T29:T31,T33:T34,T36:T37,T41:T42)>0, 1, 0)","v":0},"#7. Scenario",{"$f":"IF(SUM(V8:V11,V15:V20,V25:V27,V29:V31,V33:V34,V36:V37,V41:V42)>0, 1, 0)","v":0},{"$f":"IF(SUM(W8:W11,W15:W20,W25:W27,W29:W31,W33:W34,W36:W37,W41:W42)>0, 1, 0)","v":0},"#8. Scenario",{"$f":"IF(SUM(Y8:Y11,Y15:Y20,Y25:Y27,Y29:Y31,Y33:Y34,Y36:Y37,Y41:Y42)>0, 1, 0)","v":0},{"$f":"IF(SUM(Z8:Z11,Z15:Z20,Z25:Z27,Z29:Z31,Z33:Z34,Z36:Z37,Z41:Z42)>0, 1, 0)","v":0},"#9. Scenario",{"$f":"IF(SUM(AB8:AB11,AB15:AB20,AB25:AB27,AB29:AB31,AB33:AB34,AB36:AB37,AB41:AB42)>0, 1, 0)","v":0},{"$f":"IF(SUM(AC8:AC11,AC15:AC20,AC25:AC27,AC29:AC31,AC33:AC34,AC36:AC37,AC41:AC42)>0, 1, 0)","v":0},"#10. Scenario",{"$f":"IF(SUM(AE8:AE11,AE15:AE20,AE25:AE27,AE29:AE31,AE33:AE34,AE36:AE37,AE41:AE42)>0, 1, 0)","v":0},{"$f":"IF(SUM(AF8:AF11,AF15:AF20,AF25:AF27,AF29:AF31,AF33:AF34,AF36:AF37,AF41:AF42)>0, 1, 0)","v":0}]
[null,"Direct Costs (Outturn)"]
[null,"Carriageway Output (£k)"]
[null,"Skid (£k)"]
[null,"Lighting (£k)"]
[null,"Other (£k)"]
[null,"Total (Outturn) Direct Costs (£k)"]
[]
[null,"Direct Costs (Allocated) categorised by maintenance drivers"]
[null,"Safety (£k)"]
[null,"Accessibility (£k)"]
[null,"Condition (£k)"]
[null,"Reliability (£k)"]
[null,"Customer Service (£k)"]
[null,"Environment (£k)"]
[null,"Total Direct (Allocated) Costs (£k)"]
[]
[null,"Indirect Costs"]
[null,"Road Condition Impacts"]
[null,"VOC (£k)"]
[null,"Value of Time (£k)"]
[null,"Carbon (from fuel) (£k)"]
[null,"Road Works Impacts"]
[null,"Accidents (£k)"]
[null,"Carbon (from fuel) (£k)"]
[null,"Time (£k)"]
[null,"Accident Impacts"]
[null,"Total Number of Accidents"]
[null,"Total Accident Cost (£k)"]
[null,"Carbon Impacts (embodied)"]
[null,"Carbon Quantity (tonnes CO2e)"]
[null,"Carbon Cost (£k)"]
[]
[null,"Indirect Benefits"]
[null,"Job Impacts"]
[null,"Jobs"]
[null,"GVA (£k)"]
[]
[null,"Total Indirect Costs1"]
[null,"Excluding Carbon Impacts (Carbon Cost) and Job Impacts (GVA)"]
[null,"Total (£k)",null,6865935290.4053011,18000248605.219856,null,6813083288.3933611,17910487110.237671,null,6846875285.6125336,17957551891.023762,null,6829650851.684494,17918242269.729221,null,6785966205.923027,17786367791.359806,null,6774079002.344697,17784399704.761051,null,7044161313.7791967,18438290178.124264,null,6937131152.9137468,18217705186.459133]
[null,"Including Carbon Impacts (Carbon Cost) and Job Impacts (GVA)"]
[null,"Total (£k)",null,6831237553.0215406,17924330913.743778,null,6776413478.2676458,17832096598.919411,null,6811229204.8759689,17880593906.005657,null,6793143265.591959,17840363126.251858,null,6748101045.754158,17705902536.816643,null,6734058924.4106007,17702155762.348606,null,7016317740.2676134,18370781090.470509,null,6896805206.1069717,18129169133.042854]
[]
[null,"Economic analysis (excl. Carbon Impacts and Job Impacts)"]
[null,"Works costs change"]
[null,"Non-works costs change"]
[null,"Net Present Value2"]
[]
[null,"Economic analysis (incl. Carbon Impacts and Job Impacts)"]
[null,"Works costs change"]
[null,"Non-works costs change"]
[null,"Net Present Value2"]
[]
[null,"Notes:","1. Benefits are shown as negative costs"]
[null,null,"2. Negative NPV shows an overall increase in cost (i.e. non-works costs increase more than the change in maintenance expenditure)"]

{"sheet":"Qualitative","index":3,"n_rows":35,"n_cols":5,"rows_kept":35,"cut":false,"hidden":false,"merged":[[41,2,41,3],[10,1,10,2],[11,1,14,1],[6,1,6,2],[8,1,8,2],[36,2,36,3],[37,2,37,3],[38,2,38,3],[39,2,39,3],[40,2,40,3],[1,1,1,2],[35,0,35,5],[0,5,34,5],[0,0,34,0],[15,1,22,1],[23,1,32,1],[33,1,34,1]]}
[]
[null,"Contact:"]
[null,"Name:"]
[null,"Organisation:"]
[null,"Role:"]
[null,"Date:"]
[null,"Name of base scenario:"]
[null,"ID:","Current Budget 60yrs"]
[null,"Description of scenarios:",null,"This commentary provides qualitative discussion around Scenario 1 ('current budget'), Scenario 3 (10% increase years 1 to 10, same total spend) and Scenario 4 (20% increase years 1 to 10, same total spend). N.B. These are example comments as setup requires further refinement and calibration before conclusions can be drawn."]
[]
[null,"Impacts",null,"Summary of key impacts","Advice Notes"]
[null,"Economy","Business users & transport providers","Scenario 4 has lowest costs for value of time and condition impacts, which are borne as costs by business users and transport providers.  ","Use value of time changes to inform impact."]
[null,null,"Reliability impact on Business users","Scenario 4 causes most disruption due to road works (shown in road works impact time values) but this small compared with the value of time savings generated by improved road conditions.  Also, the increased investment overall (as reflected by the increased allocation in particular for relaibility, accessibility and customer service drivers) will result in increased investment in activities such as bridge maintenance or drainage (effects not quantified) and therefore reduce the risk of disruption due to extreme weather of unforseen structural failures.","If there is a reduction in the value of time it can be used as a proxy for an improvement in the reliability of the route."]
[null,null,"Regeneration","Regeneration is not considered applicable in terms of variation under these budget scenarios.","Only considered if within one or more regenration areas. More applicable for localised analyses rather than national."]
[null,null,"Wider Impacts","(Statements as exampled above could be made for each qualitative criteria once an analyst is satisfied the results are ready for reporting).","Use comparison of total indirect costs to inform impact."]
[null,"Environmental","Noise",null,"Any known changes in noise levels as a result of the maintenance. Splits of different treatment types could be used as a starting proxy."]
[null,null,"Air Quality",null,"Use differences in 'Carbon (from fuel)' from both road condition impacts and road works impacts"]
[null,null,"Greenhouse gases",null,"Change in carbon impacts over the analysis period."]
[null,null,"Landscape",null,"Are there differences between the networks analysed?"]
[null,null,"Townscape",null,"Are there differences between the networks analysed?"]
[null,null,"Historic Environment",null,"Are there differences between the networks analysed?"]
[null,null,"Biodiversity",null,"Relate to spend on environment driver."]
[null,null,"Water Environment",null,"Relate to spend on environment driver."]
[null,"Social ","Commuting and Other users"]
[null,null,"Reliability impact on Commuting and Other users"]
[null,null,"Physical activity"]
[null,null,"Journey quality "]
[null,null,"Accidents",null,"Changes in the number of accidents."]
[null,null,"Security",null,"Relate to spend on accessibility and customer service driver."]
[null,null,"Access to services"]
[null,null,"Affordability"]
[null,null,"Severance",null,"Relate to spend on accessibility driver."]
[null,null,"Option and non-use values",null,"Are there effects on other transport modes?"]
[null,"Public Accounts","Cost to Broad Transport Budget",null,"Changes in the total direct costs."]
[null,null,"Indirect Tax Revenues",null,"Not applicable."]

{"sheet":"Data","index":4,"n_rows":2,"n_cols":20,"rows_kept":2,"cut":false,"hidden":true,"merged":[]}
["Workbook #","Workbook Name","Module","Scheme Name","type","value title","value","units","year","(undiscounted value)",1,2,3,4,5,6,7,8,9,10]
[null,null,null,null,null,null,null,null,null,null,{"$f":"IF(AND($A2=GraphData!B$7,$C2=GraphData!$O$6,$F2=GraphData!$O$7,Quantitative!$F$2=\"Undiscounted\",LEFT($H2,1)<>\"£\"),$G2,IF(AND($A2=GraphData!B$7,$C2=GraphData!$O$6,$F2=GraphData!$O$7,Quantitative!$F$2=\"Discounted\"),$G2,IF(AND($A2=GraphData!B$7,$C2=GraphData!$O$6,$F2=GraphData!$O$7,Quantitative!$F$2=\"Undiscounted\",LEFT($H2,1)=\"£\"),$J2,0)))","v":0},{"$f":"IF(AND($A2=GraphData!C$7,$C2=GraphData!$O$6,$F2=GraphData!$O$7,Quantitative!$F$2=\"Undiscounted\",LEFT($H2,1)<>\"£\"),$G2,IF(AND($A2=GraphData!C$7,$C2=GraphData!$O$6,$F2=GraphData!$O$7,Quantitative!$F$2=\"Discounted\"),$G2,IF(AND($A2=GraphData!C$7,$C2=GraphData!$O$6,$F2=GraphData!$O$7,Quantitative!$F$2=\"Undiscounted\",LEFT($H2,1)=\"£\"),$J2,0)))","v":0},{"$f":"IF(AND($A2=GraphData!D$7,$C2=GraphData!$O$6,$F2=GraphData!$O$7,Quantitative!$F$2=\"Undiscounted\",LEFT($H2,1)<>\"£\"),$G2,IF(AND($A2=GraphData!D$7,$C2=GraphData!$O$6,$F2=GraphData!$O$7,Quantitative!$F$2=\"Discounted\"),$G2,IF(AND($A2=GraphData!D$7,$C2=GraphData!$O$6,$F2=GraphData!$O$7,Quantitative!$F$2=\"Undiscounted\",LEFT($H2,1)=\"£\"),$J2,0)))","v":0},{"$f":"IF(AND($A2=GraphData!E$7,$C2=GraphData!$O$6,$F2=GraphData!$O$7,Quantitative!$F$2=\"Undiscounted\",LEFT($H2,1)<>\"£\"),$G2,IF(AND($A2=GraphData!E$7,$C2=GraphData!$O$6,$F2=GraphData!$O$7,Quantitative!$F$2=\"Discounted\"),$G2,IF(AND($A2=GraphData!E$7,$C2=GraphData!$O$6,$F2=GraphData!$O$7,Quantitative!$F$2=\"Undiscounted\",LEFT($H2,1)=\"£\"),$J2,0)))","v":0},{"$f":"IF(AND($A2=GraphData!F$7,$C2=GraphData!$O$6,$F2=GraphData!$O$7,Quantitative!$F$2=\"Undiscounted\",LEFT($H2,1)<>\"£\"),$G2,IF(AND($A2=GraphData!F$7,$C2=GraphData!$O$6,$F2=GraphData!$O$7,Quantitative!$F$2=\"Discounted\"),$G2,IF(AND($A2=GraphData!F$7,$C2=GraphData!$O$6,$F2=GraphData!$O$7,Quantitative!$F$2=\"Undiscounted\",LEFT($H2,1)=\"£\"),$J2,0)))","v":0},{"$f":"IF(AND($A2=GraphData!G$7,$C2=GraphData!$O$6,$F2=GraphData!$O$7,Quantitative!$F$2=\"Undiscounted\",LEFT($H2,1)<>\"£\"),$G2,IF(AND($A2=GraphData!G$7,$C2=GraphData!$O$6,$F2=GraphData!$O$7,Quantitative!$F$2=\"Discounted\"),$G2,IF(AND($A2=GraphData!G$7,$C2=GraphData!$O$6,$F2=GraphData!$O$7,Quantitative!$F$2=\"Undiscounted\",LEFT($H2,1)=\"£\"),$J2,0)))","v":0},{"$f":"IF(AND($A2=GraphData!H$7,$C2=GraphData!$O$6,$F2=GraphData!$O$7,Quantitative!$F$2=\"Undiscounted\",LEFT($H2,1)<>\"£\"),$G2,IF(AND($A2=GraphData!H$7,$C2=GraphData!$O$6,$F2=GraphData!$O$7,Quantitative!$F$2=\"Discounted\"),$G2,IF(AND($A2=GraphData!H$7,$C2=GraphData!$O$6,$F2=GraphData!$O$7,Quantitative!$F$2=\"Undiscounted\",LEFT($H2,1)=\"£\"),$J2,0)))","v":0},{"$f":"IF(AND($A2=GraphData!I$7,$C2=GraphData!$O$6,$F2=GraphData!$O$7,Quantitative!$F$2=\"Undiscounted\",LEFT($H2,1)<>\"£\"),$G2,IF(AND($A2=GraphData!I$7,$C2=GraphData!$O$6,$F2=GraphData!$O$7,Quantitative!$F$2=\"Discounted\"),$G2,IF(AND($A2=GraphData!I$7,$C2=GraphData!$O$6,$F2=GraphData!$O$7,Quantitative!$F$2=\"Undiscounted\",LEFT($H2,1)=\"£\"),$J2,0)))","v":0},{"$f":"IF(AND($A2=GraphData!J$7,$C2=GraphData!$O$6,$F2=GraphData!$O$7,Quantitative!$F$2=\"Undiscounted\",LEFT($H2,1)<>\"£\"),$G2,IF(AND($A2=GraphData!J$7,$C2=GraphData!$O$6,$F2=GraphData!$O$7,Quantitative!$F$2=\"Discounted\"),$G2,IF(AND($A2=GraphData!J$7,$C2=GraphData!$O$6,$F2=GraphData!$O$7,Quantitative!$F$2=\"Undiscounted\",LEFT($H2,1)=\"£\"),$J2,0)))","v":0},{"$f":"IF(AND($A2=GraphData!K$7,$C2=GraphData!$O$6,$F2=GraphData!$O$7,Quantitative!$F$2=\"Undiscounted\",LEFT($H2,1)<>\"£\"),$G2,IF(AND($A2=GraphData!K$7,$C2=GraphData!$O$6,$F2=GraphData!$O$7,Quantitative!$F$2=\"Discounted\"),$G2,IF(AND($A2=GraphData!K$7,$C2=GraphData!$O$6,$F2=GraphData!$O$7,Quantitative!$F$2=\"Undiscounted\",LEFT($H2,1)=\"£\"),$J2,0)))","v":0}]

{"sheet":"Graph","index":5,"n_rows":17,"n_cols":14,"rows_kept":17,"cut":false,"hidden":false,"merged":[]}
[]
[null,null,null,null,null,null,null,null,null,null,null,null,null,"Cost Basis: Discounted"]
[]
[]
[]
[]
[]
[null,null,null,null,null,null,null,null,null,null,null,null,null,{"$f":"GraphData!B8","v":" 1."}]
[null,null,null,null,null,null,null,null,null,null,null,null,null,{"$f":"GraphData!C8","v":" 2."}]
[null,null,null,null,null,null,null,null,null,null,null,null,null,{"$f":"GraphData!D8","v":" 3."}]
[null,null,null,null,null,null,null,null,null,null,null,null,null,{"$f":"GraphData!E8","v":" 4."}]
[null,null,null,null,null,null,null,null,null,null,null,null,null,{"$f":"GraphData!F8","v":" 5."}]
[null,null,null,null,null,null,null,null,null,null,null,null,null,{"$f":"GraphData!G8","v":" 6."}]
[null,null,null,null,null,null,null,null,null,null,null,null,null,{"$f":"GraphData!H8","v":" 7."}]
[null,null,null,null,null,null,null,null,null,null,null,null,null,{"$f":"GraphData!I8","v":" 8."}]
[null,null,null,null,null,null,null,null,null,null,null,null,null,{"$f":"GraphData!J8","v":" 9."}]
[null,null,null,null,null,null,null,null,null,null,null,null,null,{"$f":"GraphData!K8","v":"10."}]

{"sheet":"Error Report","index":6,"n_rows":1,"n_cols":6,"rows_kept":1,"cut":false,"hidden":false,"merged":[]}
["Workbook","Module","Location","Scheme","Error","Reason"]

{"sheet":"GraphData","index":7,"n_rows":359,"n_cols":27,"rows_kept":359,"cut":false,"hidden":true,"merged":[[16,20,16,27]]}
[null,null,null,null,null,null,null,null,null,null,null,null,null,"1st Selection",6,"Count","Yaxis count"]
["Min",{"$f":"MIN(Data!I:I)","v":0},null,null,null,null,null,null,null,null,null,null,null,"2nd Selection",1,{"$f":"COUNTA(O11:O18)-COUNTIF(O11:O18,\"\")","v":3},{"$f":"COUNTA(P11:P18)-COUNTIF(P11:P18,\"\")","v":3}]
["Max",{"$f":"MAX(Data!I:I)","v":0},null,null,null,null,null,null,null,null,null,null,null,"1st title",{"$f":"INDEX(N11:N18,O1)","v":"Budgets"}]
[null,{"$f":"SUMIFS(Data!$G:$G,Data!$A:$A,B$7,Data!$C:$C,$O$6,Data!$F:$F,$O$7,Data!$I:$I,$A10)","v":0},null,null,null,null,null,null,null,null,null,null,null,"2nd Title",{"$f":"INDEX(O11:O18,O2)","v":"Carriageway output "}]
[null,{"$f":"SUMPRODUCT((Data!$A:$A=B$7)*(Data!$C:$C=$O$6)*(Data!$F:$F=$O$7)*(Data!$I:$I=$A10)*(Data!$G:$G))","v":{"$error":"#VALUE!"}},{"$f":"SUM(IF(Data!$A:$A=B$7,IF(Data!$C:$C=$O$6,IF(Data!$F:$F=$O$7,IF(Data!$I:$I=$A10,Data!$G:$G,0)))))","v":0},null,null,null,null,null,null,null,null,null,null,"Selection in lookup table",{"$f":"INDEX(T35:V64,MATCH(1,(U35:U64=O3)*(V35:V64=O4),0),1)","v":20},"<- array formula"]
[null,true,true,true,true,true,true,true,true,true,true,null,null,"Module",{"$f":"INDEX(W35:W64,O5)","v":"Expenditure by Treatment"}]
[null,1,2,3,4,5,6,7,8,9,10,null,null,"value title",{"$f":"INDEX(X35:X64,O5)","v":"Treatment Costs"},null,null,null,null,null,"Job Impacts","Accident Analysis","Road Works","Road condition","Carbon","Budgets","Drivers"]
[null,{"$f":"IF(B7<10,\" \",\"\") & B7 & \".\" & IFERROR(VLOOKUP(B7,Data!$A:$I,4,FALSE),\"\")","v":" 1."},{"$f":"IF(C7<10,\" \",\"\") & C7 & \".\" & IFERROR(VLOOKUP(C7,Data!$A:$I,4,FALSE),\"\")","v":" 2."},{"$f":"IF(D7<10,\" \",\"\") & D7 & \".\" & IFERROR(VLOOKUP(D7,Data!$A:$I,4,FALSE),\"\")","v":" 3."},{"$f":"IF(E7<10,\" \",\"\") & E7 & \".\" & IFERROR(VLOOKUP(E7,Data!$A:$I,4,FALSE),\"\")","v":" 4."},{"$f":"IF(F7<10,\" \",\"\") & F7 & \".\" & IFERROR(VLOOKUP(F7,Data!$A:$I,4,FALSE),\"\")","v":" 5."},{"$f":"IF(G7<10,\" \",\"\") & G7 & \".\" & IFERROR(VLOOKUP(G7,Data!$A:$I,4,FALSE),\"\")","v":" 6."},{"$f":"IF(H7<10,\" \",\"\") & H7 & \".\" & IFERROR(VLOOKUP(H7,Data!$A:$I,4,FALSE),\"\")","v":" 7."},{"$f":"IF(I7<10,\" \",\"\") & I7 & \".\" & IFERROR(VLOOKUP(I7,Data!$A:$I,4,FALSE),\"\")","v":" 8."},{"$f":"IF(J7<10,\" \",\"\") & J7 & \".\" & IFERROR(VLOOKUP(J7,Data!$A:$I,4,FALSE),\"\")","v":" 9."},{"$f":"IF(K7<10,\" \",\"\") & K7 & \".\" & IFERROR(VLOOKUP(K7,Data!$A:$I,4,FALSE),\"\")","v":"10."},null,null,"Yaxis",{"$f":"INDEX(P11:P18,O2)","v":"£"},null,null,null,null,null,"Jobs","Accident Count","Accidents","VOC","Quantity","Carriageway output ","Safety"]
["Year",null,null,null,null,null,null,null,null,null,null,null,null,null,null,null,null,null,null,null,"GVA","Total Accident costs","Time","Value of Time","Cost","Lighting","Accessibility"]
[{"$f":"MIN(Data!I:I)","v":0},{"$f":"IF(B$6,IF(SUMIF(Data!$I:$I,$A10,Data!K:K)=0,#N/A,SUMIF(Data!$I:$I,$A10,Data!K:K)),#N/A)","v":{"$error":"#N/A"}},{"$f":"IF(C$6,IF(SUMIF(Data!$I:$I,$A10,Data!L:L)=0,#N/A,SUMIF(Data!$I:$I,$A10,Data!L:L)),#N/A)","v":{"$error":"#N/A"}},{"$f":"IF(D$6,IF(SUMIF(Data!$I:$I,$A10,Data!M:M)=0,#N/A,SUMIF(Data!$I:$I,$A10,Data!M:M)),#N/A)","v":{"$error":"#N/A"}},{"$f":"IF(E$6,IF(SUMIF(Data!$I:$I,$A10,Data!N:N)=0,#N/A,SUMIF(Data!$I:$I,$A10,Data!N:N)),#N/A)","v":{"$error":"#N/A"}},{"$f":"IF(F$6,IF(SUMIF(Data!$I:$I,$A10,Data!O:O)=0,#N/A,SUMIF(Data!$I:$I,$A10,Data!O:O)),#N/A)","v":{"$error":"#N/A"}},{"$f":"IF(G$6,IF(SUMIF(Data!$I:$I,$A10,Data!P:P)=0,#N/A,SUMIF(Data!$I:$I,$A10,Data!P:P)),#N/A)","v":{"$error":"#N/A"}},{"$f":"IF(H$6,IF(SUMIF(Data!$I:$I,$A10,Data!Q:Q)=0,#N/A,SUMIF(Data!$I:$I,$A10,Data!Q:Q)),#N/A)","v":{"$error":"#N/A"}},{"$f":"IF(I$6,IF(SUMIF(Data!$I:$I,$A10,Data!R:R)=0,#N/A,SUMIF(Data!$I:$I,$A10,Data!R:R)),#N/A)","v":{"$error":"#N/A"}},{"$f":"IF(J$6,IF(SUMIF(Data!$I:$I,$A10,Data!S:S)=0,#N/A,SUMIF(Data!$I:$I,$A10,Data!S:S)),#N/A)","v":{"$error":"#N/A"}},{"$f":"IF(K$6,IF(SUMIF(Data!$I:$I,$A10,Data!T:T)=0,#N/A,SUMIF(Data!$I:$I,$A10,Data!T:T)),#N/A)","v":{"$error":"#N/A"}},null,null,"1st Selection","2nd Selection","Yaxis","Module","Value title",null,null,null,null,"Carbon (from fuel)","Carbon (from fuel)",null,"Skid","Condition"]
[{"$f":"IF(A10+1<$B$3,A10+1,#N/A)","v":{"$error":"#N/A"}},{"$f":"IF(B$6,IF(SUMIF(Data!$I:$I,$A11,Data!K:K)=0,#N/A,SUMIF(Data!$I:$I,$A11,Data!K:K)),#N/A)","v":{"$error":"#N/A"}},{"$f":"IF(C$6,IF(SUMIF(Data!$I:$I,$A11,Data!L:L)=0,#N/A,SUMIF(Data!$I:$I,$A11,Data!L:L)),#N/A)","v":{"$error":"#N/A"}},{"$f":"IF(D$6,IF(SUMIF(Data!$I:$I,$A11,Data!M:M)=0,#N/A,SUMIF(Data!$I:$I,$A11,Data!M:M)),#N/A)","v":{"$error":"#N/A"}},{"$f":"IF(E$6,IF(SUMIF(Data!$I:$I,$A11,Data!N:N)=0,#N/A,SUMIF(Data!$I:$I,$A11,Data!N:N)),#N/A)","v":{"$error":"#N/A"}},{"$f":"IF(F$6,IF(SUMIF(Data!$I:$I,$A11,Data!O:O)=0,#N/A,SUMIF(Data!$I:$I,$A11,Data!O:O)),#N/A)","v":{"$error":"#N/A"}},{"$f":"IF(G$6,IF(SUMIF(Data!$I:$I,$A11,Data!P:P)=0,#N/A,SUMIF(Data!$I:$I,$A11,Data!P:P)),#N/A)","v":{"$error":"#N/A"}},{"$f":"IF(H$6,IF(SUMIF(Data!$I:$I,$A11,Data!Q:Q)=0,#N/A,SUMIF(Data!$I:$I,$A11,Data!Q:Q)),#N/A)","v":{"$error":"#N/A"}},{"$f":"IF(I$6,IF(SUMIF(Data!$I:$I,$A11,Data!R:R)=0,#N/A,SUMIF(Data!$I:$I,$A11,Data!R:R)),#N/A)","v":{"$error":"#N/A"}},{"$f":"IF(J$6,IF(SUMIF(Data!$I:$I,$A11,Data!S:S)=0,#N/A,SUMIF(Data!$I:$I,$A11,Data!S:S)),#N/A)","v":{"$error":"#N/A"}},{"$f":"IF(K$6,IF(SUMIF(Data!$I:$I,$A11,Data!T:T)=0,#N/A,SUMIF(Data!$I:$I,$A11,Data!T:T)),#N/A)","v":{"$error":"#N/A"}},null,1,"Job Impacts",{"$f":"IF(AND($O$2>$Q$2,M11>$Q$2,M11<=$O$2),\"Please reselect\",IF(OFFSET(T8,0,$O$1)=\"\",\"\",OFFSET(T8,0,$O$1)))","v":"Carriageway output "},{"$f":"IF(OFFSET(T19,0,$O$1)=\"\",\"\",OFFSET(T19,0,$O$1))","v":"£"},"Job Impacts Module",null,null,null,null,null,null,null,null,null,"Reliability"]
[{"$error":"#N/A"},{"$f":"IF(B$6,IF(SUMIF(Data!$I:$I,$A12,Data!K:K)=0,#N/A,SUMIF(Data!$I:$I,$A12,Data!K:K)),#N/A)","v":{"$error":"#N/A"}},{"$f":"IF(C$6,IF(SUMIF(Data!$I:$I,$A12,Data!L:L)=0,#N/A,SUMIF(Data!$I:$I,$A12,Data!L:L)),#N/A)","v":{"$error":"#N/A"}},{"$f":"IF(D$6,IF(SUMIF(Data!$I:$I,$A12,Data!M:M)=0,#N/A,SUMIF(Data!$I:$I,$A12,Data!M:M)),#N/A)","v":{"$error":"#N/A"}},{"$f":"IF(E$6,IF(SUMIF(Data!$I:$I,$A12,Data!N:N)=0,#N/A,SUMIF(Data!$I:$I,$A12,Data!N:N)),#N/A)","v":{"$error":"#N/A"}},{"$f":"IF(F$6,IF(SUMIF(Data!$I:$I,$A12,Data!O:O)=0,#N/A,SUMIF(Data!$I:$I,$A12,Data!O:O)),#N/A)","v":{"$error":"#N/A"}},{"$f":"IF(G$6,IF(SUMIF(Data!$I:$I,$A12,Data!P:P)=0,#N/A,SUMIF(Data!$I:$I,$A12,Data!P:P)),#N/A)","v":{"$error":"#N/A"}},{"$f":"IF(H$6,IF(SUMIF(Data!$I:$I,$A12,Data!Q:Q)=0,#N/A,SUMIF(Data!$I:$I,$A12,Data!Q:Q)),#N/A)","v":{"$error":"#N/A"}},{"$f":"IF(I$6,IF(SUMIF(Data!$I:$I,$A12,Data!R:R)=0,#N/A,SUMIF(Data!$I:$I,$A12,Data!R:R)),#N/A)","v":{"$error":"#N/A"}},{"$f":"IF(J$6,IF(SUMIF(Data!$I:$I,$A12,Data!S:S)=0,#N/A,SUMIF(Data!$I:$I,$A12,Data!S:S)),#N/A)","v":{"$error":"#N/A"}},{"$f":"IF(K$6,IF(SUMIF(Data!$I:$I,$A12,Data!T:T)=0,#N/A,SUMIF(Data!$I:$I,$A12,Data!T:T)),#N/A)","v":{"$error":"#N/A"}},null,2,"Accident Analysis",{"$f":"IF(AND($O$2>$Q$2,M12>$Q$2,M12<=$O$2),\"Please reselect\",IF(OFFSET(T9,0,$O$1)=\"\",\"\",OFFSET(T9,0,$O$1)))","v":"Lighting"},{"$f":"IF(OFFSET(T20,0,$O$1)=\"\",\"\",OFFSET(T20,0,$O$1))","v":"£k"},"Accident Analysis Module",null,null,null,null,null,null,null,null,null,"Customer Service"]
[{"$error":"#N/A"},{"$f":"IF(B$6,IF(SUMIF(Data!$I:$I,$A13,Data!K:K)=0,#N/A,SUMIF(Data!$I:$I,$A13,Data!K:K)),#N/A)","v":{"$error":"#N/A"}},{"$f":"IF(C$6,IF(SUMIF(Data!$I:$I,$A13,Data!L:L)=0,#N/A,SUMIF(Data!$I:$I,$A13,Data!L:L)),#N/A)","v":{"$error":"#N/A"}},{"$f":"IF(D$6,IF(SUMIF(Data!$I:$I,$A13,Data!M:M)=0,#N/A,SUMIF(Data!$I:$I,$A13,Data!M:M)),#N/A)","v":{"$error":"#N/A"}},{"$f":"IF(E$6,IF(SUMIF(Data!$I:$I,$A13,Data!N:N)=0,#N/A,SUMIF(Data!$I:$I,$A13,Data!N:N)),#N/A)","v":{"$error":"#N/A"}},{"$f":"IF(F$6,IF(SUMIF(Data!$I:$I,$A13,Data!O:O)=0,#N/A,SUMIF(Data!$I:$I,$A13,Data!O:O)),#N/A)","v":{"$error":"#N/A"}},{"$f":"IF(G$6,IF(SUMIF(Data!$I:$I,$A13,Data!P:P)=0,#N/A,SUMIF(Data!$I:$I,$A13,Data!P:P)),#N/A)","v":{"$error":"#N/A"}},{"$f":"IF(H$6,IF(SUMIF(Data!$I:$I,$A13,Data!Q:Q)=0,#N/A,SUMIF(Data!$I:$I,$A13,Data!Q:Q)),#N/A)","v":{"$error":"#N/A"}},{"$f":"IF(I$6,IF(SUMIF(Data!$I:$I,$A13,Data!R:R)=0,#N/A,SUMIF(Data!$I:$I,$A13,Data!R:R)),#N/A)","v":{"$error":"#N/A"}},{"$f":"IF(J$6,IF(SUMIF(Data!$I:$I,$A13,Data!S:S)=0,#N/A,SUMIF(Data!$I:$I,$A13,Data!S:S)),#N/A)","v":{"$error":"#N/A"}},{"$f":"IF(K$6,IF(SUMIF(Data!$I:$I,$A13,Data!T:T)=0,#N/A,SUMIF(Data!$I:$I,$A13,Data!T:T)),#N/A)","v":{"$error":"#N/A"}},null,3,"Road Works",{"$f":"IF(AND($O$2>$Q$2,M13>$Q$2,M13<=$O$2),\"Please reselect\",IF(OFFSET(T10,0,$O$1)=\"\",\"\",OFFSET(T10,0,$O$1)))","v":"Skid"},"£k","Road Works Impacts Accidents",null,null,null,null,null,null,null,null,null,"Environment"]
[{"$error":"#N/A"},{"$f":"IF(B$6,IF(SUMIF(Data!$I:$I,$A14,Data!K:K)=0,#N/A,SUMIF(Data!$I:$I,$A14,Data!K:K)),#N/A)","v":{"$error":"#N/A"}},{"$f":"IF(C$6,IF(SUMIF(Data!$I:$I,$A14,Data!L:L)=0,#N/A,SUMIF(Data!$I:$I,$A14,Data!L:L)),#N/A)","v":{"$error":"#N/A"}},{"$f":"IF(D$6,IF(SUMIF(Data!$I:$I,$A14,Data!M:M)=0,#N/A,SUMIF(Data!$I:$I,$A14,Data!M:M)),#N/A)","v":{"$error":"#N/A"}},{"$f":"IF(E$6,IF(SUMIF(Data!$I:$I,$A14,Data!N:N)=0,#N/A,SUMIF(Data!$I:$I,$A14,Data!N:N)),#N/A)","v":{"$error":"#N/A"}},{"$f":"IF(F$6,IF(SUMIF(Data!$I:$I,$A14,Data!O:O)=0,#N/A,SUMIF(Data!$I:$I,$A14,Data!O:O)),#N/A)","v":{"$error":"#N/A"}},{"$f":"IF(G$6,IF(SUMIF(Data!$I:$I,$A14,Data!P:P)=0,#N/A,SUMIF(Data!$I:$I,$A14,Data!P:P)),#N/A)","v":{"$error":"#N/A"}},{"$f":"IF(H$6,IF(SUMIF(Data!$I:$I,$A14,Data!Q:Q)=0,#N/A,SUMIF(Data!$I:$I,$A14,Data!Q:Q)),#N/A)","v":{"$error":"#N/A"}},{"$f":"IF(I$6,IF(SUMIF(Data!$I:$I,$A14,Data!R:R)=0,#N/A,SUMIF(Data!$I:$I,$A14,Data!R:R)),#N/A)","v":{"$error":"#N/A"}},{"$f":"IF(J$6,IF(SUMIF(Data!$I:$I,$A14,Data!S:S)=0,#N/A,SUMIF(Data!$I:$I,$A14,Data!S:S)),#N/A)","v":{"$error":"#N/A"}},{"$f":"IF(K$6,IF(SUMIF(Data!$I:$I,$A14,Data!T:T)=0,#N/A,SUMIF(Data!$I:$I,$A14,Data!T:T)),#N/A)","v":{"$error":"#N/A"}},null,4,"Road condition",{"$f":"IF(AND($O$2>$Q$2,M14>$Q$2,M14<=$O$2),\"Please reselect\",IF(OFFSET(T11,0,$O$1)=\"\",\"\",OFFSET(T11,0,$O$1)))","v":""},"","Road Works Impacts Time"]
[{"$error":"#N/A"},{"$f":"IF(B$6,IF(SUMIF(Data!$I:$I,$A15,Data!K:K)=0,#N/A,SUMIF(Data!$I:$I,$A15,Data!K:K)),#N/A)","v":{"$error":"#N/A"}},{"$f":"IF(C$6,IF(SUMIF(Data!$I:$I,$A15,Data!L:L)=0,#N/A,SUMIF(Data!$I:$I,$A15,Data!L:L)),#N/A)","v":{"$error":"#N/A"}},{"$f":"IF(D$6,IF(SUMIF(Data!$I:$I,$A15,Data!M:M)=0,#N/A,SUMIF(Data!$I:$I,$A15,Data!M:M)),#N/A)","v":{"$error":"#N/A"}},{"$f":"IF(E$6,IF(SUMIF(Data!$I:$I,$A15,Data!N:N)=0,#N/A,SUMIF(Data!$I:$I,$A15,Data!N:N)),#N/A)","v":{"$error":"#N/A"}},{"$f":"IF(F$6,IF(SUMIF(Data!$I:$I,$A15,Data!O:O)=0,#N/A,SUMIF(Data!$I:$I,$A15,Data!O:O)),#N/A)","v":{"$error":"#N/A"}},{"$f":"IF(G$6,IF(SUMIF(Data!$I:$I,$A15,Data!P:P)=0,#N/A,SUMIF(Data!$I:$I,$A15,Data!P:P)),#N/A)","v":{"$error":"#N/A"}},{"$f":"IF(H$6,IF(SUMIF(Data!$I:$I,$A15,Data!Q:Q)=0,#N/A,SUMIF(Data!$I:$I,$A15,Data!Q:Q)),#N/A)","v":{"$error":"#N/A"}},{"$f":"IF(I$6,IF(SUMIF(Data!$I:$I,$A15,Data!R:R)=0,#N/A,SUMIF(Data!$I:$I,$A15,Data!R:R)),#N/A)","v":{"$error":"#N/A"}},{"$f":"IF(J$6,IF(SUMIF(Data!$I:$I,$A15,Data!S:S)=0,#N/A,SUMIF(Data!$I:$I,$A15,Data!S:S)),#N/A)","v":{"$error":"#N/A"}},{"$f":"IF(K$6,IF(SUMIF(Data!$I:$I,$A15,Data!T:T)=0,#N/A,SUMIF(Data!$I:$I,$A15,Data!T:T)),#N/A)","v":{"$error":"#N/A"}},null,5,"Carbon",{"$f":"IF(AND($O$2>$Q$2,M15>$Q$2,M15<=$O$2),\"Please reselect\",IF(OFFSET(T12,0,$O$1)=\"\",\"\",OFFSET(T12,0,$O$1)))","v":""},"","Carbon Quantity"]
[{"$error":"#N/A"},{"$f":"IF(B$6,IF(SUMIF(Data!$I:$I,$A16,Data!K:K)=0,#N/A,SUMIF(Data!$I:$I,$A16,Data!K:K)),#N/A)","v":{"$error":"#N/A"}},{"$f":"IF(C$6,IF(SUMIF(Data!$I:$I,$A16,Data!L:L)=0,#N/A,SUMIF(Data!$I:$I,$A16,Data!L:L)),#N/A)","v":{"$error":"#N/A"}},{"$f":"IF(D$6,IF(SUMIF(Data!$I:$I,$A16,Data!M:M)=0,#N/A,SUMIF(Data!$I:$I,$A16,Data!M:M)),#N/A)","v":{"$error":"#N/A"}},{"$f":"IF(E$6,IF(SUMIF(Data!$I:$I,$A16,Data!N:N)=0,#N/A,SUMIF(Data!$I:$I,$A16,Data!N:N)),#N/A)","v":{"$error":"#N/A"}},{"$f":"IF(F$6,IF(SUMIF(Data!$I:$I,$A16,Data!O:O)=0,#N/A,SUMIF(Data!$I:$I,$A16,Data!O:O)),#N/A)","v":{"$error":"#N/A"}},{"$f":"IF(G$6,IF(SUMIF(Data!$I:$I,$A16,Data!P:P)=0,#N/A,SUMIF(Data!$I:$I,$A16,Data!P:P)),#N/A)","v":{"$error":"#N/A"}},{"$f":"IF(H$6,IF(SUMIF(Data!$I:$I,$A16,Data!Q:Q)=0,#N/A,SUMIF(Data!$I:$I,$A16,Data!Q:Q)),#N/A)","v":{"$error":"#N/A"}},{"$f":"IF(I$6,IF(SUMIF(Data!$I:$I,$A16,Data!R:R)=0,#N/A,SUMIF(Data!$I:$I,$A16,Data!R:R)),#N/A)","v":{"$error":"#N/A"}},{"$f":"IF(J$6,IF(SUMIF(Data!$I:$I,$A16,Data!S:S)=0,#N/A,SUMIF(Data!$I:$I,$A16,Data!S:S)),#N/A)","v":{"$error":"#N/A"}},{"$f":"IF(K$6,IF(SUMIF(Data!$I:$I,$A16,Data!T:T)=0,#N/A,SUMIF(Data!$I:$I,$A16,Data!T:T)),#N/A)","v":{"$error":"#N/A"}},null,6,"Budgets",{"$f":"IF(AND($O$2>$Q$2,M16>$Q$2,M16<=$O$2),\"Please reselect\",IF(OFFSET(T13,0,$O$1)=\"\",\"\",OFFSET(T13,0,$O$1)))","v":""},"","Road Condition Impacts"]
[{"$error":"#N/A"},{"$f":"IF(B$6,IF(SUMIF(Data!$I:$I,$A17,Data!K:K)=0,#N/A,SUMIF(Data!$I:$I,$A17,Data!K:K)),#N/A)","v":{"$error":"#N/A"}},{"$f":"IF(C$6,IF(SUMIF(Data!$I:$I,$A17,Data!L:L)=0,#N/A,SUMIF(Data!$I:$I,$A17,Data!L:L)),#N/A)","v":{"$error":"#N/A"}},{"$f":"IF(D$6,IF(SUMIF(Data!$I:$I,$A17,Data!M:M)=0,#N/A,SUMIF(Data!$I:$I,$A17,Data!M:M)),#N/A)","v":{"$error":"#N/A"}},{"$f":"IF(E$6,IF(SUMIF(Data!$I:$I,$A17,Data!N:N)=0,#N/A,SUMIF(Data!$I:$I,$A17,Data!N:N)),#N/A)","v":{"$error":"#N/A"}},{"$f":"IF(F$6,IF(SUMIF(Data!$I:$I,$A17,Data!O:O)=0,#N/A,SUMIF(Data!$I:$I,$A17,Data!O:O)),#N/A)","v":{"$error":"#N/A"}},{"$f":"IF(G$6,IF(SUMIF(Data!$I:$I,$A17,Data!P:P)=0,#N/A,SUMIF(Data!$I:$I,$A17,Data!P:P)),#N/A)","v":{"$error":"#N/A"}},{"$f":"IF(H$6,IF(SUMIF(Data!$I:$I,$A17,Data!Q:Q)=0,#N/A,SUMIF(Data!$I:$I,$A17,Data!Q:Q)),#N/A)","v":{"$error":"#N/A"}},{"$f":"IF(I$6,IF(SUMIF(Data!$I:$I,$A17,Data!R:R)=0,#N/A,SUMIF(Data!$I:$I,$A17,Data!R:R)),#N/A)","v":{"$error":"#N/A"}},{"$f":"IF(J$6,IF(SUMIF(Data!$I:$I,$A17,Data!S:S)=0,#N/A,SUMIF(Data!$I:$I,$A17,Data!S:S)),#N/A)","v":{"$error":"#N/A"}},{"$f":"IF(K$6,IF(SUMIF(Data!$I:$I,$A17,Data!T:T)=0,#N/A,SUMIF(Data!$I:$I,$A17,Data!T:T)),#N/A)","v":{"$error":"#N/A"}},null,7,"Drivers","","",null,null,null,null,"Y axis"]
[{"$error":"#N/A"},{"$f":"IF(B$6,IF(SUMIF(Data!$I:$I,$A18,Data!K:K)=0,#N/A,SUMIF(Data!$I:$I,$A18,Data!K:K)),#N/A)","v":{"$error":"#N/A"}},{"$f":"IF(C$6,IF(SUMIF(Data!$I:$I,$A18,Data!L:L)=0,#N/A,SUMIF(Data!$I:$I,$A18,Data!L:L)),#N/A)","v":{"$error":"#N/A"}},{"$f":"IF(D$6,IF(SUMIF(Data!$I:$I,$A18,Data!M:M)=0,#N/A,SUMIF(Data!$I:$I,$A18,Data!M:M)),#N/A)","v":{"$error":"#N/A"}},{"$f":"IF(E$6,IF(SUMIF(Data!$I:$I,$A18,Data!N:N)=0,#N/A,SUMIF(Data!$I:$I,$A18,Data!N:N)),#N/A)","v":{"$error":"#N/A"}},{"$f":"IF(F$6,IF(SUMIF(Data!$I:$I,$A18,Data!O:O)=0,#N/A,SUMIF(Data!$I:$I,$A18,Data!O:O)),#N/A)","v":{"$error":"#N/A"}},{"$f":"IF(G$6,IF(SUMIF(Data!$I:$I,$A18,Data!P:P)=0,#N/A,SUMIF(Data!$I:$I,$A18,Data!P:P)),#N/A)","v":{"$error":"#N/A"}},{"$f":"IF(H$6,IF(SUMIF(Data!$I:$I,$A18,Data!Q:Q)=0,#N/A,SUMIF(Data!$I:$I,$A18,Data!Q:Q)),#N/A)","v":{"$error":"#N/A"}},{"$f":"IF(I$6,IF(SUMIF(Data!$I:$I,$A18,Data!R:R)=0,#N/A,SUMIF(Data!$I:$I,$A18,Data!R:R)),#N/A)","v":{"$error":"#N/A"}},{"$f":"IF(J$6,IF(SUMIF(Data!$I:$I,$A18,Data!S:S)=0,#N/A,SUMIF(Data!$I:$I,$A18,Data!S:S)),#N/A)","v":{"$error":"#N/A"}},{"$f":"IF(K$6,IF(SUMIF(Data!$I:$I,$A18,Data!T:T)=0,#N/A,SUMIF(Data!$I:$I,$A18,Data!T:T)),#N/A)","v":{"$error":"#N/A"}},null,8,null,"","",null,null,null,null,"Job Impacts","Accident Analysis","Road Works","Road condition","Carbon","Budgets","Drivers"]
[{"$error":"#N/A"},{"$f":"IF(B$6,IF(SUMIF(Data!$I:$I,$A19,Data!K:K)=0,#N/A,SUMIF(Data!$I:$I,$A19,Data!K:K)),#N/A)","v":{"$error":"#N/A"}},{"$f":"IF(C$6,IF(SUMIF(Data!$I:$I,$A19,Data!L:L)=0,#N/A,SUMIF(Data!$I:$I,$A19,Data!L:L)),#N/A)","v":{"$error":"#N/A"}},{"$f":"IF(D$6,IF(SUMIF(Data!$I:$I,$A19,Data!M:M)=0,#N/A,SUMIF(Data!$I:$I,$A19,Data!M:M)),#N/A)","v":{"$error":"#N/A"}},{"$f":"IF(E$6,IF(SUMIF(Data!$I:$I,$A19,Data!N:N)=0,#N/A,SUMIF(Data!$I:$I,$A19,Data!N:N)),#N/A)","v":{"$error":"#N/A"}},{"$f":"IF(F$6,IF(SUMIF(Data!$I:$I,$A19,Data!O:O)=0,#N/A,SUMIF(Data!$I:$I,$A19,Data!O:O)),#N/A)","v":{"$error":"#N/A"}},{"$f":"IF(G$6,IF(SUMIF(Data!$I:$I,$A19,Data!P:P)=0,#N/A,SUMIF(Data!$I:$I,$A19,Data!P:P)),#N/A)","v":{"$error":"#N/A"}},{"$f":"IF(H$6,IF(SUMIF(Data!$I:$I,$A19,Data!Q:Q)=0,#N/A,SUMIF(Data!$I:$I,$A19,Data!Q:Q)),#N/A)","v":{"$error":"#N/A"}},{"$f":"IF(I$6,IF(SUMIF(Data!$I:$I,$A19,Data!R:R)=0,#N/A,SUMIF(Data!$I:$I,$A19,Data!R:R)),#N/A)","v":{"$error":"#N/A"}},{"$f":"IF(J$6,IF(SUMIF(Data!$I:$I,$A19,Data!S:S)=0,#N/A,SUMIF(Data!$I:$I,$A19,Data!S:S)),#N/A)","v":{"$error":"#N/A"}},{"$f":"IF(K$6,IF(SUMIF(Data!$I:$I,$A19,Data!T:T)=0,#N/A,SUMIF(Data!$I:$I,$A19,Data!T:T)),#N/A)","v":{"$error":"#N/A"}},null,null,null,null,null,null,null,null,null,"Unit","unit","£k","£k","kg CO2e","£","£k"]
[{"$error":"#N/A"},{"$f":"IF(B$6,IF(SUMIF(Data!$I:$I,$A20,Data!K:K)=0,#N/A,SUMIF(Data!$I:$I,$A20,Data!K:K)),#N/A)","v":{"$error":"#N/A"}},{"$f":"IF(C$6,IF(SUMIF(Data!$I:$I,$A20,Data!L:L)=0,#N/A,SUMIF(Data!$I:$I,$A20,Data!L:L)),#N/A)","v":{"$error":"#N/A"}},{"$f":"IF(D$6,IF(SUMIF(Data!$I:$I,$A20,Data!M:M)=0,#N/A,SUMIF(Data!$I:$I,$A20,Data!M:M)),#N/A)","v":{"$error":"#N/A"}},{"$f":"IF(E$6,IF(SUMIF(Data!$I:$I,$A20,Data!N:N)=0,#N/A,SUMIF(Data!$I:$I,$A20,Data!N:N)),#N/A)","v":{"$error":"#N/A"}},{"$f":"IF(F$6,IF(SUMIF(Data!$I:$I,$A20,Data!O:O)=0,#N/A,SUMIF(Data!$I:$I,$A20,Data!O:O)),#N/A)","v":{"$error":"#N/A"}},{"$f":"IF(G$6,IF(SUMIF(Data!$I:$I,$A20,Data!P:P)=0,#N/A,SUMIF(Data!$I:$I,$A20,Data!P:P)),#N/A)","v":{"$error":"#N/A"}},{"$f":"IF(H$6,IF(SUMIF(Data!$I:$I,$A20,Data!Q:Q)=0,#N/A,SUMIF(Data!$I:$I,$A20,Data!Q:Q)),#N/A)","v":{"$error":"#N/A"}},{"$f":"IF(I$6,IF(SUMIF(Data!$I:$I,$A20,Data!R:R)=0,#N/A,SUMIF(Data!$I:$I,$A20,Data!R:R)),#N/A)","v":{"$error":"#N/A"}},{"$f":"IF(J$6,IF(SUMIF(Data!$I:$I,$A20,Data!S:S)=0,#N/A,SUMIF(Data!$I:$I,$A20,Data!S:S)),#N/A)","v":{"$error":"#N/A"}},{"$f":"IF(K$6,IF(SUMIF(Data!$I:$I,$A20,Data!T:T)=0,#N/A,SUMIF(Data!$I:$I,$A20,Data!T:T)),#N/A)","v":{"$error":"#N/A"}},null,null,null,null,null,null,null,null,null,"£k","£ k","£k","£k","£k","£k","£k"]
[{"$error":"#N/A"},{"$f":"IF(B$6,IF(SUMIF(Data!$I:$I,$A21,Data!K:K)=0,#N/A,SUMIF(Data!$I:$I,$A21,Data!K:K)),#N/A)","v":{"$error":"#N/A"}},{"$f":"IF(C$6,IF(SUMIF(Data!$I:$I,$A21,Data!L:L)=0,#N/A,SUMIF(Data!$I:$I,$A21,Data!L:L)),#N/A)","v":{"$error":"#N/A"}},{"$f":"IF(D$6,IF(SUMIF(Data!$I:$I,$A21,Data!M:M)=0,#N/A,SUMIF(Data!$I:$I,$A21,Data!M:M)),#N/A)","v":{"$error":"#N/A"}},{"$f":"IF(E$6,IF(SUMIF(Data!$I:$I,$A21,Data!N:N)=0,#N/A,SUMIF(Data!$I:$I,$A21,Data!N:N)),#N/A)","v":{"$error":"#N/A"}},{"$f":"IF(F$6,IF(SUMIF(Data!$I:$I,$A21,Data!O:O)=0,#N/A,SUMIF(Data!$I:$I,$A21,Data!O:O)),#N/A)","v":{"$error":"#N/A"}},{"$f":"IF(G$6,IF(SUMIF(Data!$I:$I,$A21,Data!P:P)=0,#N/A,SUMIF(Data!$I:$I,$A21,Data!P:P)),#N/A)","v":{"$error":"#N/A"}},{"$f":"IF(H$6,IF(SUMIF(Data!$I:$I,$A21,Data!Q:Q)=0,#N/A,SUMIF(Data!$I:$I,$A21,Data!Q:Q)),#N/A)","v":{"$error":"#N/A"}},{"$f":"IF(I$6,IF(SUMIF(Data!$I:$I,$A21,Data!R:R)=0,#N/A,SUMIF(Data!$I:$I,$A21,Data!R:R)),#N/A)","v":{"$error":"#N/A"}},{"$f":"IF(J$6,IF(SUMIF(Data!$I:$I,$A21,Data!S:S)=0,#N/A,SUMIF(Data!$I:$I,$A21,Data!S:S)),#N/A)","v":{"$error":"#N/A"}},{"$f":"IF(K$6,IF(SUMIF(Data!$I:$I,$A21,Data!T:T)=0,#N/A,SUMIF(Data!$I:$I,$A21,Data!T:T)),#N/A)","v":{"$error":"#N/A"}},null,null,null,null,null,null,null,null,null,null,null,"£k","£k",null,"£k","£k"]
[{"$error":"#N/A"},{"$f":"IF(B$6,IF(SUMIF(Data!$I:$I,$A22,Data!K:K)=0,#N/A,SUMIF(Data!$I:$I,$A22,Data!K:K)),#N/A)","v":{"$error":"#N/A"}},{"$f":"IF(C$6,IF(SUMIF(Data!$I:$I,$A22,Data!L:L)=0,#N/A,SUMIF(Data!$I:$I,$A22,Data!L:L)),#N/A)","v":{"$error":"#N/A"}},{"$f":"IF(D$6,IF(SUMIF(Data!$I:$I,$A22,Data!M:M)=0,#N/A,SUMIF(Data!$I:$I,$A22,Data!M:M)),#N/A)","v":{"$error":"#N/A"}},{"$f":"IF(E$6,IF(SUMIF(Data!$I:$I,$A22,Data!N:N)=0,#N/A,SUMIF(Data!$I:$I,$A22,Data!N:N)),#N/A)","v":{"$error":"#N/A"}},{"$f":"IF(F$6,IF(SUMIF(Data!$I:$I,$A22,Data!O:O)=0,#N/A,SUMIF(Data!$I:$I,$A22,Data!O:O)),#N/A)","v":{"$error":"#N/A"}},{"$f":"IF(G$6,IF(SUMIF(Data!$I:$I,$A22,Data!P:P)=0,#N/A,SUMIF(Data!$I:$I,$A22,Data!P:P)),#N/A)","v":{"$error":"#N/A"}},{"$f":"IF(H$6,IF(SUMIF(Data!$I:$I,$A22,Data!Q:Q)=0,#N/A,SUMIF(Data!$I:$I,$A22,Data!Q:Q)),#N/A)","v":{"$error":"#N/A"}},{"$f":"IF(I$6,IF(SUMIF(Data!$I:$I,$A22,Data!R:R)=0,#N/A,SUMIF(Data!$I:$I,$A22,Data!R:R)),#N/A)","v":{"$error":"#N/A"}},{"$f":"IF(J$6,IF(SUMIF(Data!$I:$I,$A22,Data!S:S)=0,#N/A,SUMIF(Data!$I:$I,$A22,Data!S:S)),#N/A)","v":{"$error":"#N/A"}},{"$f":"IF(K$6,IF(SUMIF(Data!$I:$I,$A22,Data!T:T)=0,#N/A,SUMIF(Data!$I:$I,$A22,Data!T:T)),#N/A)","v":{"$error":"#N/A"}},null,null,null,null,null,null,null,null,null,null,null,null,null,null,null,"£k"]
[{"$error":"#N/A"},{"$f":"IF(B$6,IF(SUMIF(Data!$I:$I,$A23,Data!K:K)=0,#N/A,SUMIF(Data!$I:$I,$A23,Data!K:K)),#N/A)","v":{"$error":"#N/A"}},{"$f":"IF(C$6,IF(SUMIF(Data!$I:$I,$A23,Data!L:L)=0,#N/A,SUMIF(Data!$I:$I,$A23,Data!L:L)),#N/A)","v":{"$error":"#N/A"}},{"$f":"IF(D$6,IF(SUMIF(Data!$I:$I,$A23,Data!M:M)=0,#N/A,SUMIF(Data!$I:$I,$A23,Data!M:M)),#N/A)","v":{"$error":"#N/A"}},{"$f":"IF(E$6,IF(SUMIF(Data!$I:$I,$A23,Data!N:N)=0,#N/A,SUMIF(Data!$I:$I,$A23,Data!N:N)),#N/A)","v":{"$error":"#N/A"}},{"$f":"IF(F$6,IF(SUMIF(Data!$I:$I,$A23,Data!O:O)=0,#N/A,SUMIF(Data!$I:$I,$A23,Data!O:O)),#N/A)","v":{"$error":"#N/A"}},{"$f":"IF(G$6,IF(SUMIF(Data!$I:$I,$A23,Data!P:P)=0,#N/A,SUMIF(Data!$I:$I,$A23,Data!P:P)),#N/A)","v":{"$error":"#N/A"}},{"$f":"IF(H$6,IF(SUMIF(Data!$I:$I,$A23,Data!Q:Q)=0,#N/A,SUMIF(Data!$I:$I,$A23,Data!Q:Q)),#N/A)","v":{"$error":"#N/A"}},{"$f":"IF(I$6,IF(SUMIF(Data!$I:$I,$A23,Data!R:R)=0,#N/A,SUMIF(Data!$I:$I,$A23,Data!R:R)),#N/A)","v":{"$error":"#N/A"}},{"$f":"IF(J$6,IF(SUMIF(Data!$I:$I,$A23,Data!S:S)=0,#N/A,SUMIF(Data!$I:$I,$A23,Data!S:S)),#N/A)","v":{"$error":"#N/A"}},{"$f":"IF(K$6,IF(SUMIF(Data!$I:$I,$A23,Data!T:T)=0,#N/A,SUMIF(Data!$I:$I,$A23,Data!T:T)),#N/A)","v":{"$error":"#N/A"}},null,null,null,null,null,null,null,null,null,null,null,null,null,null,null,"£k"]
[{"$error":"#N/A"},{"$f":"IF(B$6,IF(SUMIF(Data!$I:$I,$A24,Data!K:K)=0,#N/A,SUMIF(Data!$I:$I,$A24,Data!K:K)),#N/A)","v":{"$error":"#N/A"}},{"$f":"IF(C$6,IF(SUMIF(Data!$I:$I,$A24,Data!L:L)=0,#N/A,SUMIF(Data!$I:$I,$A24,Data!L:L)),#N/A)","v":{"$error":"#N/A"}},{"$f":"IF(D$6,IF(SUMIF(Data!$I:$I,$A24,Data!M:M)=0,#N/A,SUMIF(Data!$I:$I,$A24,Data!M:M)),#N/A)","v":{"$error":"#N/A"}},{"$f":"IF(E$6,IF(SUMIF(Data!$I:$I,$A24,Data!N:N)=0,#N/A,SUMIF(Data!$I:$I,$A24,Data!N:N)),#N/A)","v":{"$error":"#N/A"}},{"$f":"IF(F$6,IF(SUMIF(Data!$I:$I,$A24,Data!O:O)=0,#N/A,SUMIF(Data!$I:$I,$A24,Data!O:O)),#N/A)","v":{"$error":"#N/A"}},{"$f":"IF(G$6,IF(SUMIF(Data!$I:$I,$A24,Data!P:P)=0,#N/A,SUMIF(Data!$I:$I,$A24,Data!P:P)),#N/A)","v":{"$error":"#N/A"}},{"$f":"IF(H$6,IF(SUMIF(Data!$I:$I,$A24,Data!Q:Q)=0,#N/A,SUMIF(Data!$I:$I,$A24,Data!Q:Q)),#N/A)","v":{"$error":"#N/A"}},{"$f":"IF(I$6,IF(SUMIF(Data!$I:$I,$A24,Data!R:R)=0,#N/A,SUMIF(Data!$I:$I,$A24,Data!R:R)),#N/A)","v":{"$error":"#N/A"}},{"$f":"IF(J$6,IF(SUMIF(Data!$I:$I,$A24,Data!S:S)=0,#N/A,SUMIF(Data!$I:$I,$A24,Data!S:S)),#N/A)","v":{"$error":"#N/A"}},{"$f":"IF(K$6,IF(SUMIF(Data!$I:$I,$A24,Data!T:T)=0,#N/A,SUMIF(Data!$I:$I,$A24,Data!T:T)),#N/A)","v":{"$error":"#N/A"}},null,null,null,null,null,null,null,null,null,null,null,null,null,null,null,"£k"]
[{"$error":"#N/A"},{"$f":"IF(B$6,IF(SUMIF(Data!$I:$I,$A25,Data!K:K)=0,#N/A,SUMIF(Data!$I:$I,$A25,Data!K:K)),#N/A)","v":{"$error":"#N/A"}},{"$f":"IF(C$6,IF(SUMIF(Data!$I:$I,$A25,Data!L:L)=0,#N/A,SUMIF(Data!$I:$I,$A25,Data!L:L)),#N/A)","v":{"$error":"#N/A"}},{"$f":"IF(D$6,IF(SUMIF(Data!$I:$I,$A25,Data!M:M)=0,#N/A,SUMIF(Data!$I:$I,$A25,Data!M:M)),#N/A)","v":{"$error":"#N/A"}},{"$f":"IF(E$6,IF(SUMIF(Data!$I:$I,$A25,Data!N:N)=0,#N/A,SUMIF(Data!$I:$I,$A25,Data!N:N)),#N/A)","v":{"$error":"#N/A"}},{"$f":"IF(F$6,IF(SUMIF(Data!$I:$I,$A25,Data!O:O)=0,#N/A,SUMIF(Data!$I:$I,$A25,Data!O:O)),#N/A)","v":{"$error":"#N/A"}},{"$f":"IF(G$6,IF(SUMIF(Data!$I:$I,$A25,Data!P:P)=0,#N/A,SUMIF(Data!$I:$I,$A25,Data!P:P)),#N/A)","v":{"$error":"#N/A"}},{"$f":"IF(H$6,IF(SUMIF(Data!$I:$I,$A25,Data!Q:Q)=0,#N/A,SUMIF(Data!$I:$I,$A25,Data!Q:Q)),#N/A)","v":{"$error":"#N/A"}},{"$f":"IF(I$6,IF(SUMIF(Data!$I:$I,$A25,Data!R:R)=0,#N/A,SUMIF(Data!$I:$I,$A25,Data!R:R)),#N/A)","v":{"$error":"#N/A"}},{"$f":"IF(J$6,IF(SUMIF(Data!$I:$I,$A25,Data!S:S)=0,#N/A,SUMIF(Data!$I:$I,$A25,Data!S:S)),#N/A)","v":{"$error":"#N/A"}},{"$f":"IF(K$6,IF(SUMIF(Data!$I:$I,$A25,Data!T:T)=0,#N/A,SUMIF(Data!$I:$I,$A25,Data!T:T)),#N/A)","v":{"$error":"#N/A"}}]
[{"$error":"#N/A"},{"$f":"IF(B$6,IF(SUMIF(Data!$I:$I,$A26,Data!K:K)=0,#N/A,SUMIF(Data!$I:$I,$A26,Data!K:K)),#N/A)","v":{"$error":"#N/A"}},{"$f":"IF(C$6,IF(SUMIF(Data!$I:$I,$A26,Data!L:L)=0,#N/A,SUMIF(Data!$I:$I,$A26,Data!L:L)),#N/A)","v":{"$error":"#N/A"}},{"$f":"IF(D$6,IF(SUMIF(Data!$I:$I,$A26,Data!M:M)=0,#N/A,SUMIF(Data!$I:$I,$A26,Data!M:M)),#N/A)","v":{"$error":"#N/A"}},{"$f":"IF(E$6,IF(SUMIF(Data!$I:$I,$A26,Data!N:N)=0,#N/A,SUMIF(Data!$I:$I,$A26,Data!N:N)),#N/A)","v":{"$error":"#N/A"}},{"$f":"IF(F$6,IF(SUMIF(Data!$I:$I,$A26,Data!O:O)=0,#N/A,SUMIF(Data!$I:$I,$A26,Data!O:O)),#N/A)","v":{"$error":"#N/A"}},{"$f":"IF(G$6,IF(SUMIF(Data!$I:$I,$A26,Data!P:P)=0,#N/A,SUMIF(Data!$I:$I,$A26,Data!P:P)),#N/A)","v":{"$error":"#N/A"}},{"$f":"IF(H$6,IF(SUMIF(Data!$I:$I,$A26,Data!Q:Q)=0,#N/A,SUMIF(Data!$I:$I,$A26,Data!Q:Q)),#N/A)","v":{"$error":"#N/A"}},{"$f":"IF(I$6,IF(SUMIF(Data!$I:$I,$A26,Data!R:R)=0,#N/A,SUMIF(Data!$I:$I,$A26,Data!R:R)),#N/A)","v":{"$error":"#N/A"}},{"$f":"IF(J$6,IF(SUMIF(Data!$I:$I,$A26,Data!S:S)=0,#N/A,SUMIF(Data!$I:$I,$A26,Data!S:S)),#N/A)","v":{"$error":"#N/A"}},{"$f":"IF(K$6,IF(SUMIF(Data!$I:$I,$A26,Data!T:T)=0,#N/A,SUMIF(Data!$I:$I,$A26,Data!T:T)),#N/A)","v":{"$error":"#N/A"}}]
[{"$error":"#N/A"},{"$f":"IF(B$6,IF(SUMIF(Data!$I:$I,$A27,Data!K:K)=0,#N/A,SUMIF(Data!$I:$I,$A27,Data!K:K)),#N/A)","v":{"$error":"#N/A"}},{"$f":"IF(C$6,IF(SUMIF(Data!$I:$I,$A27,Data!L:L)=0,#N/A,SUMIF(Data!$I:$I,$A27,Data!L:L)),#N/A)","v":{"$error":"#N/A"}},{"$f":"IF(D$6,IF(SUMIF(Data!$I:$I,$A27,Data!M:M)=0,#N/A,SUMIF(Data!$I:$I,$A27,Data!M:M)),#N/A)","v":{"$error":"#N/A"}},{"$f":"IF(E$6,IF(SUMIF(Data!$I:$I,$A27,Data!N:N)=0,#N/A,SUMIF(Data!$I:$I,$A27,Data!N:N)),#N/A)","v":{"$error":"#N/A"}},{"$f":"IF(F$6,IF(SUMIF(Data!$I:$I,$A27,Data!O:O)=0,#N/A,SUMIF(Data!$I:$I,$A27,Data!O:O)),#N/A)","v":{"$error":"#N/A"}},{"$f":"IF(G$6,IF(SUMIF(Data!$I:$I,$A27,Data!P:P)=0,#N/A,SUMIF(Data!$I:$I,$A27,Data!P:P)),#N/A)","v":{"$error":"#N/A"}},{"$f":"IF(H$6,IF(SUMIF(Data!$I:$I,$A27,Data!Q:Q)=0,#N/A,SUMIF(Data!$I:$I,$A27,Data!Q:Q)),#N/A)","v":{"$error":"#N/A"}},{"$f":"IF(I$6,IF(SUMIF(Data!$I:$I,$A27,Data!R:R)=0,#N/A,SUMIF(Data!$I:$I,$A27,Data!R:R)),#N/A)","v":{"$error":"#N/A"}},{"$f":"IF(J$6,IF(SUMIF(Data!$I:$I,$A27,Data!S:S)=0,#N/A,SUMIF(Data!$I:$I,$A27,Data!S:S)),#N/A)","v":{"$error":"#N/A"}},{"$f":"IF(K$6,IF(SUMIF(Data!$I:$I,$A27,Data!T:T)=0,#N/A,SUMIF(Data!$I:$I,$A27,Data!T:T)),#N/A)","v":{"$error":"#N/A"}}]
[{"$error":"#N/A"},{"$f":"IF(B$6,IF(SUMIF(Data!$I:$I,$A28,Data!K:K)=0,#N/A,SUMIF(Data!$I:$I,$A28,Data!K:K)),#N/A)","v":{"$error":"#N/A"}},{"$f":"IF(C$6,IF(SUMIF(Data!$I:$I,$A28,Data!L:L)=0,#N/A,SUMIF(Data!$I:$I,$A28,Data!L:L)),#N/A)","v":{"$error":"#N/A"}},{"$f":"IF(D$6,IF(SUMIF(Data!$I:$I,$A28,Data!M:M)=0,#N/A,SUMIF(Data!$I:$I,$A28,Data!M:M)),#N/A)","v":{"$error":"#N/A"}},{"$f":"IF(E$6,IF(SUMIF(Data!$I:$I,$A28,Data!N:N)=0,#N/A,SUMIF(Data!$I:$I,$A28,Data!N:N)),#N/A)","v":{"$error":"#N/A"}},{"$f":"IF(F$6,IF(SUMIF(Data!$I:$I,$A28,Data!O:O)=0,#N/A,SUMIF(Data!$I:$I,$A28,Data!O:O)),#N/A)","v":{"$error":"#N/A"}},{"$f":"IF(G$6,IF(SUMIF(Data!$I:$I,$A28,Data!P:P)=0,#N/A,SUMIF(Data!$I:$I,$A28,Data!P:P)),#N/A)","v":{"$error":"#N/A"}},{"$f":"IF(H$6,IF(SUMIF(Data!$I:$I,$A28,Data!Q:Q)=0,#N/A,SUMIF(Data!$I:$I,$A28,Data!Q:Q)),#N/A)","v":{"$error":"#N/A"}},{"$f":"IF(I$6,IF(SUMIF(Data!$I:$I,$A28,Data!R:R)=0,#N/A,SUMIF(Data!$I:$I,$A28,Data!R:R)),#N/A)","v":{"$error":"#N/A"}},{"$f":"IF(J$6,IF(SUMIF(Data!$I:$I,$A28,Data!S:S)=0,#N/A,SUMIF(Data!$I:$I,$A28,Data!S:S)),#N/A)","v":{"$error":"#N/A"}},{"$f":"IF(K$6,IF(SUMIF(Data!$I:$I,$A28,Data!T:T)=0,#N/A,SUMIF(Data!$I:$I,$A28,Data!T:T)),#N/A)","v":{"$error":"#N/A"}}]
[{"$error":"#N/A"},{"$f":"IF(B$6,IF(SUMIF(Data!$I:$I,$A29,Data!K:K)=0,#N/A,SUMIF(Data!$I:$I,$A29,Data!K:K)),#N/A)","v":{"$error":"#N/A"}},{"$f":"IF(C$6,IF(SUMIF(Data!$I:$I,$A29,Data!L:L)=0,#N/A,SUMIF(Data!$I:$I,$A29,Data!L:L)),#N/A)","v":{"$error":"#N/A"}},{"$f":"IF(D$6,IF(SUMIF(Data!$I:$I,$A29,Data!M:M)=0,#N/A,SUMIF(Data!$I:$I,$A29,Data!M:M)),#N/A)","v":{"$error":"#N/A"}},{"$f":"IF(E$6,IF(SUMIF(Data!$I:$I,$A29,Data!N:N)=0,#N/A,SUMIF(Data!$I:$I,$A29,Data!N:N)),#N/A)","v":{"$error":"#N/A"}},{"$f":"IF(F$6,IF(SUMIF(Data!$I:$I,$A29,Data!O:O)=0,#N/A,SUMIF(Data!$I:$I,$A29,Data!O:O)),#N/A)","v":{"$error":"#N/A"}},{"$f":"IF(G$6,IF(SUMIF(Data!$I:$I,$A29,Data!P:P)=0,#N/A,SUMIF(Data!$I:$I,$A29,Data!P:P)),#N/A)","v":{"$error":"#N/A"}},{"$f":"IF(H$6,IF(SUMIF(Data!$I:$I,$A29,Data!Q:Q)=0,#N/A,SUMIF(Data!$I:$I,$A29,Data!Q:Q)),#N/A)","v":{"$error":"#N/A"}},{"$f":"IF(I$6,IF(SUMIF(Data!$I:$I,$A29,Data!R:R)=0,#N/A,SUMIF(Data!$I:$I,$A29,Data!R:R)),#N/A)","v":{"$error":"#N/A"}},{"$f":"IF(J$6,IF(SUMIF(Data!$I:$I,$A29,Data!S:S)=0,#N/A,SUMIF(Data!$I:$I,$A29,Data!S:S)),#N/A)","v":{"$error":"#N/A"}},{"$f":"IF(K$6,IF(SUMIF(Data!$I:$I,$A29,Data!T:T)=0,#N/A,SUMIF(Data!$I:$I,$A29,Data!T:T)),#N/A)","v":{"$error":"#N/A"}}]
[{"$error":"#N/A"},{"$f":"IF(B$6,IF(SUMIF(Data!$I:$I,$A30,Data!K:K)=0,#N/A,SUMIF(Data!$I:$I,$A30,Data!K:K)),#N/A)","v":{"$error":"#N/A"}},{"$f":"IF(C$6,IF(SUMIF(Data!$I:$I,$A30,Data!L:L)=0,#N/A,SUMIF(Data!$I:$I,$A30,Data!L:L)),#N/A)","v":{"$error":"#N/A"}},{"$f":"IF(D$6,IF(SUMIF(Data!$I:$I,$A30,Data!M:M)=0,#N/A,SUMIF(Data!$I:$I,$A30,Data!M:M)),#N/A)","v":{"$error":"#N/A"}},{"$f":"IF(E$6,IF(SUMIF(Data!$I:$I,$A30,Data!N:N)=0,#N/A,SUMIF(Data!$I:$I,$A30,Data!N:N)),#N/A)","v":{"$error":"#N/A"}},{"$f":"IF(F$6,IF(SUMIF(Data!$I:$I,$A30,Data!O:O)=0,#N/A,SUMIF(Data!$I:$I,$A30,Data!O:O)),#N/A)","v":{"$error":"#N/A"}},{"$f":"IF(G$6,IF(SUMIF(Data!$I:$I,$A30,Data!P:P)=0,#N/A,SUMIF(Data!$I:$I,$A30,Data!P:P)),#N/A)","v":{"$error":"#N/A"}},{"$f":"IF(H$6,IF(SUMIF(Data!$I:$I,$A30,Data!Q:Q)=0,#N/A,SUMIF(Data!$I:$I,$A30,Data!Q:Q)),#N/A)","v":{"$error":"#N/A"}},{"$f":"IF(I$6,IF(SUMIF(Data!$I:$I,$A30,Data!R:R)=0,#N/A,SUMIF(Data!$I:$I,$A30,Data!R:R)),#N/A)","v":{"$error":"#N/A"}},{"$f":"IF(J$6,IF(SUMIF(Data!$I:$I,$A30,Data!S:S)=0,#N/A,SUMIF(Data!$I:$I,$A30,Data!S:S)),#N/A)","v":{"$error":"#N/A"}},{"$f":"IF(K$6,IF(SUMIF(Data!$I:$I,$A30,Data!T:T)=0,#N/A,SUMIF(Data!$I:$I,$A30,Data!T:T)),#N/A)","v":{"$error":"#N/A"}},null,null,"Job Impacts"]
[{"$error":"#N/A"},{"$f":"IF(B$6,IF(SUMIF(Data!$I:$I,$A31,Data!K:K)=0,#N/A,SUMIF(Data!$I:$I,$A31,Data!K:K)),#N/A)","v":{"$error":"#N/A"}},{"$f":"IF(C$6,IF(SUMIF(Data!$I:$I,$A31,Data!L:L)=0,#N/A,SUMIF(Data!$I:$I,$A31,Data!L:L)),#N/A)","v":{"$error":"#N/A"}},{"$f":"IF(D$6,IF(SUMIF(Data!$I:$I,$A31,Data!M:M)=0,#N/A,SUMIF(Data!$I:$I,$A31,Data!M:M)),#N/A)","v":{"$error":"#N/A"}},{"$f":"IF(E$6,IF(SUMIF(Data!$I:$I,$A31,Data!N:N)=0,#N/A,SUMIF(Data!$I:$I,$A31,Data!N:N)),#N/A)","v":{"$error":"#N/A"}},{"$f":"IF(F$6,IF(SUMIF(Data!$I:$I,$A31,Data!O:O)=0,#N/A,SUMIF(Data!$I:$I,$A31,Data!O:O)),#N/A)","v":{"$error":"#N/A"}},{"$f":"IF(G$6,IF(SUMIF(Data!$I:$I,$A31,Data!P:P)=0,#N/A,SUMIF(Data!$I:$I,$A31,Data!P:P)),#N/A)","v":{"$error":"#N/A"}},{"$f":"IF(H$6,IF(SUMIF(Data!$I:$I,$A31,Data!Q:Q)=0,#N/A,SUMIF(Data!$I:$I,$A31,Data!Q:Q)),#N/A)","v":{"$error":"#N/A"}},{"$f":"IF(I$6,IF(SUMIF(Data!$I:$I,$A31,Data!R:R)=0,#N/A,SUMIF(Data!$I:$I,$A31,Data!R:R)),#N/A)","v":{"$error":"#N/A"}},{"$f":"IF(J$6,IF(SUMIF(Data!$I:$I,$A31,Data!S:S)=0,#N/A,SUMIF(Data!$I:$I,$A31,Data!S:S)),#N/A)","v":{"$error":"#N/A"}},{"$f":"IF(K$6,IF(SUMIF(Data!$I:$I,$A31,Data!T:T)=0,#N/A,SUMIF(Data!$I:$I,$A31,Data!T:T)),#N/A)","v":{"$error":"#N/A"}},null,null,"{Jobs, GVA}"]
[{"$error":"#N/A"},{"$f":"IF(B$6,IF(SUMIF(Data!$I:$I,$A32,Data!K:K)=0,#N/A,SUMIF(Data!$I:$I,$A32,Data!K:K)),#N/A)","v":{"$error":"#N/A"}},{"$f":"IF(C$6,IF(SUMIF(Data!$I:$I,$A32,Data!L:L)=0,#N/A,SUMIF(Data!$I:$I,$A32,Data!L:L)),#N/A)","v":{"$error":"#N/A"}},{"$f":"IF(D$6,IF(SUMIF(Data!$I:$I,$A32,Data!M:M)=0,#N/A,SUMIF(Data!$I:$I,$A32,Data!M:M)),#N/A)","v":{"$error":"#N/A"}},{"$f":"IF(E$6,IF(SUMIF(Data!$I:$I,$A32,Data!N:N)=0,#N/A,SUMIF(Data!$I:$I,$A32,Data!N:N)),#N/A)","v":{"$error":"#N/A"}},{"$f":"IF(F$6,IF(SUMIF(Data!$I:$I,$A32,Data!O:O)=0,#N/A,SUMIF(Data!$I:$I,$A32,Data!O:O)),#N/A)","v":{"$error":"#N/A"}},{"$f":"IF(G$6,IF(SUMIF(Data!$I:$I,$A32,Data!P:P)=0,#N/A,SUMIF(Data!$I:$I,$A32,Data!P:P)),#N/A)","v":{"$error":"#N/A"}},{"$f":"IF(H$6,IF(SUMIF(Data!$I:$I,$A32,Data!Q:Q)=0,#N/A,SUMIF(Data!$I:$I,$A32,Data!Q:Q)),#N/A)","v":{"$error":"#N/A"}},{"$f":"IF(I$6,IF(SUMIF(Data!$I:$I,$A32,Data!R:R)=0,#N/A,SUMIF(Data!$I:$I,$A32,Data!R:R)),#N/A)","v":{"$error":"#N/A"}},{"$f":"IF(J$6,IF(SUMIF(Data!$I:$I,$A32,Data!S:S)=0,#N/A,SUMIF(Data!$I:$I,$A32,Data!S:S)),#N/A)","v":{"$error":"#N/A"}},{"$f":"IF(K$6,IF(SUMIF(Data!$I:$I,$A32,Data!T:T)=0,#N/A,SUMIF(Data!$I:$I,$A32,Data!T:T)),#N/A)","v":{"$error":"#N/A"}}]
[{"$error":"#N/A"},{"$f":"IF(B$6,IF(SUMIF(Data!$I:$I,$A33,Data!K:K)=0,#N/A,SUMIF(Data!$I:$I,$A33,Data!K:K)),#N/A)","v":{"$error":"#N/A"}},{"$f":"IF(C$6,IF(SUMIF(Data!$I:$I,$A33,Data!L:L)=0,#N/A,SUMIF(Data!$I:$I,$A33,Data!L:L)),#N/A)","v":{"$error":"#N/A"}},{"$f":"IF(D$6,IF(SUMIF(Data!$I:$I,$A33,Data!M:M)=0,#N/A,SUMIF(Data!$I:$I,$A33,Data!M:M)),#N/A)","v":{"$error":"#N/A"}},{"$f":"IF(E$6,IF(SUMIF(Data!$I:$I,$A33,Data!N:N)=0,#N/A,SUMIF(Data!$I:$I,$A33,Data!N:N)),#N/A)","v":{"$error":"#N/A"}},{"$f":"IF(F$6,IF(SUMIF(Data!$I:$I,$A33,Data!O:O)=0,#N/A,SUMIF(Data!$I:$I,$A33,Data!O:O)),#N/A)","v":{"$error":"#N/A"}},{"$f":"IF(G$6,IF(SUMIF(Data!$I:$I,$A33,Data!P:P)=0,#N/A,SUMIF(Data!$I:$I,$A33,Data!P:P)),#N/A)","v":{"$error":"#N/A"}},{"$f":"IF(H$6,IF(SUMIF(Data!$I:$I,$A33,Data!Q:Q)=0,#N/A,SUMIF(Data!$I:$I,$A33,Data!Q:Q)),#N/A)","v":{"$error":"#N/A"}},{"$f":"IF(I$6,IF(SUMIF(Data!$I:$I,$A33,Data!R:R)=0,#N/A,SUMIF(Data!$I:$I,$A33,Data!R:R)),#N/A)","v":{"$error":"#N/A"}},{"$f":"IF(J$6,IF(SUMIF(Data!$I:$I,$A33,Data!S:S)=0,#N/A,SUMIF(Data!$I:$I,$A33,Data!S:S)),#N/A)","v":{"$error":"#N/A"}},{"$f":"IF(K$6,IF(SUMIF(Data!$I:$I,$A33,Data!T:T)=0,#N/A,SUMIF(Data!$I:$I,$A33,Data!T:T)),#N/A)","v":{"$error":"#N/A"}},null,null,"Accident Analysis"]
[{"$error":"#N/A"},{"$f":"IF(B$6,IF(SUMIF(Data!$I:$I,$A34,Data!K:K)=0,#N/A,SUMIF(Data!$I:$I,$A34,Data!K:K)),#N/A)","v":{"$error":"#N/A"}},{"$f":"IF(C$6,IF(SUMIF(Data!$I:$I,$A34,Data!L:L)=0,#N/A,SUMIF(Data!$I:$I,$A34,Data!L:L)),#N/A)","v":{"$error":"#N/A"}},{"$f":"IF(D$6,IF(SUMIF(Data!$I:$I,$A34,Data!M:M)=0,#N/A,SUMIF(Data!$I:$I,$A34,Data!M:M)),#N/A)","v":{"$error":"#N/A"}},{"$f":"IF(E$6,IF(SUMIF(Data!$I:$I,$A34,Data!N:N)=0,#N/A,SUMIF(Data!$I:$I,$A34,Data!N:N)),#N/A)","v":{"$error":"#N/A"}},{"$f":"IF(F$6,IF(SUMIF(Data!$I:$I,$A34,Data!O:O)=0,#N/A,SUMIF(Data!$I:$I,$A34,Data!O:O)),#N/A)","v":{"$error":"#N/A"}},{"$f":"IF(G$6,IF(SUMIF(Data!$I:$I,$A34,Data!P:P)=0,#N/A,SUMIF(Data!$I:$I,$A34,Data!P:P)),#N/A)","v":{"$error":"#N/A"}},{"$f":"IF(H$6,IF(SUMIF(Data!$I:$I,$A34,Data!Q:Q)=0,#N/A,SUMIF(Data!$I:$I,$A34,Data!Q:Q)),#N/A)","v":{"$error":"#N/A"}},{"$f":"IF(I$6,IF(SUMIF(Data!$I:$I,$A34,Data!R:R)=0,#N/A,SUMIF(Data!$I:$I,$A34,Data!R:R)),#N/A)","v":{"$error":"#N/A"}},{"$f":"IF(J$6,IF(SUMIF(Data!$I:$I,$A34,Data!S:S)=0,#N/A,SUMIF(Data!$I:$I,$A34,Data!S:S)),#N/A)","v":{"$error":"#N/A"}},{"$f":"IF(K$6,IF(SUMIF(Data!$I:$I,$A34,Data!T:T)=0,#N/A,SUMIF(Data!$I:$I,$A34,Data!T:T)),#N/A)","v":{"$error":"#N/A"}},null,null,"{Max # Accident, Max Accident Cost}",null,null,null,null,null,null,"1st Selection","2nd Selection","Module","value title"]
[{"$error":"#N/A"},{"$f":"IF(B$6,IF(SUMIF(Data!$I:$I,$A35,Data!K:K)=0,#N/A,SUMIF(Data!$I:$I,$A35,Data!K:K)),#N/A)","v":{"$error":"#N/A"}},{"$f":"IF(C$6,IF(SUMIF(Data!$I:$I,$A35,Data!L:L)=0,#N/A,SUMIF(Data!$I:$I,$A35,Data!L:L)),#N/A)","v":{"$error":"#N/A"}},{"$f":"IF(D$6,IF(SUMIF(Data!$I:$I,$A35,Data!M:M)=0,#N/A,SUMIF(Data!$I:$I,$A35,Data!M:M)),#N/A)","v":{"$error":"#N/A"}},{"$f":"IF(E$6,IF(SUMIF(Data!$I:$I,$A35,Data!N:N)=0,#N/A,SUMIF(Data!$I:$I,$A35,Data!N:N)),#N/A)","v":{"$error":"#N/A"}},{"$f":"IF(F$6,IF(SUMIF(Data!$I:$I,$A35,Data!O:O)=0,#N/A,SUMIF(Data!$I:$I,$A35,Data!O:O)),#N/A)","v":{"$error":"#N/A"}},{"$f":"IF(G$6,IF(SUMIF(Data!$I:$I,$A35,Data!P:P)=0,#N/A,SUMIF(Data!$I:$I,$A35,Data!P:P)),#N/A)","v":{"$error":"#N/A"}},{"$f":"IF(H$6,IF(SUMIF(Data!$I:$I,$A35,Data!Q:Q)=0,#N/A,SUMIF(Data!$I:$I,$A35,Data!Q:Q)),#N/A)","v":{"$error":"#N/A"}},{"$f":"IF(I$6,IF(SUMIF(Data!$I:$I,$A35,Data!R:R)=0,#N/A,SUMIF(Data!$I:$I,$A35,Data!R:R)),#N/A)","v":{"$error":"#N/A"}},{"$f":"IF(J$6,IF(SUMIF(Data!$I:$I,$A35,Data!S:S)=0,#N/A,SUMIF(Data!$I:$I,$A35,Data!S:S)),#N/A)","v":{"$error":"#N/A"}},{"$f":"IF(K$6,IF(SUMIF(Data!$I:$I,$A35,Data!T:T)=0,#N/A,SUMIF(Data!$I:$I,$A35,Data!T:T)),#N/A)","v":{"$error":"#N/A"}},null,null,null,null,null,null,null,null,1,"Job Impacts","Jobs","Job Impacts Module","Total Jobs"]
[{"$error":"#N/A"},{"$f":"IF(B$6,IF(SUMIF(Data!$I:$I,$A36,Data!K:K)=0,#N/A,SUMIF(Data!$I:$I,$A36,Data!K:K)),#N/A)","v":{"$error":"#N/A"}},{"$f":"IF(C$6,IF(SUMIF(Data!$I:$I,$A36,Data!L:L)=0,#N/A,SUMIF(Data!$I:$I,$A36,Data!L:L)),#N/A)","v":{"$error":"#N/A"}},{"$f":"IF(D$6,IF(SUMIF(Data!$I:$I,$A36,Data!M:M)=0,#N/A,SUMIF(Data!$I:$I,$A36,Data!M:M)),#N/A)","v":{"$error":"#N/A"}},{"$f":"IF(E$6,IF(SUMIF(Data!$I:$I,$A36,Data!N:N)=0,#N/A,SUMIF(Data!$I:$I,$A36,Data!N:N)),#N/A)","v":{"$error":"#N/A"}},{"$f":"IF(F$6,IF(SUMIF(Data!$I:$I,$A36,Data!O:O)=0,#N/A,SUMIF(Data!$I:$I,$A36,Data!O:O)),#N/A)","v":{"$error":"#N/A"}},{"$f":"IF(G$6,IF(SUMIF(Data!$I:$I,$A36,Data!P:P)=0,#N/A,SUMIF(Data!$I:$I,$A36,Data!P:P)),#N/A)","v":{"$error":"#N/A"}},{"$f":"IF(H$6,IF(SUMIF(Data!$I:$I,$A36,Data!Q:Q)=0,#N/A,SUMIF(Data!$I:$I,$A36,Data!Q:Q)),#N/A)","v":{"$error":"#N/A"}},{"$f":"IF(I$6,IF(SUMIF(Data!$I:$I,$A36,Data!R:R)=0,#N/A,SUMIF(Data!$I:$I,$A36,Data!R:R)),#N/A)","v":{"$error":"#N/A"}},{"$f":"IF(J$6,IF(SUMIF(Data!$I:$I,$A36,Data!S:S)=0,#N/A,SUMIF(Data!$I:$I,$A36,Data!S:S)),#N/A)","v":{"$error":"#N/A"}},{"$f":"IF(K$6,IF(SUMIF(Data!$I:$I,$A36,Data!T:T)=0,#N/A,SUMIF(Data!$I:$I,$A36,Data!T:T)),#N/A)","v":{"$error":"#N/A"}},null,null,"Road Works",null,null,null,null,null,{"$f":"T35+1","v":2},"Job Impacts","GVA","Job Impacts Module","GVA"]
[{"$error":"#N/A"},{"$f":"IF(B$6,IF(SUMIF(Data!$I:$I,$A37,Data!K:K)=0,#N/A,SUMIF(Data!$I:$I,$A37,Data!K:K)),#N/A)","v":{"$error":"#N/A"}},{"$f":"IF(C$6,IF(SUMIF(Data!$I:$I,$A37,Data!L:L)=0,#N/A,SUMIF(Data!$I:$I,$A37,Data!L:L)),#N/A)","v":{"$error":"#N/A"}},{"$f":"IF(D$6,IF(SUMIF(Data!$I:$I,$A37,Data!M:M)=0,#N/A,SUMIF(Data!$I:$I,$A37,Data!M:M)),#N/A)","v":{"$error":"#N/A"}},{"$f":"IF(E$6,IF(SUMIF(Data!$I:$I,$A37,Data!N:N)=0,#N/A,SUMIF(Data!$I:$I,$A37,Data!N:N)),#N/A)","v":{"$error":"#N/A"}},{"$f":"IF(F$6,IF(SUMIF(Data!$I:$I,$A37,Data!O:O)=0,#N/A,SUMIF(Data!$I:$I,$A37,Data!O:O)),#N/A)","v":{"$error":"#N/A"}},{"$f":"IF(G$6,IF(SUMIF(Data!$I:$I,$A37,Data!P:P)=0,#N/A,SUMIF(Data!$I:$I,$A37,Data!P:P)),#N/A)","v":{"$error":"#N/A"}},{"$f":"IF(H$6,IF(SUMIF(Data!$I:$I,$A37,Data!Q:Q)=0,#N/A,SUMIF(Data!$I:$I,$A37,Data!Q:Q)),#N/A)","v":{"$error":"#N/A"}},{"$f":"IF(I$6,IF(SUMIF(Data!$I:$I,$A37,Data!R:R)=0,#N/A,SUMIF(Data!$I:$I,$A37,Data!R:R)),#N/A)","v":{"$error":"#N/A"}},{"$f":"IF(J$6,IF(SUMIF(Data!$I:$I,$A37,Data!S:S)=0,#N/A,SUMIF(Data!$I:$I,$A37,Data!S:S)),#N/A)","v":{"$error":"#N/A"}},{"$f":"IF(K$6,IF(SUMIF(Data!$I:$I,$A37,Data!T:T)=0,#N/A,SUMIF(Data!$I:$I,$A37,Data!T:T)),#N/A)","v":{"$error":"#N/A"}},null,null,"{Accidents, Air Quality, Time}",null,null,null,null,null,{"$f":"T36+1","v":3}]
[{"$error":"#N/A"},{"$f":"IF(B$6,IF(SUMIF(Data!$I:$I,$A38,Data!K:K)=0,#N/A,SUMIF(Data!$I:$I,$A38,Data!K:K)),#N/A)","v":{"$error":"#N/A"}},{"$f":"IF(C$6,IF(SUMIF(Data!$I:$I,$A38,Data!L:L)=0,#N/A,SUMIF(Data!$I:$I,$A38,Data!L:L)),#N/A)","v":{"$error":"#N/A"}},{"$f":"IF(D$6,IF(SUMIF(Data!$I:$I,$A38,Data!M:M)=0,#N/A,SUMIF(Data!$I:$I,$A38,Data!M:M)),#N/A)","v":{"$error":"#N/A"}},{"$f":"IF(E$6,IF(SUMIF(Data!$I:$I,$A38,Data!N:N)=0,#N/A,SUMIF(Data!$I:$I,$A38,Data!N:N)),#N/A)","v":{"$error":"#N/A"}},{"$f":"IF(F$6,IF(SUMIF(Data!$I:$I,$A38,Data!O:O)=0,#N/A,SUMIF(Data!$I:$I,$A38,Data!O:O)),#N/A)","v":{"$error":"#N/A"}},{"$f":"IF(G$6,IF(SUMIF(Data!$I:$I,$A38,Data!P:P)=0,#N/A,SUMIF(Data!$I:$I,$A38,Data!P:P)),#N/A)","v":{"$error":"#N/A"}},{"$f":"IF(H$6,IF(SUMIF(Data!$I:$I,$A38,Data!Q:Q)=0,#N/A,SUMIF(Data!$I:$I,$A38,Data!Q:Q)),#N/A)","v":{"$error":"#N/A"}},{"$f":"IF(I$6,IF(SUMIF(Data!$I:$I,$A38,Data!R:R)=0,#N/A,SUMIF(Data!$I:$I,$A38,Data!R:R)),#N/A)","v":{"$error":"#N/A"}},{"$f":"IF(J$6,IF(SUMIF(Data!$I:$I,$A38,Data!S:S)=0,#N/A,SUMIF(Data!$I:$I,$A38,Data!S:S)),#N/A)","v":{"$error":"#N/A"}},{"$f":"IF(K$6,IF(SUMIF(Data!$I:$I,$A38,Data!T:T)=0,#N/A,SUMIF(Data!$I:$I,$A38,Data!T:T)),#N/A)","v":{"$error":"#N/A"}},null,null,null,null,null,null,null,null,4,"Accident Analysis","Accident Count","Accident Analysis Module","Accidents"]
[{"$error":"#N/A"},{"$f":"IF(B$6,IF(SUMIF(Data!$I:$I,$A39,Data!K:K)=0,#N/A,SUMIF(Data!$I:$I,$A39,Data!K:K)),#N/A)","v":{"$error":"#N/A"}},{"$f":"IF(C$6,IF(SUMIF(Data!$I:$I,$A39,Data!L:L)=0,#N/A,SUMIF(Data!$I:$I,$A39,Data!L:L)),#N/A)","v":{"$error":"#N/A"}},{"$f":"IF(D$6,IF(SUMIF(Data!$I:$I,$A39,Data!M:M)=0,#N/A,SUMIF(Data!$I:$I,$A39,Data!M:M)),#N/A)","v":{"$error":"#N/A"}},{"$f":"IF(E$6,IF(SUMIF(Data!$I:$I,$A39,Data!N:N)=0,#N/A,SUMIF(Data!$I:$I,$A39,Data!N:N)),#N/A)","v":{"$error":"#N/A"}},{"$f":"IF(F$6,IF(SUMIF(Data!$I:$I,$A39,Data!O:O)=0,#N/A,SUMIF(Data!$I:$I,$A39,Data!O:O)),#N/A)","v":{"$error":"#N/A"}},{"$f":"IF(G$6,IF(SUMIF(Data!$I:$I,$A39,Data!P:P)=0,#N/A,SUMIF(Data!$I:$I,$A39,Data!P:P)),#N/A)","v":{"$error":"#N/A"}},{"$f":"IF(H$6,IF(SUMIF(Data!$I:$I,$A39,Data!Q:Q)=0,#N/A,SUMIF(Data!$I:$I,$A39,Data!Q:Q)),#N/A)","v":{"$error":"#N/A"}},{"$f":"IF(I$6,IF(SUMIF(Data!$I:$I,$A39,Data!R:R)=0,#N/A,SUMIF(Data!$I:$I,$A39,Data!R:R)),#N/A)","v":{"$error":"#N/A"}},{"$f":"IF(J$6,IF(SUMIF(Data!$I:$I,$A39,Data!S:S)=0,#N/A,SUMIF(Data!$I:$I,$A39,Data!S:S)),#N/A)","v":{"$error":"#N/A"}},{"$f":"IF(K$6,IF(SUMIF(Data!$I:$I,$A39,Data!T:T)=0,#N/A,SUMIF(Data!$I:$I,$A39,Data!T:T)),#N/A)","v":{"$error":"#N/A"}},null,null,"Road Condition",null,null,null,null,null,5,"Accident Analysis","Total Accident costs","Accident Analysis Module","Accident cost"]
[{"$error":"#N/A"},{"$f":"IF(B$6,IF(SUMIF(Data!$I:$I,$A40,Data!K:K)=0,#N/A,SUMIF(Data!$I:$I,$A40,Data!K:K)),#N/A)","v":{"$error":"#N/A"}},{"$f":"IF(C$6,IF(SUMIF(Data!$I:$I,$A40,Data!L:L)=0,#N/A,SUMIF(Data!$I:$I,$A40,Data!L:L)),#N/A)","v":{"$error":"#N/A"}},{"$f":"IF(D$6,IF(SUMIF(Data!$I:$I,$A40,Data!M:M)=0,#N/A,SUMIF(Data!$I:$I,$A40,Data!M:M)),#N/A)","v":{"$error":"#N/A"}},{"$f":"IF(E$6,IF(SUMIF(Data!$I:$I,$A40,Data!N:N)=0,#N/A,SUMIF(Data!$I:$I,$A40,Data!N:N)),#N/A)","v":{"$error":"#N/A"}},{"$f":"IF(F$6,IF(SUMIF(Data!$I:$I,$A40,Data!O:O)=0,#N/A,SUMIF(Data!$I:$I,$A40,Data!O:O)),#N/A)","v":{"$error":"#N/A"}},{"$f":"IF(G$6,IF(SUMIF(Data!$I:$I,$A40,Data!P:P)=0,#N/A,SUMIF(Data!$I:$I,$A40,Data!P:P)),#N/A)","v":{"$error":"#N/A"}},{"$f":"IF(H$6,IF(SUMIF(Data!$I:$I,$A40,Data!Q:Q)=0,#N/A,SUMIF(Data!$I:$I,$A40,Data!Q:Q)),#N/A)","v":{"$error":"#N/A"}},{"$f":"IF(I$6,IF(SUMIF(Data!$I:$I,$A40,Data!R:R)=0,#N/A,SUMIF(Data!$I:$I,$A40,Data!R:R)),#N/A)","v":{"$error":"#N/A"}},{"$f":"IF(J$6,IF(SUMIF(Data!$I:$I,$A40,Data!S:S)=0,#N/A,SUMIF(Data!$I:$I,$A40,Data!S:S)),#N/A)","v":{"$error":"#N/A"}},{"$f":"IF(K$6,IF(SUMIF(Data!$I:$I,$A40,Data!T:T)=0,#N/A,SUMIF(Data!$I:$I,$A40,Data!T:T)),#N/A)","v":{"$error":"#N/A"}},null,null,"{VOC, Value of Time, Fuel}",null,null,null,null,null,6]
[{"$error":"#N/A"},{"$f":"IF(B$6,IF(SUMIF(Data!$I:$I,$A41,Data!K:K)=0,#N/A,SUMIF(Data!$I:$I,$A41,Data!K:K)),#N/A)","v":{"$error":"#N/A"}},{"$f":"IF(C$6,IF(SUMIF(Data!$I:$I,$A41,Data!L:L)=0,#N/A,SUMIF(Data!$I:$I,$A41,Data!L:L)),#N/A)","v":{"$error":"#N/A"}},{"$f":"IF(D$6,IF(SUMIF(Data!$I:$I,$A41,Data!M:M)=0,#N/A,SUMIF(Data!$I:$I,$A41,Data!M:M)),#N/A)","v":{"$error":"#N/A"}},{"$f":"IF(E$6,IF(SUMIF(Data!$I:$I,$A41,Data!N:N)=0,#N/A,SUMIF(Data!$I:$I,$A41,Data!N:N)),#N/A)","v":{"$error":"#N/A"}},{"$f":"IF(F$6,IF(SUMIF(Data!$I:$I,$A41,Data!O:O)=0,#N/A,SUMIF(Data!$I:$I,$A41,Data!O:O)),#N/A)","v":{"$error":"#N/A"}},{"$f":"IF(G$6,IF(SUMIF(Data!$I:$I,$A41,Data!P:P)=0,#N/A,SUMIF(Data!$I:$I,$A41,Data!P:P)),#N/A)","v":{"$error":"#N/A"}},{"$f":"IF(H$6,IF(SUMIF(Data!$I:$I,$A41,Data!Q:Q)=0,#N/A,SUMIF(Data!$I:$I,$A41,Data!Q:Q)),#N/A)","v":{"$error":"#N/A"}},{"$f":"IF(I$6,IF(SUMIF(Data!$I:$I,$A41,Data!R:R)=0,#N/A,SUMIF(Data!$I:$I,$A41,Data!R:R)),#N/A)","v":{"$error":"#N/A"}},{"$f":"IF(J$6,IF(SUMIF(Data!$I:$I,$A41,Data!S:S)=0,#N/A,SUMIF(Data!$I:$I,$A41,Data!S:S)),#N/A)","v":{"$error":"#N/A"}},{"$f":"IF(K$6,IF(SUMIF(Data!$I:$I,$A41,Data!T:T)=0,#N/A,SUMIF(Data!$I:$I,$A41,Data!T:T)),#N/A)","v":{"$error":"#N/A"}},null,null,null,null,null,null,null,null,7,"Road Works","Accidents","Road Works Impacts Accidents","Accidents"]
[{"$error":"#N/A"},{"$f":"IF(B$6,IF(SUMIF(Data!$I:$I,$A42,Data!K:K)=0,#N/A,SUMIF(Data!$I:$I,$A42,Data!K:K)),#N/A)","v":{"$error":"#N/A"}},{"$f":"IF(C$6,IF(SUMIF(Data!$I:$I,$A42,Data!L:L)=0,#N/A,SUMIF(Data!$I:$I,$A42,Data!L:L)),#N/A)","v":{"$error":"#N/A"}},{"$f":"IF(D$6,IF(SUMIF(Data!$I:$I,$A42,Data!M:M)=0,#N/A,SUMIF(Data!$I:$I,$A42,Data!M:M)),#N/A)","v":{"$error":"#N/A"}},{"$f":"IF(E$6,IF(SUMIF(Data!$I:$I,$A42,Data!N:N)=0,#N/A,SUMIF(Data!$I:$I,$A42,Data!N:N)),#N/A)","v":{"$error":"#N/A"}},{"$f":"IF(F$6,IF(SUMIF(Data!$I:$I,$A42,Data!O:O)=0,#N/A,SUMIF(Data!$I:$I,$A42,Data!O:O)),#N/A)","v":{"$error":"#N/A"}},{"$f":"IF(G$6,IF(SUMIF(Data!$I:$I,$A42,Data!P:P)=0,#N/A,SUMIF(Data!$I:$I,$A42,Data!P:P)),#N/A)","v":{"$error":"#N/A"}},{"$f":"IF(H$6,IF(SUMIF(Data!$I:$I,$A42,Data!Q:Q)=0,#N/A,SUMIF(Data!$I:$I,$A42,Data!Q:Q)),#N/A)","v":{"$error":"#N/A"}},{"$f":"IF(I$6,IF(SUMIF(Data!$I:$I,$A42,Data!R:R)=0,#N/A,SUMIF(Data!$I:$I,$A42,Data!R:R)),#N/A)","v":{"$error":"#N/A"}},{"$f":"IF(J$6,IF(SUMIF(Data!$I:$I,$A42,Data!S:S)=0,#N/A,SUMIF(Data!$I:$I,$A42,Data!S:S)),#N/A)","v":{"$error":"#N/A"}},{"$f":"IF(K$6,IF(SUMIF(Data!$I:$I,$A42,Data!T:T)=0,#N/A,SUMIF(Data!$I:$I,$A42,Data!T:T)),#N/A)","v":{"$error":"#N/A"}},null,null,"Carbon",null,null,null,null,null,8,"Road Works","Carbon (from fuel)","Road Works Impacts Carbon","Air Quality"]
[{"$error":"#N/A"},{"$f":"IF(B$6,IF(SUMIF(Data!$I:$I,$A43,Data!K:K)=0,#N/A,SUMIF(Data!$I:$I,$A43,Data!K:K)),#N/A)","v":{"$error":"#N/A"}},{"$f":"IF(C$6,IF(SUMIF(Data!$I:$I,$A43,Data!L:L)=0,#N/A,SUMIF(Data!$I:$I,$A43,Data!L:L)),#N/A)","v":{"$error":"#N/A"}},{"$f":"IF(D$6,IF(SUMIF(Data!$I:$I,$A43,Data!M:M)=0,#N/A,SUMIF(Data!$I:$I,$A43,Data!M:M)),#N/A)","v":{"$error":"#N/A"}},{"$f":"IF(E$6,IF(SUMIF(Data!$I:$I,$A43,Data!N:N)=0,#N/A,SUMIF(Data!$I:$I,$A43,Data!N:N)),#N/A)","v":{"$error":"#N/A"}},{"$f":"IF(F$6,IF(SUMIF(Data!$I:$I,$A43,Data!O:O)=0,#N/A,SUMIF(Data!$I:$I,$A43,Data!O:O)),#N/A)","v":{"$error":"#N/A"}},{"$f":"IF(G$6,IF(SUMIF(Data!$I:$I,$A43,Data!P:P)=0,#N/A,SUMIF(Data!$I:$I,$A43,Data!P:P)),#N/A)","v":{"$error":"#N/A"}},{"$f":"IF(H$6,IF(SUMIF(Data!$I:$I,$A43,Data!Q:Q)=0,#N/A,SUMIF(Data!$I:$I,$A43,Data!Q:Q)),#N/A)","v":{"$error":"#N/A"}},{"$f":"IF(I$6,IF(SUMIF(Data!$I:$I,$A43,Data!R:R)=0,#N/A,SUMIF(Data!$I:$I,$A43,Data!R:R)),#N/A)","v":{"$error":"#N/A"}},{"$f":"IF(J$6,IF(SUMIF(Data!$I:$I,$A43,Data!S:S)=0,#N/A,SUMIF(Data!$I:$I,$A43,Data!S:S)),#N/A)","v":{"$error":"#N/A"}},{"$f":"IF(K$6,IF(SUMIF(Data!$I:$I,$A43,Data!T:T)=0,#N/A,SUMIF(Data!$I:$I,$A43,Data!T:T)),#N/A)","v":{"$error":"#N/A"}},null,null,"{Quantity, Cost}",null,null,null,null,null,9,"Road Works","Time","Road Works Impacts Time","Time"]
[{"$error":"#N/A"},{"$f":"IF(B$6,IF(SUMIF(Data!$I:$I,$A44,Data!K:K)=0,#N/A,SUMIF(Data!$I:$I,$A44,Data!K:K)),#N/A)","v":{"$error":"#N/A"}},{"$f":"IF(C$6,IF(SUMIF(Data!$I:$I,$A44,Data!L:L)=0,#N/A,SUMIF(Data!$I:$I,$A44,Data!L:L)),#N/A)","v":{"$error":"#N/A"}},{"$f":"IF(D$6,IF(SUMIF(Data!$I:$I,$A44,Data!M:M)=0,#N/A,SUMIF(Data!$I:$I,$A44,Data!M:M)),#N/A)","v":{"$error":"#N/A"}},{"$f":"IF(E$6,IF(SUMIF(Data!$I:$I,$A44,Data!N:N)=0,#N/A,SUMIF(Data!$I:$I,$A44,Data!N:N)),#N/A)","v":{"$error":"#N/A"}},{"$f":"IF(F$6,IF(SUMIF(Data!$I:$I,$A44,Data!O:O)=0,#N/A,SUMIF(Data!$I:$I,$A44,Data!O:O)),#N/A)","v":{"$error":"#N/A"}},{"$f":"IF(G$6,IF(SUMIF(Data!$I:$I,$A44,Data!P:P)=0,#N/A,SUMIF(Data!$I:$I,$A44,Data!P:P)),#N/A)","v":{"$error":"#N/A"}},{"$f":"IF(H$6,IF(SUMIF(Data!$I:$I,$A44,Data!Q:Q)=0,#N/A,SUMIF(Data!$I:$I,$A44,Data!Q:Q)),#N/A)","v":{"$error":"#N/A"}},{"$f":"IF(I$6,IF(SUMIF(Data!$I:$I,$A44,Data!R:R)=0,#N/A,SUMIF(Data!$I:$I,$A44,Data!R:R)),#N/A)","v":{"$error":"#N/A"}},{"$f":"IF(J$6,IF(SUMIF(Data!$I:$I,$A44,Data!S:S)=0,#N/A,SUMIF(Data!$I:$I,$A44,Data!S:S)),#N/A)","v":{"$error":"#N/A"}},{"$f":"IF(K$6,IF(SUMIF(Data!$I:$I,$A44,Data!T:T)=0,#N/A,SUMIF(Data!$I:$I,$A44,Data!T:T)),#N/A)","v":{"$error":"#N/A"}},null,null,null,null,null,null,null,null,10]
[{"$error":"#N/A"},{"$f":"IF(B$6,IF(SUMIF(Data!$I:$I,$A45,Data!K:K)=0,#N/A,SUMIF(Data!$I:$I,$A45,Data!K:K)),#N/A)","v":{"$error":"#N/A"}},{"$f":"IF(C$6,IF(SUMIF(Data!$I:$I,$A45,Data!L:L)=0,#N/A,SUMIF(Data!$I:$I,$A45,Data!L:L)),#N/A)","v":{"$error":"#N/A"}},{"$f":"IF(D$6,IF(SUMIF(Data!$I:$I,$A45,Data!M:M)=0,#N/A,SUMIF(Data!$I:$I,$A45,Data!M:M)),#N/A)","v":{"$error":"#N/A"}},{"$f":"IF(E$6,IF(SUMIF(Data!$I:$I,$A45,Data!N:N)=0,#N/A,SUMIF(Data!$I:$I,$A45,Data!N:N)),#N/A)","v":{"$error":"#N/A"}},{"$f":"IF(F$6,IF(SUMIF(Data!$I:$I,$A45,Data!O:O)=0,#N/A,SUMIF(Data!$I:$I,$A45,Data!O:O)),#N/A)","v":{"$error":"#N/A"}},{"$f":"IF(G$6,IF(SUMIF(Data!$I:$I,$A45,Data!P:P)=0,#N/A,SUMIF(Data!$I:$I,$A45,Data!P:P)),#N/A)","v":{"$error":"#N/A"}},{"$f":"IF(H$6,IF(SUMIF(Data!$I:$I,$A45,Data!Q:Q)=0,#N/A,SUMIF(Data!$I:$I,$A45,Data!Q:Q)),#N/A)","v":{"$error":"#N/A"}},{"$f":"IF(I$6,IF(SUMIF(Data!$I:$I,$A45,Data!R:R)=0,#N/A,SUMIF(Data!$I:$I,$A45,Data!R:R)),#N/A)","v":{"$error":"#N/A"}},{"$f":"IF(J$6,IF(SUMIF(Data!$I:$I,$A45,Data!S:S)=0,#N/A,SUMIF(Data!$I:$I,$A45,Data!S:S)),#N/A)","v":{"$error":"#N/A"}},{"$f":"IF(K$6,IF(SUMIF(Data!$I:$I,$A45,Data!T:T)=0,#N/A,SUMIF(Data!$I:$I,$A45,Data!T:T)),#N/A)","v":{"$error":"#N/A"}},null,null,"Budgets",null,null,null,null,null,11,"Road condition","VOC","Road Condition Impacts","VOC"]
[{"$error":"#N/A"},{"$f":"IF(B$6,IF(SUMIF(Data!$I:$I,$A46,Data!K:K)=0,#N/A,SUMIF(Data!$I:$I,$A46,Data!K:K)),#N/A)","v":{"$error":"#N/A"}},{"$f":"IF(C$6,IF(SUMIF(Data!$I:$I,$A46,Data!L:L)=0,#N/A,SUMIF(Data!$I:$I,$A46,Data!L:L)),#N/A)","v":{"$error":"#N/A"}},{"$f":"IF(D$6,IF(SUMIF(Data!$I:$I,$A46,Data!M:M)=0,#N/A,SUMIF(Data!$I:$I,$A46,Data!M:M)),#N/A)","v":{"$error":"#N/A"}},{"$f":"IF(E$6,IF(SUMIF(Data!$I:$I,$A46,Data!N:N)=0,#N/A,SUMIF(Data!$I:$I,$A46,Data!N:N)),#N/A)","v":{"$error":"#N/A"}},{"$f":"IF(F$6,IF(SUMIF(Data!$I:$I,$A46,Data!O:O)=0,#N/A,SUMIF(Data!$I:$I,$A46,Data!O:O)),#N/A)","v":{"$error":"#N/A"}},{"$f":"IF(G$6,IF(SUMIF(Data!$I:$I,$A46,Data!P:P)=0,#N/A,SUMIF(Data!$I:$I,$A46,Data!P:P)),#N/A)","v":{"$error":"#N/A"}},{"$f":"IF(H$6,IF(SUMIF(Data!$I:$I,$A46,Data!Q:Q)=0,#N/A,SUMIF(Data!$I:$I,$A46,Data!Q:Q)),#N/A)","v":{"$error":"#N/A"}},{"$f":"IF(I$6,IF(SUMIF(Data!$I:$I,$A46,Data!R:R)=0,#N/A,SUMIF(Data!$I:$I,$A46,Data!R:R)),#N/A)","v":{"$error":"#N/A"}},{"$f":"IF(J$6,IF(SUMIF(Data!$I:$I,$A46,Data!S:S)=0,#N/A,SUMIF(Data!$I:$I,$A46,Data!S:S)),#N/A)","v":{"$error":"#N/A"}},{"$f":"IF(K$6,IF(SUMIF(Data!$I:$I,$A46,Data!T:T)=0,#N/A,SUMIF(Data!$I:$I,$A46,Data!T:T)),#N/A)","v":{"$error":"#N/A"}},null,null,"{Carriageway Input, Carriageway Output, Lighting, Skid}",null,null,null,null,null,12,"Road condition","Value of Time","Road Condition Impacts","Value of Time"]
[{"$error":"#N/A"},{"$f":"IF(B$6,IF(SUMIF(Data!$I:$I,$A47,Data!K:K)=0,#N/A,SUMIF(Data!$I:$I,$A47,Data!K:K)),#N/A)","v":{"$error":"#N/A"}},{"$f":"IF(C$6,IF(SUMIF(Data!$I:$I,$A47,Data!L:L)=0,#N/A,SUMIF(Data!$I:$I,$A47,Data!L:L)),#N/A)","v":{"$error":"#N/A"}},{"$f":"IF(D$6,IF(SUMIF(Data!$I:$I,$A47,Data!M:M)=0,#N/A,SUMIF(Data!$I:$I,$A47,Data!M:M)),#N/A)","v":{"$error":"#N/A"}},{"$f":"IF(E$6,IF(SUMIF(Data!$I:$I,$A47,Data!N:N)=0,#N/A,SUMIF(Data!$I:$I,$A47,Data!N:N)),#N/A)","v":{"$error":"#N/A"}},{"$f":"IF(F$6,IF(SUMIF(Data!$I:$I,$A47,Data!O:O)=0,#N/A,SUMIF(Data!$I:$I,$A47,Data!O:O)),#N/A)","v":{"$error":"#N/A"}},{"$f":"IF(G$6,IF(SUMIF(Data!$I:$I,$A47,Data!P:P)=0,#N/A,SUMIF(Data!$I:$I,$A47,Data!P:P)),#N/A)","v":{"$error":"#N/A"}},{"$f":"IF(H$6,IF(SUMIF(Data!$I:$I,$A47,Data!Q:Q)=0,#N/A,SUMIF(Data!$I:$I,$A47,Data!Q:Q)),#N/A)","v":{"$error":"#N/A"}},{"$f":"IF(I$6,IF(SUMIF(Data!$I:$I,$A47,Data!R:R)=0,#N/A,SUMIF(Data!$I:$I,$A47,Data!R:R)),#N/A)","v":{"$error":"#N/A"}},{"$f":"IF(J$6,IF(SUMIF(Data!$I:$I,$A47,Data!S:S)=0,#N/A,SUMIF(Data!$I:$I,$A47,Data!S:S)),#N/A)","v":{"$error":"#N/A"}},{"$f":"IF(K$6,IF(SUMIF(Data!$I:$I,$A47,Data!T:T)=0,#N/A,SUMIF(Data!$I:$I,$A47,Data!T:T)),#N/A)","v":{"$error":"#N/A"}},null,null,null,null,null,null,null,null,13,"Road condition","Carbon (from fuel)","Road Condition Impacts","Fuel"]
[{"$error":"#N/A"},{"$f":"IF(B$6,IF(SUMIF(Data!$I:$I,$A48,Data!K:K)=0,#N/A,SUMIF(Data!$I:$I,$A48,Data!K:K)),#N/A)","v":{"$error":"#N/A"}},{"$f":"IF(C$6,IF(SUMIF(Data!$I:$I,$A48,Data!L:L)=0,#N/A,SUMIF(Data!$I:$I,$A48,Data!L:L)),#N/A)","v":{"$error":"#N/A"}},{"$f":"IF(D$6,IF(SUMIF(Data!$I:$I,$A48,Data!M:M)=0,#N/A,SUMIF(Data!$I:$I,$A48,Data!M:M)),#N/A)","v":{"$error":"#N/A"}},{"$f":"IF(E$6,IF(SUMIF(Data!$I:$I,$A48,Data!N:N)=0,#N/A,SUMIF(Data!$I:$I,$A48,Data!N:N)),#N/A)","v":{"$error":"#N/A"}},{"$f":"IF(F$6,IF(SUMIF(Data!$I:$I,$A48,Data!O:O)=0,#N/A,SUMIF(Data!$I:$I,$A48,Data!O:O)),#N/A)","v":{"$error":"#N/A"}},{"$f":"IF(G$6,IF(SUMIF(Data!$I:$I,$A48,Data!P:P)=0,#N/A,SUMIF(Data!$I:$I,$A48,Data!P:P)),#N/A)","v":{"$error":"#N/A"}},{"$f":"IF(H$6,IF(SUMIF(Data!$I:$I,$A48,Data!Q:Q)=0,#N/A,SUMIF(Data!$I:$I,$A48,Data!Q:Q)),#N/A)","v":{"$error":"#N/A"}},{"$f":"IF(I$6,IF(SUMIF(Data!$I:$I,$A48,Data!R:R)=0,#N/A,SUMIF(Data!$I:$I,$A48,Data!R:R)),#N/A)","v":{"$error":"#N/A"}},{"$f":"IF(J$6,IF(SUMIF(Data!$I:$I,$A48,Data!S:S)=0,#N/A,SUMIF(Data!$I:$I,$A48,Data!S:S)),#N/A)","v":{"$error":"#N/A"}},{"$f":"IF(K$6,IF(SUMIF(Data!$I:$I,$A48,Data!T:T)=0,#N/A,SUMIF(Data!$I:$I,$A48,Data!T:T)),#N/A)","v":{"$error":"#N/A"}},null,null,"Drivers",null,null,null,null,null,14]
[{"$error":"#N/A"},{"$f":"IF(B$6,IF(SUMIF(Data!$I:$I,$A49,Data!K:K)=0,#N/A,SUMIF(Data!$I:$I,$A49,Data!K:K)),#N/A)","v":{"$error":"#N/A"}},{"$f":"IF(C$6,IF(SUMIF(Data!$I:$I,$A49,Data!L:L)=0,#N/A,SUMIF(Data!$I:$I,$A49,Data!L:L)),#N/A)","v":{"$error":"#N/A"}},{"$f":"IF(D$6,IF(SUMIF(Data!$I:$I,$A49,Data!M:M)=0,#N/A,SUMIF(Data!$I:$I,$A49,Data!M:M)),#N/A)","v":{"$error":"#N/A"}},{"$f":"IF(E$6,IF(SUMIF(Data!$I:$I,$A49,Data!N:N)=0,#N/A,SUMIF(Data!$I:$I,$A49,Data!N:N)),#N/A)","v":{"$error":"#N/A"}},{"$f":"IF(F$6,IF(SUMIF(Data!$I:$I,$A49,Data!O:O)=0,#N/A,SUMIF(Data!$I:$I,$A49,Data!O:O)),#N/A)","v":{"$error":"#N/A"}},{"$f":"IF(G$6,IF(SUMIF(Data!$I:$I,$A49,Data!P:P)=0,#N/A,SUMIF(Data!$I:$I,$A49,Data!P:P)),#N/A)","v":{"$error":"#N/A"}},{"$f":"IF(H$6,IF(SUMIF(Data!$I:$I,$A49,Data!Q:Q)=0,#N/A,SUMIF(Data!$I:$I,$A49,Data!Q:Q)),#N/A)","v":{"$error":"#N/A"}},{"$f":"IF(I$6,IF(SUMIF(Data!$I:$I,$A49,Data!R:R)=0,#N/A,SUMIF(Data!$I:$I,$A49,Data!R:R)),#N/A)","v":{"$error":"#N/A"}},{"$f":"IF(J$6,IF(SUMIF(Data!$I:$I,$A49,Data!S:S)=0,#N/A,SUMIF(Data!$I:$I,$A49,Data!S:S)),#N/A)","v":{"$error":"#N/A"}},{"$f":"IF(K$6,IF(SUMIF(Data!$I:$I,$A49,Data!T:T)=0,#N/A,SUMIF(Data!$I:$I,$A49,Data!T:T)),#N/A)","v":{"$error":"#N/A"}},null,null,"{Safety, Accessibility, Condition, Reliability, Customer Service, Environment}",null,null,null,null,null,15,"Carbon","Quantity","Material Carbon Quantity","Carbon Quantity"]
[{"$error":"#N/A"},{"$f":"IF(B$6,IF(SUMIF(Data!$I:$I,$A50,Data!K:K)=0,#N/A,SUMIF(Data!$I:$I,$A50,Data!K:K)),#N/A)","v":{"$error":"#N/A"}},{"$f":"IF(C$6,IF(SUMIF(Data!$I:$I,$A50,Data!L:L)=0,#N/A,SUMIF(Data!$I:$I,$A50,Data!L:L)),#N/A)","v":{"$error":"#N/A"}},{"$f":"IF(D$6,IF(SUMIF(Data!$I:$I,$A50,Data!M:M)=0,#N/A,SUMIF(Data!$I:$I,$A50,Data!M:M)),#N/A)","v":{"$error":"#N/A"}},{"$f":"IF(E$6,IF(SUMIF(Data!$I:$I,$A50,Data!N:N)=0,#N/A,SUMIF(Data!$I:$I,$A50,Data!N:N)),#N/A)","v":{"$error":"#N/A"}},{"$f":"IF(F$6,IF(SUMIF(Data!$I:$I,$A50,Data!O:O)=0,#N/A,SUMIF(Data!$I:$I,$A50,Data!O:O)),#N/A)","v":{"$error":"#N/A"}},{"$f":"IF(G$6,IF(SUMIF(Data!$I:$I,$A50,Data!P:P)=0,#N/A,SUMIF(Data!$I:$I,$A50,Data!P:P)),#N/A)","v":{"$error":"#N/A"}},{"$f":"IF(H$6,IF(SUMIF(Data!$I:$I,$A50,Data!Q:Q)=0,#N/A,SUMIF(Data!$I:$I,$A50,Data!Q:Q)),#N/A)","v":{"$error":"#N/A"}},{"$f":"IF(I$6,IF(SUMIF(Data!$I:$I,$A50,Data!R:R)=0,#N/A,SUMIF(Data!$I:$I,$A50,Data!R:R)),#N/A)","v":{"$error":"#N/A"}},{"$f":"IF(J$6,IF(SUMIF(Data!$I:$I,$A50,Data!S:S)=0,#N/A,SUMIF(Data!$I:$I,$A50,Data!S:S)),#N/A)","v":{"$error":"#N/A"}},{"$f":"IF(K$6,IF(SUMIF(Data!$I:$I,$A50,Data!T:T)=0,#N/A,SUMIF(Data!$I:$I,$A50,Data!T:T)),#N/A)","v":{"$error":"#N/A"}},null,null,null,null,null,null,null,null,16,"Carbon","Cost","Material Carbon Cost","Embodied Carbon Cost"]
[{"$error":"#N/A"},{"$f":"IF(B$6,IF(SUMIF(Data!$I:$I,$A51,Data!K:K)=0,#N/A,SUMIF(Data!$I:$I,$A51,Data!K:K)),#N/A)","v":{"$error":"#N/A"}},{"$f":"IF(C$6,IF(SUMIF(Data!$I:$I,$A51,Data!L:L)=0,#N/A,SUMIF(Data!$I:$I,$A51,Data!L:L)),#N/A)","v":{"$error":"#N/A"}},{"$f":"IF(D$6,IF(SUMIF(Data!$I:$I,$A51,Data!M:M)=0,#N/A,SUMIF(Data!$I:$I,$A51,Data!M:M)),#N/A)","v":{"$error":"#N/A"}},{"$f":"IF(E$6,IF(SUMIF(Data!$I:$I,$A51,Data!N:N)=0,#N/A,SUMIF(Data!$I:$I,$A51,Data!N:N)),#N/A)","v":{"$error":"#N/A"}},{"$f":"IF(F$6,IF(SUMIF(Data!$I:$I,$A51,Data!O:O)=0,#N/A,SUMIF(Data!$I:$I,$A51,Data!O:O)),#N/A)","v":{"$error":"#N/A"}},{"$f":"IF(G$6,IF(SUMIF(Data!$I:$I,$A51,Data!P:P)=0,#N/A,SUMIF(Data!$I:$I,$A51,Data!P:P)),#N/A)","v":{"$error":"#N/A"}},{"$f":"IF(H$6,IF(SUMIF(Data!$I:$I,$A51,Data!Q:Q)=0,#N/A,SUMIF(Data!$I:$I,$A51,Data!Q:Q)),#N/A)","v":{"$error":"#N/A"}},{"$f":"IF(I$6,IF(SUMIF(Data!$I:$I,$A51,Data!R:R)=0,#N/A,SUMIF(Data!$I:$I,$A51,Data!R:R)),#N/A)","v":{"$error":"#N/A"}},{"$f":"IF(J$6,IF(SUMIF(Data!$I:$I,$A51,Data!S:S)=0,#N/A,SUMIF(Data!$I:$I,$A51,Data!S:S)),#N/A)","v":{"$error":"#N/A"}},{"$f":"IF(K$6,IF(SUMIF(Data!$I:$I,$A51,Data!T:T)=0,#N/A,SUMIF(Data!$I:$I,$A51,Data!T:T)),#N/A)","v":{"$error":"#N/A"}},null,null,"Treatments",null,null,null,null,null,17]
[{"$error":"#N/A"},{"$f":"IF(B$6,IF(SUMIF(Data!$I:$I,$A52,Data!K:K)=0,#N/A,SUMIF(Data!$I:$I,$A52,Data!K:K)),#N/A)","v":{"$error":"#N/A"}},{"$f":"IF(C$6,IF(SUMIF(Data!$I:$I,$A52,Data!L:L)=0,#N/A,SUMIF(Data!$I:$I,$A52,Data!L:L)),#N/A)","v":{"$error":"#N/A"}},{"$f":"IF(D$6,IF(SUMIF(Data!$I:$I,$A52,Data!M:M)=0,#N/A,SUMIF(Data!$I:$I,$A52,Data!M:M)),#N/A)","v":{"$error":"#N/A"}},{"$f":"IF(E$6,IF(SUMIF(Data!$I:$I,$A52,Data!N:N)=0,#N/A,SUMIF(Data!$I:$I,$A52,Data!N:N)),#N/A)","v":{"$error":"#N/A"}},{"$f":"IF(F$6,IF(SUMIF(Data!$I:$I,$A52,Data!O:O)=0,#N/A,SUMIF(Data!$I:$I,$A52,Data!O:O)),#N/A)","v":{"$error":"#N/A"}},{"$f":"IF(G$6,IF(SUMIF(Data!$I:$I,$A52,Data!P:P)=0,#N/A,SUMIF(Data!$I:$I,$A52,Data!P:P)),#N/A)","v":{"$error":"#N/A"}},{"$f":"IF(H$6,IF(SUMIF(Data!$I:$I,$A52,Data!Q:Q)=0,#N/A,SUMIF(Data!$I:$I,$A52,Data!Q:Q)),#N/A)","v":{"$error":"#N/A"}},{"$f":"IF(I$6,IF(SUMIF(Data!$I:$I,$A52,Data!R:R)=0,#N/A,SUMIF(Data!$I:$I,$A52,Data!R:R)),#N/A)","v":{"$error":"#N/A"}},{"$f":"IF(J$6,IF(SUMIF(Data!$I:$I,$A52,Data!S:S)=0,#N/A,SUMIF(Data!$I:$I,$A52,Data!S:S)),#N/A)","v":{"$error":"#N/A"}},{"$f":"IF(K$6,IF(SUMIF(Data!$I:$I,$A52,Data!T:T)=0,#N/A,SUMIF(Data!$I:$I,$A52,Data!T:T)),#N/A)","v":{"$error":"#N/A"}},null,null,"{Treatment Costs}",null,null,null,null,null,18,"Budgets","Lighting","Activity Budgets","Lighting"]
[{"$error":"#N/A"},{"$f":"IF(B$6,IF(SUMIF(Data!$I:$I,$A53,Data!K:K)=0,#N/A,SUMIF(Data!$I:$I,$A53,Data!K:K)),#N/A)","v":{"$error":"#N/A"}},{"$f":"IF(C$6,IF(SUMIF(Data!$I:$I,$A53,Data!L:L)=0,#N/A,SUMIF(Data!$I:$I,$A53,Data!L:L)),#N/A)","v":{"$error":"#N/A"}},{"$f":"IF(D$6,IF(SUMIF(Data!$I:$I,$A53,Data!M:M)=0,#N/A,SUMIF(Data!$I:$I,$A53,Data!M:M)),#N/A)","v":{"$error":"#N/A"}},{"$f":"IF(E$6,IF(SUMIF(Data!$I:$I,$A53,Data!N:N)=0,#N/A,SUMIF(Data!$I:$I,$A53,Data!N:N)),#N/A)","v":{"$error":"#N/A"}},{"$f":"IF(F$6,IF(SUMIF(Data!$I:$I,$A53,Data!O:O)=0,#N/A,SUMIF(Data!$I:$I,$A53,Data!O:O)),#N/A)","v":{"$error":"#N/A"}},{"$f":"IF(G$6,IF(SUMIF(Data!$I:$I,$A53,Data!P:P)=0,#N/A,SUMIF(Data!$I:$I,$A53,Data!P:P)),#N/A)","v":{"$error":"#N/A"}},{"$f":"IF(H$6,IF(SUMIF(Data!$I:$I,$A53,Data!Q:Q)=0,#N/A,SUMIF(Data!$I:$I,$A53,Data!Q:Q)),#N/A)","v":{"$error":"#N/A"}},{"$f":"IF(I$6,IF(SUMIF(Data!$I:$I,$A53,Data!R:R)=0,#N/A,SUMIF(Data!$I:$I,$A53,Data!R:R)),#N/A)","v":{"$error":"#N/A"}},{"$f":"IF(J$6,IF(SUMIF(Data!$I:$I,$A53,Data!S:S)=0,#N/A,SUMIF(Data!$I:$I,$A53,Data!S:S)),#N/A)","v":{"$error":"#N/A"}},{"$f":"IF(K$6,IF(SUMIF(Data!$I:$I,$A53,Data!T:T)=0,#N/A,SUMIF(Data!$I:$I,$A53,Data!T:T)),#N/A)","v":{"$error":"#N/A"}},null,null,null,null,null,null,null,null,19,"Budgets","Skid","Activity Budgets","Skid"]
[{"$error":"#N/A"},{"$f":"IF(B$6,IF(SUMIF(Data!$I:$I,$A54,Data!K:K)=0,#N/A,SUMIF(Data!$I:$I,$A54,Data!K:K)),#N/A)","v":{"$error":"#N/A"}},{"$f":"IF(C$6,IF(SUMIF(Data!$I:$I,$A54,Data!L:L)=0,#N/A,SUMIF(Data!$I:$I,$A54,Data!L:L)),#N/A)","v":{"$error":"#N/A"}},{"$f":"IF(D$6,IF(SUMIF(Data!$I:$I,$A54,Data!M:M)=0,#N/A,SUMIF(Data!$I:$I,$A54,Data!M:M)),#N/A)","v":{"$error":"#N/A"}},{"$f":"IF(E$6,IF(SUMIF(Data!$I:$I,$A54,Data!N:N)=0,#N/A,SUMIF(Data!$I:$I,$A54,Data!N:N)),#N/A)","v":{"$error":"#N/A"}},{"$f":"IF(F$6,IF(SUMIF(Data!$I:$I,$A54,Data!O:O)=0,#N/A,SUMIF(Data!$I:$I,$A54,Data!O:O)),#N/A)","v":{"$error":"#N/A"}},{"$f":"IF(G$6,IF(SUMIF(Data!$I:$I,$A54,Data!P:P)=0,#N/A,SUMIF(Data!$I:$I,$A54,Data!P:P)),#N/A)","v":{"$error":"#N/A"}},{"$f":"IF(H$6,IF(SUMIF(Data!$I:$I,$A54,Data!Q:Q)=0,#N/A,SUMIF(Data!$I:$I,$A54,Data!Q:Q)),#N/A)","v":{"$error":"#N/A"}},{"$f":"IF(I$6,IF(SUMIF(Data!$I:$I,$A54,Data!R:R)=0,#N/A,SUMIF(Data!$I:$I,$A54,Data!R:R)),#N/A)","v":{"$error":"#N/A"}},{"$f":"IF(J$6,IF(SUMIF(Data!$I:$I,$A54,Data!S:S)=0,#N/A,SUMIF(Data!$I:$I,$A54,Data!S:S)),#N/A)","v":{"$error":"#N/A"}},{"$f":"IF(K$6,IF(SUMIF(Data!$I:$I,$A54,Data!T:T)=0,#N/A,SUMIF(Data!$I:$I,$A54,Data!T:T)),#N/A)","v":{"$error":"#N/A"}},null,null,null,null,null,null,null,null,20,"Budgets","carriageway output ","Expenditure by Treatment","Treatment Costs"]
[{"$error":"#N/A"},{"$f":"IF(B$6,IF(SUMIF(Data!$I:$I,$A55,Data!K:K)=0,#N/A,SUMIF(Data!$I:$I,$A55,Data!K:K)),#N/A)","v":{"$error":"#N/A"}},{"$f":"IF(C$6,IF(SUMIF(Data!$I:$I,$A55,Data!L:L)=0,#N/A,SUMIF(Data!$I:$I,$A55,Data!L:L)),#N/A)","v":{"$error":"#N/A"}},{"$f":"IF(D$6,IF(SUMIF(Data!$I:$I,$A55,Data!M:M)=0,#N/A,SUMIF(Data!$I:$I,$A55,Data!M:M)),#N/A)","v":{"$error":"#N/A"}},{"$f":"IF(E$6,IF(SUMIF(Data!$I:$I,$A55,Data!N:N)=0,#N/A,SUMIF(Data!$I:$I,$A55,Data!N:N)),#N/A)","v":{"$error":"#N/A"}},{"$f":"IF(F$6,IF(SUMIF(Data!$I:$I,$A55,Data!O:O)=0,#N/A,SUMIF(Data!$I:$I,$A55,Data!O:O)),#N/A)","v":{"$error":"#N/A"}},{"$f":"IF(G$6,IF(SUMIF(Data!$I:$I,$A55,Data!P:P)=0,#N/A,SUMIF(Data!$I:$I,$A55,Data!P:P)),#N/A)","v":{"$error":"#N/A"}},{"$f":"IF(H$6,IF(SUMIF(Data!$I:$I,$A55,Data!Q:Q)=0,#N/A,SUMIF(Data!$I:$I,$A55,Data!Q:Q)),#N/A)","v":{"$error":"#N/A"}},{"$f":"IF(I$6,IF(SUMIF(Data!$I:$I,$A55,Data!R:R)=0,#N/A,SUMIF(Data!$I:$I,$A55,Data!R:R)),#N/A)","v":{"$error":"#N/A"}},{"$f":"IF(J$6,IF(SUMIF(Data!$I:$I,$A55,Data!S:S)=0,#N/A,SUMIF(Data!$I:$I,$A55,Data!S:S)),#N/A)","v":{"$error":"#N/A"}},{"$f":"IF(K$6,IF(SUMIF(Data!$I:$I,$A55,Data!T:T)=0,#N/A,SUMIF(Data!$I:$I,$A55,Data!T:T)),#N/A)","v":{"$error":"#N/A"}},null,null,null,null,null,null,null,null,21]
[{"$error":"#N/A"},{"$f":"IF(B$6,IF(SUMIF(Data!$I:$I,$A56,Data!K:K)=0,#N/A,SUMIF(Data!$I:$I,$A56,Data!K:K)),#N/A)","v":{"$error":"#N/A"}},{"$f":"IF(C$6,IF(SUMIF(Data!$I:$I,$A56,Data!L:L)=0,#N/A,SUMIF(Data!$I:$I,$A56,Data!L:L)),#N/A)","v":{"$error":"#N/A"}},{"$f":"IF(D$6,IF(SUMIF(Data!$I:$I,$A56,Data!M:M)=0,#N/A,SUMIF(Data!$I:$I,$A56,Data!M:M)),#N/A)","v":{"$error":"#N/A"}},{"$f":"IF(E$6,IF(SUMIF(Data!$I:$I,$A56,Data!N:N)=0,#N/A,SUMIF(Data!$I:$I,$A56,Data!N:N)),#N/A)","v":{"$error":"#N/A"}},{"$f":"IF(F$6,IF(SUMIF(Data!$I:$I,$A56,Data!O:O)=0,#N/A,SUMIF(Data!$I:$I,$A56,Data!O:O)),#N/A)","v":{"$error":"#N/A"}},{"$f":"IF(G$6,IF(SUMIF(Data!$I:$I,$A56,Data!P:P)=0,#N/A,SUMIF(Data!$I:$I,$A56,Data!P:P)),#N/A)","v":{"$error":"#N/A"}},{"$f":"IF(H$6,IF(SUMIF(Data!$I:$I,$A56,Data!Q:Q)=0,#N/A,SUMIF(Data!$I:$I,$A56,Data!Q:Q)),#N/A)","v":{"$error":"#N/A"}},{"$f":"IF(I$6,IF(SUMIF(Data!$I:$I,$A56,Data!R:R)=0,#N/A,SUMIF(Data!$I:$I,$A56,Data!R:R)),#N/A)","v":{"$error":"#N/A"}},{"$f":"IF(J$6,IF(SUMIF(Data!$I:$I,$A56,Data!S:S)=0,#N/A,SUMIF(Data!$I:$I,$A56,Data!S:S)),#N/A)","v":{"$error":"#N/A"}},{"$f":"IF(K$6,IF(SUMIF(Data!$I:$I,$A56,Data!T:T)=0,#N/A,SUMIF(Data!$I:$I,$A56,Data!T:T)),#N/A)","v":{"$error":"#N/A"}},null,null,null,null,null,null,null,null,22]
[{"$error":"#N/A"},{"$f":"IF(B$6,IF(SUMIF(Data!$I:$I,$A57,Data!K:K)=0,#N/A,SUMIF(Data!$I:$I,$A57,Data!K:K)),#N/A)","v":{"$error":"#N/A"}},{"$f":"IF(C$6,IF(SUMIF(Data!$I:$I,$A57,Data!L:L)=0,#N/A,SUMIF(Data!$I:$I,$A57,Data!L:L)),#N/A)","v":{"$error":"#N/A"}},{"$f":"IF(D$6,IF(SUMIF(Data!$I:$I,$A57,Data!M:M)=0,#N/A,SUMIF(Data!$I:$I,$A57,Data!M:M)),#N/A)","v":{"$error":"#N/A"}},{"$f":"IF(E$6,IF(SUMIF(Data!$I:$I,$A57,Data!N:N)=0,#N/A,SUMIF(Data!$I:$I,$A57,Data!N:N)),#N/A)","v":{"$error":"#N/A"}},{"$f":"IF(F$6,IF(SUMIF(Data!$I:$I,$A57,Data!O:O)=0,#N/A,SUMIF(Data!$I:$I,$A57,Data!O:O)),#N/A)","v":{"$error":"#N/A"}},{"$f":"IF(G$6,IF(SUMIF(Data!$I:$I,$A57,Data!P:P)=0,#N/A,SUMIF(Data!$I:$I,$A57,Data!P:P)),#N/A)","v":{"$error":"#N/A"}},{"$f":"IF(H$6,IF(SUMIF(Data!$I:$I,$A57,Data!Q:Q)=0,#N/A,SUMIF(Data!$I:$I,$A57,Data!Q:Q)),#N/A)","v":{"$error":"#N/A"}},{"$f":"IF(I$6,IF(SUMIF(Data!$I:$I,$A57,Data!R:R)=0,#N/A,SUMIF(Data!$I:$I,$A57,Data!R:R)),#N/A)","v":{"$error":"#N/A"}},{"$f":"IF(J$6,IF(SUMIF(Data!$I:$I,$A57,Data!S:S)=0,#N/A,SUMIF(Data!$I:$I,$A57,Data!S:S)),#N/A)","v":{"$error":"#N/A"}},{"$f":"IF(K$6,IF(SUMIF(Data!$I:$I,$A57,Data!T:T)=0,#N/A,SUMIF(Data!$I:$I,$A57,Data!T:T)),#N/A)","v":{"$error":"#N/A"}},null,null,null,null,null,null,null,null,23,"Drivers","Safety","Activity Budgets","Safety Driver"]
[{"$error":"#N/A"},{"$f":"IF(B$6,IF(SUMIF(Data!$I:$I,$A58,Data!K:K)=0,#N/A,SUMIF(Data!$I:$I,$A58,Data!K:K)),#N/A)","v":{"$error":"#N/A"}},{"$f":"IF(C$6,IF(SUMIF(Data!$I:$I,$A58,Data!L:L)=0,#N/A,SUMIF(Data!$I:$I,$A58,Data!L:L)),#N/A)","v":{"$error":"#N/A"}},{"$f":"IF(D$6,IF(SUMIF(Data!$I:$I,$A58,Data!M:M)=0,#N/A,SUMIF(Data!$I:$I,$A58,Data!M:M)),#N/A)","v":{"$error":"#N/A"}},{"$f":"IF(E$6,IF(SUMIF(Data!$I:$I,$A58,Data!N:N)=0,#N/A,SUMIF(Data!$I:$I,$A58,Data!N:N)),#N/A)","v":{"$error":"#N/A"}},{"$f":"IF(F$6,IF(SUMIF(Data!$I:$I,$A58,Data!O:O)=0,#N/A,SUMIF(Data!$I:$I,$A58,Data!O:O)),#N/A)","v":{"$error":"#N/A"}},{"$f":"IF(G$6,IF(SUMIF(Data!$I:$I,$A58,Data!P:P)=0,#N/A,SUMIF(Data!$I:$I,$A58,Data!P:P)),#N/A)","v":{"$error":"#N/A"}},{"$f":"IF(H$6,IF(SUMIF(Data!$I:$I,$A58,Data!Q:Q)=0,#N/A,SUMIF(Data!$I:$I,$A58,Data!Q:Q)),#N/A)","v":{"$error":"#N/A"}},{"$f":"IF(I$6,IF(SUMIF(Data!$I:$I,$A58,Data!R:R)=0,#N/A,SUMIF(Data!$I:$I,$A58,Data!R:R)),#N/A)","v":{"$error":"#N/A"}},{"$f":"IF(J$6,IF(SUMIF(Data!$I:$I,$A58,Data!S:S)=0,#N/A,SUMIF(Data!$I:$I,$A58,Data!S:S)),#N/A)","v":{"$error":"#N/A"}},{"$f":"IF(K$6,IF(SUMIF(Data!$I:$I,$A58,Data!T:T)=0,#N/A,SUMIF(Data!$I:$I,$A58,Data!T:T)),#N/A)","v":{"$error":"#N/A"}},null,null,null,null,null,null,null,null,24,"Drivers","Accessibility","Activity Budgets","Accessability Driver"]
[{"$error":"#N/A"},{"$f":"IF(B$6,IF(SUMIF(Data!$I:$I,$A59,Data!K:K)=0,#N/A,SUMIF(Data!$I:$I,$A59,Data!K:K)),#N/A)","v":{"$error":"#N/A"}},{"$f":"IF(C$6,IF(SUMIF(Data!$I:$I,$A59,Data!L:L)=0,#N/A,SUMIF(Data!$I:$I,$A59,Data!L:L)),#N/A)","v":{"$error":"#N/A"}},{"$f":"IF(D$6,IF(SUMIF(Data!$I:$I,$A59,Data!M:M)=0,#N/A,SUMIF(Data!$I:$I,$A59,Data!M:M)),#N/A)","v":{"$error":"#N/A"}},{"$f":"IF(E$6,IF(SUMIF(Data!$I:$I,$A59,Data!N:N)=0,#N/A,SUMIF(Data!$I:$I,$A59,Data!N:N)),#N/A)","v":{"$error":"#N/A"}},{"$f":"IF(F$6,IF(SUMIF(Data!$I:$I,$A59,Data!O:O)=0,#N/A,SUMIF(Data!$I:$I,$A59,Data!O:O)),#N/A)","v":{"$error":"#N/A"}},{"$f":"IF(G$6,IF(SUMIF(Data!$I:$I,$A59,Data!P:P)=0,#N/A,SUMIF(Data!$I:$I,$A59,Data!P:P)),#N/A)","v":{"$error":"#N/A"}},{"$f":"IF(H$6,IF(SUMIF(Data!$I:$I,$A59,Data!Q:Q)=0,#N/A,SUMIF(Data!$I:$I,$A59,Data!Q:Q)),#N/A)","v":{"$error":"#N/A"}},{"$f":"IF(I$6,IF(SUMIF(Data!$I:$I,$A59,Data!R:R)=0,#N/A,SUMIF(Data!$I:$I,$A59,Data!R:R)),#N/A)","v":{"$error":"#N/A"}},{"$f":"IF(J$6,IF(SUMIF(Data!$I:$I,$A59,Data!S:S)=0,#N/A,SUMIF(Data!$I:$I,$A59,Data!S:S)),#N/A)","v":{"$error":"#N/A"}},{"$f":"IF(K$6,IF(SUMIF(Data!$I:$I,$A59,Data!T:T)=0,#N/A,SUMIF(Data!$I:$I,$A59,Data!T:T)),#N/A)","v":{"$error":"#N/A"}},null,null,null,null,null,null,null,null,25,"Drivers","Condition","Activity Budgets","Condition Driver"]
[{"$error":"#N/A"},{"$f":"IF(B$6,IF(SUMIF(Data!$I:$I,$A60,Data!K:K)=0,#N/A,SUMIF(Data!$I:$I,$A60,Data!K:K)),#N/A)","v":{"$error":"#N/A"}},{"$f":"IF(C$6,IF(SUMIF(Data!$I:$I,$A60,Data!L:L)=0,#N/A,SUMIF(Data!$I:$I,$A60,Data!L:L)),#N/A)","v":{"$error":"#N/A"}},{"$f":"IF(D$6,IF(SUMIF(Data!$I:$I,$A60,Data!M:M)=0,#N/A,SUMIF(Data!$I:$I,$A60,Data!M:M)),#N/A)","v":{"$error":"#N/A"}},{"$f":"IF(E$6,IF(SUMIF(Data!$I:$I,$A60,Data!N:N)=0,#N/A,SUMIF(Data!$I:$I,$A60,Data!N:N)),#N/A)","v":{"$error":"#N/A"}},{"$f":"IF(F$6,IF(SUMIF(Data!$I:$I,$A60,Data!O:O)=0,#N/A,SUMIF(Data!$I:$I,$A60,Data!O:O)),#N/A)","v":{"$error":"#N/A"}},{"$f":"IF(G$6,IF(SUMIF(Data!$I:$I,$A60,Data!P:P)=0,#N/A,SUMIF(Data!$I:$I,$A60,Data!P:P)),#N/A)","v":{"$error":"#N/A"}},{"$f":"IF(H$6,IF(SUMIF(Data!$I:$I,$A60,Data!Q:Q)=0,#N/A,SUMIF(Data!$I:$I,$A60,Data!Q:Q)),#N/A)","v":{"$error":"#N/A"}},{"$f":"IF(I$6,IF(SUMIF(Data!$I:$I,$A60,Data!R:R)=0,#N/A,SUMIF(Data!$I:$I,$A60,Data!R:R)),#N/A)","v":{"$error":"#N/A"}},{"$f":"IF(J$6,IF(SUMIF(Data!$I:$I,$A60,Data!S:S)=0,#N/A,SUMIF(Data!$I:$I,$A60,Data!S:S)),#N/A)","v":{"$error":"#N/A"}},{"$f":"IF(K$6,IF(SUMIF(Data!$I:$I,$A60,Data!T:T)=0,#N/A,SUMIF(Data!$I:$I,$A60,Data!T:T)),#N/A)","v":{"$error":"#N/A"}},null,null,null,null,null,null,null,null,26,"Drivers","Reliability","Activity Budgets","Reliability Driver"]
[{"$error":"#N/A"},{"$f":"IF(B$6,IF(SUMIF(Data!$I:$I,$A61,Data!K:K)=0,#N/A,SUMIF(Data!$I:$I,$A61,Data!K:K)),#N/A)","v":{"$error":"#N/A"}},{"$f":"IF(C$6,IF(SUMIF(Data!$I:$I,$A61,Data!L:L)=0,#N/A,SUMIF(Data!$I:$I,$A61,Data!L:L)),#N/A)","v":{"$error":"#N/A"}},{"$f":"IF(D$6,IF(SUMIF(Data!$I:$I,$A61,Data!M:M)=0,#N/A,SUMIF(Data!$I:$I,$A61,Data!M:M)),#N/A)","v":{"$error":"#N/A"}},{"$f":"IF(E$6,IF(SUMIF(Data!$I:$I,$A61,Data!N:N)=0,#N/A,SUMIF(Data!$I:$I,$A61,Data!N:N)),#N/A)","v":{"$error":"#N/A"}},{"$f":"IF(F$6,IF(SUMIF(Data!$I:$I,$A61,Data!O:O)=0,#N/A,SUMIF(Data!$I:$I,$A61,Data!O:O)),#N/A)","v":{"$error":"#N/A"}},{"$f":"IF(G$6,IF(SUMIF(Data!$I:$I,$A61,Data!P:P)=0,#N/A,SUMIF(Data!$I:$I,$A61,Data!P:P)),#N/A)","v":{"$error":"#N/A"}},{"$f":"IF(H$6,IF(SUMIF(Data!$I:$I,$A61,Data!Q:Q)=0,#N/A,SUMIF(Data!$I:$I,$A61,Data!Q:Q)),#N/A)","v":{"$error":"#N/A"}},{"$f":"IF(I$6,IF(SUMIF(Data!$I:$I,$A61,Data!R:R)=0,#N/A,SUMIF(Data!$I:$I,$A61,Data!R:R)),#N/A)","v":{"$error":"#N/A"}},{"$f":"IF(J$6,IF(SUMIF(Data!$I:$I,$A61,Data!S:S)=0,#N/A,SUMIF(Data!$I:$I,$A61,Data!S:S)),#N/A)","v":{"$error":"#N/A"}},{"$f":"IF(K$6,IF(SUMIF(Data!$I:$I,$A61,Data!T:T)=0,#N/A,SUMIF(Data!$I:$I,$A61,Data!T:T)),#N/A)","v":{"$error":"#N/A"}},null,null,null,null,null,null,null,null,27,"Drivers","Customer Service","Activity Budgets","Customer Service Driver"]
[{"$error":"#N/A"},{"$f":"IF(B$6,IF(SUMIF(Data!$I:$I,$A62,Data!K:K)=0,#N/A,SUMIF(Data!$I:$I,$A62,Data!K:K)),#N/A)","v":{"$error":"#N/A"}},{"$f":"IF(C$6,IF(SUMIF(Data!$I:$I,$A62,Data!L:L)=0,#N/A,SUMIF(Data!$I:$I,$A62,Data!L:L)),#N/A)","v":{"$error":"#N/A"}},{"$f":"IF(D$6,IF(SUMIF(Data!$I:$I,$A62,Data!M:M)=0,#N/A,SUMIF(Data!$I:$I,$A62,Data!M:M)),#N/A)","v":{"$error":"#N/A"}},{"$f":"IF(E$6,IF(SUMIF(Data!$I:$I,$A62,Data!N:N)=0,#N/A,SUMIF(Data!$I:$I,$A62,Data!N:N)),#N/A)","v":{"$error":"#N/A"}},{"$f":"IF(F$6,IF(SUMIF(Data!$I:$I,$A62,Data!O:O)=0,#N/A,SUMIF(Data!$I:$I,$A62,Data!O:O)),#N/A)","v":{"$error":"#N/A"}},{"$f":"IF(G$6,IF(SUMIF(Data!$I:$I,$A62,Data!P:P)=0,#N/A,SUMIF(Data!$I:$I,$A62,Data!P:P)),#N/A)","v":{"$error":"#N/A"}},{"$f":"IF(H$6,IF(SUMIF(Data!$I:$I,$A62,Data!Q:Q)=0,#N/A,SUMIF(Data!$I:$I,$A62,Data!Q:Q)),#N/A)","v":{"$error":"#N/A"}},{"$f":"IF(I$6,IF(SUMIF(Data!$I:$I,$A62,Data!R:R)=0,#N/A,SUMIF(Data!$I:$I,$A62,Data!R:R)),#N/A)","v":{"$error":"#N/A"}},{"$f":"IF(J$6,IF(SUMIF(Data!$I:$I,$A62,Data!S:S)=0,#N/A,SUMIF(Data!$I:$I,$A62,Data!S:S)),#N/A)","v":{"$error":"#N/A"}},{"$f":"IF(K$6,IF(SUMIF(Data!$I:$I,$A62,Data!T:T)=0,#N/A,SUMIF(Data!$I:$I,$A62,Data!T:T)),#N/A)","v":{"$error":"#N/A"}},null,null,null,null,null,null,null,null,28,"Drivers","Environment","Activity Budgets","Environment Driver"]
[{"$error":"#N/A"},{"$f":"IF(B$6,IF(SUMIF(Data!$I:$I,$A63,Data!K:K)=0,#N/A,SUMIF(Data!$I:$I,$A63,Data!K:K)),#N/A)","v":{"$error":"#N/A"}},{"$f":"IF(C$6,IF(SUMIF(Data!$I:$I,$A63,Data!L:L)=0,#N/A,SUMIF(Data!$I:$I,$A63,Data!L:L)),#N/A)","v":{"$error":"#N/A"}},{"$f":"IF(D$6,IF(SUMIF(Data!$I:$I,$A63,Data!M:M)=0,#N/A,SUMIF(Data!$I:$I,$A63,Data!M:M)),#N/A)","v":{"$error":"#N/A"}},{"$f":"IF(E$6,IF(SUMIF(Data!$I:$I,$A63,Data!N:N)=0,#N/A,SUMIF(Data!$I:$I,$A63,Data!N:N)),#N/A)","v":{"$error":"#N/A"}},{"$f":"IF(F$6,IF(SUMIF(Data!$I:$I,$A63,Data!O:O)=0,#N/A,SUMIF(Data!$I:$I,$A63,Data!O:O)),#N/A)","v":{"$error":"#N/A"}},{"$f":"IF(G$6,IF(SUMIF(Data!$I:$I,$A63,Data!P:P)=0,#N/A,SUMIF(Data!$I:$I,$A63,Data!P:P)),#N/A)","v":{"$error":"#N/A"}},{"$f":"IF(H$6,IF(SUMIF(Data!$I:$I,$A63,Data!Q:Q)=0,#N/A,SUMIF(Data!$I:$I,$A63,Data!Q:Q)),#N/A)","v":{"$error":"#N/A"}},{"$f":"IF(I$6,IF(SUMIF(Data!$I:$I,$A63,Data!R:R)=0,#N/A,SUMIF(Data!$I:$I,$A63,Data!R:R)),#N/A)","v":{"$error":"#N/A"}},{"$f":"IF(J$6,IF(SUMIF(Data!$I:$I,$A63,Data!S:S)=0,#N/A,SUMIF(Data!$I:$I,$A63,Data!S:S)),#N/A)","v":{"$error":"#N/A"}},{"$f":"IF(K$6,IF(SUMIF(Data!$I:$I,$A63,Data!T:T)=0,#N/A,SUMIF(Data!$I:$I,$A63,Data!T:T)),#N/A)","v":{"$error":"#N/A"}},null,null,null,null,null,null,null,null,29]
[{"$error":"#N/A"},{"$f":"IF(B$6,IF(SUMIF(Data!$I:$I,$A64,Data!K:K)=0,#N/A,SUMIF(Data!$I:$I,$A64,Data!K:K)),#N/A)","v":{"$error":"#N/A"}},{"$f":"IF(C$6,IF(SUMIF(Data!$I:$I,$A64,Data!L:L)=0,#N/A,SUMIF(Data!$I:$I,$A64,Data!L:L)),#N/A)","v":{"$error":"#N/A"}},{"$f":"IF(D$6,IF(SUMIF(Data!$I:$I,$A64,Data!M:M)=0,#N/A,SUMIF(Data!$I:$I,$A64,Data!M:M)),#N/A)","v":{"$error":"#N/A"}},{"$f":"IF(E$6,IF(SUMIF(Data!$I:$I,$A64,Data!N:N)=0,#N/A,SUMIF(Data!$I:$I,$A64,Data!N:N)),#N/A)","v":{"$error":"#N/A"}},{"$f":"IF(F$6,IF(SUMIF(Data!$I:$I,$A64,Data!O:O)=0,#N/A,SUMIF(Data!$I:$I,$A64,Data!O:O)),#N/A)","v":{"$error":"#N/A"}},{"$f":"IF(G$6,IF(SUMIF(Data!$I:$I,$A64,Data!P:P)=0,#N/A,SUMIF(Data!$I:$I,$A64,Data!P:P)),#N/A)","v":{"$error":"#N/A"}},{"$f":"IF(H$6,IF(SUMIF(Data!$I:$I,$A64,Data!Q:Q)=0,#N/A,SUMIF(Data!$I:$I,$A64,Data!Q:Q)),#N/A)","v":{"$error":"#N/A"}},{"$f":"IF(I$6,IF(SUMIF(Data!$I:$I,$A64,Data!R:R)=0,#N/A,SUMIF(Data!$I:$I,$A64,Data!R:R)),#N/A)","v":{"$error":"#N/A"}},{"$f":"IF(J$6,IF(SUMIF(Data!$I:$I,$A64,Data!S:S)=0,#N/A,SUMIF(Data!$I:$I,$A64,Data!S:S)),#N/A)","v":{"$error":"#N/A"}},{"$f":"IF(K$6,IF(SUMIF(Data!$I:$I,$A64,Data!T:T)=0,#N/A,SUMIF(Data!$I:$I,$A64,Data!T:T)),#N/A)","v":{"$error":"#N/A"}},null,null,null,null,null,null,null,null,30]
[{"$error":"#N/A"},{"$f":"IF(B$6,IF(SUMIF(Data!$I:$I,$A65,Data!K:K)=0,#N/A,SUMIF(Data!$I:$I,$A65,Data!K:K)),#N/A)","v":{"$error":"#N/A"}},{"$f":"IF(C$6,IF(SUMIF(Data!$I:$I,$A65,Data!L:L)=0,#N/A,SUMIF(Data!$I:$I,$A65,Data!L:L)),#N/A)","v":{"$error":"#N/A"}},{"$f":"IF(D$6,IF(SUMIF(Data!$I:$I,$A65,Data!M:M)=0,#N/A,SUMIF(Data!$I:$I,$A65,Data!M:M)),#N/A)","v":{"$error":"#N/A"}},{"$f":"IF(E$6,IF(SUMIF(Data!$I:$I,$A65,Data!N:N)=0,#N/A,SUMIF(Data!$I:$I,$A65,Data!N:N)),#N/A)","v":{"$error":"#N/A"}},{"$f":"IF(F$6,IF(SUMIF(Data!$I:$I,$A65,Data!O:O)=0,#N/A,SUMIF(Data!$I:$I,$A65,Data!O:O)),#N/A)","v":{"$error":"#N/A"}},{"$f":"IF(G$6,IF(SUMIF(Data!$I:$I,$A65,Data!P:P)=0,#N/A,SUMIF(Data!$I:$I,$A65,Data!P:P)),#N/A)","v":{"$error":"#N/A"}},{"$f":"IF(H$6,IF(SUMIF(Data!$I:$I,$A65,Data!Q:Q)=0,#N/A,SUMIF(Data!$I:$I,$A65,Data!Q:Q)),#N/A)","v":{"$error":"#N/A"}},{"$f":"IF(I$6,IF(SUMIF(Data!$I:$I,$A65,Data!R:R)=0,#N/A,SUMIF(Data!$I:$I,$A65,Data!R:R)),#N/A)","v":{"$error":"#N/A"}},{"$f":"IF(J$6,IF(SUMIF(Data!$I:$I,$A65,Data!S:S)=0,#N/A,SUMIF(Data!$I:$I,$A65,Data!S:S)),#N/A)","v":{"$error":"#N/A"}},{"$f":"IF(K$6,IF(SUMIF(Data!$I:$I,$A65,Data!T:T)=0,#N/A,SUMIF(Data!$I:$I,$A65,Data!T:T)),#N/A)","v":{"$error":"#N/A"}}]
[{"$error":"#N/A"},{"$f":"IF(B$6,IF(SUMIF(Data!$I:$I,$A66,Data!K:K)=0,#N/A,SUMIF(Data!$I:$I,$A66,Data!K:K)),#N/A)","v":{"$error":"#N/A"}},{"$f":"IF(C$6,IF(SUMIF(Data!$I:$I,$A66,Data!L:L)=0,#N/A,SUMIF(Data!$I:$I,$A66,Data!L:L)),#N/A)","v":{"$error":"#N/A"}},{"$f":"IF(D$6,IF(SUMIF(Data!$I:$I,$A66,Data!M:M)=0,#N/A,SUMIF(Data!$I:$I,$A66,Data!M:M)),#N/A)","v":{"$error":"#N/A"}},{"$f":"IF(E$6,IF(SUMIF(Data!$I:$I,$A66,Data!N:N)=0,#N/A,SUMIF(Data!$I:$I,$A66,Data!N:N)),#N/A)","v":{"$error":"#N/A"}},{"$f":"IF(F$6,IF(SUMIF(Data!$I:$I,$A66,Data!O:O)=0,#N/A,SUMIF(Data!$I:$I,$A66,Data!O:O)),#N/A)","v":{"$error":"#N/A"}},{"$f":"IF(G$6,IF(SUMIF(Data!$I:$I,$A66,Data!P:P)=0,#N/A,SUMIF(Data!$I:$I,$A66,Data!P:P)),#N/A)","v":{"$error":"#N/A"}},{"$f":"IF(H$6,IF(SUMIF(Data!$I:$I,$A66,Data!Q:Q)=0,#N/A,SUMIF(Data!$I:$I,$A66,Data!Q:Q)),#N/A)","v":{"$error":"#N/A"}},{"$f":"IF(I$6,IF(SUMIF(Data!$I:$I,$A66,Data!R:R)=0,#N/A,SUMIF(Data!$I:$I,$A66,Data!R:R)),#N/A)","v":{"$error":"#N/A"}},{"$f":"IF(J$6,IF(SUMIF(Data!$I:$I,$A66,Data!S:S)=0,#N/A,SUMIF(Data!$I:$I,$A66,Data!S:S)),#N/A)","v":{"$error":"#N/A"}},{"$f":"IF(K$6,IF(SUMIF(Data!$I:$I,$A66,Data!T:T)=0,#N/A,SUMIF(Data!$I:$I,$A66,Data!T:T)),#N/A)","v":{"$error":"#N/A"}}]
[{"$error":"#N/A"},{"$f":"IF(B$6,IF(SUMIF(Data!$I:$I,$A67,Data!K:K)=0,#N/A,SUMIF(Data!$I:$I,$A67,Data!K:K)),#N/A)","v":{"$error":"#N/A"}},{"$f":"IF(C$6,IF(SUMIF(Data!$I:$I,$A67,Data!L:L)=0,#N/A,SUMIF(Data!$I:$I,$A67,Data!L:L)),#N/A)","v":{"$error":"#N/A"}},{"$f":"IF(D$6,IF(SUMIF(Data!$I:$I,$A67,Data!M:M)=0,#N/A,SUMIF(Data!$I:$I,$A67,Data!M:M)),#N/A)","v":{"$error":"#N/A"}},{"$f":"IF(E$6,IF(SUMIF(Data!$I:$I,$A67,Data!N:N)=0,#N/A,SUMIF(Data!$I:$I,$A67,Data!N:N)),#N/A)","v":{"$error":"#N/A"}},{"$f":"IF(F$6,IF(SUMIF(Data!$I:$I,$A67,Data!O:O)=0,#N/A,SUMIF(Data!$I:$I,$A67,Data!O:O)),#N/A)","v":{"$error":"#N/A"}},{"$f":"IF(G$6,IF(SUMIF(Data!$I:$I,$A67,Data!P:P)=0,#N/A,SUMIF(Data!$I:$I,$A67,Data!P:P)),#N/A)","v":{"$error":"#N/A"}},{"$f":"IF(H$6,IF(SUMIF(Data!$I:$I,$A67,Data!Q:Q)=0,#N/A,SUMIF(Data!$I:$I,$A67,Data!Q:Q)),#N/A)","v":{"$error":"#N/A"}},{"$f":"IF(I$6,IF(SUMIF(Data!$I:$I,$A67,Data!R:R)=0,#N/A,SUMIF(Data!$I:$I,$A67,Data!R:R)),#N/A)","v":{"$error":"#N/A"}},{"$f":"IF(J$6,IF(SUMIF(Data!$I:$I,$A67,Data!S:S)=0,#N/A,SUMIF(Data!$I:$I,$A67,Data!S:S)),#N/A)","v":{"$error":"#N/A"}},{"$f":"IF(K$6,IF(SUMIF(Data!$I:$I,$A67,Data!T:T)=0,#N/A,SUMIF(Data!$I:$I,$A67,Data!T:T)),#N/A)","v":{"$error":"#N/A"}}]
[{"$error":"#N/A"},{"$f":"IF(B$6,IF(SUMIF(Data!$I:$I,$A68,Data!K:K)=0,#N/A,SUMIF(Data!$I:$I,$A68,Data!K:K)),#N/A)","v":{"$error":"#N/A"}},{"$f":"IF(C$6,IF(SUMIF(Data!$I:$I,$A68,Data!L:L)=0,#N/A,SUMIF(Data!$I:$I,$A68,Data!L:L)),#N/A)","v":{"$error":"#N/A"}},{"$f":"IF(D$6,IF(SUMIF(Data!$I:$I,$A68,Data!M:M)=0,#N/A,SUMIF(Data!$I:$I,$A68,Data!M:M)),#N/A)","v":{"$error":"#N/A"}},{"$f":"IF(E$6,IF(SUMIF(Data!$I:$I,$A68,Data!N:N)=0,#N/A,SUMIF(Data!$I:$I,$A68,Data!N:N)),#N/A)","v":{"$error":"#N/A"}},{"$f":"IF(F$6,IF(SUMIF(Data!$I:$I,$A68,Data!O:O)=0,#N/A,SUMIF(Data!$I:$I,$A68,Data!O:O)),#N/A)","v":{"$error":"#N/A"}},{"$f":"IF(G$6,IF(SUMIF(Data!$I:$I,$A68,Data!P:P)=0,#N/A,SUMIF(Data!$I:$I,$A68,Data!P:P)),#N/A)","v":{"$error":"#N/A"}},{"$f":"IF(H$6,IF(SUMIF(Data!$I:$I,$A68,Data!Q:Q)=0,#N/A,SUMIF(Data!$I:$I,$A68,Data!Q:Q)),#N/A)","v":{"$error":"#N/A"}},{"$f":"IF(I$6,IF(SUMIF(Data!$I:$I,$A68,Data!R:R)=0,#N/A,SUMIF(Data!$I:$I,$A68,Data!R:R)),#N/A)","v":{"$error":"#N/A"}},{"$f":"IF(J$6,IF(SUMIF(Data!$I:$I,$A68,Data!S:S)=0,#N/A,SUMIF(Data!$I:$I,$A68,Data!S:S)),#N/A)","v":{"$error":"#N/A"}},{"$f":"IF(K$6,IF(SUMIF(Data!$I:$I,$A68,Data!T:T)=0,#N/A,SUMIF(Data!$I:$I,$A68,Data!T:T)),#N/A)","v":{"$error":"#N/A"}}]
[{"$error":"#N/A"},{"$f":"IF(B$6,IF(SUMIF(Data!$I:$I,$A69,Data!K:K)=0,#N/A,SUMIF(Data!$I:$I,$A69,Data!K:K)),#N/A)","v":{"$error":"#N/A"}},{"$f":"IF(C$6,IF(SUMIF(Data!$I:$I,$A69,Data!L:L)=0,#N/A,SUMIF(Data!$I:$I,$A69,Data!L:L)),#N/A)","v":{"$error":"#N/A"}},{"$f":"IF(D$6,IF(SUMIF(Data!$I:$I,$A69,Data!M:M)=0,#N/A,SUMIF(Data!$I:$I,$A69,Data!M:M)),#N/A)","v":{"$error":"#N/A"}},{"$f":"IF(E$6,IF(SUMIF(Data!$I:$I,$A69,Data!N:N)=0,#N/A,SUMIF(Data!$I:$I,$A69,Data!N:N)),#N/A)","v":{"$error":"#N/A"}},{"$f":"IF(F$6,IF(SUMIF(Data!$I:$I,$A69,Data!O:O)=0,#N/A,SUMIF(Data!$I:$I,$A69,Data!O:O)),#N/A)","v":{"$error":"#N/A"}},{"$f":"IF(G$6,IF(SUMIF(Data!$I:$I,$A69,Data!P:P)=0,#N/A,SUMIF(Data!$I:$I,$A69,Data!P:P)),#N/A)","v":{"$error":"#N/A"}},{"$f":"IF(H$6,IF(SUMIF(Data!$I:$I,$A69,Data!Q:Q)=0,#N/A,SUMIF(Data!$I:$I,$A69,Data!Q:Q)),#N/A)","v":{"$error":"#N/A"}},{"$f":"IF(I$6,IF(SUMIF(Data!$I:$I,$A69,Data!R:R)=0,#N/A,SUMIF(Data!$I:$I,$A69,Data!R:R)),#N/A)","v":{"$error":"#N/A"}},{"$f":"IF(J$6,IF(SUMIF(Data!$I:$I,$A69,Data!S:S)=0,#N/A,SUMIF(Data!$I:$I,$A69,Data!S:S)),#N/A)","v":{"$error":"#N/A"}},{"$f":"IF(K$6,IF(SUMIF(Data!$I:$I,$A69,Data!T:T)=0,#N/A,SUMIF(Data!$I:$I,$A69,Data!T:T)),#N/A)","v":{"$error":"#N/A"}}]
[{"$error":"#N/A"},{"$f":"IF(B$6,IF(SUMIF(Data!$I:$I,$A70,Data!K:K)=0,#N/A,SUMIF(Data!$I:$I,$A70,Data!K:K)),#N/A)","v":{"$error":"#N/A"}},{"$f":"IF(C$6,IF(SUMIF(Data!$I:$I,$A70,Data!L:L)=0,#N/A,SUMIF(Data!$I:$I,$A70,Data!L:L)),#N/A)","v":{"$error":"#N/A"}},{"$f":"IF(D$6,IF(SUMIF(Data!$I:$I,$A70,Data!M:M)=0,#N/A,SUMIF(Data!$I:$I,$A70,Data!M:M)),#N/A)","v":{"$error":"#N/A"}},{"$f":"IF(E$6,IF(SUMIF(Data!$I:$I,$A70,Data!N:N)=0,#N/A,SUMIF(Data!$I:$I,$A70,Data!N:N)),#N/A)","v":{"$error":"#N/A"}},{"$f":"IF(F$6,IF(SUMIF(Data!$I:$I,$A70,Data!O:O)=0,#N/A,SUMIF(Data!$I:$I,$A70,Data!O:O)),#N/A)","v":{"$error":"#N/A"}},{"$f":"IF(G$6,IF(SUMIF(Data!$I:$I,$A70,Data!P:P)=0,#N/A,SUMIF(Data!$I:$I,$A70,Data!P:P)),#N/A)","v":{"$error":"#N/A"}},{"$f":"IF(H$6,IF(SUMIF(Data!$I:$I,$A70,Data!Q:Q)=0,#N/A,SUMIF(Data!$I:$I,$A70,Data!Q:Q)),#N/A)","v":{"$error":"#N/A"}},{"$f":"IF(I$6,IF(SUMIF(Data!$I:$I,$A70,Data!R:R)=0,#N/A,SUMIF(Data!$I:$I,$A70,Data!R:R)),#N/A)","v":{"$error":"#N/A"}},{"$f":"IF(J$6,IF(SUMIF(Data!$I:$I,$A70,Data!S:S)=0,#N/A,SUMIF(Data!$I:$I,$A70,Data!S:S)),#N/A)","v":{"$error":"#N/A"}},{"$f":"IF(K$6,IF(SUMIF(Data!$I:$I,$A70,Data!T:T)=0,#N/A,SUMIF(Data!$I:$I,$A70,Data!T:T)),#N/A)","v":{"$error":"#N/A"}}]
[{"$error":"#N/A"},{"$f":"IF(B$6,IF(SUMIF(Data!$I:$I,$A71,Data!K:K)=0,#N/A,SUMIF(Data!$I:$I,$A71,Data!K:K)),#N/A)","v":{"$error":"#N/A"}},{"$f":"IF(C$6,IF(SUMIF(Data!$I:$I,$A71,Data!L:L)=0,#N/A,SUMIF(Data!$I:$I,$A71,Data!L:L)),#N/A)","v":{"$error":"#N/A"}},{"$f":"IF(D$6,IF(SUMIF(Data!$I:$I,$A71,Data!M:M)=0,#N/A,SUMIF(Data!$I:$I,$A71,Data!M:M)),#N/A)","v":{"$error":"#N/A"}},{"$f":"IF(E$6,IF(SUMIF(Data!$I:$I,$A71,Data!N:N)=0,#N/A,SUMIF(Data!$I:$I,$A71,Data!N:N)),#N/A)","v":{"$error":"#N/A"}},{"$f":"IF(F$6,IF(SUMIF(Data!$I:$I,$A71,Data!O:O)=0,#N/A,SUMIF(Data!$I:$I,$A71,Data!O:O)),#N/A)","v":{"$error":"#N/A"}},{"$f":"IF(G$6,IF(SUMIF(Data!$I:$I,$A71,Data!P:P)=0,#N/A,SUMIF(Data!$I:$I,$A71,Data!P:P)),#N/A)","v":{"$error":"#N/A"}},{"$f":"IF(H$6,IF(SUMIF(Data!$I:$I,$A71,Data!Q:Q)=0,#N/A,SUMIF(Data!$I:$I,$A71,Data!Q:Q)),#N/A)","v":{"$error":"#N/A"}},{"$f":"IF(I$6,IF(SUMIF(Data!$I:$I,$A71,Data!R:R)=0,#N/A,SUMIF(Data!$I:$I,$A71,Data!R:R)),#N/A)","v":{"$error":"#N/A"}},{"$f":"IF(J$6,IF(SUMIF(Data!$I:$I,$A71,Data!S:S)=0,#N/A,SUMIF(Data!$I:$I,$A71,Data!S:S)),#N/A)","v":{"$error":"#N/A"}},{"$f":"IF(K$6,IF(SUMIF(Data!$I:$I,$A71,Data!T:T)=0,#N/A,SUMIF(Data!$I:$I,$A71,Data!T:T)),#N/A)","v":{"$error":"#N/A"}}]
[{"$error":"#N/A"},{"$f":"IF(B$6,IF(SUMIF(Data!$I:$I,$A72,Data!K:K)=0,#N/A,SUMIF(Data!$I:$I,$A72,Data!K:K)),#N/A)","v":{"$error":"#N/A"}},{"$f":"IF(C$6,IF(SUMIF(Data!$I:$I,$A72,Data!L:L)=0,#N/A,SUMIF(Data!$I:$I,$A72,Data!L:L)),#N/A)","v":{"$error":"#N/A"}},{"$f":"IF(D$6,IF(SUMIF(Data!$I:$I,$A72,Data!M:M)=0,#N/A,SUMIF(Data!$I:$I,$A72,Data!M:M)),#N/A)","v":{"$error":"#N/A"}},{"$f":"IF(E$6,IF(SUMIF(Data!$I:$I,$A72,Data!N:N)=0,#N/A,SUMIF(Data!$I:$I,$A72,Data!N:N)),#N/A)","v":{"$error":"#N/A"}},{"$f":"IF(F$6,IF(SUMIF(Data!$I:$I,$A72,Data!O:O)=0,#N/A,SUMIF(Data!$I:$I,$A72,Data!O:O)),#N/A)","v":{"$error":"#N/A"}},{"$f":"IF(G$6,IF(SUMIF(Data!$I:$I,$A72,Data!P:P)=0,#N/A,SUMIF(Data!$I:$I,$A72,Data!P:P)),#N/A)","v":{"$error":"#N/A"}},{"$f":"IF(H$6,IF(SUMIF(Data!$I:$I,$A72,Data!Q:Q)=0,#N/A,SUMIF(Data!$I:$I,$A72,Data!Q:Q)),#N/A)","v":{"$error":"#N/A"}},{"$f":"IF(I$6,IF(SUMIF(Data!$I:$I,$A72,Data!R:R)=0,#N/A,SUMIF(Data!$I:$I,$A72,Data!R:R)),#N/A)","v":{"$error":"#N/A"}},{"$f":"IF(J$6,IF(SUMIF(Data!$I:$I,$A72,Data!S:S)=0,#N/A,SUMIF(Data!$I:$I,$A72,Data!S:S)),#N/A)","v":{"$error":"#N/A"}},{"$f":"IF(K$6,IF(SUMIF(Data!$I:$I,$A72,Data!T:T)=0,#N/A,SUMIF(Data!$I:$I,$A72,Data!T:T)),#N/A)","v":{"$error":"#N/A"}}]
[{"$error":"#N/A"},{"$f":"IF(B$6,IF(SUMIF(Data!$I:$I,$A73,Data!K:K)=0,#N/A,SUMIF(Data!$I:$I,$A73,Data!K:K)),#N/A)","v":{"$error":"#N/A"}},{"$f":"IF(C$6,IF(SUMIF(Data!$I:$I,$A73,Data!L:L)=0,#N/A,SUMIF(Data!$I:$I,$A73,Data!L:L)),#N/A)","v":{"$error":"#N/A"}},{"$f":"IF(D$6,IF(SUMIF(Data!$I:$I,$A73,Data!M:M)=0,#N/A,SUMIF(Data!$I:$I,$A73,Data!M:M)),#N/A)","v":{"$error":"#N/A"}},{"$f":"IF(E$6,IF(SUMIF(Data!$I:$I,$A73,Data!N:N)=0,#N/A,SUMIF(Data!$I:$I,$A73,Data!N:N)),#N/A)","v":{"$error":"#N/A"}},{"$f":"IF(F$6,IF(SUMIF(Data!$I:$I,$A73,Data!O:O)=0,#N/A,SUMIF(Data!$I:$I,$A73,Data!O:O)),#N/A)","v":{"$error":"#N/A"}},{"$f":"IF(G$6,IF(SUMIF(Data!$I:$I,$A73,Data!P:P)=0,#N/A,SUMIF(Data!$I:$I,$A73,Data!P:P)),#N/A)","v":{"$error":"#N/A"}},{"$f":"IF(H$6,IF(SUMIF(Data!$I:$I,$A73,Data!Q:Q)=0,#N/A,SUMIF(Data!$I:$I,$A73,Data!Q:Q)),#N/A)","v":{"$error":"#N/A"}},{"$f":"IF(I$6,IF(SUMIF(Data!$I:$I,$A73,Data!R:R)=0,#N/A,SUMIF(Data!$I:$I,$A73,Data!R:R)),#N/A)","v":{"$error":"#N/A"}},{"$f":"IF(J$6,IF(SUMIF(Data!$I:$I,$A73,Data!S:S)=0,#N/A,SUMIF(Data!$I:$I,$A73,Data!S:S)),#N/A)","v":{"$error":"#N/A"}},{"$f":"IF(K$6,IF(SUMIF(Data!$I:$I,$A73,Data!T:T)=0,#N/A,SUMIF(Data!$I:$I,$A73,Data!T:T)),#N/A)","v":{"$error":"#N/A"}}]
[{"$error":"#N/A"},{"$f":"IF(B$6,IF(SUMIF(Data!$I:$I,$A74,Data!K:K)=0,#N/A,SUMIF(Data!$I:$I,$A74,Data!K:K)),#N/A)","v":{"$error":"#N/A"}},{"$f":"IF(C$6,IF(SUMIF(Data!$I:$I,$A74,Data!L:L)=0,#N/A,SUMIF(Data!$I:$I,$A74,Data!L:L)),#N/A)","v":{"$error":"#N/A"}},{"$f":"IF(D$6,IF(SUMIF(Data!$I:$I,$A74,Data!M:M)=0,#N/A,SUMIF(Data!$I:$I,$A74,Data!M:M)),#N/A)","v":{"$error":"#N/A"}},{"$f":"IF(E$6,IF(SUMIF(Data!$I:$I,$A74,Data!N:N)=0,#N/A,SUMIF(Data!$I:$I,$A74,Data!N:N)),#N/A)","v":{"$error":"#N/A"}},{"$f":"IF(F$6,IF(SUMIF(Data!$I:$I,$A74,Data!O:O)=0,#N/A,SUMIF(Data!$I:$I,$A74,Data!O:O)),#N/A)","v":{"$error":"#N/A"}},{"$f":"IF(G$6,IF(SUMIF(Data!$I:$I,$A74,Data!P:P)=0,#N/A,SUMIF(Data!$I:$I,$A74,Data!P:P)),#N/A)","v":{"$error":"#N/A"}},{"$f":"IF(H$6,IF(SUMIF(Data!$I:$I,$A74,Data!Q:Q)=0,#N/A,SUMIF(Data!$I:$I,$A74,Data!Q:Q)),#N/A)","v":{"$error":"#N/A"}},{"$f":"IF(I$6,IF(SUMIF(Data!$I:$I,$A74,Data!R:R)=0,#N/A,SUMIF(Data!$I:$I,$A74,Data!R:R)),#N/A)","v":{"$error":"#N/A"}},{"$f":"IF(J$6,IF(SUMIF(Data!$I:$I,$A74,Data!S:S)=0,#N/A,SUMIF(Data!$I:$I,$A74,Data!S:S)),#N/A)","v":{"$error":"#N/A"}},{"$f":"IF(K$6,IF(SUMIF(Data!$I:$I,$A74,Data!T:T)=0,#N/A,SUMIF(Data!$I:$I,$A74,Data!T:T)),#N/A)","v":{"$error":"#N/A"}}]
[{"$f":"IF(A74+1<$B$3,A74+1,#N/A)","v":{"$error":"#N/A"}},{"$f":"IF(B$6,IF(SUMIF(Data!$I:$I,$A75,Data!K:K)=0,#N/A,SUMIF(Data!$I:$I,$A75,Data!K:K)),#N/A)","v":{"$error":"#N/A"}},{"$f":"IF(C$6,IF(SUMIF(Data!$I:$I,$A75,Data!L:L)=0,#N/A,SUMIF(Data!$I:$I,$A75,Data!L:L)),#N/A)","v":{"$error":"#N/A"}},{"$f":"IF(D$6,IF(SUMIF(Data!$I:$I,$A75,Data!M:M)=0,#N/A,SUMIF(Data!$I:$I,$A75,Data!M:M)),#N/A)","v":{"$error":"#N/A"}},{"$f":"IF(E$6,IF(SUMIF(Data!$I:$I,$A75,Data!N:N)=0,#N/A,SUMIF(Data!$I:$I,$A75,Data!N:N)),#N/A)","v":{"$error":"#N/A"}},{"$f":"IF(F$6,IF(SUMIF(Data!$I:$I,$A75,Data!O:O)=0,#N/A,SUMIF(Data!$I:$I,$A75,Data!O:O)),#N/A)","v":{"$error":"#N/A"}},{"$f":"IF(G$6,IF(SUMIF(Data!$I:$I,$A75,Data!P:P)=0,#N/A,SUMIF(Data!$I:$I,$A75,Data!P:P)),#N/A)","v":{"$error":"#N/A"}},{"$f":"IF(H$6,IF(SUMIF(Data!$I:$I,$A75,Data!Q:Q)=0,#N/A,SUMIF(Data!$I:$I,$A75,Data!Q:Q)),#N/A)","v":{"$error":"#N/A"}},{"$f":"IF(I$6,IF(SUMIF(Data!$I:$I,$A75,Data!R:R)=0,#N/A,SUMIF(Data!$I:$I,$A75,Data!R:R)),#N/A)","v":{"$error":"#N/A"}},{"$f":"IF(J$6,IF(SUMIF(Data!$I:$I,$A75,Data!S:S)=0,#N/A,SUMIF(Data!$I:$I,$A75,Data!S:S)),#N/A)","v":{"$error":"#N/A"}},{"$f":"IF(K$6,IF(SUMIF(Data!$I:$I,$A75,Data!T:T)=0,#N/A,SUMIF(Data!$I:$I,$A75,Data!T:T)),#N/A)","v":{"$error":"#N/A"}}]
[{"$error":"#N/A"},{"$f":"IF(B$6,IF(SUMIF(Data!$I:$I,$A76,Data!K:K)=0,#N/A,SUMIF(Data!$I:$I,$A76,Data!K:K)),#N/A)","v":{"$error":"#N/A"}},{"$f":"IF(C$6,IF(SUMIF(Data!$I:$I,$A76,Data!L:L)=0,#N/A,SUMIF(Data!$I:$I,$A76,Data!L:L)),#N/A)","v":{"$error":"#N/A"}},{"$f":"IF(D$6,IF(SUMIF(Data!$I:$I,$A76,Data!M:M)=0,#N/A,SUMIF(Data!$I:$I,$A76,Data!M:M)),#N/A)","v":{"$error":"#N/A"}},{"$f":"IF(E$6,IF(SUMIF(Data!$I:$I,$A76,Data!N:N)=0,#N/A,SUMIF(Data!$I:$I,$A76,Data!N:N)),#N/A)","v":{"$error":"#N/A"}},{"$f":"IF(F$6,IF(SUMIF(Data!$I:$I,$A76,Data!O:O)=0,#N/A,SUMIF(Data!$I:$I,$A76,Data!O:O)),#N/A)","v":{"$error":"#N/A"}},{"$f":"IF(G$6,IF(SUMIF(Data!$I:$I,$A76,Data!P:P)=0,#N/A,SUMIF(Data!$I:$I,$A76,Data!P:P)),#N/A)","v":{"$error":"#N/A"}},{"$f":"IF(H$6,IF(SUMIF(Data!$I:$I,$A76,Data!Q:Q)=0,#N/A,SUMIF(Data!$I:$I,$A76,Data!Q:Q)),#N/A)","v":{"$error":"#N/A"}},{"$f":"IF(I$6,IF(SUMIF(Data!$I:$I,$A76,Data!R:R)=0,#N/A,SUMIF(Data!$I:$I,$A76,Data!R:R)),#N/A)","v":{"$error":"#N/A"}},{"$f":"IF(J$6,IF(SUMIF(Data!$I:$I,$A76,Data!S:S)=0,#N/A,SUMIF(Data!$I:$I,$A76,Data!S:S)),#N/A)","v":{"$error":"#N/A"}},{"$f":"IF(K$6,IF(SUMIF(Data!$I:$I,$A76,Data!T:T)=0,#N/A,SUMIF(Data!$I:$I,$A76,Data!T:T)),#N/A)","v":{"$error":"#N/A"}}]
[{"$error":"#N/A"},{"$f":"IF(B$6,IF(SUMIF(Data!$I:$I,$A77,Data!K:K)=0,#N/A,SUMIF(Data!$I:$I,$A77,Data!K:K)),#N/A)","v":{"$error":"#N/A"}},{"$f":"IF(C$6,IF(SUMIF(Data!$I:$I,$A77,Data!L:L)=0,#N/A,SUMIF(Data!$I:$I,$A77,Data!L:L)),#N/A)","v":{"$error":"#N/A"}},{"$f":"IF(D$6,IF(SUMIF(Data!$I:$I,$A77,Data!M:M)=0,#N/A,SUMIF(Data!$I:$I,$A77,Data!M:M)),#N/A)","v":{"$error":"#N/A"}},{"$f":"IF(E$6,IF(SUMIF(Data!$I:$I,$A77,Data!N:N)=0,#N/A,SUMIF(Data!$I:$I,$A77,Data!N:N)),#N/A)","v":{"$error":"#N/A"}},{"$f":"IF(F$6,IF(SUMIF(Data!$I:$I,$A77,Data!O:O)=0,#N/A,SUMIF(Data!$I:$I,$A77,Data!O:O)),#N/A)","v":{"$error":"#N/A"}},{"$f":"IF(G$6,IF(SUMIF(Data!$I:$I,$A77,Data!P:P)=0,#N/A,SUMIF(Data!$I:$I,$A77,Data!P:P)),#N/A)","v":{"$error":"#N/A"}},{"$f":"IF(H$6,IF(SUMIF(Data!$I:$I,$A77,Data!Q:Q)=0,#N/A,SUMIF(Data!$I:$I,$A77,Data!Q:Q)),#N/A)","v":{"$error":"#N/A"}},{"$f":"IF(I$6,IF(SUMIF(Data!$I:$I,$A77,Data!R:R)=0,#N/A,SUMIF(Data!$I:$I,$A77,Data!R:R)),#N/A)","v":{"$error":"#N/A"}},{"$f":"IF(J$6,IF(SUMIF(Data!$I:$I,$A77,Data!S:S)=0,#N/A,SUMIF(Data!$I:$I,$A77,Data!S:S)),#N/A)","v":{"$error":"#N/A"}},{"$f":"IF(K$6,IF(SUMIF(Data!$I:$I,$A77,Data!T:T)=0,#N/A,SUMIF(Data!$I:$I,$A77,Data!T:T)),#N/A)","v":{"$error":"#N/A"}}]
[{"$error":"#N/A"},{"$f":"IF(B$6,IF(SUMIF(Data!$I:$I,$A78,Data!K:K)=0,#N/A,SUMIF(Data!$I:$I,$A78,Data!K:K)),#N/A)","v":{"$error":"#N/A"}},{"$f":"IF(C$6,IF(SUMIF(Data!$I:$I,$A78,Data!L:L)=0,#N/A,SUMIF(Data!$I:$I,$A78,Data!L:L)),#N/A)","v":{"$error":"#N/A"}},{"$f":"IF(D$6,IF(SUMIF(Data!$I:$I,$A78,Data!M:M)=0,#N/A,SUMIF(Data!$I:$I,$A78,Data!M:M)),#N/A)","v":{"$error":"#N/A"}},{"$f":"IF(E$6,IF(SUMIF(Data!$I:$I,$A78,Data!N:N)=0,#N/A,SUMIF(Data!$I:$I,$A78,Data!N:N)),#N/A)","v":{"$error":"#N/A"}},{"$f":"IF(F$6,IF(SUMIF(Data!$I:$I,$A78,Data!O:O)=0,#N/A,SUMIF(Data!$I:$I,$A78,Data!O:O)),#N/A)","v":{"$error":"#N/A"}},{"$f":"IF(G$6,IF(SUMIF(Data!$I:$I,$A78,Data!P:P)=0,#N/A,SUMIF(Data!$I:$I,$A78,Data!P:P)),#N/A)","v":{"$error":"#N/A"}},{"$f":"IF(H$6,IF(SUMIF(Data!$I:$I,$A78,Data!Q:Q)=0,#N/A,SUMIF(Data!$I:$I,$A78,Data!Q:Q)),#N/A)","v":{"$error":"#N/A"}},{"$f":"IF(I$6,IF(SUMIF(Data!$I:$I,$A78,Data!R:R)=0,#N/A,SUMIF(Data!$I:$I,$A78,Data!R:R)),#N/A)","v":{"$error":"#N/A"}},{"$f":"IF(J$6,IF(SUMIF(Data!$I:$I,$A78,Data!S:S)=0,#N/A,SUMIF(Data!$I:$I,$A78,Data!S:S)),#N/A)","v":{"$error":"#N/A"}},{"$f":"IF(K$6,IF(SUMIF(Data!$I:$I,$A78,Data!T:T)=0,#N/A,SUMIF(Data!$I:$I,$A78,Data!T:T)),#N/A)","v":{"$error":"#N/A"}}]
[{"$error":"#N/A"},{"$f":"IF(B$6,IF(SUMIF(Data!$I:$I,$A79,Data!K:K)=0,#N/A,SUMIF(Data!$I:$I,$A79,Data!K:K)),#N/A)","v":{"$error":"#N/A"}},{"$f":"IF(C$6,IF(SUMIF(Data!$I:$I,$A79,Data!L:L)=0,#N/A,SUMIF(Data!$I:$I,$A79,Data!L:L)),#N/A)","v":{"$error":"#N/A"}},{"$f":"IF(D$6,IF(SUMIF(Data!$I:$I,$A79,Data!M:M)=0,#N/A,SUMIF(Data!$I:$I,$A79,Data!M:M)),#N/A)","v":{"$error":"#N/A"}},{"$f":"IF(E$6,IF(SUMIF(Data!$I:$I,$A79,Data!N:N)=0,#N/A,SUMIF(Data!$I:$I,$A79,Data!N:N)),#N/A)","v":{"$error":"#N/A"}},{"$f":"IF(F$6,IF(SUMIF(Data!$I:$I,$A79,Data!O:O)=0,#N/A,SUMIF(Data!$I:$I,$A79,Data!O:O)),#N/A)","v":{"$error":"#N/A"}},{"$f":"IF(G$6,IF(SUMIF(Data!$I:$I,$A79,Data!P:P)=0,#N/A,SUMIF(Data!$I:$I,$A79,Data!P:P)),#N/A)","v":{"$error":"#N/A"}},{"$f":"IF(H$6,IF(SUMIF(Data!$I:$I,$A79,Data!Q:Q)=0,#N/A,SUMIF(Data!$I:$I,$A79,Data!Q:Q)),#N/A)","v":{"$error":"#N/A"}},{"$f":"IF(I$6,IF(SUMIF(Data!$I:$I,$A79,Data!R:R)=0,#N/A,SUMIF(Data!$I:$I,$A79,Data!R:R)),#N/A)","v":{"$error":"#N/A"}},{"$f":"IF(J$6,IF(SUMIF(Data!$I:$I,$A79,Data!S:S)=0,#N/A,SUMIF(Data!$I:$I,$A79,Data!S:S)),#N/A)","v":{"$error":"#N/A"}},{"$f":"IF(K$6,IF(SUMIF(Data!$I:$I,$A79,Data!T:T)=0,#N/A,SUMIF(Data!$I:$I,$A79,Data!T:T)),#N/A)","v":{"$error":"#N/A"}}]
[{"$error":"#N/A"},{"$f":"IF(B$6,IF(SUMIF(Data!$I:$I,$A80,Data!K:K)=0,#N/A,SUMIF(Data!$I:$I,$A80,Data!K:K)),#N/A)","v":{"$error":"#N/A"}},{"$f":"IF(C$6,IF(SUMIF(Data!$I:$I,$A80,Data!L:L)=0,#N/A,SUMIF(Data!$I:$I,$A80,Data!L:L)),#N/A)","v":{"$error":"#N/A"}},{"$f":"IF(D$6,IF(SUMIF(Data!$I:$I,$A80,Data!M:M)=0,#N/A,SUMIF(Data!$I:$I,$A80,Data!M:M)),#N/A)","v":{"$error":"#N/A"}},{"$f":"IF(E$6,IF(SUMIF(Data!$I:$I,$A80,Data!N:N)=0,#N/A,SUMIF(Data!$I:$I,$A80,Data!N:N)),#N/A)","v":{"$error":"#N/A"}},{"$f":"IF(F$6,IF(SUMIF(Data!$I:$I,$A80,Data!O:O)=0,#N/A,SUMIF(Data!$I:$I,$A80,Data!O:O)),#N/A)","v":{"$error":"#N/A"}},{"$f":"IF(G$6,IF(SUMIF(Data!$I:$I,$A80,Data!P:P)=0,#N/A,SUMIF(Data!$I:$I,$A80,Data!P:P)),#N/A)","v":{"$error":"#N/A"}},{"$f":"IF(H$6,IF(SUMIF(Data!$I:$I,$A80,Data!Q:Q)=0,#N/A,SUMIF(Data!$I:$I,$A80,Data!Q:Q)),#N/A)","v":{"$error":"#N/A"}},{"$f":"IF(I$6,IF(SUMIF(Data!$I:$I,$A80,Data!R:R)=0,#N/A,SUMIF(Data!$I:$I,$A80,Data!R:R)),#N/A)","v":{"$error":"#N/A"}},{"$f":"IF(J$6,IF(SUMIF(Data!$I:$I,$A80,Data!S:S)=0,#N/A,SUMIF(Data!$I:$I,$A80,Data!S:S)),#N/A)","v":{"$error":"#N/A"}},{"$f":"IF(K$6,IF(SUMIF(Data!$I:$I,$A80,Data!T:T)=0,#N/A,SUMIF(Data!$I:$I,$A80,Data!T:T)),#N/A)","v":{"$error":"#N/A"}}]
[{"$error":"#N/A"},{"$f":"IF(B$6,IF(SUMIF(Data!$I:$I,$A81,Data!K:K)=0,#N/A,SUMIF(Data!$I:$I,$A81,Data!K:K)),#N/A)","v":{"$error":"#N/A"}},{"$f":"IF(C$6,IF(SUMIF(Data!$I:$I,$A81,Data!L:L)=0,#N/A,SUMIF(Data!$I:$I,$A81,Data!L:L)),#N/A)","v":{"$error":"#N/A"}},{"$f":"IF(D$6,IF(SUMIF(Data!$I:$I,$A81,Data!M:M)=0,#N/A,SUMIF(Data!$I:$I,$A81,Data!M:M)),#N/A)","v":{"$error":"#N/A"}},{"$f":"IF(E$6,IF(SUMIF(Data!$I:$I,$A81,Data!N:N)=0,#N/A,SUMIF(Data!$I:$I,$A81,Data!N:N)),#N/A)","v":{"$error":"#N/A"}},{"$f":"IF(F$6,IF(SUMIF(Data!$I:$I,$A81,Data!O:O)=0,#N/A,SUMIF(Data!$I:$I,$A81,Data!O:O)),#N/A)","v":{"$error":"#N/A"}},{"$f":"IF(G$6,IF(SUMIF(Data!$I:$I,$A81,Data!P:P)=0,#N/A,SUMIF(Data!$I:$I,$A81,Data!P:P)),#N/A)","v":{"$error":"#N/A"}},{"$f":"IF(H$6,IF(SUMIF(Data!$I:$I,$A81,Data!Q:Q)=0,#N/A,SUMIF(Data!$I:$I,$A81,Data!Q:Q)),#N/A)","v":{"$error":"#N/A"}},{"$f":"IF(I$6,IF(SUMIF(Data!$I:$I,$A81,Data!R:R)=0,#N/A,SUMIF(Data!$I:$I,$A81,Data!R:R)),#N/A)","v":{"$error":"#N/A"}},{"$f":"IF(J$6,IF(SUMIF(Data!$I:$I,$A81,Data!S:S)=0,#N/A,SUMIF(Data!$I:$I,$A81,Data!S:S)),#N/A)","v":{"$error":"#N/A"}},{"$f":"IF(K$6,IF(SUMIF(Data!$I:$I,$A81,Data!T:T)=0,#N/A,SUMIF(Data!$I:$I,$A81,Data!T:T)),#N/A)","v":{"$error":"#N/A"}}]
[{"$error":"#N/A"},{"$f":"IF(B$6,IF(SUMIF(Data!$I:$I,$A82,Data!K:K)=0,#N/A,SUMIF(Data!$I:$I,$A82,Data!K:K)),#N/A)","v":{"$error":"#N/A"}},{"$f":"IF(C$6,IF(SUMIF(Data!$I:$I,$A82,Data!L:L)=0,#N/A,SUMIF(Data!$I:$I,$A82,Data!L:L)),#N/A)","v":{"$error":"#N/A"}},{"$f":"IF(D$6,IF(SUMIF(Data!$I:$I,$A82,Data!M:M)=0,#N/A,SUMIF(Data!$I:$I,$A82,Data!M:M)),#N/A)","v":{"$error":"#N/A"}},{"$f":"IF(E$6,IF(SUMIF(Data!$I:$I,$A82,Data!N:N)=0,#N/A,SUMIF(Data!$I:$I,$A82,Data!N:N)),#N/A)","v":{"$error":"#N/A"}},{"$f":"IF(F$6,IF(SUMIF(Data!$I:$I,$A82,Data!O:O)=0,#N/A,SUMIF(Data!$I:$I,$A82,Data!O:O)),#N/A)","v":{"$error":"#N/A"}},{"$f":"IF(G$6,IF(SUMIF(Data!$I:$I,$A82,Data!P:P)=0,#N/A,SUMIF(Data!$I:$I,$A82,Data!P:P)),#N/A)","v":{"$error":"#N/A"}},{"$f":"IF(H$6,IF(SUMIF(Data!$I:$I,$A82,Data!Q:Q)=0,#N/A,SUMIF(Data!$I:$I,$A82,Data!Q:Q)),#N/A)","v":{"$error":"#N/A"}},{"$f":"IF(I$6,IF(SUMIF(Data!$I:$I,$A82,Data!R:R)=0,#N/A,SUMIF(Data!$I:$I,$A82,Data!R:R)),#N/A)","v":{"$error":"#N/A"}},{"$f":"IF(J$6,IF(SUMIF(Data!$I:$I,$A82,Data!S:S)=0,#N/A,SUMIF(Data!$I:$I,$A82,Data!S:S)),#N/A)","v":{"$error":"#N/A"}},{"$f":"IF(K$6,IF(SUMIF(Data!$I:$I,$A82,Data!T:T)=0,#N/A,SUMIF(Data!$I:$I,$A82,Data!T:T)),#N/A)","v":{"$error":"#N/A"}}]
[{"$error":"#N/A"},{"$f":"IF(B$6,IF(SUMIF(Data!$I:$I,$A83,Data!K:K)=0,#N/A,SUMIF(Data!$I:$I,$A83,Data!K:K)),#N/A)","v":{"$error":"#N/A"}},{"$f":"IF(C$6,IF(SUMIF(Data!$I:$I,$A83,Data!L:L)=0,#N/A,SUMIF(Data!$I:$I,$A83,Data!L:L)),#N/A)","v":{"$error":"#N/A"}},{"$f":"IF(D$6,IF(SUMIF(Data!$I:$I,$A83,Data!M:M)=0,#N/A,SUMIF(Data!$I:$I,$A83,Data!M:M)),#N/A)","v":{"$error":"#N/A"}},{"$f":"IF(E$6,IF(SUMIF(Data!$I:$I,$A83,Data!N:N)=0,#N/A,SUMIF(Data!$I:$I,$A83,Data!N:N)),#N/A)","v":{"$error":"#N/A"}},{"$f":"IF(F$6,IF(SUMIF(Data!$I:$I,$A83,Data!O:O)=0,#N/A,SUMIF(Data!$I:$I,$A83,Data!O:O)),#N/A)","v":{"$error":"#N/A"}},{"$f":"IF(G$6,IF(SUMIF(Data!$I:$I,$A83,Data!P:P)=0,#N/A,SUMIF(Data!$I:$I,$A83,Data!P:P)),#N/A)","v":{"$error":"#N/A"}},{"$f":"IF(H$6,IF(SUMIF(Data!$I:$I,$A83,Data!Q:Q)=0,#N/A,SUMIF(Data!$I:$I,$A83,Data!Q:Q)),#N/A)","v":{"$error":"#N/A"}},{"$f":"IF(I$6,IF(SUMIF(Data!$I:$I,$A83,Data!R:R)=0,#N/A,SUMIF(Data!$I:$I,$A83,Data!R:R)),#N/A)","v":{"$error":"#N/A"}},{"$f":"IF(J$6,IF(SUMIF(Data!$I:$I,$A83,Data!S:S)=0,#N/A,SUMIF(Data!$I:$I,$A83,Data!S:S)),#N/A)","v":{"$error":"#N/A"}},{"$f":"IF(K$6,IF(SUMIF(Data!$I:$I,$A83,Data!T:T)=0,#N/A,SUMIF(Data!$I:$I,$A83,Data!T:T)),#N/A)","v":{"$error":"#N/A"}}]
[{"$error":"#N/A"},{"$f":"IF(B$6,IF(SUMIF(Data!$I:$I,$A84,Data!K:K)=0,#N/A,SUMIF(Data!$I:$I,$A84,Data!K:K)),#N/A)","v":{"$error":"#N/A"}},{"$f":"IF(C$6,IF(SUMIF(Data!$I:$I,$A84,Data!L:L)=0,#N/A,SUMIF(Data!$I:$I,$A84,Data!L:L)),#N/A)","v":{"$error":"#N/A"}},{"$f":"IF(D$6,IF(SUMIF(Data!$I:$I,$A84,Data!M:M)=0,#N/A,SUMIF(Data!$I:$I,$A84,Data!M:M)),#N/A)","v":{"$error":"#N/A"}},{"$f":"IF(E$6,IF(SUMIF(Data!$I:$I,$A84,Data!N:N)=0,#N/A,SUMIF(Data!$I:$I,$A84,Data!N:N)),#N/A)","v":{"$error":"#N/A"}},{"$f":"IF(F$6,IF(SUMIF(Data!$I:$I,$A84,Data!O:O)=0,#N/A,SUMIF(Data!$I:$I,$A84,Data!O:O)),#N/A)","v":{"$error":"#N/A"}},{"$f":"IF(G$6,IF(SUMIF(Data!$I:$I,$A84,Data!P:P)=0,#N/A,SUMIF(Data!$I:$I,$A84,Data!P:P)),#N/A)","v":{"$error":"#N/A"}},{"$f":"IF(H$6,IF(SUMIF(Data!$I:$I,$A84,Data!Q:Q)=0,#N/A,SUMIF(Data!$I:$I,$A84,Data!Q:Q)),#N/A)","v":{"$error":"#N/A"}},{"$f":"IF(I$6,IF(SUMIF(Data!$I:$I,$A84,Data!R:R)=0,#N/A,SUMIF(Data!$I:$I,$A84,Data!R:R)),#N/A)","v":{"$error":"#N/A"}},{"$f":"IF(J$6,IF(SUMIF(Data!$I:$I,$A84,Data!S:S)=0,#N/A,SUMIF(Data!$I:$I,$A84,Data!S:S)),#N/A)","v":{"$error":"#N/A"}},{"$f":"IF(K$6,IF(SUMIF(Data!$I:$I,$A84,Data!T:T)=0,#N/A,SUMIF(Data!$I:$I,$A84,Data!T:T)),#N/A)","v":{"$error":"#N/A"}}]
[{"$error":"#N/A"},{"$f":"IF(B$6,IF(SUMIF(Data!$I:$I,$A85,Data!K:K)=0,#N/A,SUMIF(Data!$I:$I,$A85,Data!K:K)),#N/A)","v":{"$error":"#N/A"}},{"$f":"IF(C$6,IF(SUMIF(Data!$I:$I,$A85,Data!L:L)=0,#N/A,SUMIF(Data!$I:$I,$A85,Data!L:L)),#N/A)","v":{"$error":"#N/A"}},{"$f":"IF(D$6,IF(SUMIF(Data!$I:$I,$A85,Data!M:M)=0,#N/A,SUMIF(Data!$I:$I,$A85,Data!M:M)),#N/A)","v":{"$error":"#N/A"}},{"$f":"IF(E$6,IF(SUMIF(Data!$I:$I,$A85,Data!N:N)=0,#N/A,SUMIF(Data!$I:$I,$A85,Data!N:N)),#N/A)","v":{"$error":"#N/A"}},{"$f":"IF(F$6,IF(SUMIF(Data!$I:$I,$A85,Data!O:O)=0,#N/A,SUMIF(Data!$I:$I,$A85,Data!O:O)),#N/A)","v":{"$error":"#N/A"}},{"$f":"IF(G$6,IF(SUMIF(Data!$I:$I,$A85,Data!P:P)=0,#N/A,SUMIF(Data!$I:$I,$A85,Data!P:P)),#N/A)","v":{"$error":"#N/A"}},{"$f":"IF(H$6,IF(SUMIF(Data!$I:$I,$A85,Data!Q:Q)=0,#N/A,SUMIF(Data!$I:$I,$A85,Data!Q:Q)),#N/A)","v":{"$error":"#N/A"}},{"$f":"IF(I$6,IF(SUMIF(Data!$I:$I,$A85,Data!R:R)=0,#N/A,SUMIF(Data!$I:$I,$A85,Data!R:R)),#N/A)","v":{"$error":"#N/A"}},{"$f":"IF(J$6,IF(SUMIF(Data!$I:$I,$A85,Data!S:S)=0,#N/A,SUMIF(Data!$I:$I,$A85,Data!S:S)),#N/A)","v":{"$error":"#N/A"}},{"$f":"IF(K$6,IF(SUMIF(Data!$I:$I,$A85,Data!T:T)=0,#N/A,SUMIF(Data!$I:$I,$A85,Data!T:T)),#N/A)","v":{"$error":"#N/A"}}]
[{"$error":"#N/A"},{"$f":"IF(B$6,IF(SUMIF(Data!$I:$I,$A86,Data!K:K)=0,#N/A,SUMIF(Data!$I:$I,$A86,Data!K:K)),#N/A)","v":{"$error":"#N/A"}},{"$f":"IF(C$6,IF(SUMIF(Data!$I:$I,$A86,Data!L:L)=0,#N/A,SUMIF(Data!$I:$I,$A86,Data!L:L)),#N/A)","v":{"$error":"#N/A"}},{"$f":"IF(D$6,IF(SUMIF(Data!$I:$I,$A86,Data!M:M)=0,#N/A,SUMIF(Data!$I:$I,$A86,Data!M:M)),#N/A)","v":{"$error":"#N/A"}},{"$f":"IF(E$6,IF(SUMIF(Data!$I:$I,$A86,Data!N:N)=0,#N/A,SUMIF(Data!$I:$I,$A86,Data!N:N)),#N/A)","v":{"$error":"#N/A"}},{"$f":"IF(F$6,IF(SUMIF(Data!$I:$I,$A86,Data!O:O)=0,#N/A,SUMIF(Data!$I:$I,$A86,Data!O:O)),#N/A)","v":{"$error":"#N/A"}},{"$f":"IF(G$6,IF(SUMIF(Data!$I:$I,$A86,Data!P:P)=0,#N/A,SUMIF(Data!$I:$I,$A86,Data!P:P)),#N/A)","v":{"$error":"#N/A"}},{"$f":"IF(H$6,IF(SUMIF(Data!$I:$I,$A86,Data!Q:Q)=0,#N/A,SUMIF(Data!$I:$I,$A86,Data!Q:Q)),#N/A)","v":{"$error":"#N/A"}},{"$f":"IF(I$6,IF(SUMIF(Data!$I:$I,$A86,Data!R:R)=0,#N/A,SUMIF(Data!$I:$I,$A86,Data!R:R)),#N/A)","v":{"$error":"#N/A"}},{"$f":"IF(J$6,IF(SUMIF(Data!$I:$I,$A86,Data!S:S)=0,#N/A,SUMIF(Data!$I:$I,$A86,Data!S:S)),#N/A)","v":{"$error":"#N/A"}},{"$f":"IF(K$6,IF(SUMIF(Data!$I:$I,$A86,Data!T:T)=0,#N/A,SUMIF(Data!$I:$I,$A86,Data!T:T)),#N/A)","v":{"$error":"#N/A"}}]
[{"$error":"#N/A"},{"$f":"IF(B$6,IF(SUMIF(Data!$I:$I,$A87,Data!K:K)=0,#N/A,SUMIF(Data!$I:$I,$A87,Data!K:K)),#N/A)","v":{"$error":"#N/A"}},{"$f":"IF(C$6,IF(SUMIF(Data!$I:$I,$A87,Data!L:L)=0,#N/A,SUMIF(Data!$I:$I,$A87,Data!L:L)),#N/A)","v":{"$error":"#N/A"}},{"$f":"IF(D$6,IF(SUMIF(Data!$I:$I,$A87,Data!M:M)=0,#N/A,SUMIF(Data!$I:$I,$A87,Data!M:M)),#N/A)","v":{"$error":"#N/A"}},{"$f":"IF(E$6,IF(SUMIF(Data!$I:$I,$A87,Data!N:N)=0,#N/A,SUMIF(Data!$I:$I,$A87,Data!N:N)),#N/A)","v":{"$error":"#N/A"}},{"$f":"IF(F$6,IF(SUMIF(Data!$I:$I,$A87,Data!O:O)=0,#N/A,SUMIF(Data!$I:$I,$A87,Data!O:O)),#N/A)","v":{"$error":"#N/A"}},{"$f":"IF(G$6,IF(SUMIF(Data!$I:$I,$A87,Data!P:P)=0,#N/A,SUMIF(Data!$I:$I,$A87,Data!P:P)),#N/A)","v":{"$error":"#N/A"}},{"$f":"IF(H$6,IF(SUMIF(Data!$I:$I,$A87,Data!Q:Q)=0,#N/A,SUMIF(Data!$I:$I,$A87,Data!Q:Q)),#N/A)","v":{"$error":"#N/A"}},{"$f":"IF(I$6,IF(SUMIF(Data!$I:$I,$A87,Data!R:R)=0,#N/A,SUMIF(Data!$I:$I,$A87,Data!R:R)),#N/A)","v":{"$error":"#N/A"}},{"$f":"IF(J$6,IF(SUMIF(Data!$I:$I,$A87,Data!S:S)=0,#N/A,SUMIF(Data!$I:$I,$A87,Data!S:S)),#N/A)","v":{"$error":"#N/A"}},{"$f":"IF(K$6,IF(SUMIF(Data!$I:$I,$A87,Data!T:T)=0,#N/A,SUMIF(Data!$I:$I,$A87,Data!T:T)),#N/A)","v":{"$error":"#N/A"}}]
[{"$error":"#N/A"},{"$f":"IF(B$6,IF(SUMIF(Data!$I:$I,$A88,Data!K:K)=0,#N/A,SUMIF(Data!$I:$I,$A88,Data!K:K)),#N/A)","v":{"$error":"#N/A"}},{"$f":"IF(C$6,IF(SUMIF(Data!$I:$I,$A88,Data!L:L)=0,#N/A,SUMIF(Data!$I:$I,$A88,Data!L:L)),#N/A)","v":{"$error":"#N/A"}},{"$f":"IF(D$6,IF(SUMIF(Data!$I:$I,$A88,Data!M:M)=0,#N/A,SUMIF(Data!$I:$I,$A88,Data!M:M)),#N/A)","v":{"$error":"#N/A"}},{"$f":"IF(E$6,IF(SUMIF(Data!$I:$I,$A88,Data!N:N)=0,#N/A,SUMIF(Data!$I:$I,$A88,Data!N:N)),#N/A)","v":{"$error":"#N/A"}},{"$f":"IF(F$6,IF(SUMIF(Data!$I:$I,$A88,Data!O:O)=0,#N/A,SUMIF(Data!$I:$I,$A88,Data!O:O)),#N/A)","v":{"$error":"#N/A"}},{"$f":"IF(G$6,IF(SUMIF(Data!$I:$I,$A88,Data!P:P)=0,#N/A,SUMIF(Data!$I:$I,$A88,Data!P:P)),#N/A)","v":{"$error":"#N/A"}},{"$f":"IF(H$6,IF(SUMIF(Data!$I:$I,$A88,Data!Q:Q)=0,#N/A,SUMIF(Data!$I:$I,$A88,Data!Q:Q)),#N/A)","v":{"$error":"#N/A"}},{"$f":"IF(I$6,IF(SUMIF(Data!$I:$I,$A88,Data!R:R)=0,#N/A,SUMIF(Data!$I:$I,$A88,Data!R:R)),#N/A)","v":{"$error":"#N/A"}},{"$f":"IF(J$6,IF(SUMIF(Data!$I:$I,$A88,Data!S:S)=0,#N/A,SUMIF(Data!$I:$I,$A88,Data!S:S)),#N/A)","v":{"$error":"#N/A"}},{"$f":"IF(K$6,IF(SUMIF(Data!$I:$I,$A88,Data!T:T)=0,#N/A,SUMIF(Data!$I:$I,$A88,Data!T:T)),#N/A)","v":{"$error":"#N/A"}}]
[{"$error":"#N/A"},{"$f":"IF(B$6,IF(SUMIF(Data!$I:$I,$A89,Data!K:K)=0,#N/A,SUMIF(Data!$I:$I,$A89,Data!K:K)),#N/A)","v":{"$error":"#N/A"}},{"$f":"IF(C$6,IF(SUMIF(Data!$I:$I,$A89,Data!L:L)=0,#N/A,SUMIF(Data!$I:$I,$A89,Data!L:L)),#N/A)","v":{"$error":"#N/A"}},{"$f":"IF(D$6,IF(SUMIF(Data!$I:$I,$A89,Data!M:M)=0,#N/A,SUMIF(Data!$I:$I,$A89,Data!M:M)),#N/A)","v":{"$error":"#N/A"}},{"$f":"IF(E$6,IF(SUMIF(Data!$I:$I,$A89,Data!N:N)=0,#N/A,SUMIF(Data!$I:$I,$A89,Data!N:N)),#N/A)","v":{"$error":"#N/A"}},{"$f":"IF(F$6,IF(SUMIF(Data!$I:$I,$A89,Data!O:O)=0,#N/A,SUMIF(Data!$I:$I,$A89,Data!O:O)),#N/A)","v":{"$error":"#N/A"}},{"$f":"IF(G$6,IF(SUMIF(Data!$I:$I,$A89,Data!P:P)=0,#N/A,SUMIF(Data!$I:$I,$A89,Data!P:P)),#N/A)","v":{"$error":"#N/A"}},{"$f":"IF(H$6,IF(SUMIF(Data!$I:$I,$A89,Data!Q:Q)=0,#N/A,SUMIF(Data!$I:$I,$A89,Data!Q:Q)),#N/A)","v":{"$error":"#N/A"}},{"$f":"IF(I$6,IF(SUMIF(Data!$I:$I,$A89,Data!R:R)=0,#N/A,SUMIF(Data!$I:$I,$A89,Data!R:R)),#N/A)","v":{"$error":"#N/A"}},{"$f":"IF(J$6,IF(SUMIF(Data!$I:$I,$A89,Data!S:S)=0,#N/A,SUMIF(Data!$I:$I,$A89,Data!S:S)),#N/A)","v":{"$error":"#N/A"}},{"$f":"IF(K$6,IF(SUMIF(Data!$I:$I,$A89,Data!T:T)=0,#N/A,SUMIF(Data!$I:$I,$A89,Data!T:T)),#N/A)","v":{"$error":"#N/A"}}]
[{"$error":"#N/A"},{"$f":"IF(B$6,IF(SUMIF(Data!$I:$I,$A90,Data!K:K)=0,#N/A,SUMIF(Data!$I:$I,$A90,Data!K:K)),#N/A)","v":{"$error":"#N/A"}},{"$f":"IF(C$6,IF(SUMIF(Data!$I:$I,$A90,Data!L:L)=0,#N/A,SUMIF(Data!$I:$I,$A90,Data!L:L)),#N/A)","v":{"$error":"#N/A"}},{"$f":"IF(D$6,IF(SUMIF(Data!$I:$I,$A90,Data!M:M)=0,#N/A,SUMIF(Data!$I:$I,$A90,Data!M:M)),#N/A)","v":{"$error":"#N/A"}},{"$f":"IF(E$6,IF(SUMIF(Data!$I:$I,$A90,Data!N:N)=0,#N/A,SUMIF(Data!$I:$I,$A90,Data!N:N)),#N/A)","v":{"$error":"#N/A"}},{"$f":"IF(F$6,IF(SUMIF(Data!$I:$I,$A90,Data!O:O)=0,#N/A,SUMIF(Data!$I:$I,$A90,Data!O:O)),#N/A)","v":{"$error":"#N/A"}},{"$f":"IF(G$6,IF(SUMIF(Data!$I:$I,$A90,Data!P:P)=0,#N/A,SUMIF(Data!$I:$I,$A90,Data!P:P)),#N/A)","v":{"$error":"#N/A"}},{"$f":"IF(H$6,IF(SUMIF(Data!$I:$I,$A90,Data!Q:Q)=0,#N/A,SUMIF(Data!$I:$I,$A90,Data!Q:Q)),#N/A)","v":{"$error":"#N/A"}},{"$f":"IF(I$6,IF(SUMIF(Data!$I:$I,$A90,Data!R:R)=0,#N/A,SUMIF(Data!$I:$I,$A90,Data!R:R)),#N/A)","v":{"$error":"#N/A"}},{"$f":"IF(J$6,IF(SUMIF(Data!$I:$I,$A90,Data!S:S)=0,#N/A,SUMIF(Data!$I:$I,$A90,Data!S:S)),#N/A)","v":{"$error":"#N/A"}},{"$f":"IF(K$6,IF(SUMIF(Data!$I:$I,$A90,Data!T:T)=0,#N/A,SUMIF(Data!$I:$I,$A90,Data!T:T)),#N/A)","v":{"$error":"#N/A"}}]
[{"$error":"#N/A"},{"$f":"IF(B$6,IF(SUMIF(Data!$I:$I,$A91,Data!K:K)=0,#N/A,SUMIF(Data!$I:$I,$A91,Data!K:K)),#N/A)","v":{"$error":"#N/A"}},{"$f":"IF(C$6,IF(SUMIF(Data!$I:$I,$A91,Data!L:L)=0,#N/A,SUMIF(Data!$I:$I,$A91,Data!L:L)),#N/A)","v":{"$error":"#N/A"}},{"$f":"IF(D$6,IF(SUMIF(Data!$I:$I,$A91,Data!M:M)=0,#N/A,SUMIF(Data!$I:$I,$A91,Data!M:M)),#N/A)","v":{"$error":"#N/A"}},{"$f":"IF(E$6,IF(SUMIF(Data!$I:$I,$A91,Data!N:N)=0,#N/A,SUMIF(Data!$I:$I,$A91,Data!N:N)),#N/A)","v":{"$error":"#N/A"}},{"$f":"IF(F$6,IF(SUMIF(Data!$I:$I,$A91,Data!O:O)=0,#N/A,SUMIF(Data!$I:$I,$A91,Data!O:O)),#N/A)","v":{"$error":"#N/A"}},{"$f":"IF(G$6,IF(SUMIF(Data!$I:$I,$A91,Data!P:P)=0,#N/A,SUMIF(Data!$I:$I,$A91,Data!P:P)),#N/A)","v":{"$error":"#N/A"}},{"$f":"IF(H$6,IF(SUMIF(Data!$I:$I,$A91,Data!Q:Q)=0,#N/A,SUMIF(Data!$I:$I,$A91,Data!Q:Q)),#N/A)","v":{"$error":"#N/A"}},{"$f":"IF(I$6,IF(SUMIF(Data!$I:$I,$A91,Data!R:R)=0,#N/A,SUMIF(Data!$I:$I,$A91,Data!R:R)),#N/A)","v":{"$error":"#N/A"}},{"$f":"IF(J$6,IF(SUMIF(Data!$I:$I,$A91,Data!S:S)=0,#N/A,SUMIF(Data!$I:$I,$A91,Data!S:S)),#N/A)","v":{"$error":"#N/A"}},{"$f":"IF(K$6,IF(SUMIF(Data!$I:$I,$A91,Data!T:T)=0,#N/A,SUMIF(Data!$I:$I,$A91,Data!T:T)),#N/A)","v":{"$error":"#N/A"}}]
[{"$error":"#N/A"},{"$f":"IF(B$6,IF(SUMIF(Data!$I:$I,$A92,Data!K:K)=0,#N/A,SUMIF(Data!$I:$I,$A92,Data!K:K)),#N/A)","v":{"$error":"#N/A"}},{"$f":"IF(C$6,IF(SUMIF(Data!$I:$I,$A92,Data!L:L)=0,#N/A,SUMIF(Data!$I:$I,$A92,Data!L:L)),#N/A)","v":{"$error":"#N/A"}},{"$f":"IF(D$6,IF(SUMIF(Data!$I:$I,$A92,Data!M:M)=0,#N/A,SUMIF(Data!$I:$I,$A92,Data!M:M)),#N/A)","v":{"$error":"#N/A"}},{"$f":"IF(E$6,IF(SUMIF(Data!$I:$I,$A92,Data!N:N)=0,#N/A,SUMIF(Data!$I:$I,$A92,Data!N:N)),#N/A)","v":{"$error":"#N/A"}},{"$f":"IF(F$6,IF(SUMIF(Data!$I:$I,$A92,Data!O:O)=0,#N/A,SUMIF(Data!$I:$I,$A92,Data!O:O)),#N/A)","v":{"$error":"#N/A"}},{"$f":"IF(G$6,IF(SUMIF(Data!$I:$I,$A92,Data!P:P)=0,#N/A,SUMIF(Data!$I:$I,$A92,Data!P:P)),#N/A)","v":{"$error":"#N/A"}},{"$f":"IF(H$6,IF(SUMIF(Data!$I:$I,$A92,Data!Q:Q)=0,#N/A,SUMIF(Data!$I:$I,$A92,Data!Q:Q)),#N/A)","v":{"$error":"#N/A"}},{"$f":"IF(I$6,IF(SUMIF(Data!$I:$I,$A92,Data!R:R)=0,#N/A,SUMIF(Data!$I:$I,$A92,Data!R:R)),#N/A)","v":{"$error":"#N/A"}},{"$f":"IF(J$6,IF(SUMIF(Data!$I:$I,$A92,Data!S:S)=0,#N/A,SUMIF(Data!$I:$I,$A92,Data!S:S)),#N/A)","v":{"$error":"#N/A"}},{"$f":"IF(K$6,IF(SUMIF(Data!$I:$I,$A92,Data!T:T)=0,#N/A,SUMIF(Data!$I:$I,$A92,Data!T:T)),#N/A)","v":{"$error":"#N/A"}}]
[{"$error":"#N/A"},{"$f":"IF(B$6,IF(SUMIF(Data!$I:$I,$A93,Data!K:K)=0,#N/A,SUMIF(Data!$I:$I,$A93,Data!K:K)),#N/A)","v":{"$error":"#N/A"}},{"$f":"IF(C$6,IF(SUMIF(Data!$I:$I,$A93,Data!L:L)=0,#N/A,SUMIF(Data!$I:$I,$A93,Data!L:L)),#N/A)","v":{"$error":"#N/A"}},{"$f":"IF(D$6,IF(SUMIF(Data!$I:$I,$A93,Data!M:M)=0,#N/A,SUMIF(Data!$I:$I,$A93,Data!M:M)),#N/A)","v":{"$error":"#N/A"}},{"$f":"IF(E$6,IF(SUMIF(Data!$I:$I,$A93,Data!N:N)=0,#N/A,SUMIF(Data!$I:$I,$A93,Data!N:N)),#N/A)","v":{"$error":"#N/A"}},{"$f":"IF(F$6,IF(SUMIF(Data!$I:$I,$A93,Data!O:O)=0,#N/A,SUMIF(Data!$I:$I,$A93,Data!O:O)),#N/A)","v":{"$error":"#N/A"}},{"$f":"IF(G$6,IF(SUMIF(Data!$I:$I,$A93,Data!P:P)=0,#N/A,SUMIF(Data!$I:$I,$A93,Data!P:P)),#N/A)","v":{"$error":"#N/A"}},{"$f":"IF(H$6,IF(SUMIF(Data!$I:$I,$A93,Data!Q:Q)=0,#N/A,SUMIF(Data!$I:$I,$A93,Data!Q:Q)),#N/A)","v":{"$error":"#N/A"}},{"$f":"IF(I$6,IF(SUMIF(Data!$I:$I,$A93,Data!R:R)=0,#N/A,SUMIF(Data!$I:$I,$A93,Data!R:R)),#N/A)","v":{"$error":"#N/A"}},{"$f":"IF(J$6,IF(SUMIF(Data!$I:$I,$A93,Data!S:S)=0,#N/A,SUMIF(Data!$I:$I,$A93,Data!S:S)),#N/A)","v":{"$error":"#N/A"}},{"$f":"IF(K$6,IF(SUMIF(Data!$I:$I,$A93,Data!T:T)=0,#N/A,SUMIF(Data!$I:$I,$A93,Data!T:T)),#N/A)","v":{"$error":"#N/A"}}]
[{"$error":"#N/A"},{"$f":"IF(B$6,IF(SUMIF(Data!$I:$I,$A94,Data!K:K)=0,#N/A,SUMIF(Data!$I:$I,$A94,Data!K:K)),#N/A)","v":{"$error":"#N/A"}},{"$f":"IF(C$6,IF(SUMIF(Data!$I:$I,$A94,Data!L:L)=0,#N/A,SUMIF(Data!$I:$I,$A94,Data!L:L)),#N/A)","v":{"$error":"#N/A"}},{"$f":"IF(D$6,IF(SUMIF(Data!$I:$I,$A94,Data!M:M)=0,#N/A,SUMIF(Data!$I:$I,$A94,Data!M:M)),#N/A)","v":{"$error":"#N/A"}},{"$f":"IF(E$6,IF(SUMIF(Data!$I:$I,$A94,Data!N:N)=0,#N/A,SUMIF(Data!$I:$I,$A94,Data!N:N)),#N/A)","v":{"$error":"#N/A"}},{"$f":"IF(F$6,IF(SUMIF(Data!$I:$I,$A94,Data!O:O)=0,#N/A,SUMIF(Data!$I:$I,$A94,Data!O:O)),#N/A)","v":{"$error":"#N/A"}},{"$f":"IF(G$6,IF(SUMIF(Data!$I:$I,$A94,Data!P:P)=0,#N/A,SUMIF(Data!$I:$I,$A94,Data!P:P)),#N/A)","v":{"$error":"#N/A"}},{"$f":"IF(H$6,IF(SUMIF(Data!$I:$I,$A94,Data!Q:Q)=0,#N/A,SUMIF(Data!$I:$I,$A94,Data!Q:Q)),#N/A)","v":{"$error":"#N/A"}},{"$f":"IF(I$6,IF(SUMIF(Data!$I:$I,$A94,Data!R:R)=0,#N/A,SUMIF(Data!$I:$I,$A94,Data!R:R)),#N/A)","v":{"$error":"#N/A"}},{"$f":"IF(J$6,IF(SUMIF(Data!$I:$I,$A94,Data!S:S)=0,#N/A,SUMIF(Data!$I:$I,$A94,Data!S:S)),#N/A)","v":{"$error":"#N/A"}},{"$f":"IF(K$6,IF(SUMIF(Data!$I:$I,$A94,Data!T:T)=0,#N/A,SUMIF(Data!$I:$I,$A94,Data!T:T)),#N/A)","v":{"$error":"#N/A"}}]
[{"$error":"#N/A"},{"$f":"IF(B$6,IF(SUMIF(Data!$I:$I,$A95,Data!K:K)=0,#N/A,SUMIF(Data!$I:$I,$A95,Data!K:K)),#N/A)","v":{"$error":"#N/A"}},{"$f":"IF(C$6,IF(SUMIF(Data!$I:$I,$A95,Data!L:L)=0,#N/A,SUMIF(Data!$I:$I,$A95,Data!L:L)),#N/A)","v":{"$error":"#N/A"}},{"$f":"IF(D$6,IF(SUMIF(Data!$I:$I,$A95,Data!M:M)=0,#N/A,SUMIF(Data!$I:$I,$A95,Data!M:M)),#N/A)","v":{"$error":"#N/A"}},{"$f":"IF(E$6,IF(SUMIF(Data!$I:$I,$A95,Data!N:N)=0,#N/A,SUMIF(Data!$I:$I,$A95,Data!N:N)),#N/A)","v":{"$error":"#N/A"}},{"$f":"IF(F$6,IF(SUMIF(Data!$I:$I,$A95,Data!O:O)=0,#N/A,SUMIF(Data!$I:$I,$A95,Data!O:O)),#N/A)","v":{"$error":"#N/A"}},{"$f":"IF(G$6,IF(SUMIF(Data!$I:$I,$A95,Data!P:P)=0,#N/A,SUMIF(Data!$I:$I,$A95,Data!P:P)),#N/A)","v":{"$error":"#N/A"}},{"$f":"IF(H$6,IF(SUMIF(Data!$I:$I,$A95,Data!Q:Q)=0,#N/A,SUMIF(Data!$I:$I,$A95,Data!Q:Q)),#N/A)","v":{"$error":"#N/A"}},{"$f":"IF(I$6,IF(SUMIF(Data!$I:$I,$A95,Data!R:R)=0,#N/A,SUMIF(Data!$I:$I,$A95,Data!R:R)),#N/A)","v":{"$error":"#N/A"}},{"$f":"IF(J$6,IF(SUMIF(Data!$I:$I,$A95,Data!S:S)=0,#N/A,SUMIF(Data!$I:$I,$A95,Data!S:S)),#N/A)","v":{"$error":"#N/A"}},{"$f":"IF(K$6,IF(SUMIF(Data!$I:$I,$A95,Data!T:T)=0,#N/A,SUMIF(Data!$I:$I,$A95,Data!T:T)),#N/A)","v":{"$error":"#N/A"}}]
[{"$error":"#N/A"},{"$f":"IF(B$6,IF(SUMIF(Data!$I:$I,$A96,Data!K:K)=0,#N/A,SUMIF(Data!$I:$I,$A96,Data!K:K)),#N/A)","v":{"$error":"#N/A"}},{"$f":"IF(C$6,IF(SUMIF(Data!$I:$I,$A96,Data!L:L)=0,#N/A,SUMIF(Data!$I:$I,$A96,Data!L:L)),#N/A)","v":{"$error":"#N/A"}},{"$f":"IF(D$6,IF(SUMIF(Data!$I:$I,$A96,Data!M:M)=0,#N/A,SUMIF(Data!$I:$I,$A96,Data!M:M)),#N/A)","v":{"$error":"#N/A"}},{"$f":"IF(E$6,IF(SUMIF(Data!$I:$I,$A96,Data!N:N)=0,#N/A,SUMIF(Data!$I:$I,$A96,Data!N:N)),#N/A)","v":{"$error":"#N/A"}},{"$f":"IF(F$6,IF(SUMIF(Data!$I:$I,$A96,Data!O:O)=0,#N/A,SUMIF(Data!$I:$I,$A96,Data!O:O)),#N/A)","v":{"$error":"#N/A"}},{"$f":"IF(G$6,IF(SUMIF(Data!$I:$I,$A96,Data!P:P)=0,#N/A,SUMIF(Data!$I:$I,$A96,Data!P:P)),#N/A)","v":{"$error":"#N/A"}},{"$f":"IF(H$6,IF(SUMIF(Data!$I:$I,$A96,Data!Q:Q)=0,#N/A,SUMIF(Data!$I:$I,$A96,Data!Q:Q)),#N/A)","v":{"$error":"#N/A"}},{"$f":"IF(I$6,IF(SUMIF(Data!$I:$I,$A96,Data!R:R)=0,#N/A,SUMIF(Data!$I:$I,$A96,Data!R:R)),#N/A)","v":{"$error":"#N/A"}},{"$f":"IF(J$6,IF(SUMIF(Data!$I:$I,$A96,Data!S:S)=0,#N/A,SUMIF(Data!$I:$I,$A96,Data!S:S)),#N/A)","v":{"$error":"#N/A"}},{"$f":"IF(K$6,IF(SUMIF(Data!$I:$I,$A96,Data!T:T)=0,#N/A,SUMIF(Data!$I:$I,$A96,Data!T:T)),#N/A)","v":{"$error":"#N/A"}}]
[{"$error":"#N/A"},{"$f":"IF(B$6,IF(SUMIF(Data!$I:$I,$A97,Data!K:K)=0,#N/A,SUMIF(Data!$I:$I,$A97,Data!K:K)),#N/A)","v":{"$error":"#N/A"}},{"$f":"IF(C$6,IF(SUMIF(Data!$I:$I,$A97,Data!L:L)=0,#N/A,SUMIF(Data!$I:$I,$A97,Data!L:L)),#N/A)","v":{"$error":"#N/A"}},{"$f":"IF(D$6,IF(SUMIF(Data!$I:$I,$A97,Data!M:M)=0,#N/A,SUMIF(Data!$I:$I,$A97,Data!M:M)),#N/A)","v":{"$error":"#N/A"}},{"$f":"IF(E$6,IF(SUMIF(Data!$I:$I,$A97,Data!N:N)=0,#N/A,SUMIF(Data!$I:$I,$A97,Data!N:N)),#N/A)","v":{"$error":"#N/A"}},{"$f":"IF(F$6,IF(SUMIF(Data!$I:$I,$A97,Data!O:O)=0,#N/A,SUMIF(Data!$I:$I,$A97,Data!O:O)),#N/A)","v":{"$error":"#N/A"}},{"$f":"IF(G$6,IF(SUMIF(Data!$I:$I,$A97,Data!P:P)=0,#N/A,SUMIF(Data!$I:$I,$A97,Data!P:P)),#N/A)","v":{"$error":"#N/A"}},{"$f":"IF(H$6,IF(SUMIF(Data!$I:$I,$A97,Data!Q:Q)=0,#N/A,SUMIF(Data!$I:$I,$A97,Data!Q:Q)),#N/A)","v":{"$error":"#N/A"}},{"$f":"IF(I$6,IF(SUMIF(Data!$I:$I,$A97,Data!R:R)=0,#N/A,SUMIF(Data!$I:$I,$A97,Data!R:R)),#N/A)","v":{"$error":"#N/A"}},{"$f":"IF(J$6,IF(SUMIF(Data!$I:$I,$A97,Data!S:S)=0,#N/A,SUMIF(Data!$I:$I,$A97,Data!S:S)),#N/A)","v":{"$error":"#N/A"}},{"$f":"IF(K$6,IF(SUMIF(Data!$I:$I,$A97,Data!T:T)=0,#N/A,SUMIF(Data!$I:$I,$A97,Data!T:T)),#N/A)","v":{"$error":"#N/A"}}]
[{"$error":"#N/A"},{"$f":"IF(B$6,IF(SUMIF(Data!$I:$I,$A98,Data!K:K)=0,#N/A,SUMIF(Data!$I:$I,$A98,Data!K:K)),#N/A)","v":{"$error":"#N/A"}},{"$f":"IF(C$6,IF(SUMIF(Data!$I:$I,$A98,Data!L:L)=0,#N/A,SUMIF(Data!$I:$I,$A98,Data!L:L)),#N/A)","v":{"$error":"#N/A"}},{"$f":"IF(D$6,IF(SUMIF(Data!$I:$I,$A98,Data!M:M)=0,#N/A,SUMIF(Data!$I:$I,$A98,Data!M:M)),#N/A)","v":{"$error":"#N/A"}},{"$f":"IF(E$6,IF(SUMIF(Data!$I:$I,$A98,Data!N:N)=0,#N/A,SUMIF(Data!$I:$I,$A98,Data!N:N)),#N/A)","v":{"$error":"#N/A"}},{"$f":"IF(F$6,IF(SUMIF(Data!$I:$I,$A98,Data!O:O)=0,#N/A,SUMIF(Data!$I:$I,$A98,Data!O:O)),#N/A)","v":{"$error":"#N/A"}},{"$f":"IF(G$6,IF(SUMIF(Data!$I:$I,$A98,Data!P:P)=0,#N/A,SUMIF(Data!$I:$I,$A98,Data!P:P)),#N/A)","v":{"$error":"#N/A"}},{"$f":"IF(H$6,IF(SUMIF(Data!$I:$I,$A98,Data!Q:Q)=0,#N/A,SUMIF(Data!$I:$I,$A98,Data!Q:Q)),#N/A)","v":{"$error":"#N/A"}},{"$f":"IF(I$6,IF(SUMIF(Data!$I:$I,$A98,Data!R:R)=0,#N/A,SUMIF(Data!$I:$I,$A98,Data!R:R)),#N/A)","v":{"$error":"#N/A"}},{"$f":"IF(J$6,IF(SUMIF(Data!$I:$I,$A98,Data!S:S)=0,#N/A,SUMIF(Data!$I:$I,$A98,Data!S:S)),#N/A)","v":{"$error":"#N/A"}},{"$f":"IF(K$6,IF(SUMIF(Data!$I:$I,$A98,Data!T:T)=0,#N/A,SUMIF(Data!$I:$I,$A98,Data!T:T)),#N/A)","v":{"$error":"#N/A"}}]
[{"$error":"#N/A"},{"$f":"IF(B$6,IF(SUMIF(Data!$I:$I,$A99,Data!K:K)=0,#N/A,SUMIF(Data!$I:$I,$A99,Data!K:K)),#N/A)","v":{"$error":"#N/A"}},{"$f":"IF(C$6,IF(SUMIF(Data!$I:$I,$A99,Data!L:L)=0,#N/A,SUMIF(Data!$I:$I,$A99,Data!L:L)),#N/A)","v":{"$error":"#N/A"}},{"$f":"IF(D$6,IF(SUMIF(Data!$I:$I,$A99,Data!M:M)=0,#N/A,SUMIF(Data!$I:$I,$A99,Data!M:M)),#N/A)","v":{"$error":"#N/A"}},{"$f":"IF(E$6,IF(SUMIF(Data!$I:$I,$A99,Data!N:N)=0,#N/A,SUMIF(Data!$I:$I,$A99,Data!N:N)),#N/A)","v":{"$error":"#N/A"}},{"$f":"IF(F$6,IF(SUMIF(Data!$I:$I,$A99,Data!O:O)=0,#N/A,SUMIF(Data!$I:$I,$A99,Data!O:O)),#N/A)","v":{"$error":"#N/A"}},{"$f":"IF(G$6,IF(SUMIF(Data!$I:$I,$A99,Data!P:P)=0,#N/A,SUMIF(Data!$I:$I,$A99,Data!P:P)),#N/A)","v":{"$error":"#N/A"}},{"$f":"IF(H$6,IF(SUMIF(Data!$I:$I,$A99,Data!Q:Q)=0,#N/A,SUMIF(Data!$I:$I,$A99,Data!Q:Q)),#N/A)","v":{"$error":"#N/A"}},{"$f":"IF(I$6,IF(SUMIF(Data!$I:$I,$A99,Data!R:R)=0,#N/A,SUMIF(Data!$I:$I,$A99,Data!R:R)),#N/A)","v":{"$error":"#N/A"}},{"$f":"IF(J$6,IF(SUMIF(Data!$I:$I,$A99,Data!S:S)=0,#N/A,SUMIF(Data!$I:$I,$A99,Data!S:S)),#N/A)","v":{"$error":"#N/A"}},{"$f":"IF(K$6,IF(SUMIF(Data!$I:$I,$A99,Data!T:T)=0,#N/A,SUMIF(Data!$I:$I,$A99,Data!T:T)),#N/A)","v":{"$error":"#N/A"}}]
[{"$error":"#N/A"},{"$f":"IF(B$6,IF(SUMIF(Data!$I:$I,$A100,Data!K:K)=0,#N/A,SUMIF(Data!$I:$I,$A100,Data!K:K)),#N/A)","v":{"$error":"#N/A"}},{"$f":"IF(C$6,IF(SUMIF(Data!$I:$I,$A100,Data!L:L)=0,#N/A,SUMIF(Data!$I:$I,$A100,Data!L:L)),#N/A)","v":{"$error":"#N/A"}},{"$f":"IF(D$6,IF(SUMIF(Data!$I:$I,$A100,Data!M:M)=0,#N/A,SUMIF(Data!$I:$I,$A100,Data!M:M)),#N/A)","v":{"$error":"#N/A"}},{"$f":"IF(E$6,IF(SUMIF(Data!$I:$I,$A100,Data!N:N)=0,#N/A,SUMIF(Data!$I:$I,$A100,Data!N:N)),#N/A)","v":{"$error":"#N/A"}},{"$f":"IF(F$6,IF(SUMIF(Data!$I:$I,$A100,Data!O:O)=0,#N/A,SUMIF(Data!$I:$I,$A100,Data!O:O)),#N/A)","v":{"$error":"#N/A"}},{"$f":"IF(G$6,IF(SUMIF(Data!$I:$I,$A100,Data!P:P)=0,#N/A,SUMIF(Data!$I:$I,$A100,Data!P:P)),#N/A)","v":{"$error":"#N/A"}},{"$f":"IF(H$6,IF(SUMIF(Data!$I:$I,$A100,Data!Q:Q)=0,#N/A,SUMIF(Data!$I:$I,$A100,Data!Q:Q)),#N/A)","v":{"$error":"#N/A"}},{"$f":"IF(I$6,IF(SUMIF(Data!$I:$I,$A100,Data!R:R)=0,#N/A,SUMIF(Data!$I:$I,$A100,Data!R:R)),#N/A)","v":{"$error":"#N/A"}},{"$f":"IF(J$6,IF(SUMIF(Data!$I:$I,$A100,Data!S:S)=0,#N/A,SUMIF(Data!$I:$I,$A100,Data!S:S)),#N/A)","v":{"$error":"#N/A"}},{"$f":"IF(K$6,IF(SUMIF(Data!$I:$I,$A100,Data!T:T)=0,#N/A,SUMIF(Data!$I:$I,$A100,Data!T:T)),#N/A)","v":{"$error":"#N/A"}}]
[{"$error":"#N/A"},{"$f":"IF(B$6,IF(SUMIF(Data!$I:$I,$A101,Data!K:K)=0,#N/A,SUMIF(Data!$I:$I,$A101,Data!K:K)),#N/A)","v":{"$error":"#N/A"}},{"$f":"IF(C$6,IF(SUMIF(Data!$I:$I,$A101,Data!L:L)=0,#N/A,SUMIF(Data!$I:$I,$A101,Data!L:L)),#N/A)","v":{"$error":"#N/A"}},{"$f":"IF(D$6,IF(SUMIF(Data!$I:$I,$A101,Data!M:M)=0,#N/A,SUMIF(Data!$I:$I,$A101,Data!M:M)),#N/A)","v":{"$error":"#N/A"}},{"$f":"IF(E$6,IF(SUMIF(Data!$I:$I,$A101,Data!N:N)=0,#N/A,SUMIF(Data!$I:$I,$A101,Data!N:N)),#N/A)","v":{"$error":"#N/A"}},{"$f":"IF(F$6,IF(SUMIF(Data!$I:$I,$A101,Data!O:O)=0,#N/A,SUMIF(Data!$I:$I,$A101,Data!O:O)),#N/A)","v":{"$error":"#N/A"}},{"$f":"IF(G$6,IF(SUMIF(Data!$I:$I,$A101,Data!P:P)=0,#N/A,SUMIF(Data!$I:$I,$A101,Data!P:P)),#N/A)","v":{"$error":"#N/A"}},{"$f":"IF(H$6,IF(SUMIF(Data!$I:$I,$A101,Data!Q:Q)=0,#N/A,SUMIF(Data!$I:$I,$A101,Data!Q:Q)),#N/A)","v":{"$error":"#N/A"}},{"$f":"IF(I$6,IF(SUMIF(Data!$I:$I,$A101,Data!R:R)=0,#N/A,SUMIF(Data!$I:$I,$A101,Data!R:R)),#N/A)","v":{"$error":"#N/A"}},{"$f":"IF(J$6,IF(SUMIF(Data!$I:$I,$A101,Data!S:S)=0,#N/A,SUMIF(Data!$I:$I,$A101,Data!S:S)),#N/A)","v":{"$error":"#N/A"}},{"$f":"IF(K$6,IF(SUMIF(Data!$I:$I,$A101,Data!T:T)=0,#N/A,SUMIF(Data!$I:$I,$A101,Data!T:T)),#N/A)","v":{"$error":"#N/A"}}]
[{"$error":"#N/A"},{"$f":"IF(B$6,IF(SUMIF(Data!$I:$I,$A102,Data!K:K)=0,#N/A,SUMIF(Data!$I:$I,$A102,Data!K:K)),#N/A)","v":{"$error":"#N/A"}},{"$f":"IF(C$6,IF(SUMIF(Data!$I:$I,$A102,Data!L:L)=0,#N/A,SUMIF(Data!$I:$I,$A102,Data!L:L)),#N/A)","v":{"$error":"#N/A"}},{"$f":"IF(D$6,IF(SUMIF(Data!$I:$I,$A102,Data!M:M)=0,#N/A,SUMIF(Data!$I:$I,$A102,Data!M:M)),#N/A)","v":{"$error":"#N/A"}},{"$f":"IF(E$6,IF(SUMIF(Data!$I:$I,$A102,Data!N:N)=0,#N/A,SUMIF(Data!$I:$I,$A102,Data!N:N)),#N/A)","v":{"$error":"#N/A"}},{"$f":"IF(F$6,IF(SUMIF(Data!$I:$I,$A102,Data!O:O)=0,#N/A,SUMIF(Data!$I:$I,$A102,Data!O:O)),#N/A)","v":{"$error":"#N/A"}},{"$f":"IF(G$6,IF(SUMIF(Data!$I:$I,$A102,Data!P:P)=0,#N/A,SUMIF(Data!$I:$I,$A102,Data!P:P)),#N/A)","v":{"$error":"#N/A"}},{"$f":"IF(H$6,IF(SUMIF(Data!$I:$I,$A102,Data!Q:Q)=0,#N/A,SUMIF(Data!$I:$I,$A102,Data!Q:Q)),#N/A)","v":{"$error":"#N/A"}},{"$f":"IF(I$6,IF(SUMIF(Data!$I:$I,$A102,Data!R:R)=0,#N/A,SUMIF(Data!$I:$I,$A102,Data!R:R)),#N/A)","v":{"$error":"#N/A"}},{"$f":"IF(J$6,IF(SUMIF(Data!$I:$I,$A102,Data!S:S)=0,#N/A,SUMIF(Data!$I:$I,$A102,Data!S:S)),#N/A)","v":{"$error":"#N/A"}},{"$f":"IF(K$6,IF(SUMIF(Data!$I:$I,$A102,Data!T:T)=0,#N/A,SUMIF(Data!$I:$I,$A102,Data!T:T)),#N/A)","v":{"$error":"#N/A"}}]
[{"$error":"#N/A"},{"$f":"IF(B$6,IF(SUMIF(Data!$I:$I,$A103,Data!K:K)=0,#N/A,SUMIF(Data!$I:$I,$A103,Data!K:K)),#N/A)","v":{"$error":"#N/A"}},{"$f":"IF(C$6,IF(SUMIF(Data!$I:$I,$A103,Data!L:L)=0,#N/A,SUMIF(Data!$I:$I,$A103,Data!L:L)),#N/A)","v":{"$error":"#N/A"}},{"$f":"IF(D$6,IF(SUMIF(Data!$I:$I,$A103,Data!M:M)=0,#N/A,SUMIF(Data!$I:$I,$A103,Data!M:M)),#N/A)","v":{"$error":"#N/A"}},{"$f":"IF(E$6,IF(SUMIF(Data!$I:$I,$A103,Data!N:N)=0,#N/A,SUMIF(Data!$I:$I,$A103,Data!N:N)),#N/A)","v":{"$error":"#N/A"}},{"$f":"IF(F$6,IF(SUMIF(Data!$I:$I,$A103,Data!O:O)=0,#N/A,SUMIF(Data!$I:$I,$A103,Data!O:O)),#N/A)","v":{"$error":"#N/A"}},{"$f":"IF(G$6,IF(SUMIF(Data!$I:$I,$A103,Data!P:P)=0,#N/A,SUMIF(Data!$I:$I,$A103,Data!P:P)),#N/A)","v":{"$error":"#N/A"}},{"$f":"IF(H$6,IF(SUMIF(Data!$I:$I,$A103,Data!Q:Q)=0,#N/A,SUMIF(Data!$I:$I,$A103,Data!Q:Q)),#N/A)","v":{"$error":"#N/A"}},{"$f":"IF(I$6,IF(SUMIF(Data!$I:$I,$A103,Data!R:R)=0,#N/A,SUMIF(Data!$I:$I,$A103,Data!R:R)),#N/A)","v":{"$error":"#N/A"}},{"$f":"IF(J$6,IF(SUMIF(Data!$I:$I,$A103,Data!S:S)=0,#N/A,SUMIF(Data!$I:$I,$A103,Data!S:S)),#N/A)","v":{"$error":"#N/A"}},{"$f":"IF(K$6,IF(SUMIF(Data!$I:$I,$A103,Data!T:T)=0,#N/A,SUMIF(Data!$I:$I,$A103,Data!T:T)),#N/A)","v":{"$error":"#N/A"}}]
[{"$error":"#N/A"},{"$f":"IF(B$6,IF(SUMIF(Data!$I:$I,$A104,Data!K:K)=0,#N/A,SUMIF(Data!$I:$I,$A104,Data!K:K)),#N/A)","v":{"$error":"#N/A"}},{"$f":"IF(C$6,IF(SUMIF(Data!$I:$I,$A104,Data!L:L)=0,#N/A,SUMIF(Data!$I:$I,$A104,Data!L:L)),#N/A)","v":{"$error":"#N/A"}},{"$f":"IF(D$6,IF(SUMIF(Data!$I:$I,$A104,Data!M:M)=0,#N/A,SUMIF(Data!$I:$I,$A104,Data!M:M)),#N/A)","v":{"$error":"#N/A"}},{"$f":"IF(E$6,IF(SUMIF(Data!$I:$I,$A104,Data!N:N)=0,#N/A,SUMIF(Data!$I:$I,$A104,Data!N:N)),#N/A)","v":{"$error":"#N/A"}},{"$f":"IF(F$6,IF(SUMIF(Data!$I:$I,$A104,Data!O:O)=0,#N/A,SUMIF(Data!$I:$I,$A104,Data!O:O)),#N/A)","v":{"$error":"#N/A"}},{"$f":"IF(G$6,IF(SUMIF(Data!$I:$I,$A104,Data!P:P)=0,#N/A,SUMIF(Data!$I:$I,$A104,Data!P:P)),#N/A)","v":{"$error":"#N/A"}},{"$f":"IF(H$6,IF(SUMIF(Data!$I:$I,$A104,Data!Q:Q)=0,#N/A,SUMIF(Data!$I:$I,$A104,Data!Q:Q)),#N/A)","v":{"$error":"#N/A"}},{"$f":"IF(I$6,IF(SUMIF(Data!$I:$I,$A104,Data!R:R)=0,#N/A,SUMIF(Data!$I:$I,$A104,Data!R:R)),#N/A)","v":{"$error":"#N/A"}},{"$f":"IF(J$6,IF(SUMIF(Data!$I:$I,$A104,Data!S:S)=0,#N/A,SUMIF(Data!$I:$I,$A104,Data!S:S)),#N/A)","v":{"$error":"#N/A"}},{"$f":"IF(K$6,IF(SUMIF(Data!$I:$I,$A104,Data!T:T)=0,#N/A,SUMIF(Data!$I:$I,$A104,Data!T:T)),#N/A)","v":{"$error":"#N/A"}}]
[{"$error":"#N/A"},{"$f":"IF(B$6,IF(SUMIF(Data!$I:$I,$A105,Data!K:K)=0,#N/A,SUMIF(Data!$I:$I,$A105,Data!K:K)),#N/A)","v":{"$error":"#N/A"}},{"$f":"IF(C$6,IF(SUMIF(Data!$I:$I,$A105,Data!L:L)=0,#N/A,SUMIF(Data!$I:$I,$A105,Data!L:L)),#N/A)","v":{"$error":"#N/A"}},{"$f":"IF(D$6,IF(SUMIF(Data!$I:$I,$A105,Data!M:M)=0,#N/A,SUMIF(Data!$I:$I,$A105,Data!M:M)),#N/A)","v":{"$error":"#N/A"}},{"$f":"IF(E$6,IF(SUMIF(Data!$I:$I,$A105,Data!N:N)=0,#N/A,SUMIF(Data!$I:$I,$A105,Data!N:N)),#N/A)","v":{"$error":"#N/A"}},{"$f":"IF(F$6,IF(SUMIF(Data!$I:$I,$A105,Data!O:O)=0,#N/A,SUMIF(Data!$I:$I,$A105,Data!O:O)),#N/A)","v":{"$error":"#N/A"}},{"$f":"IF(G$6,IF(SUMIF(Data!$I:$I,$A105,Data!P:P)=0,#N/A,SUMIF(Data!$I:$I,$A105,Data!P:P)),#N/A)","v":{"$error":"#N/A"}},{"$f":"IF(H$6,IF(SUMIF(Data!$I:$I,$A105,Data!Q:Q)=0,#N/A,SUMIF(Data!$I:$I,$A105,Data!Q:Q)),#N/A)","v":{"$error":"#N/A"}},{"$f":"IF(I$6,IF(SUMIF(Data!$I:$I,$A105,Data!R:R)=0,#N/A,SUMIF(Data!$I:$I,$A105,Data!R:R)),#N/A)","v":{"$error":"#N/A"}},{"$f":"IF(J$6,IF(SUMIF(Data!$I:$I,$A105,Data!S:S)=0,#N/A,SUMIF(Data!$I:$I,$A105,Data!S:S)),#N/A)","v":{"$error":"#N/A"}},{"$f":"IF(K$6,IF(SUMIF(Data!$I:$I,$A105,Data!T:T)=0,#N/A,SUMIF(Data!$I:$I,$A105,Data!T:T)),#N/A)","v":{"$error":"#N/A"}}]
[{"$error":"#N/A"},{"$f":"IF(B$6,IF(SUMIF(Data!$I:$I,$A106,Data!K:K)=0,#N/A,SUMIF(Data!$I:$I,$A106,Data!K:K)),#N/A)","v":{"$error":"#N/A"}},{"$f":"IF(C$6,IF(SUMIF(Data!$I:$I,$A106,Data!L:L)=0,#N/A,SUMIF(Data!$I:$I,$A106,Data!L:L)),#N/A)","v":{"$error":"#N/A"}},{"$f":"IF(D$6,IF(SUMIF(Data!$I:$I,$A106,Data!M:M)=0,#N/A,SUMIF(Data!$I:$I,$A106,Data!M:M)),#N/A)","v":{"$error":"#N/A"}},{"$f":"IF(E$6,IF(SUMIF(Data!$I:$I,$A106,Data!N:N)=0,#N/A,SUMIF(Data!$I:$I,$A106,Data!N:N)),#N/A)","v":{"$error":"#N/A"}},{"$f":"IF(F$6,IF(SUMIF(Data!$I:$I,$A106,Data!O:O)=0,#N/A,SUMIF(Data!$I:$I,$A106,Data!O:O)),#N/A)","v":{"$error":"#N/A"}},{"$f":"IF(G$6,IF(SUMIF(Data!$I:$I,$A106,Data!P:P)=0,#N/A,SUMIF(Data!$I:$I,$A106,Data!P:P)),#N/A)","v":{"$error":"#N/A"}},{"$f":"IF(H$6,IF(SUMIF(Data!$I:$I,$A106,Data!Q:Q)=0,#N/A,SUMIF(Data!$I:$I,$A106,Data!Q:Q)),#N/A)","v":{"$error":"#N/A"}},{"$f":"IF(I$6,IF(SUMIF(Data!$I:$I,$A106,Data!R:R)=0,#N/A,SUMIF(Data!$I:$I,$A106,Data!R:R)),#N/A)","v":{"$error":"#N/A"}},{"$f":"IF(J$6,IF(SUMIF(Data!$I:$I,$A106,Data!S:S)=0,#N/A,SUMIF(Data!$I:$I,$A106,Data!S:S)),#N/A)","v":{"$error":"#N/A"}},{"$f":"IF(K$6,IF(SUMIF(Data!$I:$I,$A106,Data!T:T)=0,#N/A,SUMIF(Data!$I:$I,$A106,Data!T:T)),#N/A)","v":{"$error":"#N/A"}}]
[{"$error":"#N/A"},{"$f":"IF(B$6,IF(SUMIF(Data!$I:$I,$A107,Data!K:K)=0,#N/A,SUMIF(Data!$I:$I,$A107,Data!K:K)),#N/A)","v":{"$error":"#N/A"}},{"$f":"IF(C$6,IF(SUMIF(Data!$I:$I,$A107,Data!L:L)=0,#N/A,SUMIF(Data!$I:$I,$A107,Data!L:L)),#N/A)","v":{"$error":"#N/A"}},{"$f":"IF(D$6,IF(SUMIF(Data!$I:$I,$A107,Data!M:M)=0,#N/A,SUMIF(Data!$I:$I,$A107,Data!M:M)),#N/A)","v":{"$error":"#N/A"}},{"$f":"IF(E$6,IF(SUMIF(Data!$I:$I,$A107,Data!N:N)=0,#N/A,SUMIF(Data!$I:$I,$A107,Data!N:N)),#N/A)","v":{"$error":"#N/A"}},{"$f":"IF(F$6,IF(SUMIF(Data!$I:$I,$A107,Data!O:O)=0,#N/A,SUMIF(Data!$I:$I,$A107,Data!O:O)),#N/A)","v":{"$error":"#N/A"}},{"$f":"IF(G$6,IF(SUMIF(Data!$I:$I,$A107,Data!P:P)=0,#N/A,SUMIF(Data!$I:$I,$A107,Data!P:P)),#N/A)","v":{"$error":"#N/A"}},{"$f":"IF(H$6,IF(SUMIF(Data!$I:$I,$A107,Data!Q:Q)=0,#N/A,SUMIF(Data!$I:$I,$A107,Data!Q:Q)),#N/A)","v":{"$error":"#N/A"}},{"$f":"IF(I$6,IF(SUMIF(Data!$I:$I,$A107,Data!R:R)=0,#N/A,SUMIF(Data!$I:$I,$A107,Data!R:R)),#N/A)","v":{"$error":"#N/A"}},{"$f":"IF(J$6,IF(SUMIF(Data!$I:$I,$A107,Data!S:S)=0,#N/A,SUMIF(Data!$I:$I,$A107,Data!S:S)),#N/A)","v":{"$error":"#N/A"}},{"$f":"IF(K$6,IF(SUMIF(Data!$I:$I,$A107,Data!T:T)=0,#N/A,SUMIF(Data!$I:$I,$A107,Data!T:T)),#N/A)","v":{"$error":"#N/A"}}]
[{"$error":"#N/A"},{"$f":"IF(B$6,IF(SUMIF(Data!$I:$I,$A108,Data!K:K)=0,#N/A,SUMIF(Data!$I:$I,$A108,Data!K:K)),#N/A)","v":{"$error":"#N/A"}},{"$f":"IF(C$6,IF(SUMIF(Data!$I:$I,$A108,Data!L:L)=0,#N/A,SUMIF(Data!$I:$I,$A108,Data!L:L)),#N/A)","v":{"$error":"#N/A"}},{"$f":"IF(D$6,IF(SUMIF(Data!$I:$I,$A108,Data!M:M)=0,#N/A,SUMIF(Data!$I:$I,$A108,Data!M:M)),#N/A)","v":{"$error":"#N/A"}},{"$f":"IF(E$6,IF(SUMIF(Data!$I:$I,$A108,Data!N:N)=0,#N/A,SUMIF(Data!$I:$I,$A108,Data!N:N)),#N/A)","v":{"$error":"#N/A"}},{"$f":"IF(F$6,IF(SUMIF(Data!$I:$I,$A108,Data!O:O)=0,#N/A,SUMIF(Data!$I:$I,$A108,Data!O:O)),#N/A)","v":{"$error":"#N/A"}},{"$f":"IF(G$6,IF(SUMIF(Data!$I:$I,$A108,Data!P:P)=0,#N/A,SUMIF(Data!$I:$I,$A108,Data!P:P)),#N/A)","v":{"$error":"#N/A"}},{"$f":"IF(H$6,IF(SUMIF(Data!$I:$I,$A108,Data!Q:Q)=0,#N/A,SUMIF(Data!$I:$I,$A108,Data!Q:Q)),#N/A)","v":{"$error":"#N/A"}},{"$f":"IF(I$6,IF(SUMIF(Data!$I:$I,$A108,Data!R:R)=0,#N/A,SUMIF(Data!$I:$I,$A108,Data!R:R)),#N/A)","v":{"$error":"#N/A"}},{"$f":"IF(J$6,IF(SUMIF(Data!$I:$I,$A108,Data!S:S)=0,#N/A,SUMIF(Data!$I:$I,$A108,Data!S:S)),#N/A)","v":{"$error":"#N/A"}},{"$f":"IF(K$6,IF(SUMIF(Data!$I:$I,$A108,Data!T:T)=0,#N/A,SUMIF(Data!$I:$I,$A108,Data!T:T)),#N/A)","v":{"$error":"#N/A"}}]
[{"$error":"#N/A"},{"$f":"IF(B$6,IF(SUMIF(Data!$I:$I,$A109,Data!K:K)=0,#N/A,SUMIF(Data!$I:$I,$A109,Data!K:K)),#N/A)","v":{"$error":"#N/A"}},{"$f":"IF(C$6,IF(SUMIF(Data!$I:$I,$A109,Data!L:L)=0,#N/A,SUMIF(Data!$I:$I,$A109,Data!L:L)),#N/A)","v":{"$error":"#N/A"}},{"$f":"IF(D$6,IF(SUMIF(Data!$I:$I,$A109,Data!M:M)=0,#N/A,SUMIF(Data!$I:$I,$A109,Data!M:M)),#N/A)","v":{"$error":"#N/A"}},{"$f":"IF(E$6,IF(SUMIF(Data!$I:$I,$A109,Data!N:N)=0,#N/A,SUMIF(Data!$I:$I,$A109,Data!N:N)),#N/A)","v":{"$error":"#N/A"}},{"$f":"IF(F$6,IF(SUMIF(Data!$I:$I,$A109,Data!O:O)=0,#N/A,SUMIF(Data!$I:$I,$A109,Data!O:O)),#N/A)","v":{"$error":"#N/A"}},{"$f":"IF(G$6,IF(SUMIF(Data!$I:$I,$A109,Data!P:P)=0,#N/A,SUMIF(Data!$I:$I,$A109,Data!P:P)),#N/A)","v":{"$error":"#N/A"}},{"$f":"IF(H$6,IF(SUMIF(Data!$I:$I,$A109,Data!Q:Q)=0,#N/A,SUMIF(Data!$I:$I,$A109,Data!Q:Q)),#N/A)","v":{"$error":"#N/A"}},{"$f":"IF(I$6,IF(SUMIF(Data!$I:$I,$A109,Data!R:R)=0,#N/A,SUMIF(Data!$I:$I,$A109,Data!R:R)),#N/A)","v":{"$error":"#N/A"}},{"$f":"IF(J$6,IF(SUMIF(Data!$I:$I,$A109,Data!S:S)=0,#N/A,SUMIF(Data!$I:$I,$A109,Data!S:S)),#N/A)","v":{"$error":"#N/A"}},{"$f":"IF(K$6,IF(SUMIF(Data!$I:$I,$A109,Data!T:T)=0,#N/A,SUMIF(Data!$I:$I,$A109,Data!T:T)),#N/A)","v":{"$error":"#N/A"}}]
[{"$error":"#N/A"},{"$f":"IF(B$6,IF(SUMIF(Data!$I:$I,$A110,Data!K:K)=0,#N/A,SUMIF(Data!$I:$I,$A110,Data!K:K)),#N/A)","v":{"$error":"#N/A"}},{"$f":"IF(C$6,IF(SUMIF(Data!$I:$I,$A110,Data!L:L)=0,#N/A,SUMIF(Data!$I:$I,$A110,Data!L:L)),#N/A)","v":{"$error":"#N/A"}},{"$f":"IF(D$6,IF(SUMIF(Data!$I:$I,$A110,Data!M:M)=0,#N/A,SUMIF(Data!$I:$I,$A110,Data!M:M)),#N/A)","v":{"$error":"#N/A"}},{"$f":"IF(E$6,IF(SUMIF(Data!$I:$I,$A110,Data!N:N)=0,#N/A,SUMIF(Data!$I:$I,$A110,Data!N:N)),#N/A)","v":{"$error":"#N/A"}},{"$f":"IF(F$6,IF(SUMIF(Data!$I:$I,$A110,Data!O:O)=0,#N/A,SUMIF(Data!$I:$I,$A110,Data!O:O)),#N/A)","v":{"$error":"#N/A"}},{"$f":"IF(G$6,IF(SUMIF(Data!$I:$I,$A110,Data!P:P)=0,#N/A,SUMIF(Data!$I:$I,$A110,Data!P:P)),#N/A)","v":{"$error":"#N/A"}},{"$f":"IF(H$6,IF(SUMIF(Data!$I:$I,$A110,Data!Q:Q)=0,#N/A,SUMIF(Data!$I:$I,$A110,Data!Q:Q)),#N/A)","v":{"$error":"#N/A"}},{"$f":"IF(I$6,IF(SUMIF(Data!$I:$I,$A110,Data!R:R)=0,#N/A,SUMIF(Data!$I:$I,$A110,Data!R:R)),#N/A)","v":{"$error":"#N/A"}},{"$f":"IF(J$6,IF(SUMIF(Data!$I:$I,$A110,Data!S:S)=0,#N/A,SUMIF(Data!$I:$I,$A110,Data!S:S)),#N/A)","v":{"$error":"#N/A"}},{"$f":"IF(K$6,IF(SUMIF(Data!$I:$I,$A110,Data!T:T)=0,#N/A,SUMIF(Data!$I:$I,$A110,Data!T:T)),#N/A)","v":{"$error":"#N/A"}}]
[{"$error":"#N/A"},{"$f":"IF(B$6,IF(SUMIF(Data!$I:$I,$A111,Data!K:K)=0,#N/A,SUMIF(Data!$I:$I,$A111,Data!K:K)),#N/A)","v":{"$error":"#N/A"}},{"$f":"IF(C$6,IF(SUMIF(Data!$I:$I,$A111,Data!L:L)=0,#N/A,SUMIF(Data!$I:$I,$A111,Data!L:L)),#N/A)","v":{"$error":"#N/A"}},{"$f":"IF(D$6,IF(SUMIF(Data!$I:$I,$A111,Data!M:M)=0,#N/A,SUMIF(Data!$I:$I,$A111,Data!M:M)),#N/A)","v":{"$error":"#N/A"}},{"$f":"IF(E$6,IF(SUMIF(Data!$I:$I,$A111,Data!N:N)=0,#N/A,SUMIF(Data!$I:$I,$A111,Data!N:N)),#N/A)","v":{"$error":"#N/A"}},{"$f":"IF(F$6,IF(SUMIF(Data!$I:$I,$A111,Data!O:O)=0,#N/A,SUMIF(Data!$I:$I,$A111,Data!O:O)),#N/A)","v":{"$error":"#N/A"}},{"$f":"IF(G$6,IF(SUMIF(Data!$I:$I,$A111,Data!P:P)=0,#N/A,SUMIF(Data!$I:$I,$A111,Data!P:P)),#N/A)","v":{"$error":"#N/A"}},{"$f":"IF(H$6,IF(SUMIF(Data!$I:$I,$A111,Data!Q:Q)=0,#N/A,SUMIF(Data!$I:$I,$A111,Data!Q:Q)),#N/A)","v":{"$error":"#N/A"}},{"$f":"IF(I$6,IF(SUMIF(Data!$I:$I,$A111,Data!R:R)=0,#N/A,SUMIF(Data!$I:$I,$A111,Data!R:R)),#N/A)","v":{"$error":"#N/A"}},{"$f":"IF(J$6,IF(SUMIF(Data!$I:$I,$A111,Data!S:S)=0,#N/A,SUMIF(Data!$I:$I,$A111,Data!S:S)),#N/A)","v":{"$error":"#N/A"}},{"$f":"IF(K$6,IF(SUMIF(Data!$I:$I,$A111,Data!T:T)=0,#N/A,SUMIF(Data!$I:$I,$A111,Data!T:T)),#N/A)","v":{"$error":"#N/A"}}]
[{"$error":"#N/A"},{"$f":"IF(B$6,IF(SUMIF(Data!$I:$I,$A112,Data!K:K)=0,#N/A,SUMIF(Data!$I:$I,$A112,Data!K:K)),#N/A)","v":{"$error":"#N/A"}},{"$f":"IF(C$6,IF(SUMIF(Data!$I:$I,$A112,Data!L:L)=0,#N/A,SUMIF(Data!$I:$I,$A112,Data!L:L)),#N/A)","v":{"$error":"#N/A"}},{"$f":"IF(D$6,IF(SUMIF(Data!$I:$I,$A112,Data!M:M)=0,#N/A,SUMIF(Data!$I:$I,$A112,Data!M:M)),#N/A)","v":{"$error":"#N/A"}},{"$f":"IF(E$6,IF(SUMIF(Data!$I:$I,$A112,Data!N:N)=0,#N/A,SUMIF(Data!$I:$I,$A112,Data!N:N)),#N/A)","v":{"$error":"#N/A"}},{"$f":"IF(F$6,IF(SUMIF(Data!$I:$I,$A112,Data!O:O)=0,#N/A,SUMIF(Data!$I:$I,$A112,Data!O:O)),#N/A)","v":{"$error":"#N/A"}},{"$f":"IF(G$6,IF(SUMIF(Data!$I:$I,$A112,Data!P:P)=0,#N/A,SUMIF(Data!$I:$I,$A112,Data!P:P)),#N/A)","v":{"$error":"#N/A"}},{"$f":"IF(H$6,IF(SUMIF(Data!$I:$I,$A112,Data!Q:Q)=0,#N/A,SUMIF(Data!$I:$I,$A112,Data!Q:Q)),#N/A)","v":{"$error":"#N/A"}},{"$f":"IF(I$6,IF(SUMIF(Data!$I:$I,$A112,Data!R:R)=0,#N/A,SUMIF(Data!$I:$I,$A112,Data!R:R)),#N/A)","v":{"$error":"#N/A"}},{"$f":"IF(J$6,IF(SUMIF(Data!$I:$I,$A112,Data!S:S)=0,#N/A,SUMIF(Data!$I:$I,$A112,Data!S:S)),#N/A)","v":{"$error":"#N/A"}},{"$f":"IF(K$6,IF(SUMIF(Data!$I:$I,$A112,Data!T:T)=0,#N/A,SUMIF(Data!$I:$I,$A112,Data!T:T)),#N/A)","v":{"$error":"#N/A"}}]
[{"$error":"#N/A"},{"$f":"IF(B$6,IF(SUMIF(Data!$I:$I,$A113,Data!K:K)=0,#N/A,SUMIF(Data!$I:$I,$A113,Data!K:K)),#N/A)","v":{"$error":"#N/A"}},{"$f":"IF(C$6,IF(SUMIF(Data!$I:$I,$A113,Data!L:L)=0,#N/A,SUMIF(Data!$I:$I,$A113,Data!L:L)),#N/A)","v":{"$error":"#N/A"}},{"$f":"IF(D$6,IF(SUMIF(Data!$I:$I,$A113,Data!M:M)=0,#N/A,SUMIF(Data!$I:$I,$A113,Data!M:M)),#N/A)","v":{"$error":"#N/A"}},{"$f":"IF(E$6,IF(SUMIF(Data!$I:$I,$A113,Data!N:N)=0,#N/A,SUMIF(Data!$I:$I,$A113,Data!N:N)),#N/A)","v":{"$error":"#N/A"}},{"$f":"IF(F$6,IF(SUMIF(Data!$I:$I,$A113,Data!O:O)=0,#N/A,SUMIF(Data!$I:$I,$A113,Data!O:O)),#N/A)","v":{"$error":"#N/A"}},{"$f":"IF(G$6,IF(SUMIF(Data!$I:$I,$A113,Data!P:P)=0,#N/A,SUMIF(Data!$I:$I,$A113,Data!P:P)),#N/A)","v":{"$error":"#N/A"}},{"$f":"IF(H$6,IF(SUMIF(Data!$I:$I,$A113,Data!Q:Q)=0,#N/A,SUMIF(Data!$I:$I,$A113,Data!Q:Q)),#N/A)","v":{"$error":"#N/A"}},{"$f":"IF(I$6,IF(SUMIF(Data!$I:$I,$A113,Data!R:R)=0,#N/A,SUMIF(Data!$I:$I,$A113,Data!R:R)),#N/A)","v":{"$error":"#N/A"}},{"$f":"IF(J$6,IF(SUMIF(Data!$I:$I,$A113,Data!S:S)=0,#N/A,SUMIF(Data!$I:$I,$A113,Data!S:S)),#N/A)","v":{"$error":"#N/A"}},{"$f":"IF(K$6,IF(SUMIF(Data!$I:$I,$A113,Data!T:T)=0,#N/A,SUMIF(Data!$I:$I,$A113,Data!T:T)),#N/A)","v":{"$error":"#N/A"}}]
[{"$error":"#N/A"},{"$f":"IF(B$6,IF(SUMIF(Data!$I:$I,$A114,Data!K:K)=0,#N/A,SUMIF(Data!$I:$I,$A114,Data!K:K)),#N/A)","v":{"$error":"#N/A"}},{"$f":"IF(C$6,IF(SUMIF(Data!$I:$I,$A114,Data!L:L)=0,#N/A,SUMIF(Data!$I:$I,$A114,Data!L:L)),#N/A)","v":{"$error":"#N/A"}},{"$f":"IF(D$6,IF(SUMIF(Data!$I:$I,$A114,Data!M:M)=0,#N/A,SUMIF(Data!$I:$I,$A114,Data!M:M)),#N/A)","v":{"$error":"#N/A"}},{"$f":"IF(E$6,IF(SUMIF(Data!$I:$I,$A114,Data!N:N)=0,#N/A,SUMIF(Data!$I:$I,$A114,Data!N:N)),#N/A)","v":{"$error":"#N/A"}},{"$f":"IF(F$6,IF(SUMIF(Data!$I:$I,$A114,Data!O:O)=0,#N/A,SUMIF(Data!$I:$I,$A114,Data!O:O)),#N/A)","v":{"$error":"#N/A"}},{"$f":"IF(G$6,IF(SUMIF(Data!$I:$I,$A114,Data!P:P)=0,#N/A,SUMIF(Data!$I:$I,$A114,Data!P:P)),#N/A)","v":{"$error":"#N/A"}},{"$f":"IF(H$6,IF(SUMIF(Data!$I:$I,$A114,Data!Q:Q)=0,#N/A,SUMIF(Data!$I:$I,$A114,Data!Q:Q)),#N/A)","v":{"$error":"#N/A"}},{"$f":"IF(I$6,IF(SUMIF(Data!$I:$I,$A114,Data!R:R)=0,#N/A,SUMIF(Data!$I:$I,$A114,Data!R:R)),#N/A)","v":{"$error":"#N/A"}},{"$f":"IF(J$6,IF(SUMIF(Data!$I:$I,$A114,Data!S:S)=0,#N/A,SUMIF(Data!$I:$I,$A114,Data!S:S)),#N/A)","v":{"$error":"#N/A"}},{"$f":"IF(K$6,IF(SUMIF(Data!$I:$I,$A114,Data!T:T)=0,#N/A,SUMIF(Data!$I:$I,$A114,Data!T:T)),#N/A)","v":{"$error":"#N/A"}}]
[{"$error":"#N/A"},{"$f":"IF(B$6,IF(SUMIF(Data!$I:$I,$A115,Data!K:K)=0,#N/A,SUMIF(Data!$I:$I,$A115,Data!K:K)),#N/A)","v":{"$error":"#N/A"}},{"$f":"IF(C$6,IF(SUMIF(Data!$I:$I,$A115,Data!L:L)=0,#N/A,SUMIF(Data!$I:$I,$A115,Data!L:L)),#N/A)","v":{"$error":"#N/A"}},{"$f":"IF(D$6,IF(SUMIF(Data!$I:$I,$A115,Data!M:M)=0,#N/A,SUMIF(Data!$I:$I,$A115,Data!M:M)),#N/A)","v":{"$error":"#N/A"}},{"$f":"IF(E$6,IF(SUMIF(Data!$I:$I,$A115,Data!N:N)=0,#N/A,SUMIF(Data!$I:$I,$A115,Data!N:N)),#N/A)","v":{"$error":"#N/A"}},{"$f":"IF(F$6,IF(SUMIF(Data!$I:$I,$A115,Data!O:O)=0,#N/A,SUMIF(Data!$I:$I,$A115,Data!O:O)),#N/A)","v":{"$error":"#N/A"}},{"$f":"IF(G$6,IF(SUMIF(Data!$I:$I,$A115,Data!P:P)=0,#N/A,SUMIF(Data!$I:$I,$A115,Data!P:P)),#N/A)","v":{"$error":"#N/A"}},{"$f":"IF(H$6,IF(SUMIF(Data!$I:$I,$A115,Data!Q:Q)=0,#N/A,SUMIF(Data!$I:$I,$A115,Data!Q:Q)),#N/A)","v":{"$error":"#N/A"}},{"$f":"IF(I$6,IF(SUMIF(Data!$I:$I,$A115,Data!R:R)=0,#N/A,SUMIF(Data!$I:$I,$A115,Data!R:R)),#N/A)","v":{"$error":"#N/A"}},{"$f":"IF(J$6,IF(SUMIF(Data!$I:$I,$A115,Data!S:S)=0,#N/A,SUMIF(Data!$I:$I,$A115,Data!S:S)),#N/A)","v":{"$error":"#N/A"}},{"$f":"IF(K$6,IF(SUMIF(Data!$I:$I,$A115,Data!T:T)=0,#N/A,SUMIF(Data!$I:$I,$A115,Data!T:T)),#N/A)","v":{"$error":"#N/A"}}]
[{"$error":"#N/A"},{"$f":"IF(B$6,IF(SUMIF(Data!$I:$I,$A116,Data!K:K)=0,#N/A,SUMIF(Data!$I:$I,$A116,Data!K:K)),#N/A)","v":{"$error":"#N/A"}},{"$f":"IF(C$6,IF(SUMIF(Data!$I:$I,$A116,Data!L:L)=0,#N/A,SUMIF(Data!$I:$I,$A116,Data!L:L)),#N/A)","v":{"$error":"#N/A"}},{"$f":"IF(D$6,IF(SUMIF(Data!$I:$I,$A116,Data!M:M)=0,#N/A,SUMIF(Data!$I:$I,$A116,Data!M:M)),#N/A)","v":{"$error":"#N/A"}},{"$f":"IF(E$6,IF(SUMIF(Data!$I:$I,$A116,Data!N:N)=0,#N/A,SUMIF(Data!$I:$I,$A116,Data!N:N)),#N/A)","v":{"$error":"#N/A"}},{"$f":"IF(F$6,IF(SUMIF(Data!$I:$I,$A116,Data!O:O)=0,#N/A,SUMIF(Data!$I:$I,$A116,Data!O:O)),#N/A)","v":{"$error":"#N/A"}},{"$f":"IF(G$6,IF(SUMIF(Data!$I:$I,$A116,Data!P:P)=0,#N/A,SUMIF(Data!$I:$I,$A116,Data!P:P)),#N/A)","v":{"$error":"#N/A"}},{"$f":"IF(H$6,IF(SUMIF(Data!$I:$I,$A116,Data!Q:Q)=0,#N/A,SUMIF(Data!$I:$I,$A116,Data!Q:Q)),#N/A)","v":{"$error":"#N/A"}},{"$f":"IF(I$6,IF(SUMIF(Data!$I:$I,$A116,Data!R:R)=0,#N/A,SUMIF(Data!$I:$I,$A116,Data!R:R)),#N/A)","v":{"$error":"#N/A"}},{"$f":"IF(J$6,IF(SUMIF(Data!$I:$I,$A116,Data!S:S)=0,#N/A,SUMIF(Data!$I:$I,$A116,Data!S:S)),#N/A)","v":{"$error":"#N/A"}},{"$f":"IF(K$6,IF(SUMIF(Data!$I:$I,$A116,Data!T:T)=0,#N/A,SUMIF(Data!$I:$I,$A116,Data!T:T)),#N/A)","v":{"$error":"#N/A"}}]
[{"$error":"#N/A"},{"$f":"IF(B$6,IF(SUMIF(Data!$I:$I,$A117,Data!K:K)=0,#N/A,SUMIF(Data!$I:$I,$A117,Data!K:K)),#N/A)","v":{"$error":"#N/A"}},{"$f":"IF(C$6,IF(SUMIF(Data!$I:$I,$A117,Data!L:L)=0,#N/A,SUMIF(Data!$I:$I,$A117,Data!L:L)),#N/A)","v":{"$error":"#N/A"}},{"$f":"IF(D$6,IF(SUMIF(Data!$I:$I,$A117,Data!M:M)=0,#N/A,SUMIF(Data!$I:$I,$A117,Data!M:M)),#N/A)","v":{"$error":"#N/A"}},{"$f":"IF(E$6,IF(SUMIF(Data!$I:$I,$A117,Data!N:N)=0,#N/A,SUMIF(Data!$I:$I,$A117,Data!N:N)),#N/A)","v":{"$error":"#N/A"}},{"$f":"IF(F$6,IF(SUMIF(Data!$I:$I,$A117,Data!O:O)=0,#N/A,SUMIF(Data!$I:$I,$A117,Data!O:O)),#N/A)","v":{"$error":"#N/A"}},{"$f":"IF(G$6,IF(SUMIF(Data!$I:$I,$A117,Data!P:P)=0,#N/A,SUMIF(Data!$I:$I,$A117,Data!P:P)),#N/A)","v":{"$error":"#N/A"}},{"$f":"IF(H$6,IF(SUMIF(Data!$I:$I,$A117,Data!Q:Q)=0,#N/A,SUMIF(Data!$I:$I,$A117,Data!Q:Q)),#N/A)","v":{"$error":"#N/A"}},{"$f":"IF(I$6,IF(SUMIF(Data!$I:$I,$A117,Data!R:R)=0,#N/A,SUMIF(Data!$I:$I,$A117,Data!R:R)),#N/A)","v":{"$error":"#N/A"}},{"$f":"IF(J$6,IF(SUMIF(Data!$I:$I,$A117,Data!S:S)=0,#N/A,SUMIF(Data!$I:$I,$A117,Data!S:S)),#N/A)","v":{"$error":"#N/A"}},{"$f":"IF(K$6,IF(SUMIF(Data!$I:$I,$A117,Data!T:T)=0,#N/A,SUMIF(Data!$I:$I,$A117,Data!T:T)),#N/A)","v":{"$error":"#N/A"}}]
[{"$error":"#N/A"},{"$f":"IF(B$6,IF(SUMIF(Data!$I:$I,$A118,Data!K:K)=0,#N/A,SUMIF(Data!$I:$I,$A118,Data!K:K)),#N/A)","v":{"$error":"#N/A"}},{"$f":"IF(C$6,IF(SUMIF(Data!$I:$I,$A118,Data!L:L)=0,#N/A,SUMIF(Data!$I:$I,$A118,Data!L:L)),#N/A)","v":{"$error":"#N/A"}},{"$f":"IF(D$6,IF(SUMIF(Data!$I:$I,$A118,Data!M:M)=0,#N/A,SUMIF(Data!$I:$I,$A118,Data!M:M)),#N/A)","v":{"$error":"#N/A"}},{"$f":"IF(E$6,IF(SUMIF(Data!$I:$I,$A118,Data!N:N)=0,#N/A,SUMIF(Data!$I:$I,$A118,Data!N:N)),#N/A)","v":{"$error":"#N/A"}},{"$f":"IF(F$6,IF(SUMIF(Data!$I:$I,$A118,Data!O:O)=0,#N/A,SUMIF(Data!$I:$I,$A118,Data!O:O)),#N/A)","v":{"$error":"#N/A"}},{"$f":"IF(G$6,IF(SUMIF(Data!$I:$I,$A118,Data!P:P)=0,#N/A,SUMIF(Data!$I:$I,$A118,Data!P:P)),#N/A)","v":{"$error":"#N/A"}},{"$f":"IF(H$6,IF(SUMIF(Data!$I:$I,$A118,Data!Q:Q)=0,#N/A,SUMIF(Data!$I:$I,$A118,Data!Q:Q)),#N/A)","v":{"$error":"#N/A"}},{"$f":"IF(I$6,IF(SUMIF(Data!$I:$I,$A118,Data!R:R)=0,#N/A,SUMIF(Data!$I:$I,$A118,Data!R:R)),#N/A)","v":{"$error":"#N/A"}},{"$f":"IF(J$6,IF(SUMIF(Data!$I:$I,$A118,Data!S:S)=0,#N/A,SUMIF(Data!$I:$I,$A118,Data!S:S)),#N/A)","v":{"$error":"#N/A"}},{"$f":"IF(K$6,IF(SUMIF(Data!$I:$I,$A118,Data!T:T)=0,#N/A,SUMIF(Data!$I:$I,$A118,Data!T:T)),#N/A)","v":{"$error":"#N/A"}}]
[{"$error":"#N/A"},{"$f":"IF(B$6,IF(SUMIF(Data!$I:$I,$A119,Data!K:K)=0,#N/A,SUMIF(Data!$I:$I,$A119,Data!K:K)),#N/A)","v":{"$error":"#N/A"}},{"$f":"IF(C$6,IF(SUMIF(Data!$I:$I,$A119,Data!L:L)=0,#N/A,SUMIF(Data!$I:$I,$A119,Data!L:L)),#N/A)","v":{"$error":"#N/A"}},{"$f":"IF(D$6,IF(SUMIF(Data!$I:$I,$A119,Data!M:M)=0,#N/A,SUMIF(Data!$I:$I,$A119,Data!M:M)),#N/A)","v":{"$error":"#N/A"}},{"$f":"IF(E$6,IF(SUMIF(Data!$I:$I,$A119,Data!N:N)=0,#N/A,SUMIF(Data!$I:$I,$A119,Data!N:N)),#N/A)","v":{"$error":"#N/A"}},{"$f":"IF(F$6,IF(SUMIF(Data!$I:$I,$A119,Data!O:O)=0,#N/A,SUMIF(Data!$I:$I,$A119,Data!O:O)),#N/A)","v":{"$error":"#N/A"}},{"$f":"IF(G$6,IF(SUMIF(Data!$I:$I,$A119,Data!P:P)=0,#N/A,SUMIF(Data!$I:$I,$A119,Data!P:P)),#N/A)","v":{"$error":"#N/A"}},{"$f":"IF(H$6,IF(SUMIF(Data!$I:$I,$A119,Data!Q:Q)=0,#N/A,SUMIF(Data!$I:$I,$A119,Data!Q:Q)),#N/A)","v":{"$error":"#N/A"}},{"$f":"IF(I$6,IF(SUMIF(Data!$I:$I,$A119,Data!R:R)=0,#N/A,SUMIF(Data!$I:$I,$A119,Data!R:R)),#N/A)","v":{"$error":"#N/A"}},{"$f":"IF(J$6,IF(SUMIF(Data!$I:$I,$A119,Data!S:S)=0,#N/A,SUMIF(Data!$I:$I,$A119,Data!S:S)),#N/A)","v":{"$error":"#N/A"}},{"$f":"IF(K$6,IF(SUMIF(Data!$I:$I,$A119,Data!T:T)=0,#N/A,SUMIF(Data!$I:$I,$A119,Data!T:T)),#N/A)","v":{"$error":"#N/A"}}]
[{"$error":"#N/A"},{"$f":"IF(B$6,IF(SUMIF(Data!$I:$I,$A120,Data!K:K)=0,#N/A,SUMIF(Data!$I:$I,$A120,Data!K:K)),#N/A)","v":{"$error":"#N/A"}},{"$f":"IF(C$6,IF(SUMIF(Data!$I:$I,$A120,Data!L:L)=0,#N/A,SUMIF(Data!$I:$I,$A120,Data!L:L)),#N/A)","v":{"$error":"#N/A"}},{"$f":"IF(D$6,IF(SUMIF(Data!$I:$I,$A120,Data!M:M)=0,#N/A,SUMIF(Data!$I:$I,$A120,Data!M:M)),#N/A)","v":{"$error":"#N/A"}},{"$f":"IF(E$6,IF(SUMIF(Data!$I:$I,$A120,Data!N:N)=0,#N/A,SUMIF(Data!$I:$I,$A120,Data!N:N)),#N/A)","v":{"$error":"#N/A"}},{"$f":"IF(F$6,IF(SUMIF(Data!$I:$I,$A120,Data!O:O)=0,#N/A,SUMIF(Data!$I:$I,$A120,Data!O:O)),#N/A)","v":{"$error":"#N/A"}},{"$f":"IF(G$6,IF(SUMIF(Data!$I:$I,$A120,Data!P:P)=0,#N/A,SUMIF(Data!$I:$I,$A120,Data!P:P)),#N/A)","v":{"$error":"#N/A"}},{"$f":"IF(H$6,IF(SUMIF(Data!$I:$I,$A120,Data!Q:Q)=0,#N/A,SUMIF(Data!$I:$I,$A120,Data!Q:Q)),#N/A)","v":{"$error":"#N/A"}},{"$f":"IF(I$6,IF(SUMIF(Data!$I:$I,$A120,Data!R:R)=0,#N/A,SUMIF(Data!$I:$I,$A120,Data!R:R)),#N/A)","v":{"$error":"#N/A"}},{"$f":"IF(J$6,IF(SUMIF(Data!$I:$I,$A120,Data!S:S)=0,#N/A,SUMIF(Data!$I:$I,$A120,Data!S:S)),#N/A)","v":{"$error":"#N/A"}},{"$f":"IF(K$6,IF(SUMIF(Data!$I:$I,$A120,Data!T:T)=0,#N/A,SUMIF(Data!$I:$I,$A120,Data!T:T)),#N/A)","v":{"$error":"#N/A"}}]
[{"$error":"#N/A"},{"$f":"IF(B$6,IF(SUMIF(Data!$I:$I,$A121,Data!K:K)=0,#N/A,SUMIF(Data!$I:$I,$A121,Data!K:K)),#N/A)","v":{"$error":"#N/A"}},{"$f":"IF(C$6,IF(SUMIF(Data!$I:$I,$A121,Data!L:L)=0,#N/A,SUMIF(Data!$I:$I,$A121,Data!L:L)),#N/A)","v":{"$error":"#N/A"}},{"$f":"IF(D$6,IF(SUMIF(Data!$I:$I,$A121,Data!M:M)=0,#N/A,SUMIF(Data!$I:$I,$A121,Data!M:M)),#N/A)","v":{"$error":"#N/A"}},{"$f":"IF(E$6,IF(SUMIF(Data!$I:$I,$A121,Data!N:N)=0,#N/A,SUMIF(Data!$I:$I,$A121,Data!N:N)),#N/A)","v":{"$error":"#N/A"}},{"$f":"IF(F$6,IF(SUMIF(Data!$I:$I,$A121,Data!O:O)=0,#N/A,SUMIF(Data!$I:$I,$A121,Data!O:O)),#N/A)","v":{"$error":"#N/A"}},{"$f":"IF(G$6,IF(SUMIF(Data!$I:$I,$A121,Data!P:P)=0,#N/A,SUMIF(Data!$I:$I,$A121,Data!P:P)),#N/A)","v":{"$error":"#N/A"}},{"$f":"IF(H$6,IF(SUMIF(Data!$I:$I,$A121,Data!Q:Q)=0,#N/A,SUMIF(Data!$I:$I,$A121,Data!Q:Q)),#N/A)","v":{"$error":"#N/A"}},{"$f":"IF(I$6,IF(SUMIF(Data!$I:$I,$A121,Data!R:R)=0,#N/A,SUMIF(Data!$I:$I,$A121,Data!R:R)),#N/A)","v":{"$error":"#N/A"}},{"$f":"IF(J$6,IF(SUMIF(Data!$I:$I,$A121,Data!S:S)=0,#N/A,SUMIF(Data!$I:$I,$A121,Data!S:S)),#N/A)","v":{"$error":"#N/A"}},{"$f":"IF(K$6,IF(SUMIF(Data!$I:$I,$A121,Data!T:T)=0,#N/A,SUMIF(Data!$I:$I,$A121,Data!T:T)),#N/A)","v":{"$error":"#N/A"}}]
[{"$error":"#N/A"},{"$f":"IF(B$6,IF(SUMIF(Data!$I:$I,$A122,Data!K:K)=0,#N/A,SUMIF(Data!$I:$I,$A122,Data!K:K)),#N/A)","v":{"$error":"#N/A"}},{"$f":"IF(C$6,IF(SUMIF(Data!$I:$I,$A122,Data!L:L)=0,#N/A,SUMIF(Data!$I:$I,$A122,Data!L:L)),#N/A)","v":{"$error":"#N/A"}},{"$f":"IF(D$6,IF(SUMIF(Data!$I:$I,$A122,Data!M:M)=0,#N/A,SUMIF(Data!$I:$I,$A122,Data!M:M)),#N/A)","v":{"$error":"#N/A"}},{"$f":"IF(E$6,IF(SUMIF(Data!$I:$I,$A122,Data!N:N)=0,#N/A,SUMIF(Data!$I:$I,$A122,Data!N:N)),#N/A)","v":{"$error":"#N/A"}},{"$f":"IF(F$6,IF(SUMIF(Data!$I:$I,$A122,Data!O:O)=0,#N/A,SUMIF(Data!$I:$I,$A122,Data!O:O)),#N/A)","v":{"$error":"#N/A"}},{"$f":"IF(G$6,IF(SUMIF(Data!$I:$I,$A122,Data!P:P)=0,#N/A,SUMIF(Data!$I:$I,$A122,Data!P:P)),#N/A)","v":{"$error":"#N/A"}},{"$f":"IF(H$6,IF(SUMIF(Data!$I:$I,$A122,Data!Q:Q)=0,#N/A,SUMIF(Data!$I:$I,$A122,Data!Q:Q)),#N/A)","v":{"$error":"#N/A"}},{"$f":"IF(I$6,IF(SUMIF(Data!$I:$I,$A122,Data!R:R)=0,#N/A,SUMIF(Data!$I:$I,$A122,Data!R:R)),#N/A)","v":{"$error":"#N/A"}},{"$f":"IF(J$6,IF(SUMIF(Data!$I:$I,$A122,Data!S:S)=0,#N/A,SUMIF(Data!$I:$I,$A122,Data!S:S)),#N/A)","v":{"$error":"#N/A"}},{"$f":"IF(K$6,IF(SUMIF(Data!$I:$I,$A122,Data!T:T)=0,#N/A,SUMIF(Data!$I:$I,$A122,Data!T:T)),#N/A)","v":{"$error":"#N/A"}}]
[{"$error":"#N/A"},{"$f":"IF(B$6,IF(SUMIF(Data!$I:$I,$A123,Data!K:K)=0,#N/A,SUMIF(Data!$I:$I,$A123,Data!K:K)),#N/A)","v":{"$error":"#N/A"}},{"$f":"IF(C$6,IF(SUMIF(Data!$I:$I,$A123,Data!L:L)=0,#N/A,SUMIF(Data!$I:$I,$A123,Data!L:L)),#N/A)","v":{"$error":"#N/A"}},{"$f":"IF(D$6,IF(SUMIF(Data!$I:$I,$A123,Data!M:M)=0,#N/A,SUMIF(Data!$I:$I,$A123,Data!M:M)),#N/A)","v":{"$error":"#N/A"}},{"$f":"IF(E$6,IF(SUMIF(Data!$I:$I,$A123,Data!N:N)=0,#N/A,SUMIF(Data!$I:$I,$A123,Data!N:N)),#N/A)","v":{"$error":"#N/A"}},{"$f":"IF(F$6,IF(SUMIF(Data!$I:$I,$A123,Data!O:O)=0,#N/A,SUMIF(Data!$I:$I,$A123,Data!O:O)),#N/A)","v":{"$error":"#N/A"}},{"$f":"IF(G$6,IF(SUMIF(Data!$I:$I,$A123,Data!P:P)=0,#N/A,SUMIF(Data!$I:$I,$A123,Data!P:P)),#N/A)","v":{"$error":"#N/A"}},{"$f":"IF(H$6,IF(SUMIF(Data!$I:$I,$A123,Data!Q:Q)=0,#N/A,SUMIF(Data!$I:$I,$A123,Data!Q:Q)),#N/A)","v":{"$error":"#N/A"}},{"$f":"IF(I$6,IF(SUMIF(Data!$I:$I,$A123,Data!R:R)=0,#N/A,SUMIF(Data!$I:$I,$A123,Data!R:R)),#N/A)","v":{"$error":"#N/A"}},{"$f":"IF(J$6,IF(SUMIF(Data!$I:$I,$A123,Data!S:S)=0,#N/A,SUMIF(Data!$I:$I,$A123,Data!S:S)),#N/A)","v":{"$error":"#N/A"}},{"$f":"IF(K$6,IF(SUMIF(Data!$I:$I,$A123,Data!T:T)=0,#N/A,SUMIF(Data!$I:$I,$A123,Data!T:T)),#N/A)","v":{"$error":"#N/A"}}]
[{"$error":"#N/A"},{"$f":"IF(B$6,IF(SUMIF(Data!$I:$I,$A124,Data!K:K)=0,#N/A,SUMIF(Data!$I:$I,$A124,Data!K:K)),#N/A)","v":{"$error":"#N/A"}},{"$f":"IF(C$6,IF(SUMIF(Data!$I:$I,$A124,Data!L:L)=0,#N/A,SUMIF(Data!$I:$I,$A124,Data!L:L)),#N/A)","v":{"$error":"#N/A"}},{"$f":"IF(D$6,IF(SUMIF(Data!$I:$I,$A124,Data!M:M)=0,#N/A,SUMIF(Data!$I:$I,$A124,Data!M:M)),#N/A)","v":{"$error":"#N/A"}},{"$f":"IF(E$6,IF(SUMIF(Data!$I:$I,$A124,Data!N:N)=0,#N/A,SUMIF(Data!$I:$I,$A124,Data!N:N)),#N/A)","v":{"$error":"#N/A"}},{"$f":"IF(F$6,IF(SUMIF(Data!$I:$I,$A124,Data!O:O)=0,#N/A,SUMIF(Data!$I:$I,$A124,Data!O:O)),#N/A)","v":{"$error":"#N/A"}},{"$f":"IF(G$6,IF(SUMIF(Data!$I:$I,$A124,Data!P:P)=0,#N/A,SUMIF(Data!$I:$I,$A124,Data!P:P)),#N/A)","v":{"$error":"#N/A"}},{"$f":"IF(H$6,IF(SUMIF(Data!$I:$I,$A124,Data!Q:Q)=0,#N/A,SUMIF(Data!$I:$I,$A124,Data!Q:Q)),#N/A)","v":{"$error":"#N/A"}},{"$f":"IF(I$6,IF(SUMIF(Data!$I:$I,$A124,Data!R:R)=0,#N/A,SUMIF(Data!$I:$I,$A124,Data!R:R)),#N/A)","v":{"$error":"#N/A"}},{"$f":"IF(J$6,IF(SUMIF(Data!$I:$I,$A124,Data!S:S)=0,#N/A,SUMIF(Data!$I:$I,$A124,Data!S:S)),#N/A)","v":{"$error":"#N/A"}},{"$f":"IF(K$6,IF(SUMIF(Data!$I:$I,$A124,Data!T:T)=0,#N/A,SUMIF(Data!$I:$I,$A124,Data!T:T)),#N/A)","v":{"$error":"#N/A"}}]
[{"$error":"#N/A"},{"$f":"IF(B$6,IF(SUMIF(Data!$I:$I,$A125,Data!K:K)=0,#N/A,SUMIF(Data!$I:$I,$A125,Data!K:K)),#N/A)","v":{"$error":"#N/A"}},{"$f":"IF(C$6,IF(SUMIF(Data!$I:$I,$A125,Data!L:L)=0,#N/A,SUMIF(Data!$I:$I,$A125,Data!L:L)),#N/A)","v":{"$error":"#N/A"}},{"$f":"IF(D$6,IF(SUMIF(Data!$I:$I,$A125,Data!M:M)=0,#N/A,SUMIF(Data!$I:$I,$A125,Data!M:M)),#N/A)","v":{"$error":"#N/A"}},{"$f":"IF(E$6,IF(SUMIF(Data!$I:$I,$A125,Data!N:N)=0,#N/A,SUMIF(Data!$I:$I,$A125,Data!N:N)),#N/A)","v":{"$error":"#N/A"}},{"$f":"IF(F$6,IF(SUMIF(Data!$I:$I,$A125,Data!O:O)=0,#N/A,SUMIF(Data!$I:$I,$A125,Data!O:O)),#N/A)","v":{"$error":"#N/A"}},{"$f":"IF(G$6,IF(SUMIF(Data!$I:$I,$A125,Data!P:P)=0,#N/A,SUMIF(Data!$I:$I,$A125,Data!P:P)),#N/A)","v":{"$error":"#N/A"}},{"$f":"IF(H$6,IF(SUMIF(Data!$I:$I,$A125,Data!Q:Q)=0,#N/A,SUMIF(Data!$I:$I,$A125,Data!Q:Q)),#N/A)","v":{"$error":"#N/A"}},{"$f":"IF(I$6,IF(SUMIF(Data!$I:$I,$A125,Data!R:R)=0,#N/A,SUMIF(Data!$I:$I,$A125,Data!R:R)),#N/A)","v":{"$error":"#N/A"}},{"$f":"IF(J$6,IF(SUMIF(Data!$I:$I,$A125,Data!S:S)=0,#N/A,SUMIF(Data!$I:$I,$A125,Data!S:S)),#N/A)","v":{"$error":"#N/A"}},{"$f":"IF(K$6,IF(SUMIF(Data!$I:$I,$A125,Data!T:T)=0,#N/A,SUMIF(Data!$I:$I,$A125,Data!T:T)),#N/A)","v":{"$error":"#N/A"}}]
[{"$error":"#N/A"},{"$f":"IF(B$6,IF(SUMIF(Data!$I:$I,$A126,Data!K:K)=0,#N/A,SUMIF(Data!$I:$I,$A126,Data!K:K)),#N/A)","v":{"$error":"#N/A"}},{"$f":"IF(C$6,IF(SUMIF(Data!$I:$I,$A126,Data!L:L)=0,#N/A,SUMIF(Data!$I:$I,$A126,Data!L:L)),#N/A)","v":{"$error":"#N/A"}},{"$f":"IF(D$6,IF(SUMIF(Data!$I:$I,$A126,Data!M:M)=0,#N/A,SUMIF(Data!$I:$I,$A126,Data!M:M)),#N/A)","v":{"$error":"#N/A"}},{"$f":"IF(E$6,IF(SUMIF(Data!$I:$I,$A126,Data!N:N)=0,#N/A,SUMIF(Data!$I:$I,$A126,Data!N:N)),#N/A)","v":{"$error":"#N/A"}},{"$f":"IF(F$6,IF(SUMIF(Data!$I:$I,$A126,Data!O:O)=0,#N/A,SUMIF(Data!$I:$I,$A126,Data!O:O)),#N/A)","v":{"$error":"#N/A"}},{"$f":"IF(G$6,IF(SUMIF(Data!$I:$I,$A126,Data!P:P)=0,#N/A,SUMIF(Data!$I:$I,$A126,Data!P:P)),#N/A)","v":{"$error":"#N/A"}},{"$f":"IF(H$6,IF(SUMIF(Data!$I:$I,$A126,Data!Q:Q)=0,#N/A,SUMIF(Data!$I:$I,$A126,Data!Q:Q)),#N/A)","v":{"$error":"#N/A"}},{"$f":"IF(I$6,IF(SUMIF(Data!$I:$I,$A126,Data!R:R)=0,#N/A,SUMIF(Data!$I:$I,$A126,Data!R:R)),#N/A)","v":{"$error":"#N/A"}},{"$f":"IF(J$6,IF(SUMIF(Data!$I:$I,$A126,Data!S:S)=0,#N/A,SUMIF(Data!$I:$I,$A126,Data!S:S)),#N/A)","v":{"$error":"#N/A"}},{"$f":"IF(K$6,IF(SUMIF(Data!$I:$I,$A126,Data!T:T)=0,#N/A,SUMIF(Data!$I:$I,$A126,Data!T:T)),#N/A)","v":{"$error":"#N/A"}}]
[{"$error":"#N/A"},{"$f":"IF(B$6,IF(SUMIF(Data!$I:$I,$A127,Data!K:K)=0,#N/A,SUMIF(Data!$I:$I,$A127,Data!K:K)),#N/A)","v":{"$error":"#N/A"}},{"$f":"IF(C$6,IF(SUMIF(Data!$I:$I,$A127,Data!L:L)=0,#N/A,SUMIF(Data!$I:$I,$A127,Data!L:L)),#N/A)","v":{"$error":"#N/A"}},{"$f":"IF(D$6,IF(SUMIF(Data!$I:$I,$A127,Data!M:M)=0,#N/A,SUMIF(Data!$I:$I,$A127,Data!M:M)),#N/A)","v":{"$error":"#N/A"}},{"$f":"IF(E$6,IF(SUMIF(Data!$I:$I,$A127,Data!N:N)=0,#N/A,SUMIF(Data!$I:$I,$A127,Data!N:N)),#N/A)","v":{"$error":"#N/A"}},{"$f":"IF(F$6,IF(SUMIF(Data!$I:$I,$A127,Data!O:O)=0,#N/A,SUMIF(Data!$I:$I,$A127,Data!O:O)),#N/A)","v":{"$error":"#N/A"}},{"$f":"IF(G$6,IF(SUMIF(Data!$I:$I,$A127,Data!P:P)=0,#N/A,SUMIF(Data!$I:$I,$A127,Data!P:P)),#N/A)","v":{"$error":"#N/A"}},{"$f":"IF(H$6,IF(SUMIF(Data!$I:$I,$A127,Data!Q:Q)=0,#N/A,SUMIF(Data!$I:$I,$A127,Data!Q:Q)),#N/A)","v":{"$error":"#N/A"}},{"$f":"IF(I$6,IF(SUMIF(Data!$I:$I,$A127,Data!R:R)=0,#N/A,SUMIF(Data!$I:$I,$A127,Data!R:R)),#N/A)","v":{"$error":"#N/A"}},{"$f":"IF(J$6,IF(SUMIF(Data!$I:$I,$A127,Data!S:S)=0,#N/A,SUMIF(Data!$I:$I,$A127,Data!S:S)),#N/A)","v":{"$error":"#N/A"}},{"$f":"IF(K$6,IF(SUMIF(Data!$I:$I,$A127,Data!T:T)=0,#N/A,SUMIF(Data!$I:$I,$A127,Data!T:T)),#N/A)","v":{"$error":"#N/A"}}]
[{"$error":"#N/A"},{"$f":"IF(B$6,IF(SUMIF(Data!$I:$I,$A128,Data!K:K)=0,#N/A,SUMIF(Data!$I:$I,$A128,Data!K:K)),#N/A)","v":{"$error":"#N/A"}},{"$f":"IF(C$6,IF(SUMIF(Data!$I:$I,$A128,Data!L:L)=0,#N/A,SUMIF(Data!$I:$I,$A128,Data!L:L)),#N/A)","v":{"$error":"#N/A"}},{"$f":"IF(D$6,IF(SUMIF(Data!$I:$I,$A128,Data!M:M)=0,#N/A,SUMIF(Data!$I:$I,$A128,Data!M:M)),#N/A)","v":{"$error":"#N/A"}},{"$f":"IF(E$6,IF(SUMIF(Data!$I:$I,$A128,Data!N:N)=0,#N/A,SUMIF(Data!$I:$I,$A128,Data!N:N)),#N/A)","v":{"$error":"#N/A"}},{"$f":"IF(F$6,IF(SUMIF(Data!$I:$I,$A128,Data!O:O)=0,#N/A,SUMIF(Data!$I:$I,$A128,Data!O:O)),#N/A)","v":{"$error":"#N/A"}},{"$f":"IF(G$6,IF(SUMIF(Data!$I:$I,$A128,Data!P:P)=0,#N/A,SUMIF(Data!$I:$I,$A128,Data!P:P)),#N/A)","v":{"$error":"#N/A"}},{"$f":"IF(H$6,IF(SUMIF(Data!$I:$I,$A128,Data!Q:Q)=0,#N/A,SUMIF(Data!$I:$I,$A128,Data!Q:Q)),#N/A)","v":{"$error":"#N/A"}},{"$f":"IF(I$6,IF(SUMIF(Data!$I:$I,$A128,Data!R:R)=0,#N/A,SUMIF(Data!$I:$I,$A128,Data!R:R)),#N/A)","v":{"$error":"#N/A"}},{"$f":"IF(J$6,IF(SUMIF(Data!$I:$I,$A128,Data!S:S)=0,#N/A,SUMIF(Data!$I:$I,$A128,Data!S:S)),#N/A)","v":{"$error":"#N/A"}},{"$f":"IF(K$6,IF(SUMIF(Data!$I:$I,$A128,Data!T:T)=0,#N/A,SUMIF(Data!$I:$I,$A128,Data!T:T)),#N/A)","v":{"$error":"#N/A"}}]
[{"$error":"#N/A"},{"$f":"IF(B$6,IF(SUMIF(Data!$I:$I,$A129,Data!K:K)=0,#N/A,SUMIF(Data!$I:$I,$A129,Data!K:K)),#N/A)","v":{"$error":"#N/A"}},{"$f":"IF(C$6,IF(SUMIF(Data!$I:$I,$A129,Data!L:L)=0,#N/A,SUMIF(Data!$I:$I,$A129,Data!L:L)),#N/A)","v":{"$error":"#N/A"}},{"$f":"IF(D$6,IF(SUMIF(Data!$I:$I,$A129,Data!M:M)=0,#N/A,SUMIF(Data!$I:$I,$A129,Data!M:M)),#N/A)","v":{"$error":"#N/A"}},{"$f":"IF(E$6,IF(SUMIF(Data!$I:$I,$A129,Data!N:N)=0,#N/A,SUMIF(Data!$I:$I,$A129,Data!N:N)),#N/A)","v":{"$error":"#N/A"}},{"$f":"IF(F$6,IF(SUMIF(Data!$I:$I,$A129,Data!O:O)=0,#N/A,SUMIF(Data!$I:$I,$A129,Data!O:O)),#N/A)","v":{"$error":"#N/A"}},{"$f":"IF(G$6,IF(SUMIF(Data!$I:$I,$A129,Data!P:P)=0,#N/A,SUMIF(Data!$I:$I,$A129,Data!P:P)),#N/A)","v":{"$error":"#N/A"}},{"$f":"IF(H$6,IF(SUMIF(Data!$I:$I,$A129,Data!Q:Q)=0,#N/A,SUMIF(Data!$I:$I,$A129,Data!Q:Q)),#N/A)","v":{"$error":"#N/A"}},{"$f":"IF(I$6,IF(SUMIF(Data!$I:$I,$A129,Data!R:R)=0,#N/A,SUMIF(Data!$I:$I,$A129,Data!R:R)),#N/A)","v":{"$error":"#N/A"}},{"$f":"IF(J$6,IF(SUMIF(Data!$I:$I,$A129,Data!S:S)=0,#N/A,SUMIF(Data!$I:$I,$A129,Data!S:S)),#N/A)","v":{"$error":"#N/A"}},{"$f":"IF(K$6,IF(SUMIF(Data!$I:$I,$A129,Data!T:T)=0,#N/A,SUMIF(Data!$I:$I,$A129,Data!T:T)),#N/A)","v":{"$error":"#N/A"}}]
[{"$error":"#N/A"},{"$f":"IF(B$6,IF(SUMIF(Data!$I:$I,$A130,Data!K:K)=0,#N/A,SUMIF(Data!$I:$I,$A130,Data!K:K)),#N/A)","v":{"$error":"#N/A"}},{"$f":"IF(C$6,IF(SUMIF(Data!$I:$I,$A130,Data!L:L)=0,#N/A,SUMIF(Data!$I:$I,$A130,Data!L:L)),#N/A)","v":{"$error":"#N/A"}},{"$f":"IF(D$6,IF(SUMIF(Data!$I:$I,$A130,Data!M:M)=0,#N/A,SUMIF(Data!$I:$I,$A130,Data!M:M)),#N/A)","v":{"$error":"#N/A"}},{"$f":"IF(E$6,IF(SUMIF(Data!$I:$I,$A130,Data!N:N)=0,#N/A,SUMIF(Data!$I:$I,$A130,Data!N:N)),#N/A)","v":{"$error":"#N/A"}},{"$f":"IF(F$6,IF(SUMIF(Data!$I:$I,$A130,Data!O:O)=0,#N/A,SUMIF(Data!$I:$I,$A130,Data!O:O)),#N/A)","v":{"$error":"#N/A"}},{"$f":"IF(G$6,IF(SUMIF(Data!$I:$I,$A130,Data!P:P)=0,#N/A,SUMIF(Data!$I:$I,$A130,Data!P:P)),#N/A)","v":{"$error":"#N/A"}},{"$f":"IF(H$6,IF(SUMIF(Data!$I:$I,$A130,Data!Q:Q)=0,#N/A,SUMIF(Data!$I:$I,$A130,Data!Q:Q)),#N/A)","v":{"$error":"#N/A"}},{"$f":"IF(I$6,IF(SUMIF(Data!$I:$I,$A130,Data!R:R)=0,#N/A,SUMIF(Data!$I:$I,$A130,Data!R:R)),#N/A)","v":{"$error":"#N/A"}},{"$f":"IF(J$6,IF(SUMIF(Data!$I:$I,$A130,Data!S:S)=0,#N/A,SUMIF(Data!$I:$I,$A130,Data!S:S)),#N/A)","v":{"$error":"#N/A"}},{"$f":"IF(K$6,IF(SUMIF(Data!$I:$I,$A130,Data!T:T)=0,#N/A,SUMIF(Data!$I:$I,$A130,Data!T:T)),#N/A)","v":{"$error":"#N/A"}}]
[{"$error":"#N/A"},{"$f":"IF(B$6,IF(SUMIF(Data!$I:$I,$A131,Data!K:K)=0,#N/A,SUMIF(Data!$I:$I,$A131,Data!K:K)),#N/A)","v":{"$error":"#N/A"}},{"$f":"IF(C$6,IF(SUMIF(Data!$I:$I,$A131,Data!L:L)=0,#N/A,SUMIF(Data!$I:$I,$A131,Data!L:L)),#N/A)","v":{"$error":"#N/A"}},{"$f":"IF(D$6,IF(SUMIF(Data!$I:$I,$A131,Data!M:M)=0,#N/A,SUMIF(Data!$I:$I,$A131,Data!M:M)),#N/A)","v":{"$error":"#N/A"}},{"$f":"IF(E$6,IF(SUMIF(Data!$I:$I,$A131,Data!N:N)=0,#N/A,SUMIF(Data!$I:$I,$A131,Data!N:N)),#N/A)","v":{"$error":"#N/A"}},{"$f":"IF(F$6,IF(SUMIF(Data!$I:$I,$A131,Data!O:O)=0,#N/A,SUMIF(Data!$I:$I,$A131,Data!O:O)),#N/A)","v":{"$error":"#N/A"}},{"$f":"IF(G$6,IF(SUMIF(Data!$I:$I,$A131,Data!P:P)=0,#N/A,SUMIF(Data!$I:$I,$A131,Data!P:P)),#N/A)","v":{"$error":"#N/A"}},{"$f":"IF(H$6,IF(SUMIF(Data!$I:$I,$A131,Data!Q:Q)=0,#N/A,SUMIF(Data!$I:$I,$A131,Data!Q:Q)),#N/A)","v":{"$error":"#N/A"}},{"$f":"IF(I$6,IF(SUMIF(Data!$I:$I,$A131,Data!R:R)=0,#N/A,SUMIF(Data!$I:$I,$A131,Data!R:R)),#N/A)","v":{"$error":"#N/A"}},{"$f":"IF(J$6,IF(SUMIF(Data!$I:$I,$A131,Data!S:S)=0,#N/A,SUMIF(Data!$I:$I,$A131,Data!S:S)),#N/A)","v":{"$error":"#N/A"}},{"$f":"IF(K$6,IF(SUMIF(Data!$I:$I,$A131,Data!T:T)=0,#N/A,SUMIF(Data!$I:$I,$A131,Data!T:T)),#N/A)","v":{"$error":"#N/A"}}]
[{"$error":"#N/A"},{"$f":"IF(B$6,IF(SUMIF(Data!$I:$I,$A132,Data!K:K)=0,#N/A,SUMIF(Data!$I:$I,$A132,Data!K:K)),#N/A)","v":{"$error":"#N/A"}},{"$f":"IF(C$6,IF(SUMIF(Data!$I:$I,$A132,Data!L:L)=0,#N/A,SUMIF(Data!$I:$I,$A132,Data!L:L)),#N/A)","v":{"$error":"#N/A"}},{"$f":"IF(D$6,IF(SUMIF(Data!$I:$I,$A132,Data!M:M)=0,#N/A,SUMIF(Data!$I:$I,$A132,Data!M:M)),#N/A)","v":{"$error":"#N/A"}},{"$f":"IF(E$6,IF(SUMIF(Data!$I:$I,$A132,Data!N:N)=0,#N/A,SUMIF(Data!$I:$I,$A132,Data!N:N)),#N/A)","v":{"$error":"#N/A"}},{"$f":"IF(F$6,IF(SUMIF(Data!$I:$I,$A132,Data!O:O)=0,#N/A,SUMIF(Data!$I:$I,$A132,Data!O:O)),#N/A)","v":{"$error":"#N/A"}},{"$f":"IF(G$6,IF(SUMIF(Data!$I:$I,$A132,Data!P:P)=0,#N/A,SUMIF(Data!$I:$I,$A132,Data!P:P)),#N/A)","v":{"$error":"#N/A"}},{"$f":"IF(H$6,IF(SUMIF(Data!$I:$I,$A132,Data!Q:Q)=0,#N/A,SUMIF(Data!$I:$I,$A132,Data!Q:Q)),#N/A)","v":{"$error":"#N/A"}},{"$f":"IF(I$6,IF(SUMIF(Data!$I:$I,$A132,Data!R:R)=0,#N/A,SUMIF(Data!$I:$I,$A132,Data!R:R)),#N/A)","v":{"$error":"#N/A"}},{"$f":"IF(J$6,IF(SUMIF(Data!$I:$I,$A132,Data!S:S)=0,#N/A,SUMIF(Data!$I:$I,$A132,Data!S:S)),#N/A)","v":{"$error":"#N/A"}},{"$f":"IF(K$6,IF(SUMIF(Data!$I:$I,$A132,Data!T:T)=0,#N/A,SUMIF(Data!$I:$I,$A132,Data!T:T)),#N/A)","v":{"$error":"#N/A"}}]
[{"$error":"#N/A"},{"$f":"IF(B$6,IF(SUMIF(Data!$I:$I,$A133,Data!K:K)=0,#N/A,SUMIF(Data!$I:$I,$A133,Data!K:K)),#N/A)","v":{"$error":"#N/A"}},{"$f":"IF(C$6,IF(SUMIF(Data!$I:$I,$A133,Data!L:L)=0,#N/A,SUMIF(Data!$I:$I,$A133,Data!L:L)),#N/A)","v":{"$error":"#N/A"}},{"$f":"IF(D$6,IF(SUMIF(Data!$I:$I,$A133,Data!M:M)=0,#N/A,SUMIF(Data!$I:$I,$A133,Data!M:M)),#N/A)","v":{"$error":"#N/A"}},{"$f":"IF(E$6,IF(SUMIF(Data!$I:$I,$A133,Data!N:N)=0,#N/A,SUMIF(Data!$I:$I,$A133,Data!N:N)),#N/A)","v":{"$error":"#N/A"}},{"$f":"IF(F$6,IF(SUMIF(Data!$I:$I,$A133,Data!O:O)=0,#N/A,SUMIF(Data!$I:$I,$A133,Data!O:O)),#N/A)","v":{"$error":"#N/A"}},{"$f":"IF(G$6,IF(SUMIF(Data!$I:$I,$A133,Data!P:P)=0,#N/A,SUMIF(Data!$I:$I,$A133,Data!P:P)),#N/A)","v":{"$error":"#N/A"}},{"$f":"IF(H$6,IF(SUMIF(Data!$I:$I,$A133,Data!Q:Q)=0,#N/A,SUMIF(Data!$I:$I,$A133,Data!Q:Q)),#N/A)","v":{"$error":"#N/A"}},{"$f":"IF(I$6,IF(SUMIF(Data!$I:$I,$A133,Data!R:R)=0,#N/A,SUMIF(Data!$I:$I,$A133,Data!R:R)),#N/A)","v":{"$error":"#N/A"}},{"$f":"IF(J$6,IF(SUMIF(Data!$I:$I,$A133,Data!S:S)=0,#N/A,SUMIF(Data!$I:$I,$A133,Data!S:S)),#N/A)","v":{"$error":"#N/A"}},{"$f":"IF(K$6,IF(SUMIF(Data!$I:$I,$A133,Data!T:T)=0,#N/A,SUMIF(Data!$I:$I,$A133,Data!T:T)),#N/A)","v":{"$error":"#N/A"}}]
[{"$error":"#N/A"},{"$f":"IF(B$6,IF(SUMIF(Data!$I:$I,$A134,Data!K:K)=0,#N/A,SUMIF(Data!$I:$I,$A134,Data!K:K)),#N/A)","v":{"$error":"#N/A"}},{"$f":"IF(C$6,IF(SUMIF(Data!$I:$I,$A134,Data!L:L)=0,#N/A,SUMIF(Data!$I:$I,$A134,Data!L:L)),#N/A)","v":{"$error":"#N/A"}},{"$f":"IF(D$6,IF(SUMIF(Data!$I:$I,$A134,Data!M:M)=0,#N/A,SUMIF(Data!$I:$I,$A134,Data!M:M)),#N/A)","v":{"$error":"#N/A"}},{"$f":"IF(E$6,IF(SUMIF(Data!$I:$I,$A134,Data!N:N)=0,#N/A,SUMIF(Data!$I:$I,$A134,Data!N:N)),#N/A)","v":{"$error":"#N/A"}},{"$f":"IF(F$6,IF(SUMIF(Data!$I:$I,$A134,Data!O:O)=0,#N/A,SUMIF(Data!$I:$I,$A134,Data!O:O)),#N/A)","v":{"$error":"#N/A"}},{"$f":"IF(G$6,IF(SUMIF(Data!$I:$I,$A134,Data!P:P)=0,#N/A,SUMIF(Data!$I:$I,$A134,Data!P:P)),#N/A)","v":{"$error":"#N/A"}},{"$f":"IF(H$6,IF(SUMIF(Data!$I:$I,$A134,Data!Q:Q)=0,#N/A,SUMIF(Data!$I:$I,$A134,Data!Q:Q)),#N/A)","v":{"$error":"#N/A"}},{"$f":"IF(I$6,IF(SUMIF(Data!$I:$I,$A134,Data!R:R)=0,#N/A,SUMIF(Data!$I:$I,$A134,Data!R:R)),#N/A)","v":{"$error":"#N/A"}},{"$f":"IF(J$6,IF(SUMIF(Data!$I:$I,$A134,Data!S:S)=0,#N/A,SUMIF(Data!$I:$I,$A134,Data!S:S)),#N/A)","v":{"$error":"#N/A"}},{"$f":"IF(K$6,IF(SUMIF(Data!$I:$I,$A134,Data!T:T)=0,#N/A,SUMIF(Data!$I:$I,$A134,Data!T:T)),#N/A)","v":{"$error":"#N/A"}}]
[{"$error":"#N/A"},{"$f":"IF(B$6,IF(SUMIF(Data!$I:$I,$A135,Data!K:K)=0,#N/A,SUMIF(Data!$I:$I,$A135,Data!K:K)),#N/A)","v":{"$error":"#N/A"}},{"$f":"IF(C$6,IF(SUMIF(Data!$I:$I,$A135,Data!L:L)=0,#N/A,SUMIF(Data!$I:$I,$A135,Data!L:L)),#N/A)","v":{"$error":"#N/A"}},{"$f":"IF(D$6,IF(SUMIF(Data!$I:$I,$A135,Data!M:M)=0,#N/A,SUMIF(Data!$I:$I,$A135,Data!M:M)),#N/A)","v":{"$error":"#N/A"}},{"$f":"IF(E$6,IF(SUMIF(Data!$I:$I,$A135,Data!N:N)=0,#N/A,SUMIF(Data!$I:$I,$A135,Data!N:N)),#N/A)","v":{"$error":"#N/A"}},{"$f":"IF(F$6,IF(SUMIF(Data!$I:$I,$A135,Data!O:O)=0,#N/A,SUMIF(Data!$I:$I,$A135,Data!O:O)),#N/A)","v":{"$error":"#N/A"}},{"$f":"IF(G$6,IF(SUMIF(Data!$I:$I,$A135,Data!P:P)=0,#N/A,SUMIF(Data!$I:$I,$A135,Data!P:P)),#N/A)","v":{"$error":"#N/A"}},{"$f":"IF(H$6,IF(SUMIF(Data!$I:$I,$A135,Data!Q:Q)=0,#N/A,SUMIF(Data!$I:$I,$A135,Data!Q:Q)),#N/A)","v":{"$error":"#N/A"}},{"$f":"IF(I$6,IF(SUMIF(Data!$I:$I,$A135,Data!R:R)=0,#N/A,SUMIF(Data!$I:$I,$A135,Data!R:R)),#N/A)","v":{"$error":"#N/A"}},{"$f":"IF(J$6,IF(SUMIF(Data!$I:$I,$A135,Data!S:S)=0,#N/A,SUMIF(Data!$I:$I,$A135,Data!S:S)),#N/A)","v":{"$error":"#N/A"}},{"$f":"IF(K$6,IF(SUMIF(Data!$I:$I,$A135,Data!T:T)=0,#N/A,SUMIF(Data!$I:$I,$A135,Data!T:T)),#N/A)","v":{"$error":"#N/A"}}]
[{"$error":"#N/A"},{"$f":"IF(B$6,IF(SUMIF(Data!$I:$I,$A136,Data!K:K)=0,#N/A,SUMIF(Data!$I:$I,$A136,Data!K:K)),#N/A)","v":{"$error":"#N/A"}},{"$f":"IF(C$6,IF(SUMIF(Data!$I:$I,$A136,Data!L:L)=0,#N/A,SUMIF(Data!$I:$I,$A136,Data!L:L)),#N/A)","v":{"$error":"#N/A"}},{"$f":"IF(D$6,IF(SUMIF(Data!$I:$I,$A136,Data!M:M)=0,#N/A,SUMIF(Data!$I:$I,$A136,Data!M:M)),#N/A)","v":{"$error":"#N/A"}},{"$f":"IF(E$6,IF(SUMIF(Data!$I:$I,$A136,Data!N:N)=0,#N/A,SUMIF(Data!$I:$I,$A136,Data!N:N)),#N/A)","v":{"$error":"#N/A"}},{"$f":"IF(F$6,IF(SUMIF(Data!$I:$I,$A136,Data!O:O)=0,#N/A,SUMIF(Data!$I:$I,$A136,Data!O:O)),#N/A)","v":{"$error":"#N/A"}},{"$f":"IF(G$6,IF(SUMIF(Data!$I:$I,$A136,Data!P:P)=0,#N/A,SUMIF(Data!$I:$I,$A136,Data!P:P)),#N/A)","v":{"$error":"#N/A"}},{"$f":"IF(H$6,IF(SUMIF(Data!$I:$I,$A136,Data!Q:Q)=0,#N/A,SUMIF(Data!$I:$I,$A136,Data!Q:Q)),#N/A)","v":{"$error":"#N/A"}},{"$f":"IF(I$6,IF(SUMIF(Data!$I:$I,$A136,Data!R:R)=0,#N/A,SUMIF(Data!$I:$I,$A136,Data!R:R)),#N/A)","v":{"$error":"#N/A"}},{"$f":"IF(J$6,IF(SUMIF(Data!$I:$I,$A136,Data!S:S)=0,#N/A,SUMIF(Data!$I:$I,$A136,Data!S:S)),#N/A)","v":{"$error":"#N/A"}},{"$f":"IF(K$6,IF(SUMIF(Data!$I:$I,$A136,Data!T:T)=0,#N/A,SUMIF(Data!$I:$I,$A136,Data!T:T)),#N/A)","v":{"$error":"#N/A"}}]
[{"$error":"#N/A"},{"$f":"IF(B$6,IF(SUMIF(Data!$I:$I,$A137,Data!K:K)=0,#N/A,SUMIF(Data!$I:$I,$A137,Data!K:K)),#N/A)","v":{"$error":"#N/A"}},{"$f":"IF(C$6,IF(SUMIF(Data!$I:$I,$A137,Data!L:L)=0,#N/A,SUMIF(Data!$I:$I,$A137,Data!L:L)),#N/A)","v":{"$error":"#N/A"}},{"$f":"IF(D$6,IF(SUMIF(Data!$I:$I,$A137,Data!M:M)=0,#N/A,SUMIF(Data!$I:$I,$A137,Data!M:M)),#N/A)","v":{"$error":"#N/A"}},{"$f":"IF(E$6,IF(SUMIF(Data!$I:$I,$A137,Data!N:N)=0,#N/A,SUMIF(Data!$I:$I,$A137,Data!N:N)),#N/A)","v":{"$error":"#N/A"}},{"$f":"IF(F$6,IF(SUMIF(Data!$I:$I,$A137,Data!O:O)=0,#N/A,SUMIF(Data!$I:$I,$A137,Data!O:O)),#N/A)","v":{"$error":"#N/A"}},{"$f":"IF(G$6,IF(SUMIF(Data!$I:$I,$A137,Data!P:P)=0,#N/A,SUMIF(Data!$I:$I,$A137,Data!P:P)),#N/A)","v":{"$error":"#N/A"}},{"$f":"IF(H$6,IF(SUMIF(Data!$I:$I,$A137,Data!Q:Q)=0,#N/A,SUMIF(Data!$I:$I,$A137,Data!Q:Q)),#N/A)","v":{"$error":"#N/A"}},{"$f":"IF(I$6,IF(SUMIF(Data!$I:$I,$A137,Data!R:R)=0,#N/A,SUMIF(Data!$I:$I,$A137,Data!R:R)),#N/A)","v":{"$error":"#N/A"}},{"$f":"IF(J$6,IF(SUMIF(Data!$I:$I,$A137,Data!S:S)=0,#N/A,SUMIF(Data!$I:$I,$A137,Data!S:S)),#N/A)","v":{"$error":"#N/A"}},{"$f":"IF(K$6,IF(SUMIF(Data!$I:$I,$A137,Data!T:T)=0,#N/A,SUMIF(Data!$I:$I,$A137,Data!T:T)),#N/A)","v":{"$error":"#N/A"}}]
[{"$error":"#N/A"},{"$f":"IF(B$6,IF(SUMIF(Data!$I:$I,$A138,Data!K:K)=0,#N/A,SUMIF(Data!$I:$I,$A138,Data!K:K)),#N/A)","v":{"$error":"#N/A"}},{"$f":"IF(C$6,IF(SUMIF(Data!$I:$I,$A138,Data!L:L)=0,#N/A,SUMIF(Data!$I:$I,$A138,Data!L:L)),#N/A)","v":{"$error":"#N/A"}},{"$f":"IF(D$6,IF(SUMIF(Data!$I:$I,$A138,Data!M:M)=0,#N/A,SUMIF(Data!$I:$I,$A138,Data!M:M)),#N/A)","v":{"$error":"#N/A"}},{"$f":"IF(E$6,IF(SUMIF(Data!$I:$I,$A138,Data!N:N)=0,#N/A,SUMIF(Data!$I:$I,$A138,Data!N:N)),#N/A)","v":{"$error":"#N/A"}},{"$f":"IF(F$6,IF(SUMIF(Data!$I:$I,$A138,Data!O:O)=0,#N/A,SUMIF(Data!$I:$I,$A138,Data!O:O)),#N/A)","v":{"$error":"#N/A"}},{"$f":"IF(G$6,IF(SUMIF(Data!$I:$I,$A138,Data!P:P)=0,#N/A,SUMIF(Data!$I:$I,$A138,Data!P:P)),#N/A)","v":{"$error":"#N/A"}},{"$f":"IF(H$6,IF(SUMIF(Data!$I:$I,$A138,Data!Q:Q)=0,#N/A,SUMIF(Data!$I:$I,$A138,Data!Q:Q)),#N/A)","v":{"$error":"#N/A"}},{"$f":"IF(I$6,IF(SUMIF(Data!$I:$I,$A138,Data!R:R)=0,#N/A,SUMIF(Data!$I:$I,$A138,Data!R:R)),#N/A)","v":{"$error":"#N/A"}},{"$f":"IF(J$6,IF(SUMIF(Data!$I:$I,$A138,Data!S:S)=0,#N/A,SUMIF(Data!$I:$I,$A138,Data!S:S)),#N/A)","v":{"$error":"#N/A"}},{"$f":"IF(K$6,IF(SUMIF(Data!$I:$I,$A138,Data!T:T)=0,#N/A,SUMIF(Data!$I:$I,$A138,Data!T:T)),#N/A)","v":{"$error":"#N/A"}}]
[{"$f":"IF(A138+1<$B$3,A138+1,#N/A)","v":{"$error":"#N/A"}},{"$f":"IF(B$6,IF(SUMIF(Data!$I:$I,$A139,Data!K:K)=0,#N/A,SUMIF(Data!$I:$I,$A139,Data!K:K)),#N/A)","v":{"$error":"#N/A"}},{"$f":"IF(C$6,IF(SUMIF(Data!$I:$I,$A139,Data!L:L)=0,#N/A,SUMIF(Data!$I:$I,$A139,Data!L:L)),#N/A)","v":{"$error":"#N/A"}},{"$f":"IF(D$6,IF(SUMIF(Data!$I:$I,$A139,Data!M:M)=0,#N/A,SUMIF(Data!$I:$I,$A139,Data!M:M)),#N/A)","v":{"$error":"#N/A"}},{"$f":"IF(E$6,IF(SUMIF(Data!$I:$I,$A139,Data!N:N)=0,#N/A,SUMIF(Data!$I:$I,$A139,Data!N:N)),#N/A)","v":{"$error":"#N/A"}},{"$f":"IF(F$6,IF(SUMIF(Data!$I:$I,$A139,Data!O:O)=0,#N/A,SUMIF(Data!$I:$I,$A139,Data!O:O)),#N/A)","v":{"$error":"#N/A"}},{"$f":"IF(G$6,IF(SUMIF(Data!$I:$I,$A139,Data!P:P)=0,#N/A,SUMIF(Data!$I:$I,$A139,Data!P:P)),#N/A)","v":{"$error":"#N/A"}},{"$f":"IF(H$6,IF(SUMIF(Data!$I:$I,$A139,Data!Q:Q)=0,#N/A,SUMIF(Data!$I:$I,$A139,Data!Q:Q)),#N/A)","v":{"$error":"#N/A"}},{"$f":"IF(I$6,IF(SUMIF(Data!$I:$I,$A139,Data!R:R)=0,#N/A,SUMIF(Data!$I:$I,$A139,Data!R:R)),#N/A)","v":{"$error":"#N/A"}},{"$f":"IF(J$6,IF(SUMIF(Data!$I:$I,$A139,Data!S:S)=0,#N/A,SUMIF(Data!$I:$I,$A139,Data!S:S)),#N/A)","v":{"$error":"#N/A"}},{"$f":"IF(K$6,IF(SUMIF(Data!$I:$I,$A139,Data!T:T)=0,#N/A,SUMIF(Data!$I:$I,$A139,Data!T:T)),#N/A)","v":{"$error":"#N/A"}}]
[{"$error":"#N/A"},{"$f":"IF(B$6,IF(SUMIF(Data!$I:$I,$A140,Data!K:K)=0,#N/A,SUMIF(Data!$I:$I,$A140,Data!K:K)),#N/A)","v":{"$error":"#N/A"}},{"$f":"IF(C$6,IF(SUMIF(Data!$I:$I,$A140,Data!L:L)=0,#N/A,SUMIF(Data!$I:$I,$A140,Data!L:L)),#N/A)","v":{"$error":"#N/A"}},{"$f":"IF(D$6,IF(SUMIF(Data!$I:$I,$A140,Data!M:M)=0,#N/A,SUMIF(Data!$I:$I,$A140,Data!M:M)),#N/A)","v":{"$error":"#N/A"}},{"$f":"IF(E$6,IF(SUMIF(Data!$I:$I,$A140,Data!N:N)=0,#N/A,SUMIF(Data!$I:$I,$A140,Data!N:N)),#N/A)","v":{"$error":"#N/A"}},{"$f":"IF(F$6,IF(SUMIF(Data!$I:$I,$A140,Data!O:O)=0,#N/A,SUMIF(Data!$I:$I,$A140,Data!O:O)),#N/A)","v":{"$error":"#N/A"}},{"$f":"IF(G$6,IF(SUMIF(Data!$I:$I,$A140,Data!P:P)=0,#N/A,SUMIF(Data!$I:$I,$A140,Data!P:P)),#N/A)","v":{"$error":"#N/A"}},{"$f":"IF(H$6,IF(SUMIF(Data!$I:$I,$A140,Data!Q:Q)=0,#N/A,SUMIF(Data!$I:$I,$A140,Data!Q:Q)),#N/A)","v":{"$error":"#N/A"}},{"$f":"IF(I$6,IF(SUMIF(Data!$I:$I,$A140,Data!R:R)=0,#N/A,SUMIF(Data!$I:$I,$A140,Data!R:R)),#N/A)","v":{"$error":"#N/A"}},{"$f":"IF(J$6,IF(SUMIF(Data!$I:$I,$A140,Data!S:S)=0,#N/A,SUMIF(Data!$I:$I,$A140,Data!S:S)),#N/A)","v":{"$error":"#N/A"}},{"$f":"IF(K$6,IF(SUMIF(Data!$I:$I,$A140,Data!T:T)=0,#N/A,SUMIF(Data!$I:$I,$A140,Data!T:T)),#N/A)","v":{"$error":"#N/A"}}]
[{"$error":"#N/A"},{"$f":"IF(B$6,IF(SUMIF(Data!$I:$I,$A141,Data!K:K)=0,#N/A,SUMIF(Data!$I:$I,$A141,Data!K:K)),#N/A)","v":{"$error":"#N/A"}},{"$f":"IF(C$6,IF(SUMIF(Data!$I:$I,$A141,Data!L:L)=0,#N/A,SUMIF(Data!$I:$I,$A141,Data!L:L)),#N/A)","v":{"$error":"#N/A"}},{"$f":"IF(D$6,IF(SUMIF(Data!$I:$I,$A141,Data!M:M)=0,#N/A,SUMIF(Data!$I:$I,$A141,Data!M:M)),#N/A)","v":{"$error":"#N/A"}},{"$f":"IF(E$6,IF(SUMIF(Data!$I:$I,$A141,Data!N:N)=0,#N/A,SUMIF(Data!$I:$I,$A141,Data!N:N)),#N/A)","v":{"$error":"#N/A"}},{"$f":"IF(F$6,IF(SUMIF(Data!$I:$I,$A141,Data!O:O)=0,#N/A,SUMIF(Data!$I:$I,$A141,Data!O:O)),#N/A)","v":{"$error":"#N/A"}},{"$f":"IF(G$6,IF(SUMIF(Data!$I:$I,$A141,Data!P:P)=0,#N/A,SUMIF(Data!$I:$I,$A141,Data!P:P)),#N/A)","v":{"$error":"#N/A"}},{"$f":"IF(H$6,IF(SUMIF(Data!$I:$I,$A141,Data!Q:Q)=0,#N/A,SUMIF(Data!$I:$I,$A141,Data!Q:Q)),#N/A)","v":{"$error":"#N/A"}},{"$f":"IF(I$6,IF(SUMIF(Data!$I:$I,$A141,Data!R:R)=0,#N/A,SUMIF(Data!$I:$I,$A141,Data!R:R)),#N/A)","v":{"$error":"#N/A"}},{"$f":"IF(J$6,IF(SUMIF(Data!$I:$I,$A141,Data!S:S)=0,#N/A,SUMIF(Data!$I:$I,$A141,Data!S:S)),#N/A)","v":{"$error":"#N/A"}},{"$f":"IF(K$6,IF(SUMIF(Data!$I:$I,$A141,Data!T:T)=0,#N/A,SUMIF(Data!$I:$I,$A141,Data!T:T)),#N/A)","v":{"$error":"#N/A"}}]
[{"$error":"#N/A"},{"$f":"IF(B$6,IF(SUMIF(Data!$I:$I,$A142,Data!K:K)=0,#N/A,SUMIF(Data!$I:$I,$A142,Data!K:K)),#N/A)","v":{"$error":"#N/A"}},{"$f":"IF(C$6,IF(SUMIF(Data!$I:$I,$A142,Data!L:L)=0,#N/A,SUMIF(Data!$I:$I,$A142,Data!L:L)),#N/A)","v":{"$error":"#N/A"}},{"$f":"IF(D$6,IF(SUMIF(Data!$I:$I,$A142,Data!M:M)=0,#N/A,SUMIF(Data!$I:$I,$A142,Data!M:M)),#N/A)","v":{"$error":"#N/A"}},{"$f":"IF(E$6,IF(SUMIF(Data!$I:$I,$A142,Data!N:N)=0,#N/A,SUMIF(Data!$I:$I,$A142,Data!N:N)),#N/A)","v":{"$error":"#N/A"}},{"$f":"IF(F$6,IF(SUMIF(Data!$I:$I,$A142,Data!O:O)=0,#N/A,SUMIF(Data!$I:$I,$A142,Data!O:O)),#N/A)","v":{"$error":"#N/A"}},{"$f":"IF(G$6,IF(SUMIF(Data!$I:$I,$A142,Data!P:P)=0,#N/A,SUMIF(Data!$I:$I,$A142,Data!P:P)),#N/A)","v":{"$error":"#N/A"}},{"$f":"IF(H$6,IF(SUMIF(Data!$I:$I,$A142,Data!Q:Q)=0,#N/A,SUMIF(Data!$I:$I,$A142,Data!Q:Q)),#N/A)","v":{"$error":"#N/A"}},{"$f":"IF(I$6,IF(SUMIF(Data!$I:$I,$A142,Data!R:R)=0,#N/A,SUMIF(Data!$I:$I,$A142,Data!R:R)),#N/A)","v":{"$error":"#N/A"}},{"$f":"IF(J$6,IF(SUMIF(Data!$I:$I,$A142,Data!S:S)=0,#N/A,SUMIF(Data!$I:$I,$A142,Data!S:S)),#N/A)","v":{"$error":"#N/A"}},{"$f":"IF(K$6,IF(SUMIF(Data!$I:$I,$A142,Data!T:T)=0,#N/A,SUMIF(Data!$I:$I,$A142,Data!T:T)),#N/A)","v":{"$error":"#N/A"}}]
[{"$error":"#N/A"},{"$f":"IF(B$6,IF(SUMIF(Data!$I:$I,$A143,Data!K:K)=0,#N/A,SUMIF(Data!$I:$I,$A143,Data!K:K)),#N/A)","v":{"$error":"#N/A"}},{"$f":"IF(C$6,IF(SUMIF(Data!$I:$I,$A143,Data!L:L)=0,#N/A,SUMIF(Data!$I:$I,$A143,Data!L:L)),#N/A)","v":{"$error":"#N/A"}},{"$f":"IF(D$6,IF(SUMIF(Data!$I:$I,$A143,Data!M:M)=0,#N/A,SUMIF(Data!$I:$I,$A143,Data!M:M)),#N/A)","v":{"$error":"#N/A"}},{"$f":"IF(E$6,IF(SUMIF(Data!$I:$I,$A143,Data!N:N)=0,#N/A,SUMIF(Data!$I:$I,$A143,Data!N:N)),#N/A)","v":{"$error":"#N/A"}},{"$f":"IF(F$6,IF(SUMIF(Data!$I:$I,$A143,Data!O:O)=0,#N/A,SUMIF(Data!$I:$I,$A143,Data!O:O)),#N/A)","v":{"$error":"#N/A"}},{"$f":"IF(G$6,IF(SUMIF(Data!$I:$I,$A143,Data!P:P)=0,#N/A,SUMIF(Data!$I:$I,$A143,Data!P:P)),#N/A)","v":{"$error":"#N/A"}},{"$f":"IF(H$6,IF(SUMIF(Data!$I:$I,$A143,Data!Q:Q)=0,#N/A,SUMIF(Data!$I:$I,$A143,Data!Q:Q)),#N/A)","v":{"$error":"#N/A"}},{"$f":"IF(I$6,IF(SUMIF(Data!$I:$I,$A143,Data!R:R)=0,#N/A,SUMIF(Data!$I:$I,$A143,Data!R:R)),#N/A)","v":{"$error":"#N/A"}},{"$f":"IF(J$6,IF(SUMIF(Data!$I:$I,$A143,Data!S:S)=0,#N/A,SUMIF(Data!$I:$I,$A143,Data!S:S)),#N/A)","v":{"$error":"#N/A"}},{"$f":"IF(K$6,IF(SUMIF(Data!$I:$I,$A143,Data!T:T)=0,#N/A,SUMIF(Data!$I:$I,$A143,Data!T:T)),#N/A)","v":{"$error":"#N/A"}}]
[{"$error":"#N/A"},{"$f":"IF(B$6,IF(SUMIF(Data!$I:$I,$A144,Data!K:K)=0,#N/A,SUMIF(Data!$I:$I,$A144,Data!K:K)),#N/A)","v":{"$error":"#N/A"}},{"$f":"IF(C$6,IF(SUMIF(Data!$I:$I,$A144,Data!L:L)=0,#N/A,SUMIF(Data!$I:$I,$A144,Data!L:L)),#N/A)","v":{"$error":"#N/A"}},{"$f":"IF(D$6,IF(SUMIF(Data!$I:$I,$A144,Data!M:M)=0,#N/A,SUMIF(Data!$I:$I,$A144,Data!M:M)),#N/A)","v":{"$error":"#N/A"}},{"$f":"IF(E$6,IF(SUMIF(Data!$I:$I,$A144,Data!N:N)=0,#N/A,SUMIF(Data!$I:$I,$A144,Data!N:N)),#N/A)","v":{"$error":"#N/A"}},{"$f":"IF(F$6,IF(SUMIF(Data!$I:$I,$A144,Data!O:O)=0,#N/A,SUMIF(Data!$I:$I,$A144,Data!O:O)),#N/A)","v":{"$error":"#N/A"}},{"$f":"IF(G$6,IF(SUMIF(Data!$I:$I,$A144,Data!P:P)=0,#N/A,SUMIF(Data!$I:$I,$A144,Data!P:P)),#N/A)","v":{"$error":"#N/A"}},{"$f":"IF(H$6,IF(SUMIF(Data!$I:$I,$A144,Data!Q:Q)=0,#N/A,SUMIF(Data!$I:$I,$A144,Data!Q:Q)),#N/A)","v":{"$error":"#N/A"}},{"$f":"IF(I$6,IF(SUMIF(Data!$I:$I,$A144,Data!R:R)=0,#N/A,SUMIF(Data!$I:$I,$A144,Data!R:R)),#N/A)","v":{"$error":"#N/A"}},{"$f":"IF(J$6,IF(SUMIF(Data!$I:$I,$A144,Data!S:S)=0,#N/A,SUMIF(Data!$I:$I,$A144,Data!S:S)),#N/A)","v":{"$error":"#N/A"}},{"$f":"IF(K$6,IF(SUMIF(Data!$I:$I,$A144,Data!T:T)=0,#N/A,SUMIF(Data!$I:$I,$A144,Data!T:T)),#N/A)","v":{"$error":"#N/A"}}]
[{"$error":"#N/A"},{"$f":"IF(B$6,IF(SUMIF(Data!$I:$I,$A145,Data!K:K)=0,#N/A,SUMIF(Data!$I:$I,$A145,Data!K:K)),#N/A)","v":{"$error":"#N/A"}},{"$f":"IF(C$6,IF(SUMIF(Data!$I:$I,$A145,Data!L:L)=0,#N/A,SUMIF(Data!$I:$I,$A145,Data!L:L)),#N/A)","v":{"$error":"#N/A"}},{"$f":"IF(D$6,IF(SUMIF(Data!$I:$I,$A145,Data!M:M)=0,#N/A,SUMIF(Data!$I:$I,$A145,Data!M:M)),#N/A)","v":{"$error":"#N/A"}},{"$f":"IF(E$6,IF(SUMIF(Data!$I:$I,$A145,Data!N:N)=0,#N/A,SUMIF(Data!$I:$I,$A145,Data!N:N)),#N/A)","v":{"$error":"#N/A"}},{"$f":"IF(F$6,IF(SUMIF(Data!$I:$I,$A145,Data!O:O)=0,#N/A,SUMIF(Data!$I:$I,$A145,Data!O:O)),#N/A)","v":{"$error":"#N/A"}},{"$f":"IF(G$6,IF(SUMIF(Data!$I:$I,$A145,Data!P:P)=0,#N/A,SUMIF(Data!$I:$I,$A145,Data!P:P)),#N/A)","v":{"$error":"#N/A"}},{"$f":"IF(H$6,IF(SUMIF(Data!$I:$I,$A145,Data!Q:Q)=0,#N/A,SUMIF(Data!$I:$I,$A145,Data!Q:Q)),#N/A)","v":{"$error":"#N/A"}},{"$f":"IF(I$6,IF(SUMIF(Data!$I:$I,$A145,Data!R:R)=0,#N/A,SUMIF(Data!$I:$I,$A145,Data!R:R)),#N/A)","v":{"$error":"#N/A"}},{"$f":"IF(J$6,IF(SUMIF(Data!$I:$I,$A145,Data!S:S)=0,#N/A,SUMIF(Data!$I:$I,$A145,Data!S:S)),#N/A)","v":{"$error":"#N/A"}},{"$f":"IF(K$6,IF(SUMIF(Data!$I:$I,$A145,Data!T:T)=0,#N/A,SUMIF(Data!$I:$I,$A145,Data!T:T)),#N/A)","v":{"$error":"#N/A"}}]
[{"$error":"#N/A"},{"$f":"IF(B$6,IF(SUMIF(Data!$I:$I,$A146,Data!K:K)=0,#N/A,SUMIF(Data!$I:$I,$A146,Data!K:K)),#N/A)","v":{"$error":"#N/A"}},{"$f":"IF(C$6,IF(SUMIF(Data!$I:$I,$A146,Data!L:L)=0,#N/A,SUMIF(Data!$I:$I,$A146,Data!L:L)),#N/A)","v":{"$error":"#N/A"}},{"$f":"IF(D$6,IF(SUMIF(Data!$I:$I,$A146,Data!M:M)=0,#N/A,SUMIF(Data!$I:$I,$A146,Data!M:M)),#N/A)","v":{"$error":"#N/A"}},{"$f":"IF(E$6,IF(SUMIF(Data!$I:$I,$A146,Data!N:N)=0,#N/A,SUMIF(Data!$I:$I,$A146,Data!N:N)),#N/A)","v":{"$error":"#N/A"}},{"$f":"IF(F$6,IF(SUMIF(Data!$I:$I,$A146,Data!O:O)=0,#N/A,SUMIF(Data!$I:$I,$A146,Data!O:O)),#N/A)","v":{"$error":"#N/A"}},{"$f":"IF(G$6,IF(SUMIF(Data!$I:$I,$A146,Data!P:P)=0,#N/A,SUMIF(Data!$I:$I,$A146,Data!P:P)),#N/A)","v":{"$error":"#N/A"}},{"$f":"IF(H$6,IF(SUMIF(Data!$I:$I,$A146,Data!Q:Q)=0,#N/A,SUMIF(Data!$I:$I,$A146,Data!Q:Q)),#N/A)","v":{"$error":"#N/A"}},{"$f":"IF(I$6,IF(SUMIF(Data!$I:$I,$A146,Data!R:R)=0,#N/A,SUMIF(Data!$I:$I,$A146,Data!R:R)),#N/A)","v":{"$error":"#N/A"}},{"$f":"IF(J$6,IF(SUMIF(Data!$I:$I,$A146,Data!S:S)=0,#N/A,SUMIF(Data!$I:$I,$A146,Data!S:S)),#N/A)","v":{"$error":"#N/A"}},{"$f":"IF(K$6,IF(SUMIF(Data!$I:$I,$A146,Data!T:T)=0,#N/A,SUMIF(Data!$I:$I,$A146,Data!T:T)),#N/A)","v":{"$error":"#N/A"}}]
[{"$error":"#N/A"},{"$f":"IF(B$6,IF(SUMIF(Data!$I:$I,$A147,Data!K:K)=0,#N/A,SUMIF(Data!$I:$I,$A147,Data!K:K)),#N/A)","v":{"$error":"#N/A"}},{"$f":"IF(C$6,IF(SUMIF(Data!$I:$I,$A147,Data!L:L)=0,#N/A,SUMIF(Data!$I:$I,$A147,Data!L:L)),#N/A)","v":{"$error":"#N/A"}},{"$f":"IF(D$6,IF(SUMIF(Data!$I:$I,$A147,Data!M:M)=0,#N/A,SUMIF(Data!$I:$I,$A147,Data!M:M)),#N/A)","v":{"$error":"#N/A"}},{"$f":"IF(E$6,IF(SUMIF(Data!$I:$I,$A147,Data!N:N)=0,#N/A,SUMIF(Data!$I:$I,$A147,Data!N:N)),#N/A)","v":{"$error":"#N/A"}},{"$f":"IF(F$6,IF(SUMIF(Data!$I:$I,$A147,Data!O:O)=0,#N/A,SUMIF(Data!$I:$I,$A147,Data!O:O)),#N/A)","v":{"$error":"#N/A"}},{"$f":"IF(G$6,IF(SUMIF(Data!$I:$I,$A147,Data!P:P)=0,#N/A,SUMIF(Data!$I:$I,$A147,Data!P:P)),#N/A)","v":{"$error":"#N/A"}},{"$f":"IF(H$6,IF(SUMIF(Data!$I:$I,$A147,Data!Q:Q)=0,#N/A,SUMIF(Data!$I:$I,$A147,Data!Q:Q)),#N/A)","v":{"$error":"#N/A"}},{"$f":"IF(I$6,IF(SUMIF(Data!$I:$I,$A147,Data!R:R)=0,#N/A,SUMIF(Data!$I:$I,$A147,Data!R:R)),#N/A)","v":{"$error":"#N/A"}},{"$f":"IF(J$6,IF(SUMIF(Data!$I:$I,$A147,Data!S:S)=0,#N/A,SUMIF(Data!$I:$I,$A147,Data!S:S)),#N/A)","v":{"$error":"#N/A"}},{"$f":"IF(K$6,IF(SUMIF(Data!$I:$I,$A147,Data!T:T)=0,#N/A,SUMIF(Data!$I:$I,$A147,Data!T:T)),#N/A)","v":{"$error":"#N/A"}}]
[{"$error":"#N/A"},{"$f":"IF(B$6,IF(SUMIF(Data!$I:$I,$A148,Data!K:K)=0,#N/A,SUMIF(Data!$I:$I,$A148,Data!K:K)),#N/A)","v":{"$error":"#N/A"}},{"$f":"IF(C$6,IF(SUMIF(Data!$I:$I,$A148,Data!L:L)=0,#N/A,SUMIF(Data!$I:$I,$A148,Data!L:L)),#N/A)","v":{"$error":"#N/A"}},{"$f":"IF(D$6,IF(SUMIF(Data!$I:$I,$A148,Data!M:M)=0,#N/A,SUMIF(Data!$I:$I,$A148,Data!M:M)),#N/A)","v":{"$error":"#N/A"}},{"$f":"IF(E$6,IF(SUMIF(Data!$I:$I,$A148,Data!N:N)=0,#N/A,SUMIF(Data!$I:$I,$A148,Data!N:N)),#N/A)","v":{"$error":"#N/A"}},{"$f":"IF(F$6,IF(SUMIF(Data!$I:$I,$A148,Data!O:O)=0,#N/A,SUMIF(Data!$I:$I,$A148,Data!O:O)),#N/A)","v":{"$error":"#N/A"}},{"$f":"IF(G$6,IF(SUMIF(Data!$I:$I,$A148,Data!P:P)=0,#N/A,SUMIF(Data!$I:$I,$A148,Data!P:P)),#N/A)","v":{"$error":"#N/A"}},{"$f":"IF(H$6,IF(SUMIF(Data!$I:$I,$A148,Data!Q:Q)=0,#N/A,SUMIF(Data!$I:$I,$A148,Data!Q:Q)),#N/A)","v":{"$error":"#N/A"}},{"$f":"IF(I$6,IF(SUMIF(Data!$I:$I,$A148,Data!R:R)=0,#N/A,SUMIF(Data!$I:$I,$A148,Data!R:R)),#N/A)","v":{"$error":"#N/A"}},{"$f":"IF(J$6,IF(SUMIF(Data!$I:$I,$A148,Data!S:S)=0,#N/A,SUMIF(Data!$I:$I,$A148,Data!S:S)),#N/A)","v":{"$error":"#N/A"}},{"$f":"IF(K$6,IF(SUMIF(Data!$I:$I,$A148,Data!T:T)=0,#N/A,SUMIF(Data!$I:$I,$A148,Data!T:T)),#N/A)","v":{"$error":"#N/A"}}]
[{"$error":"#N/A"},{"$f":"IF(B$6,IF(SUMIF(Data!$I:$I,$A149,Data!K:K)=0,#N/A,SUMIF(Data!$I:$I,$A149,Data!K:K)),#N/A)","v":{"$error":"#N/A"}},{"$f":"IF(C$6,IF(SUMIF(Data!$I:$I,$A149,Data!L:L)=0,#N/A,SUMIF(Data!$I:$I,$A149,Data!L:L)),#N/A)","v":{"$error":"#N/A"}},{"$f":"IF(D$6,IF(SUMIF(Data!$I:$I,$A149,Data!M:M)=0,#N/A,SUMIF(Data!$I:$I,$A149,Data!M:M)),#N/A)","v":{"$error":"#N/A"}},{"$f":"IF(E$6,IF(SUMIF(Data!$I:$I,$A149,Data!N:N)=0,#N/A,SUMIF(Data!$I:$I,$A149,Data!N:N)),#N/A)","v":{"$error":"#N/A"}},{"$f":"IF(F$6,IF(SUMIF(Data!$I:$I,$A149,Data!O:O)=0,#N/A,SUMIF(Data!$I:$I,$A149,Data!O:O)),#N/A)","v":{"$error":"#N/A"}},{"$f":"IF(G$6,IF(SUMIF(Data!$I:$I,$A149,Data!P:P)=0,#N/A,SUMIF(Data!$I:$I,$A149,Data!P:P)),#N/A)","v":{"$error":"#N/A"}},{"$f":"IF(H$6,IF(SUMIF(Data!$I:$I,$A149,Data!Q:Q)=0,#N/A,SUMIF(Data!$I:$I,$A149,Data!Q:Q)),#N/A)","v":{"$error":"#N/A"}},{"$f":"IF(I$6,IF(SUMIF(Data!$I:$I,$A149,Data!R:R)=0,#N/A,SUMIF(Data!$I:$I,$A149,Data!R:R)),#N/A)","v":{"$error":"#N/A"}},{"$f":"IF(J$6,IF(SUMIF(Data!$I:$I,$A149,Data!S:S)=0,#N/A,SUMIF(Data!$I:$I,$A149,Data!S:S)),#N/A)","v":{"$error":"#N/A"}},{"$f":"IF(K$6,IF(SUMIF(Data!$I:$I,$A149,Data!T:T)=0,#N/A,SUMIF(Data!$I:$I,$A149,Data!T:T)),#N/A)","v":{"$error":"#N/A"}}]
[{"$error":"#N/A"},{"$f":"IF(B$6,IF(SUMIF(Data!$I:$I,$A150,Data!K:K)=0,#N/A,SUMIF(Data!$I:$I,$A150,Data!K:K)),#N/A)","v":{"$error":"#N/A"}},{"$f":"IF(C$6,IF(SUMIF(Data!$I:$I,$A150,Data!L:L)=0,#N/A,SUMIF(Data!$I:$I,$A150,Data!L:L)),#N/A)","v":{"$error":"#N/A"}},{"$f":"IF(D$6,IF(SUMIF(Data!$I:$I,$A150,Data!M:M)=0,#N/A,SUMIF(Data!$I:$I,$A150,Data!M:M)),#N/A)","v":{"$error":"#N/A"}},{"$f":"IF(E$6,IF(SUMIF(Data!$I:$I,$A150,Data!N:N)=0,#N/A,SUMIF(Data!$I:$I,$A150,Data!N:N)),#N/A)","v":{"$error":"#N/A"}},{"$f":"IF(F$6,IF(SUMIF(Data!$I:$I,$A150,Data!O:O)=0,#N/A,SUMIF(Data!$I:$I,$A150,Data!O:O)),#N/A)","v":{"$error":"#N/A"}},{"$f":"IF(G$6,IF(SUMIF(Data!$I:$I,$A150,Data!P:P)=0,#N/A,SUMIF(Data!$I:$I,$A150,Data!P:P)),#N/A)","v":{"$error":"#N/A"}},{"$f":"IF(H$6,IF(SUMIF(Data!$I:$I,$A150,Data!Q:Q)=0,#N/A,SUMIF(Data!$I:$I,$A150,Data!Q:Q)),#N/A)","v":{"$error":"#N/A"}},{"$f":"IF(I$6,IF(SUMIF(Data!$I:$I,$A150,Data!R:R)=0,#N/A,SUMIF(Data!$I:$I,$A150,Data!R:R)),#N/A)","v":{"$error":"#N/A"}},{"$f":"IF(J$6,IF(SUMIF(Data!$I:$I,$A150,Data!S:S)=0,#N/A,SUMIF(Data!$I:$I,$A150,Data!S:S)),#N/A)","v":{"$error":"#N/A"}},{"$f":"IF(K$6,IF(SUMIF(Data!$I:$I,$A150,Data!T:T)=0,#N/A,SUMIF(Data!$I:$I,$A150,Data!T:T)),#N/A)","v":{"$error":"#N/A"}}]
[{"$error":"#N/A"},{"$f":"IF(B$6,IF(SUMIF(Data!$I:$I,$A151,Data!K:K)=0,#N/A,SUMIF(Data!$I:$I,$A151,Data!K:K)),#N/A)","v":{"$error":"#N/A"}},{"$f":"IF(C$6,IF(SUMIF(Data!$I:$I,$A151,Data!L:L)=0,#N/A,SUMIF(Data!$I:$I,$A151,Data!L:L)),#N/A)","v":{"$error":"#N/A"}},{"$f":"IF(D$6,IF(SUMIF(Data!$I:$I,$A151,Data!M:M)=0,#N/A,SUMIF(Data!$I:$I,$A151,Data!M:M)),#N/A)","v":{"$error":"#N/A"}},{"$f":"IF(E$6,IF(SUMIF(Data!$I:$I,$A151,Data!N:N)=0,#N/A,SUMIF(Data!$I:$I,$A151,Data!N:N)),#N/A)","v":{"$error":"#N/A"}},{"$f":"IF(F$6,IF(SUMIF(Data!$I:$I,$A151,Data!O:O)=0,#N/A,SUMIF(Data!$I:$I,$A151,Data!O:O)),#N/A)","v":{"$error":"#N/A"}},{"$f":"IF(G$6,IF(SUMIF(Data!$I:$I,$A151,Data!P:P)=0,#N/A,SUMIF(Data!$I:$I,$A151,Data!P:P)),#N/A)","v":{"$error":"#N/A"}},{"$f":"IF(H$6,IF(SUMIF(Data!$I:$I,$A151,Data!Q:Q)=0,#N/A,SUMIF(Data!$I:$I,$A151,Data!Q:Q)),#N/A)","v":{"$error":"#N/A"}},{"$f":"IF(I$6,IF(SUMIF(Data!$I:$I,$A151,Data!R:R)=0,#N/A,SUMIF(Data!$I:$I,$A151,Data!R:R)),#N/A)","v":{"$error":"#N/A"}},{"$f":"IF(J$6,IF(SUMIF(Data!$I:$I,$A151,Data!S:S)=0,#N/A,SUMIF(Data!$I:$I,$A151,Data!S:S)),#N/A)","v":{"$error":"#N/A"}},{"$f":"IF(K$6,IF(SUMIF(Data!$I:$I,$A151,Data!T:T)=0,#N/A,SUMIF(Data!$I:$I,$A151,Data!T:T)),#N/A)","v":{"$error":"#N/A"}}]
[{"$error":"#N/A"},{"$f":"IF(B$6,IF(SUMIF(Data!$I:$I,$A152,Data!K:K)=0,#N/A,SUMIF(Data!$I:$I,$A152,Data!K:K)),#N/A)","v":{"$error":"#N/A"}},{"$f":"IF(C$6,IF(SUMIF(Data!$I:$I,$A152,Data!L:L)=0,#N/A,SUMIF(Data!$I:$I,$A152,Data!L:L)),#N/A)","v":{"$error":"#N/A"}},{"$f":"IF(D$6,IF(SUMIF(Data!$I:$I,$A152,Data!M:M)=0,#N/A,SUMIF(Data!$I:$I,$A152,Data!M:M)),#N/A)","v":{"$error":"#N/A"}},{"$f":"IF(E$6,IF(SUMIF(Data!$I:$I,$A152,Data!N:N)=0,#N/A,SUMIF(Data!$I:$I,$A152,Data!N:N)),#N/A)","v":{"$error":"#N/A"}},{"$f":"IF(F$6,IF(SUMIF(Data!$I:$I,$A152,Data!O:O)=0,#N/A,SUMIF(Data!$I:$I,$A152,Data!O:O)),#N/A)","v":{"$error":"#N/A"}},{"$f":"IF(G$6,IF(SUMIF(Data!$I:$I,$A152,Data!P:P)=0,#N/A,SUMIF(Data!$I:$I,$A152,Data!P:P)),#N/A)","v":{"$error":"#N/A"}},{"$f":"IF(H$6,IF(SUMIF(Data!$I:$I,$A152,Data!Q:Q)=0,#N/A,SUMIF(Data!$I:$I,$A152,Data!Q:Q)),#N/A)","v":{"$error":"#N/A"}},{"$f":"IF(I$6,IF(SUMIF(Data!$I:$I,$A152,Data!R:R)=0,#N/A,SUMIF(Data!$I:$I,$A152,Data!R:R)),#N/A)","v":{"$error":"#N/A"}},{"$f":"IF(J$6,IF(SUMIF(Data!$I:$I,$A152,Data!S:S)=0,#N/A,SUMIF(Data!$I:$I,$A152,Data!S:S)),#N/A)","v":{"$error":"#N/A"}},{"$f":"IF(K$6,IF(SUMIF(Data!$I:$I,$A152,Data!T:T)=0,#N/A,SUMIF(Data!$I:$I,$A152,Data!T:T)),#N/A)","v":{"$error":"#N/A"}}]
[{"$error":"#N/A"},{"$f":"IF(B$6,IF(SUMIF(Data!$I:$I,$A153,Data!K:K)=0,#N/A,SUMIF(Data!$I:$I,$A153,Data!K:K)),#N/A)","v":{"$error":"#N/A"}},{"$f":"IF(C$6,IF(SUMIF(Data!$I:$I,$A153,Data!L:L)=0,#N/A,SUMIF(Data!$I:$I,$A153,Data!L:L)),#N/A)","v":{"$error":"#N/A"}},{"$f":"IF(D$6,IF(SUMIF(Data!$I:$I,$A153,Data!M:M)=0,#N/A,SUMIF(Data!$I:$I,$A153,Data!M:M)),#N/A)","v":{"$error":"#N/A"}},{"$f":"IF(E$6,IF(SUMIF(Data!$I:$I,$A153,Data!N:N)=0,#N/A,SUMIF(Data!$I:$I,$A153,Data!N:N)),#N/A)","v":{"$error":"#N/A"}},{"$f":"IF(F$6,IF(SUMIF(Data!$I:$I,$A153,Data!O:O)=0,#N/A,SUMIF(Data!$I:$I,$A153,Data!O:O)),#N/A)","v":{"$error":"#N/A"}},{"$f":"IF(G$6,IF(SUMIF(Data!$I:$I,$A153,Data!P:P)=0,#N/A,SUMIF(Data!$I:$I,$A153,Data!P:P)),#N/A)","v":{"$error":"#N/A"}},{"$f":"IF(H$6,IF(SUMIF(Data!$I:$I,$A153,Data!Q:Q)=0,#N/A,SUMIF(Data!$I:$I,$A153,Data!Q:Q)),#N/A)","v":{"$error":"#N/A"}},{"$f":"IF(I$6,IF(SUMIF(Data!$I:$I,$A153,Data!R:R)=0,#N/A,SUMIF(Data!$I:$I,$A153,Data!R:R)),#N/A)","v":{"$error":"#N/A"}},{"$f":"IF(J$6,IF(SUMIF(Data!$I:$I,$A153,Data!S:S)=0,#N/A,SUMIF(Data!$I:$I,$A153,Data!S:S)),#N/A)","v":{"$error":"#N/A"}},{"$f":"IF(K$6,IF(SUMIF(Data!$I:$I,$A153,Data!T:T)=0,#N/A,SUMIF(Data!$I:$I,$A153,Data!T:T)),#N/A)","v":{"$error":"#N/A"}}]
[{"$error":"#N/A"},{"$f":"IF(B$6,IF(SUMIF(Data!$I:$I,$A154,Data!K:K)=0,#N/A,SUMIF(Data!$I:$I,$A154,Data!K:K)),#N/A)","v":{"$error":"#N/A"}},{"$f":"IF(C$6,IF(SUMIF(Data!$I:$I,$A154,Data!L:L)=0,#N/A,SUMIF(Data!$I:$I,$A154,Data!L:L)),#N/A)","v":{"$error":"#N/A"}},{"$f":"IF(D$6,IF(SUMIF(Data!$I:$I,$A154,Data!M:M)=0,#N/A,SUMIF(Data!$I:$I,$A154,Data!M:M)),#N/A)","v":{"$error":"#N/A"}},{"$f":"IF(E$6,IF(SUMIF(Data!$I:$I,$A154,Data!N:N)=0,#N/A,SUMIF(Data!$I:$I,$A154,Data!N:N)),#N/A)","v":{"$error":"#N/A"}},{"$f":"IF(F$6,IF(SUMIF(Data!$I:$I,$A154,Data!O:O)=0,#N/A,SUMIF(Data!$I:$I,$A154,Data!O:O)),#N/A)","v":{"$error":"#N/A"}},{"$f":"IF(G$6,IF(SUMIF(Data!$I:$I,$A154,Data!P:P)=0,#N/A,SUMIF(Data!$I:$I,$A154,Data!P:P)),#N/A)","v":{"$error":"#N/A"}},{"$f":"IF(H$6,IF(SUMIF(Data!$I:$I,$A154,Data!Q:Q)=0,#N/A,SUMIF(Data!$I:$I,$A154,Data!Q:Q)),#N/A)","v":{"$error":"#N/A"}},{"$f":"IF(I$6,IF(SUMIF(Data!$I:$I,$A154,Data!R:R)=0,#N/A,SUMIF(Data!$I:$I,$A154,Data!R:R)),#N/A)","v":{"$error":"#N/A"}},{"$f":"IF(J$6,IF(SUMIF(Data!$I:$I,$A154,Data!S:S)=0,#N/A,SUMIF(Data!$I:$I,$A154,Data!S:S)),#N/A)","v":{"$error":"#N/A"}},{"$f":"IF(K$6,IF(SUMIF(Data!$I:$I,$A154,Data!T:T)=0,#N/A,SUMIF(Data!$I:$I,$A154,Data!T:T)),#N/A)","v":{"$error":"#N/A"}}]
[{"$error":"#N/A"},{"$f":"IF(B$6,IF(SUMIF(Data!$I:$I,$A155,Data!K:K)=0,#N/A,SUMIF(Data!$I:$I,$A155,Data!K:K)),#N/A)","v":{"$error":"#N/A"}},{"$f":"IF(C$6,IF(SUMIF(Data!$I:$I,$A155,Data!L:L)=0,#N/A,SUMIF(Data!$I:$I,$A155,Data!L:L)),#N/A)","v":{"$error":"#N/A"}},{"$f":"IF(D$6,IF(SUMIF(Data!$I:$I,$A155,Data!M:M)=0,#N/A,SUMIF(Data!$I:$I,$A155,Data!M:M)),#N/A)","v":{"$error":"#N/A"}},{"$f":"IF(E$6,IF(SUMIF(Data!$I:$I,$A155,Data!N:N)=0,#N/A,SUMIF(Data!$I:$I,$A155,Data!N:N)),#N/A)","v":{"$error":"#N/A"}},{"$f":"IF(F$6,IF(SUMIF(Data!$I:$I,$A155,Data!O:O)=0,#N/A,SUMIF(Data!$I:$I,$A155,Data!O:O)),#N/A)","v":{"$error":"#N/A"}},{"$f":"IF(G$6,IF(SUMIF(Data!$I:$I,$A155,Data!P:P)=0,#N/A,SUMIF(Data!$I:$I,$A155,Data!P:P)),#N/A)","v":{"$error":"#N/A"}},{"$f":"IF(H$6,IF(SUMIF(Data!$I:$I,$A155,Data!Q:Q)=0,#N/A,SUMIF(Data!$I:$I,$A155,Data!Q:Q)),#N/A)","v":{"$error":"#N/A"}},{"$f":"IF(I$6,IF(SUMIF(Data!$I:$I,$A155,Data!R:R)=0,#N/A,SUMIF(Data!$I:$I,$A155,Data!R:R)),#N/A)","v":{"$error":"#N/A"}},{"$f":"IF(J$6,IF(SUMIF(Data!$I:$I,$A155,Data!S:S)=0,#N/A,SUMIF(Data!$I:$I,$A155,Data!S:S)),#N/A)","v":{"$error":"#N/A"}},{"$f":"IF(K$6,IF(SUMIF(Data!$I:$I,$A155,Data!T:T)=0,#N/A,SUMIF(Data!$I:$I,$A155,Data!T:T)),#N/A)","v":{"$error":"#N/A"}}]
[{"$error":"#N/A"},{"$f":"IF(B$6,IF(SUMIF(Data!$I:$I,$A156,Data!K:K)=0,#N/A,SUMIF(Data!$I:$I,$A156,Data!K:K)),#N/A)","v":{"$error":"#N/A"}},{"$f":"IF(C$6,IF(SUMIF(Data!$I:$I,$A156,Data!L:L)=0,#N/A,SUMIF(Data!$I:$I,$A156,Data!L:L)),#N/A)","v":{"$error":"#N/A"}},{"$f":"IF(D$6,IF(SUMIF(Data!$I:$I,$A156,Data!M:M)=0,#N/A,SUMIF(Data!$I:$I,$A156,Data!M:M)),#N/A)","v":{"$error":"#N/A"}},{"$f":"IF(E$6,IF(SUMIF(Data!$I:$I,$A156,Data!N:N)=0,#N/A,SUMIF(Data!$I:$I,$A156,Data!N:N)),#N/A)","v":{"$error":"#N/A"}},{"$f":"IF(F$6,IF(SUMIF(Data!$I:$I,$A156,Data!O:O)=0,#N/A,SUMIF(Data!$I:$I,$A156,Data!O:O)),#N/A)","v":{"$error":"#N/A"}},{"$f":"IF(G$6,IF(SUMIF(Data!$I:$I,$A156,Data!P:P)=0,#N/A,SUMIF(Data!$I:$I,$A156,Data!P:P)),#N/A)","v":{"$error":"#N/A"}},{"$f":"IF(H$6,IF(SUMIF(Data!$I:$I,$A156,Data!Q:Q)=0,#N/A,SUMIF(Data!$I:$I,$A156,Data!Q:Q)),#N/A)","v":{"$error":"#N/A"}},{"$f":"IF(I$6,IF(SUMIF(Data!$I:$I,$A156,Data!R:R)=0,#N/A,SUMIF(Data!$I:$I,$A156,Data!R:R)),#N/A)","v":{"$error":"#N/A"}},{"$f":"IF(J$6,IF(SUMIF(Data!$I:$I,$A156,Data!S:S)=0,#N/A,SUMIF(Data!$I:$I,$A156,Data!S:S)),#N/A)","v":{"$error":"#N/A"}},{"$f":"IF(K$6,IF(SUMIF(Data!$I:$I,$A156,Data!T:T)=0,#N/A,SUMIF(Data!$I:$I,$A156,Data!T:T)),#N/A)","v":{"$error":"#N/A"}}]
[{"$error":"#N/A"},{"$f":"IF(B$6,IF(SUMIF(Data!$I:$I,$A157,Data!K:K)=0,#N/A,SUMIF(Data!$I:$I,$A157,Data!K:K)),#N/A)","v":{"$error":"#N/A"}},{"$f":"IF(C$6,IF(SUMIF(Data!$I:$I,$A157,Data!L:L)=0,#N/A,SUMIF(Data!$I:$I,$A157,Data!L:L)),#N/A)","v":{"$error":"#N/A"}},{"$f":"IF(D$6,IF(SUMIF(Data!$I:$I,$A157,Data!M:M)=0,#N/A,SUMIF(Data!$I:$I,$A157,Data!M:M)),#N/A)","v":{"$error":"#N/A"}},{"$f":"IF(E$6,IF(SUMIF(Data!$I:$I,$A157,Data!N:N)=0,#N/A,SUMIF(Data!$I:$I,$A157,Data!N:N)),#N/A)","v":{"$error":"#N/A"}},{"$f":"IF(F$6,IF(SUMIF(Data!$I:$I,$A157,Data!O:O)=0,#N/A,SUMIF(Data!$I:$I,$A157,Data!O:O)),#N/A)","v":{"$error":"#N/A"}},{"$f":"IF(G$6,IF(SUMIF(Data!$I:$I,$A157,Data!P:P)=0,#N/A,SUMIF(Data!$I:$I,$A157,Data!P:P)),#N/A)","v":{"$error":"#N/A"}},{"$f":"IF(H$6,IF(SUMIF(Data!$I:$I,$A157,Data!Q:Q)=0,#N/A,SUMIF(Data!$I:$I,$A157,Data!Q:Q)),#N/A)","v":{"$error":"#N/A"}},{"$f":"IF(I$6,IF(SUMIF(Data!$I:$I,$A157,Data!R:R)=0,#N/A,SUMIF(Data!$I:$I,$A157,Data!R:R)),#N/A)","v":{"$error":"#N/A"}},{"$f":"IF(J$6,IF(SUMIF(Data!$I:$I,$A157,Data!S:S)=0,#N/A,SUMIF(Data!$I:$I,$A157,Data!S:S)),#N/A)","v":{"$error":"#N/A"}},{"$f":"IF(K$6,IF(SUMIF(Data!$I:$I,$A157,Data!T:T)=0,#N/A,SUMIF(Data!$I:$I,$A157,Data!T:T)),#N/A)","v":{"$error":"#N/A"}}]
[{"$error":"#N/A"},{"$f":"IF(B$6,IF(SUMIF(Data!$I:$I,$A158,Data!K:K)=0,#N/A,SUMIF(Data!$I:$I,$A158,Data!K:K)),#N/A)","v":{"$error":"#N/A"}},{"$f":"IF(C$6,IF(SUMIF(Data!$I:$I,$A158,Data!L:L)=0,#N/A,SUMIF(Data!$I:$I,$A158,Data!L:L)),#N/A)","v":{"$error":"#N/A"}},{"$f":"IF(D$6,IF(SUMIF(Data!$I:$I,$A158,Data!M:M)=0,#N/A,SUMIF(Data!$I:$I,$A158,Data!M:M)),#N/A)","v":{"$error":"#N/A"}},{"$f":"IF(E$6,IF(SUMIF(Data!$I:$I,$A158,Data!N:N)=0,#N/A,SUMIF(Data!$I:$I,$A158,Data!N:N)),#N/A)","v":{"$error":"#N/A"}},{"$f":"IF(F$6,IF(SUMIF(Data!$I:$I,$A158,Data!O:O)=0,#N/A,SUMIF(Data!$I:$I,$A158,Data!O:O)),#N/A)","v":{"$error":"#N/A"}},{"$f":"IF(G$6,IF(SUMIF(Data!$I:$I,$A158,Data!P:P)=0,#N/A,SUMIF(Data!$I:$I,$A158,Data!P:P)),#N/A)","v":{"$error":"#N/A"}},{"$f":"IF(H$6,IF(SUMIF(Data!$I:$I,$A158,Data!Q:Q)=0,#N/A,SUMIF(Data!$I:$I,$A158,Data!Q:Q)),#N/A)","v":{"$error":"#N/A"}},{"$f":"IF(I$6,IF(SUMIF(Data!$I:$I,$A158,Data!R:R)=0,#N/A,SUMIF(Data!$I:$I,$A158,Data!R:R)),#N/A)","v":{"$error":"#N/A"}},{"$f":"IF(J$6,IF(SUMIF(Data!$I:$I,$A158,Data!S:S)=0,#N/A,SUMIF(Data!$I:$I,$A158,Data!S:S)),#N/A)","v":{"$error":"#N/A"}},{"$f":"IF(K$6,IF(SUMIF(Data!$I:$I,$A158,Data!T:T)=0,#N/A,SUMIF(Data!$I:$I,$A158,Data!T:T)),#N/A)","v":{"$error":"#N/A"}}]
[{"$error":"#N/A"},{"$f":"IF(B$6,IF(SUMIF(Data!$I:$I,$A159,Data!K:K)=0,#N/A,SUMIF(Data!$I:$I,$A159,Data!K:K)),#N/A)","v":{"$error":"#N/A"}},{"$f":"IF(C$6,IF(SUMIF(Data!$I:$I,$A159,Data!L:L)=0,#N/A,SUMIF(Data!$I:$I,$A159,Data!L:L)),#N/A)","v":{"$error":"#N/A"}},{"$f":"IF(D$6,IF(SUMIF(Data!$I:$I,$A159,Data!M:M)=0,#N/A,SUMIF(Data!$I:$I,$A159,Data!M:M)),#N/A)","v":{"$error":"#N/A"}},{"$f":"IF(E$6,IF(SUMIF(Data!$I:$I,$A159,Data!N:N)=0,#N/A,SUMIF(Data!$I:$I,$A159,Data!N:N)),#N/A)","v":{"$error":"#N/A"}},{"$f":"IF(F$6,IF(SUMIF(Data!$I:$I,$A159,Data!O:O)=0,#N/A,SUMIF(Data!$I:$I,$A159,Data!O:O)),#N/A)","v":{"$error":"#N/A"}},{"$f":"IF(G$6,IF(SUMIF(Data!$I:$I,$A159,Data!P:P)=0,#N/A,SUMIF(Data!$I:$I,$A159,Data!P:P)),#N/A)","v":{"$error":"#N/A"}},{"$f":"IF(H$6,IF(SUMIF(Data!$I:$I,$A159,Data!Q:Q)=0,#N/A,SUMIF(Data!$I:$I,$A159,Data!Q:Q)),#N/A)","v":{"$error":"#N/A"}},{"$f":"IF(I$6,IF(SUMIF(Data!$I:$I,$A159,Data!R:R)=0,#N/A,SUMIF(Data!$I:$I,$A159,Data!R:R)),#N/A)","v":{"$error":"#N/A"}},{"$f":"IF(J$6,IF(SUMIF(Data!$I:$I,$A159,Data!S:S)=0,#N/A,SUMIF(Data!$I:$I,$A159,Data!S:S)),#N/A)","v":{"$error":"#N/A"}},{"$f":"IF(K$6,IF(SUMIF(Data!$I:$I,$A159,Data!T:T)=0,#N/A,SUMIF(Data!$I:$I,$A159,Data!T:T)),#N/A)","v":{"$error":"#N/A"}}]
[{"$error":"#N/A"},{"$f":"IF(B$6,IF(SUMIF(Data!$I:$I,$A160,Data!K:K)=0,#N/A,SUMIF(Data!$I:$I,$A160,Data!K:K)),#N/A)","v":{"$error":"#N/A"}},{"$f":"IF(C$6,IF(SUMIF(Data!$I:$I,$A160,Data!L:L)=0,#N/A,SUMIF(Data!$I:$I,$A160,Data!L:L)),#N/A)","v":{"$error":"#N/A"}},{"$f":"IF(D$6,IF(SUMIF(Data!$I:$I,$A160,Data!M:M)=0,#N/A,SUMIF(Data!$I:$I,$A160,Data!M:M)),#N/A)","v":{"$error":"#N/A"}},{"$f":"IF(E$6,IF(SUMIF(Data!$I:$I,$A160,Data!N:N)=0,#N/A,SUMIF(Data!$I:$I,$A160,Data!N:N)),#N/A)","v":{"$error":"#N/A"}},{"$f":"IF(F$6,IF(SUMIF(Data!$I:$I,$A160,Data!O:O)=0,#N/A,SUMIF(Data!$I:$I,$A160,Data!O:O)),#N/A)","v":{"$error":"#N/A"}},{"$f":"IF(G$6,IF(SUMIF(Data!$I:$I,$A160,Data!P:P)=0,#N/A,SUMIF(Data!$I:$I,$A160,Data!P:P)),#N/A)","v":{"$error":"#N/A"}},{"$f":"IF(H$6,IF(SUMIF(Data!$I:$I,$A160,Data!Q:Q)=0,#N/A,SUMIF(Data!$I:$I,$A160,Data!Q:Q)),#N/A)","v":{"$error":"#N/A"}},{"$f":"IF(I$6,IF(SUMIF(Data!$I:$I,$A160,Data!R:R)=0,#N/A,SUMIF(Data!$I:$I,$A160,Data!R:R)),#N/A)","v":{"$error":"#N/A"}},{"$f":"IF(J$6,IF(SUMIF(Data!$I:$I,$A160,Data!S:S)=0,#N/A,SUMIF(Data!$I:$I,$A160,Data!S:S)),#N/A)","v":{"$error":"#N/A"}},{"$f":"IF(K$6,IF(SUMIF(Data!$I:$I,$A160,Data!T:T)=0,#N/A,SUMIF(Data!$I:$I,$A160,Data!T:T)),#N/A)","v":{"$error":"#N/A"}}]
[{"$error":"#N/A"},{"$f":"IF(B$6,IF(SUMIF(Data!$I:$I,$A161,Data!K:K)=0,#N/A,SUMIF(Data!$I:$I,$A161,Data!K:K)),#N/A)","v":{"$error":"#N/A"}},{"$f":"IF(C$6,IF(SUMIF(Data!$I:$I,$A161,Data!L:L)=0,#N/A,SUMIF(Data!$I:$I,$A161,Data!L:L)),#N/A)","v":{"$error":"#N/A"}},{"$f":"IF(D$6,IF(SUMIF(Data!$I:$I,$A161,Data!M:M)=0,#N/A,SUMIF(Data!$I:$I,$A161,Data!M:M)),#N/A)","v":{"$error":"#N/A"}},{"$f":"IF(E$6,IF(SUMIF(Data!$I:$I,$A161,Data!N:N)=0,#N/A,SUMIF(Data!$I:$I,$A161,Data!N:N)),#N/A)","v":{"$error":"#N/A"}},{"$f":"IF(F$6,IF(SUMIF(Data!$I:$I,$A161,Data!O:O)=0,#N/A,SUMIF(Data!$I:$I,$A161,Data!O:O)),#N/A)","v":{"$error":"#N/A"}},{"$f":"IF(G$6,IF(SUMIF(Data!$I:$I,$A161,Data!P:P)=0,#N/A,SUMIF(Data!$I:$I,$A161,Data!P:P)),#N/A)","v":{"$error":"#N/A"}},{"$f":"IF(H$6,IF(SUMIF(Data!$I:$I,$A161,Data!Q:Q)=0,#N/A,SUMIF(Data!$I:$I,$A161,Data!Q:Q)),#N/A)","v":{"$error":"#N/A"}},{"$f":"IF(I$6,IF(SUMIF(Data!$I:$I,$A161,Data!R:R)=0,#N/A,SUMIF(Data!$I:$I,$A161,Data!R:R)),#N/A)","v":{"$error":"#N/A"}},{"$f":"IF(J$6,IF(SUMIF(Data!$I:$I,$A161,Data!S:S)=0,#N/A,SUMIF(Data!$I:$I,$A161,Data!S:S)),#N/A)","v":{"$error":"#N/A"}},{"$f":"IF(K$6,IF(SUMIF(Data!$I:$I,$A161,Data!T:T)=0,#N/A,SUMIF(Data!$I:$I,$A161,Data!T:T)),#N/A)","v":{"$error":"#N/A"}}]
[{"$error":"#N/A"},{"$f":"IF(B$6,IF(SUMIF(Data!$I:$I,$A162,Data!K:K)=0,#N/A,SUMIF(Data!$I:$I,$A162,Data!K:K)),#N/A)","v":{"$error":"#N/A"}},{"$f":"IF(C$6,IF(SUMIF(Data!$I:$I,$A162,Data!L:L)=0,#N/A,SUMIF(Data!$I:$I,$A162,Data!L:L)),#N/A)","v":{"$error":"#N/A"}},{"$f":"IF(D$6,IF(SUMIF(Data!$I:$I,$A162,Data!M:M)=0,#N/A,SUMIF(Data!$I:$I,$A162,Data!M:M)),#N/A)","v":{"$error":"#N/A"}},{"$f":"IF(E$6,IF(SUMIF(Data!$I:$I,$A162,Data!N:N)=0,#N/A,SUMIF(Data!$I:$I,$A162,Data!N:N)),#N/A)","v":{"$error":"#N/A"}},{"$f":"IF(F$6,IF(SUMIF(Data!$I:$I,$A162,Data!O:O)=0,#N/A,SUMIF(Data!$I:$I,$A162,Data!O:O)),#N/A)","v":{"$error":"#N/A"}},{"$f":"IF(G$6,IF(SUMIF(Data!$I:$I,$A162,Data!P:P)=0,#N/A,SUMIF(Data!$I:$I,$A162,Data!P:P)),#N/A)","v":{"$error":"#N/A"}},{"$f":"IF(H$6,IF(SUMIF(Data!$I:$I,$A162,Data!Q:Q)=0,#N/A,SUMIF(Data!$I:$I,$A162,Data!Q:Q)),#N/A)","v":{"$error":"#N/A"}},{"$f":"IF(I$6,IF(SUMIF(Data!$I:$I,$A162,Data!R:R)=0,#N/A,SUMIF(Data!$I:$I,$A162,Data!R:R)),#N/A)","v":{"$error":"#N/A"}},{"$f":"IF(J$6,IF(SUMIF(Data!$I:$I,$A162,Data!S:S)=0,#N/A,SUMIF(Data!$I:$I,$A162,Data!S:S)),#N/A)","v":{"$error":"#N/A"}},{"$f":"IF(K$6,IF(SUMIF(Data!$I:$I,$A162,Data!T:T)=0,#N/A,SUMIF(Data!$I:$I,$A162,Data!T:T)),#N/A)","v":{"$error":"#N/A"}}]
[{"$error":"#N/A"},{"$f":"IF(B$6,IF(SUMIF(Data!$I:$I,$A163,Data!K:K)=0,#N/A,SUMIF(Data!$I:$I,$A163,Data!K:K)),#N/A)","v":{"$error":"#N/A"}},{"$f":"IF(C$6,IF(SUMIF(Data!$I:$I,$A163,Data!L:L)=0,#N/A,SUMIF(Data!$I:$I,$A163,Data!L:L)),#N/A)","v":{"$error":"#N/A"}},{"$f":"IF(D$6,IF(SUMIF(Data!$I:$I,$A163,Data!M:M)=0,#N/A,SUMIF(Data!$I:$I,$A163,Data!M:M)),#N/A)","v":{"$error":"#N/A"}},{"$f":"IF(E$6,IF(SUMIF(Data!$I:$I,$A163,Data!N:N)=0,#N/A,SUMIF(Data!$I:$I,$A163,Data!N:N)),#N/A)","v":{"$error":"#N/A"}},{"$f":"IF(F$6,IF(SUMIF(Data!$I:$I,$A163,Data!O:O)=0,#N/A,SUMIF(Data!$I:$I,$A163,Data!O:O)),#N/A)","v":{"$error":"#N/A"}},{"$f":"IF(G$6,IF(SUMIF(Data!$I:$I,$A163,Data!P:P)=0,#N/A,SUMIF(Data!$I:$I,$A163,Data!P:P)),#N/A)","v":{"$error":"#N/A"}},{"$f":"IF(H$6,IF(SUMIF(Data!$I:$I,$A163,Data!Q:Q)=0,#N/A,SUMIF(Data!$I:$I,$A163,Data!Q:Q)),#N/A)","v":{"$error":"#N/A"}},{"$f":"IF(I$6,IF(SUMIF(Data!$I:$I,$A163,Data!R:R)=0,#N/A,SUMIF(Data!$I:$I,$A163,Data!R:R)),#N/A)","v":{"$error":"#N/A"}},{"$f":"IF(J$6,IF(SUMIF(Data!$I:$I,$A163,Data!S:S)=0,#N/A,SUMIF(Data!$I:$I,$A163,Data!S:S)),#N/A)","v":{"$error":"#N/A"}},{"$f":"IF(K$6,IF(SUMIF(Data!$I:$I,$A163,Data!T:T)=0,#N/A,SUMIF(Data!$I:$I,$A163,Data!T:T)),#N/A)","v":{"$error":"#N/A"}}]
[{"$error":"#N/A"},{"$f":"IF(B$6,IF(SUMIF(Data!$I:$I,$A164,Data!K:K)=0,#N/A,SUMIF(Data!$I:$I,$A164,Data!K:K)),#N/A)","v":{"$error":"#N/A"}},{"$f":"IF(C$6,IF(SUMIF(Data!$I:$I,$A164,Data!L:L)=0,#N/A,SUMIF(Data!$I:$I,$A164,Data!L:L)),#N/A)","v":{"$error":"#N/A"}},{"$f":"IF(D$6,IF(SUMIF(Data!$I:$I,$A164,Data!M:M)=0,#N/A,SUMIF(Data!$I:$I,$A164,Data!M:M)),#N/A)","v":{"$error":"#N/A"}},{"$f":"IF(E$6,IF(SUMIF(Data!$I:$I,$A164,Data!N:N)=0,#N/A,SUMIF(Data!$I:$I,$A164,Data!N:N)),#N/A)","v":{"$error":"#N/A"}},{"$f":"IF(F$6,IF(SUMIF(Data!$I:$I,$A164,Data!O:O)=0,#N/A,SUMIF(Data!$I:$I,$A164,Data!O:O)),#N/A)","v":{"$error":"#N/A"}},{"$f":"IF(G$6,IF(SUMIF(Data!$I:$I,$A164,Data!P:P)=0,#N/A,SUMIF(Data!$I:$I,$A164,Data!P:P)),#N/A)","v":{"$error":"#N/A"}},{"$f":"IF(H$6,IF(SUMIF(Data!$I:$I,$A164,Data!Q:Q)=0,#N/A,SUMIF(Data!$I:$I,$A164,Data!Q:Q)),#N/A)","v":{"$error":"#N/A"}},{"$f":"IF(I$6,IF(SUMIF(Data!$I:$I,$A164,Data!R:R)=0,#N/A,SUMIF(Data!$I:$I,$A164,Data!R:R)),#N/A)","v":{"$error":"#N/A"}},{"$f":"IF(J$6,IF(SUMIF(Data!$I:$I,$A164,Data!S:S)=0,#N/A,SUMIF(Data!$I:$I,$A164,Data!S:S)),#N/A)","v":{"$error":"#N/A"}},{"$f":"IF(K$6,IF(SUMIF(Data!$I:$I,$A164,Data!T:T)=0,#N/A,SUMIF(Data!$I:$I,$A164,Data!T:T)),#N/A)","v":{"$error":"#N/A"}}]
[{"$error":"#N/A"},{"$f":"IF(B$6,IF(SUMIF(Data!$I:$I,$A165,Data!K:K)=0,#N/A,SUMIF(Data!$I:$I,$A165,Data!K:K)),#N/A)","v":{"$error":"#N/A"}},{"$f":"IF(C$6,IF(SUMIF(Data!$I:$I,$A165,Data!L:L)=0,#N/A,SUMIF(Data!$I:$I,$A165,Data!L:L)),#N/A)","v":{"$error":"#N/A"}},{"$f":"IF(D$6,IF(SUMIF(Data!$I:$I,$A165,Data!M:M)=0,#N/A,SUMIF(Data!$I:$I,$A165,Data!M:M)),#N/A)","v":{"$error":"#N/A"}},{"$f":"IF(E$6,IF(SUMIF(Data!$I:$I,$A165,Data!N:N)=0,#N/A,SUMIF(Data!$I:$I,$A165,Data!N:N)),#N/A)","v":{"$error":"#N/A"}},{"$f":"IF(F$6,IF(SUMIF(Data!$I:$I,$A165,Data!O:O)=0,#N/A,SUMIF(Data!$I:$I,$A165,Data!O:O)),#N/A)","v":{"$error":"#N/A"}},{"$f":"IF(G$6,IF(SUMIF(Data!$I:$I,$A165,Data!P:P)=0,#N/A,SUMIF(Data!$I:$I,$A165,Data!P:P)),#N/A)","v":{"$error":"#N/A"}},{"$f":"IF(H$6,IF(SUMIF(Data!$I:$I,$A165,Data!Q:Q)=0,#N/A,SUMIF(Data!$I:$I,$A165,Data!Q:Q)),#N/A)","v":{"$error":"#N/A"}},{"$f":"IF(I$6,IF(SUMIF(Data!$I:$I,$A165,Data!R:R)=0,#N/A,SUMIF(Data!$I:$I,$A165,Data!R:R)),#N/A)","v":{"$error":"#N/A"}},{"$f":"IF(J$6,IF(SUMIF(Data!$I:$I,$A165,Data!S:S)=0,#N/A,SUMIF(Data!$I:$I,$A165,Data!S:S)),#N/A)","v":{"$error":"#N/A"}},{"$f":"IF(K$6,IF(SUMIF(Data!$I:$I,$A165,Data!T:T)=0,#N/A,SUMIF(Data!$I:$I,$A165,Data!T:T)),#N/A)","v":{"$error":"#N/A"}}]
[{"$error":"#N/A"},{"$f":"IF(B$6,IF(SUMIF(Data!$I:$I,$A166,Data!K:K)=0,#N/A,SUMIF(Data!$I:$I,$A166,Data!K:K)),#N/A)","v":{"$error":"#N/A"}},{"$f":"IF(C$6,IF(SUMIF(Data!$I:$I,$A166,Data!L:L)=0,#N/A,SUMIF(Data!$I:$I,$A166,Data!L:L)),#N/A)","v":{"$error":"#N/A"}},{"$f":"IF(D$6,IF(SUMIF(Data!$I:$I,$A166,Data!M:M)=0,#N/A,SUMIF(Data!$I:$I,$A166,Data!M:M)),#N/A)","v":{"$error":"#N/A"}},{"$f":"IF(E$6,IF(SUMIF(Data!$I:$I,$A166,Data!N:N)=0,#N/A,SUMIF(Data!$I:$I,$A166,Data!N:N)),#N/A)","v":{"$error":"#N/A"}},{"$f":"IF(F$6,IF(SUMIF(Data!$I:$I,$A166,Data!O:O)=0,#N/A,SUMIF(Data!$I:$I,$A166,Data!O:O)),#N/A)","v":{"$error":"#N/A"}},{"$f":"IF(G$6,IF(SUMIF(Data!$I:$I,$A166,Data!P:P)=0,#N/A,SUMIF(Data!$I:$I,$A166,Data!P:P)),#N/A)","v":{"$error":"#N/A"}},{"$f":"IF(H$6,IF(SUMIF(Data!$I:$I,$A166,Data!Q:Q)=0,#N/A,SUMIF(Data!$I:$I,$A166,Data!Q:Q)),#N/A)","v":{"$error":"#N/A"}},{"$f":"IF(I$6,IF(SUMIF(Data!$I:$I,$A166,Data!R:R)=0,#N/A,SUMIF(Data!$I:$I,$A166,Data!R:R)),#N/A)","v":{"$error":"#N/A"}},{"$f":"IF(J$6,IF(SUMIF(Data!$I:$I,$A166,Data!S:S)=0,#N/A,SUMIF(Data!$I:$I,$A166,Data!S:S)),#N/A)","v":{"$error":"#N/A"}},{"$f":"IF(K$6,IF(SUMIF(Data!$I:$I,$A166,Data!T:T)=0,#N/A,SUMIF(Data!$I:$I,$A166,Data!T:T)),#N/A)","v":{"$error":"#N/A"}}]
[{"$error":"#N/A"},{"$f":"IF(B$6,IF(SUMIF(Data!$I:$I,$A167,Data!K:K)=0,#N/A,SUMIF(Data!$I:$I,$A167,Data!K:K)),#N/A)","v":{"$error":"#N/A"}},{"$f":"IF(C$6,IF(SUMIF(Data!$I:$I,$A167,Data!L:L)=0,#N/A,SUMIF(Data!$I:$I,$A167,Data!L:L)),#N/A)","v":{"$error":"#N/A"}},{"$f":"IF(D$6,IF(SUMIF(Data!$I:$I,$A167,Data!M:M)=0,#N/A,SUMIF(Data!$I:$I,$A167,Data!M:M)),#N/A)","v":{"$error":"#N/A"}},{"$f":"IF(E$6,IF(SUMIF(Data!$I:$I,$A167,Data!N:N)=0,#N/A,SUMIF(Data!$I:$I,$A167,Data!N:N)),#N/A)","v":{"$error":"#N/A"}},{"$f":"IF(F$6,IF(SUMIF(Data!$I:$I,$A167,Data!O:O)=0,#N/A,SUMIF(Data!$I:$I,$A167,Data!O:O)),#N/A)","v":{"$error":"#N/A"}},{"$f":"IF(G$6,IF(SUMIF(Data!$I:$I,$A167,Data!P:P)=0,#N/A,SUMIF(Data!$I:$I,$A167,Data!P:P)),#N/A)","v":{"$error":"#N/A"}},{"$f":"IF(H$6,IF(SUMIF(Data!$I:$I,$A167,Data!Q:Q)=0,#N/A,SUMIF(Data!$I:$I,$A167,Data!Q:Q)),#N/A)","v":{"$error":"#N/A"}},{"$f":"IF(I$6,IF(SUMIF(Data!$I:$I,$A167,Data!R:R)=0,#N/A,SUMIF(Data!$I:$I,$A167,Data!R:R)),#N/A)","v":{"$error":"#N/A"}},{"$f":"IF(J$6,IF(SUMIF(Data!$I:$I,$A167,Data!S:S)=0,#N/A,SUMIF(Data!$I:$I,$A167,Data!S:S)),#N/A)","v":{"$error":"#N/A"}},{"$f":"IF(K$6,IF(SUMIF(Data!$I:$I,$A167,Data!T:T)=0,#N/A,SUMIF(Data!$I:$I,$A167,Data!T:T)),#N/A)","v":{"$error":"#N/A"}}]
[{"$error":"#N/A"},{"$f":"IF(B$6,IF(SUMIF(Data!$I:$I,$A168,Data!K:K)=0,#N/A,SUMIF(Data!$I:$I,$A168,Data!K:K)),#N/A)","v":{"$error":"#N/A"}},{"$f":"IF(C$6,IF(SUMIF(Data!$I:$I,$A168,Data!L:L)=0,#N/A,SUMIF(Data!$I:$I,$A168,Data!L:L)),#N/A)","v":{"$error":"#N/A"}},{"$f":"IF(D$6,IF(SUMIF(Data!$I:$I,$A168,Data!M:M)=0,#N/A,SUMIF(Data!$I:$I,$A168,Data!M:M)),#N/A)","v":{"$error":"#N/A"}},{"$f":"IF(E$6,IF(SUMIF(Data!$I:$I,$A168,Data!N:N)=0,#N/A,SUMIF(Data!$I:$I,$A168,Data!N:N)),#N/A)","v":{"$error":"#N/A"}},{"$f":"IF(F$6,IF(SUMIF(Data!$I:$I,$A168,Data!O:O)=0,#N/A,SUMIF(Data!$I:$I,$A168,Data!O:O)),#N/A)","v":{"$error":"#N/A"}},{"$f":"IF(G$6,IF(SUMIF(Data!$I:$I,$A168,Data!P:P)=0,#N/A,SUMIF(Data!$I:$I,$A168,Data!P:P)),#N/A)","v":{"$error":"#N/A"}},{"$f":"IF(H$6,IF(SUMIF(Data!$I:$I,$A168,Data!Q:Q)=0,#N/A,SUMIF(Data!$I:$I,$A168,Data!Q:Q)),#N/A)","v":{"$error":"#N/A"}},{"$f":"IF(I$6,IF(SUMIF(Data!$I:$I,$A168,Data!R:R)=0,#N/A,SUMIF(Data!$I:$I,$A168,Data!R:R)),#N/A)","v":{"$error":"#N/A"}},{"$f":"IF(J$6,IF(SUMIF(Data!$I:$I,$A168,Data!S:S)=0,#N/A,SUMIF(Data!$I:$I,$A168,Data!S:S)),#N/A)","v":{"$error":"#N/A"}},{"$f":"IF(K$6,IF(SUMIF(Data!$I:$I,$A168,Data!T:T)=0,#N/A,SUMIF(Data!$I:$I,$A168,Data!T:T)),#N/A)","v":{"$error":"#N/A"}}]
[{"$error":"#N/A"},{"$f":"IF(B$6,IF(SUMIF(Data!$I:$I,$A169,Data!K:K)=0,#N/A,SUMIF(Data!$I:$I,$A169,Data!K:K)),#N/A)","v":{"$error":"#N/A"}},{"$f":"IF(C$6,IF(SUMIF(Data!$I:$I,$A169,Data!L:L)=0,#N/A,SUMIF(Data!$I:$I,$A169,Data!L:L)),#N/A)","v":{"$error":"#N/A"}},{"$f":"IF(D$6,IF(SUMIF(Data!$I:$I,$A169,Data!M:M)=0,#N/A,SUMIF(Data!$I:$I,$A169,Data!M:M)),#N/A)","v":{"$error":"#N/A"}},{"$f":"IF(E$6,IF(SUMIF(Data!$I:$I,$A169,Data!N:N)=0,#N/A,SUMIF(Data!$I:$I,$A169,Data!N:N)),#N/A)","v":{"$error":"#N/A"}},{"$f":"IF(F$6,IF(SUMIF(Data!$I:$I,$A169,Data!O:O)=0,#N/A,SUMIF(Data!$I:$I,$A169,Data!O:O)),#N/A)","v":{"$error":"#N/A"}},{"$f":"IF(G$6,IF(SUMIF(Data!$I:$I,$A169,Data!P:P)=0,#N/A,SUMIF(Data!$I:$I,$A169,Data!P:P)),#N/A)","v":{"$error":"#N/A"}},{"$f":"IF(H$6,IF(SUMIF(Data!$I:$I,$A169,Data!Q:Q)=0,#N/A,SUMIF(Data!$I:$I,$A169,Data!Q:Q)),#N/A)","v":{"$error":"#N/A"}},{"$f":"IF(I$6,IF(SUMIF(Data!$I:$I,$A169,Data!R:R)=0,#N/A,SUMIF(Data!$I:$I,$A169,Data!R:R)),#N/A)","v":{"$error":"#N/A"}},{"$f":"IF(J$6,IF(SUMIF(Data!$I:$I,$A169,Data!S:S)=0,#N/A,SUMIF(Data!$I:$I,$A169,Data!S:S)),#N/A)","v":{"$error":"#N/A"}},{"$f":"IF(K$6,IF(SUMIF(Data!$I:$I,$A169,Data!T:T)=0,#N/A,SUMIF(Data!$I:$I,$A169,Data!T:T)),#N/A)","v":{"$error":"#N/A"}}]
[{"$error":"#N/A"},{"$f":"IF(B$6,IF(SUMIF(Data!$I:$I,$A170,Data!K:K)=0,#N/A,SUMIF(Data!$I:$I,$A170,Data!K:K)),#N/A)","v":{"$error":"#N/A"}},{"$f":"IF(C$6,IF(SUMIF(Data!$I:$I,$A170,Data!L:L)=0,#N/A,SUMIF(Data!$I:$I,$A170,Data!L:L)),#N/A)","v":{"$error":"#N/A"}},{"$f":"IF(D$6,IF(SUMIF(Data!$I:$I,$A170,Data!M:M)=0,#N/A,SUMIF(Data!$I:$I,$A170,Data!M:M)),#N/A)","v":{"$error":"#N/A"}},{"$f":"IF(E$6,IF(SUMIF(Data!$I:$I,$A170,Data!N:N)=0,#N/A,SUMIF(Data!$I:$I,$A170,Data!N:N)),#N/A)","v":{"$error":"#N/A"}},{"$f":"IF(F$6,IF(SUMIF(Data!$I:$I,$A170,Data!O:O)=0,#N/A,SUMIF(Data!$I:$I,$A170,Data!O:O)),#N/A)","v":{"$error":"#N/A"}},{"$f":"IF(G$6,IF(SUMIF(Data!$I:$I,$A170,Data!P:P)=0,#N/A,SUMIF(Data!$I:$I,$A170,Data!P:P)),#N/A)","v":{"$error":"#N/A"}},{"$f":"IF(H$6,IF(SUMIF(Data!$I:$I,$A170,Data!Q:Q)=0,#N/A,SUMIF(Data!$I:$I,$A170,Data!Q:Q)),#N/A)","v":{"$error":"#N/A"}},{"$f":"IF(I$6,IF(SUMIF(Data!$I:$I,$A170,Data!R:R)=0,#N/A,SUMIF(Data!$I:$I,$A170,Data!R:R)),#N/A)","v":{"$error":"#N/A"}},{"$f":"IF(J$6,IF(SUMIF(Data!$I:$I,$A170,Data!S:S)=0,#N/A,SUMIF(Data!$I:$I,$A170,Data!S:S)),#N/A)","v":{"$error":"#N/A"}},{"$f":"IF(K$6,IF(SUMIF(Data!$I:$I,$A170,Data!T:T)=0,#N/A,SUMIF(Data!$I:$I,$A170,Data!T:T)),#N/A)","v":{"$error":"#N/A"}}]
[{"$error":"#N/A"},{"$f":"IF(B$6,IF(SUMIF(Data!$I:$I,$A171,Data!K:K)=0,#N/A,SUMIF(Data!$I:$I,$A171,Data!K:K)),#N/A)","v":{"$error":"#N/A"}},{"$f":"IF(C$6,IF(SUMIF(Data!$I:$I,$A171,Data!L:L)=0,#N/A,SUMIF(Data!$I:$I,$A171,Data!L:L)),#N/A)","v":{"$error":"#N/A"}},{"$f":"IF(D$6,IF(SUMIF(Data!$I:$I,$A171,Data!M:M)=0,#N/A,SUMIF(Data!$I:$I,$A171,Data!M:M)),#N/A)","v":{"$error":"#N/A"}},{"$f":"IF(E$6,IF(SUMIF(Data!$I:$I,$A171,Data!N:N)=0,#N/A,SUMIF(Data!$I:$I,$A171,Data!N:N)),#N/A)","v":{"$error":"#N/A"}},{"$f":"IF(F$6,IF(SUMIF(Data!$I:$I,$A171,Data!O:O)=0,#N/A,SUMIF(Data!$I:$I,$A171,Data!O:O)),#N/A)","v":{"$error":"#N/A"}},{"$f":"IF(G$6,IF(SUMIF(Data!$I:$I,$A171,Data!P:P)=0,#N/A,SUMIF(Data!$I:$I,$A171,Data!P:P)),#N/A)","v":{"$error":"#N/A"}},{"$f":"IF(H$6,IF(SUMIF(Data!$I:$I,$A171,Data!Q:Q)=0,#N/A,SUMIF(Data!$I:$I,$A171,Data!Q:Q)),#N/A)","v":{"$error":"#N/A"}},{"$f":"IF(I$6,IF(SUMIF(Data!$I:$I,$A171,Data!R:R)=0,#N/A,SUMIF(Data!$I:$I,$A171,Data!R:R)),#N/A)","v":{"$error":"#N/A"}},{"$f":"IF(J$6,IF(SUMIF(Data!$I:$I,$A171,Data!S:S)=0,#N/A,SUMIF(Data!$I:$I,$A171,Data!S:S)),#N/A)","v":{"$error":"#N/A"}},{"$f":"IF(K$6,IF(SUMIF(Data!$I:$I,$A171,Data!T:T)=0,#N/A,SUMIF(Data!$I:$I,$A171,Data!T:T)),#N/A)","v":{"$error":"#N/A"}}]
[{"$error":"#N/A"},{"$f":"IF(B$6,IF(SUMIF(Data!$I:$I,$A172,Data!K:K)=0,#N/A,SUMIF(Data!$I:$I,$A172,Data!K:K)),#N/A)","v":{"$error":"#N/A"}},{"$f":"IF(C$6,IF(SUMIF(Data!$I:$I,$A172,Data!L:L)=0,#N/A,SUMIF(Data!$I:$I,$A172,Data!L:L)),#N/A)","v":{"$error":"#N/A"}},{"$f":"IF(D$6,IF(SUMIF(Data!$I:$I,$A172,Data!M:M)=0,#N/A,SUMIF(Data!$I:$I,$A172,Data!M:M)),#N/A)","v":{"$error":"#N/A"}},{"$f":"IF(E$6,IF(SUMIF(Data!$I:$I,$A172,Data!N:N)=0,#N/A,SUMIF(Data!$I:$I,$A172,Data!N:N)),#N/A)","v":{"$error":"#N/A"}},{"$f":"IF(F$6,IF(SUMIF(Data!$I:$I,$A172,Data!O:O)=0,#N/A,SUMIF(Data!$I:$I,$A172,Data!O:O)),#N/A)","v":{"$error":"#N/A"}},{"$f":"IF(G$6,IF(SUMIF(Data!$I:$I,$A172,Data!P:P)=0,#N/A,SUMIF(Data!$I:$I,$A172,Data!P:P)),#N/A)","v":{"$error":"#N/A"}},{"$f":"IF(H$6,IF(SUMIF(Data!$I:$I,$A172,Data!Q:Q)=0,#N/A,SUMIF(Data!$I:$I,$A172,Data!Q:Q)),#N/A)","v":{"$error":"#N/A"}},{"$f":"IF(I$6,IF(SUMIF(Data!$I:$I,$A172,Data!R:R)=0,#N/A,SUMIF(Data!$I:$I,$A172,Data!R:R)),#N/A)","v":{"$error":"#N/A"}},{"$f":"IF(J$6,IF(SUMIF(Data!$I:$I,$A172,Data!S:S)=0,#N/A,SUMIF(Data!$I:$I,$A172,Data!S:S)),#N/A)","v":{"$error":"#N/A"}},{"$f":"IF(K$6,IF(SUMIF(Data!$I:$I,$A172,Data!T:T)=0,#N/A,SUMIF(Data!$I:$I,$A172,Data!T:T)),#N/A)","v":{"$error":"#N/A"}}]
[{"$error":"#N/A"},{"$f":"IF(B$6,IF(SUMIF(Data!$I:$I,$A173,Data!K:K)=0,#N/A,SUMIF(Data!$I:$I,$A173,Data!K:K)),#N/A)","v":{"$error":"#N/A"}},{"$f":"IF(C$6,IF(SUMIF(Data!$I:$I,$A173,Data!L:L)=0,#N/A,SUMIF(Data!$I:$I,$A173,Data!L:L)),#N/A)","v":{"$error":"#N/A"}},{"$f":"IF(D$6,IF(SUMIF(Data!$I:$I,$A173,Data!M:M)=0,#N/A,SUMIF(Data!$I:$I,$A173,Data!M:M)),#N/A)","v":{"$error":"#N/A"}},{"$f":"IF(E$6,IF(SUMIF(Data!$I:$I,$A173,Data!N:N)=0,#N/A,SUMIF(Data!$I:$I,$A173,Data!N:N)),#N/A)","v":{"$error":"#N/A"}},{"$f":"IF(F$6,IF(SUMIF(Data!$I:$I,$A173,Data!O:O)=0,#N/A,SUMIF(Data!$I:$I,$A173,Data!O:O)),#N/A)","v":{"$error":"#N/A"}},{"$f":"IF(G$6,IF(SUMIF(Data!$I:$I,$A173,Data!P:P)=0,#N/A,SUMIF(Data!$I:$I,$A173,Data!P:P)),#N/A)","v":{"$error":"#N/A"}},{"$f":"IF(H$6,IF(SUMIF(Data!$I:$I,$A173,Data!Q:Q)=0,#N/A,SUMIF(Data!$I:$I,$A173,Data!Q:Q)),#N/A)","v":{"$error":"#N/A"}},{"$f":"IF(I$6,IF(SUMIF(Data!$I:$I,$A173,Data!R:R)=0,#N/A,SUMIF(Data!$I:$I,$A173,Data!R:R)),#N/A)","v":{"$error":"#N/A"}},{"$f":"IF(J$6,IF(SUMIF(Data!$I:$I,$A173,Data!S:S)=0,#N/A,SUMIF(Data!$I:$I,$A173,Data!S:S)),#N/A)","v":{"$error":"#N/A"}},{"$f":"IF(K$6,IF(SUMIF(Data!$I:$I,$A173,Data!T:T)=0,#N/A,SUMIF(Data!$I:$I,$A173,Data!T:T)),#N/A)","v":{"$error":"#N/A"}}]
[{"$error":"#N/A"},{"$f":"IF(B$6,IF(SUMIF(Data!$I:$I,$A174,Data!K:K)=0,#N/A,SUMIF(Data!$I:$I,$A174,Data!K:K)),#N/A)","v":{"$error":"#N/A"}},{"$f":"IF(C$6,IF(SUMIF(Data!$I:$I,$A174,Data!L:L)=0,#N/A,SUMIF(Data!$I:$I,$A174,Data!L:L)),#N/A)","v":{"$error":"#N/A"}},{"$f":"IF(D$6,IF(SUMIF(Data!$I:$I,$A174,Data!M:M)=0,#N/A,SUMIF(Data!$I:$I,$A174,Data!M:M)),#N/A)","v":{"$error":"#N/A"}},{"$f":"IF(E$6,IF(SUMIF(Data!$I:$I,$A174,Data!N:N)=0,#N/A,SUMIF(Data!$I:$I,$A174,Data!N:N)),#N/A)","v":{"$error":"#N/A"}},{"$f":"IF(F$6,IF(SUMIF(Data!$I:$I,$A174,Data!O:O)=0,#N/A,SUMIF(Data!$I:$I,$A174,Data!O:O)),#N/A)","v":{"$error":"#N/A"}},{"$f":"IF(G$6,IF(SUMIF(Data!$I:$I,$A174,Data!P:P)=0,#N/A,SUMIF(Data!$I:$I,$A174,Data!P:P)),#N/A)","v":{"$error":"#N/A"}},{"$f":"IF(H$6,IF(SUMIF(Data!$I:$I,$A174,Data!Q:Q)=0,#N/A,SUMIF(Data!$I:$I,$A174,Data!Q:Q)),#N/A)","v":{"$error":"#N/A"}},{"$f":"IF(I$6,IF(SUMIF(Data!$I:$I,$A174,Data!R:R)=0,#N/A,SUMIF(Data!$I:$I,$A174,Data!R:R)),#N/A)","v":{"$error":"#N/A"}},{"$f":"IF(J$6,IF(SUMIF(Data!$I:$I,$A174,Data!S:S)=0,#N/A,SUMIF(Data!$I:$I,$A174,Data!S:S)),#N/A)","v":{"$error":"#N/A"}},{"$f":"IF(K$6,IF(SUMIF(Data!$I:$I,$A174,Data!T:T)=0,#N/A,SUMIF(Data!$I:$I,$A174,Data!T:T)),#N/A)","v":{"$error":"#N/A"}}]
[{"$error":"#N/A"},{"$f":"IF(B$6,IF(SUMIF(Data!$I:$I,$A175,Data!K:K)=0,#N/A,SUMIF(Data!$I:$I,$A175,Data!K:K)),#N/A)","v":{"$error":"#N/A"}},{"$f":"IF(C$6,IF(SUMIF(Data!$I:$I,$A175,Data!L:L)=0,#N/A,SUMIF(Data!$I:$I,$A175,Data!L:L)),#N/A)","v":{"$error":"#N/A"}},{"$f":"IF(D$6,IF(SUMIF(Data!$I:$I,$A175,Data!M:M)=0,#N/A,SUMIF(Data!$I:$I,$A175,Data!M:M)),#N/A)","v":{"$error":"#N/A"}},{"$f":"IF(E$6,IF(SUMIF(Data!$I:$I,$A175,Data!N:N)=0,#N/A,SUMIF(Data!$I:$I,$A175,Data!N:N)),#N/A)","v":{"$error":"#N/A"}},{"$f":"IF(F$6,IF(SUMIF(Data!$I:$I,$A175,Data!O:O)=0,#N/A,SUMIF(Data!$I:$I,$A175,Data!O:O)),#N/A)","v":{"$error":"#N/A"}},{"$f":"IF(G$6,IF(SUMIF(Data!$I:$I,$A175,Data!P:P)=0,#N/A,SUMIF(Data!$I:$I,$A175,Data!P:P)),#N/A)","v":{"$error":"#N/A"}},{"$f":"IF(H$6,IF(SUMIF(Data!$I:$I,$A175,Data!Q:Q)=0,#N/A,SUMIF(Data!$I:$I,$A175,Data!Q:Q)),#N/A)","v":{"$error":"#N/A"}},{"$f":"IF(I$6,IF(SUMIF(Data!$I:$I,$A175,Data!R:R)=0,#N/A,SUMIF(Data!$I:$I,$A175,Data!R:R)),#N/A)","v":{"$error":"#N/A"}},{"$f":"IF(J$6,IF(SUMIF(Data!$I:$I,$A175,Data!S:S)=0,#N/A,SUMIF(Data!$I:$I,$A175,Data!S:S)),#N/A)","v":{"$error":"#N/A"}},{"$f":"IF(K$6,IF(SUMIF(Data!$I:$I,$A175,Data!T:T)=0,#N/A,SUMIF(Data!$I:$I,$A175,Data!T:T)),#N/A)","v":{"$error":"#N/A"}}]
[{"$error":"#N/A"},{"$f":"IF(B$6,IF(SUMIF(Data!$I:$I,$A176,Data!K:K)=0,#N/A,SUMIF(Data!$I:$I,$A176,Data!K:K)),#N/A)","v":{"$error":"#N/A"}},{"$f":"IF(C$6,IF(SUMIF(Data!$I:$I,$A176,Data!L:L)=0,#N/A,SUMIF(Data!$I:$I,$A176,Data!L:L)),#N/A)","v":{"$error":"#N/A"}},{"$f":"IF(D$6,IF(SUMIF(Data!$I:$I,$A176,Data!M:M)=0,#N/A,SUMIF(Data!$I:$I,$A176,Data!M:M)),#N/A)","v":{"$error":"#N/A"}},{"$f":"IF(E$6,IF(SUMIF(Data!$I:$I,$A176,Data!N:N)=0,#N/A,SUMIF(Data!$I:$I,$A176,Data!N:N)),#N/A)","v":{"$error":"#N/A"}},{"$f":"IF(F$6,IF(SUMIF(Data!$I:$I,$A176,Data!O:O)=0,#N/A,SUMIF(Data!$I:$I,$A176,Data!O:O)),#N/A)","v":{"$error":"#N/A"}},{"$f":"IF(G$6,IF(SUMIF(Data!$I:$I,$A176,Data!P:P)=0,#N/A,SUMIF(Data!$I:$I,$A176,Data!P:P)),#N/A)","v":{"$error":"#N/A"}},{"$f":"IF(H$6,IF(SUMIF(Data!$I:$I,$A176,Data!Q:Q)=0,#N/A,SUMIF(Data!$I:$I,$A176,Data!Q:Q)),#N/A)","v":{"$error":"#N/A"}},{"$f":"IF(I$6,IF(SUMIF(Data!$I:$I,$A176,Data!R:R)=0,#N/A,SUMIF(Data!$I:$I,$A176,Data!R:R)),#N/A)","v":{"$error":"#N/A"}},{"$f":"IF(J$6,IF(SUMIF(Data!$I:$I,$A176,Data!S:S)=0,#N/A,SUMIF(Data!$I:$I,$A176,Data!S:S)),#N/A)","v":{"$error":"#N/A"}},{"$f":"IF(K$6,IF(SUMIF(Data!$I:$I,$A176,Data!T:T)=0,#N/A,SUMIF(Data!$I:$I,$A176,Data!T:T)),#N/A)","v":{"$error":"#N/A"}}]
[{"$error":"#N/A"},{"$f":"IF(B$6,IF(SUMIF(Data!$I:$I,$A177,Data!K:K)=0,#N/A,SUMIF(Data!$I:$I,$A177,Data!K:K)),#N/A)","v":{"$error":"#N/A"}},{"$f":"IF(C$6,IF(SUMIF(Data!$I:$I,$A177,Data!L:L)=0,#N/A,SUMIF(Data!$I:$I,$A177,Data!L:L)),#N/A)","v":{"$error":"#N/A"}},{"$f":"IF(D$6,IF(SUMIF(Data!$I:$I,$A177,Data!M:M)=0,#N/A,SUMIF(Data!$I:$I,$A177,Data!M:M)),#N/A)","v":{"$error":"#N/A"}},{"$f":"IF(E$6,IF(SUMIF(Data!$I:$I,$A177,Data!N:N)=0,#N/A,SUMIF(Data!$I:$I,$A177,Data!N:N)),#N/A)","v":{"$error":"#N/A"}},{"$f":"IF(F$6,IF(SUMIF(Data!$I:$I,$A177,Data!O:O)=0,#N/A,SUMIF(Data!$I:$I,$A177,Data!O:O)),#N/A)","v":{"$error":"#N/A"}},{"$f":"IF(G$6,IF(SUMIF(Data!$I:$I,$A177,Data!P:P)=0,#N/A,SUMIF(Data!$I:$I,$A177,Data!P:P)),#N/A)","v":{"$error":"#N/A"}},{"$f":"IF(H$6,IF(SUMIF(Data!$I:$I,$A177,Data!Q:Q)=0,#N/A,SUMIF(Data!$I:$I,$A177,Data!Q:Q)),#N/A)","v":{"$error":"#N/A"}},{"$f":"IF(I$6,IF(SUMIF(Data!$I:$I,$A177,Data!R:R)=0,#N/A,SUMIF(Data!$I:$I,$A177,Data!R:R)),#N/A)","v":{"$error":"#N/A"}},{"$f":"IF(J$6,IF(SUMIF(Data!$I:$I,$A177,Data!S:S)=0,#N/A,SUMIF(Data!$I:$I,$A177,Data!S:S)),#N/A)","v":{"$error":"#N/A"}},{"$f":"IF(K$6,IF(SUMIF(Data!$I:$I,$A177,Data!T:T)=0,#N/A,SUMIF(Data!$I:$I,$A177,Data!T:T)),#N/A)","v":{"$error":"#N/A"}}]
[{"$error":"#N/A"},{"$f":"IF(B$6,IF(SUMIF(Data!$I:$I,$A178,Data!K:K)=0,#N/A,SUMIF(Data!$I:$I,$A178,Data!K:K)),#N/A)","v":{"$error":"#N/A"}},{"$f":"IF(C$6,IF(SUMIF(Data!$I:$I,$A178,Data!L:L)=0,#N/A,SUMIF(Data!$I:$I,$A178,Data!L:L)),#N/A)","v":{"$error":"#N/A"}},{"$f":"IF(D$6,IF(SUMIF(Data!$I:$I,$A178,Data!M:M)=0,#N/A,SUMIF(Data!$I:$I,$A178,Data!M:M)),#N/A)","v":{"$error":"#N/A"}},{"$f":"IF(E$6,IF(SUMIF(Data!$I:$I,$A178,Data!N:N)=0,#N/A,SUMIF(Data!$I:$I,$A178,Data!N:N)),#N/A)","v":{"$error":"#N/A"}},{"$f":"IF(F$6,IF(SUMIF(Data!$I:$I,$A178,Data!O:O)=0,#N/A,SUMIF(Data!$I:$I,$A178,Data!O:O)),#N/A)","v":{"$error":"#N/A"}},{"$f":"IF(G$6,IF(SUMIF(Data!$I:$I,$A178,Data!P:P)=0,#N/A,SUMIF(Data!$I:$I,$A178,Data!P:P)),#N/A)","v":{"$error":"#N/A"}},{"$f":"IF(H$6,IF(SUMIF(Data!$I:$I,$A178,Data!Q:Q)=0,#N/A,SUMIF(Data!$I:$I,$A178,Data!Q:Q)),#N/A)","v":{"$error":"#N/A"}},{"$f":"IF(I$6,IF(SUMIF(Data!$I:$I,$A178,Data!R:R)=0,#N/A,SUMIF(Data!$I:$I,$A178,Data!R:R)),#N/A)","v":{"$error":"#N/A"}},{"$f":"IF(J$6,IF(SUMIF(Data!$I:$I,$A178,Data!S:S)=0,#N/A,SUMIF(Data!$I:$I,$A178,Data!S:S)),#N/A)","v":{"$error":"#N/A"}},{"$f":"IF(K$6,IF(SUMIF(Data!$I:$I,$A178,Data!T:T)=0,#N/A,SUMIF(Data!$I:$I,$A178,Data!T:T)),#N/A)","v":{"$error":"#N/A"}}]
[{"$error":"#N/A"},{"$f":"IF(B$6,IF(SUMIF(Data!$I:$I,$A179,Data!K:K)=0,#N/A,SUMIF(Data!$I:$I,$A179,Data!K:K)),#N/A)","v":{"$error":"#N/A"}},{"$f":"IF(C$6,IF(SUMIF(Data!$I:$I,$A179,Data!L:L)=0,#N/A,SUMIF(Data!$I:$I,$A179,Data!L:L)),#N/A)","v":{"$error":"#N/A"}},{"$f":"IF(D$6,IF(SUMIF(Data!$I:$I,$A179,Data!M:M)=0,#N/A,SUMIF(Data!$I:$I,$A179,Data!M:M)),#N/A)","v":{"$error":"#N/A"}},{"$f":"IF(E$6,IF(SUMIF(Data!$I:$I,$A179,Data!N:N)=0,#N/A,SUMIF(Data!$I:$I,$A179,Data!N:N)),#N/A)","v":{"$error":"#N/A"}},{"$f":"IF(F$6,IF(SUMIF(Data!$I:$I,$A179,Data!O:O)=0,#N/A,SUMIF(Data!$I:$I,$A179,Data!O:O)),#N/A)","v":{"$error":"#N/A"}},{"$f":"IF(G$6,IF(SUMIF(Data!$I:$I,$A179,Data!P:P)=0,#N/A,SUMIF(Data!$I:$I,$A179,Data!P:P)),#N/A)","v":{"$error":"#N/A"}},{"$f":"IF(H$6,IF(SUMIF(Data!$I:$I,$A179,Data!Q:Q)=0,#N/A,SUMIF(Data!$I:$I,$A179,Data!Q:Q)),#N/A)","v":{"$error":"#N/A"}},{"$f":"IF(I$6,IF(SUMIF(Data!$I:$I,$A179,Data!R:R)=0,#N/A,SUMIF(Data!$I:$I,$A179,Data!R:R)),#N/A)","v":{"$error":"#N/A"}},{"$f":"IF(J$6,IF(SUMIF(Data!$I:$I,$A179,Data!S:S)=0,#N/A,SUMIF(Data!$I:$I,$A179,Data!S:S)),#N/A)","v":{"$error":"#N/A"}},{"$f":"IF(K$6,IF(SUMIF(Data!$I:$I,$A179,Data!T:T)=0,#N/A,SUMIF(Data!$I:$I,$A179,Data!T:T)),#N/A)","v":{"$error":"#N/A"}}]
[{"$error":"#N/A"},{"$f":"IF(B$6,IF(SUMIF(Data!$I:$I,$A180,Data!K:K)=0,#N/A,SUMIF(Data!$I:$I,$A180,Data!K:K)),#N/A)","v":{"$error":"#N/A"}},{"$f":"IF(C$6,IF(SUMIF(Data!$I:$I,$A180,Data!L:L)=0,#N/A,SUMIF(Data!$I:$I,$A180,Data!L:L)),#N/A)","v":{"$error":"#N/A"}},{"$f":"IF(D$6,IF(SUMIF(Data!$I:$I,$A180,Data!M:M)=0,#N/A,SUMIF(Data!$I:$I,$A180,Data!M:M)),#N/A)","v":{"$error":"#N/A"}},{"$f":"IF(E$6,IF(SUMIF(Data!$I:$I,$A180,Data!N:N)=0,#N/A,SUMIF(Data!$I:$I,$A180,Data!N:N)),#N/A)","v":{"$error":"#N/A"}},{"$f":"IF(F$6,IF(SUMIF(Data!$I:$I,$A180,Data!O:O)=0,#N/A,SUMIF(Data!$I:$I,$A180,Data!O:O)),#N/A)","v":{"$error":"#N/A"}},{"$f":"IF(G$6,IF(SUMIF(Data!$I:$I,$A180,Data!P:P)=0,#N/A,SUMIF(Data!$I:$I,$A180,Data!P:P)),#N/A)","v":{"$error":"#N/A"}},{"$f":"IF(H$6,IF(SUMIF(Data!$I:$I,$A180,Data!Q:Q)=0,#N/A,SUMIF(Data!$I:$I,$A180,Data!Q:Q)),#N/A)","v":{"$error":"#N/A"}},{"$f":"IF(I$6,IF(SUMIF(Data!$I:$I,$A180,Data!R:R)=0,#N/A,SUMIF(Data!$I:$I,$A180,Data!R:R)),#N/A)","v":{"$error":"#N/A"}},{"$f":"IF(J$6,IF(SUMIF(Data!$I:$I,$A180,Data!S:S)=0,#N/A,SUMIF(Data!$I:$I,$A180,Data!S:S)),#N/A)","v":{"$error":"#N/A"}},{"$f":"IF(K$6,IF(SUMIF(Data!$I:$I,$A180,Data!T:T)=0,#N/A,SUMIF(Data!$I:$I,$A180,Data!T:T)),#N/A)","v":{"$error":"#N/A"}}]
[{"$error":"#N/A"},{"$f":"IF(B$6,IF(SUMIF(Data!$I:$I,$A181,Data!K:K)=0,#N/A,SUMIF(Data!$I:$I,$A181,Data!K:K)),#N/A)","v":{"$error":"#N/A"}},{"$f":"IF(C$6,IF(SUMIF(Data!$I:$I,$A181,Data!L:L)=0,#N/A,SUMIF(Data!$I:$I,$A181,Data!L:L)),#N/A)","v":{"$error":"#N/A"}},{"$f":"IF(D$6,IF(SUMIF(Data!$I:$I,$A181,Data!M:M)=0,#N/A,SUMIF(Data!$I:$I,$A181,Data!M:M)),#N/A)","v":{"$error":"#N/A"}},{"$f":"IF(E$6,IF(SUMIF(Data!$I:$I,$A181,Data!N:N)=0,#N/A,SUMIF(Data!$I:$I,$A181,Data!N:N)),#N/A)","v":{"$error":"#N/A"}},{"$f":"IF(F$6,IF(SUMIF(Data!$I:$I,$A181,Data!O:O)=0,#N/A,SUMIF(Data!$I:$I,$A181,Data!O:O)),#N/A)","v":{"$error":"#N/A"}},{"$f":"IF(G$6,IF(SUMIF(Data!$I:$I,$A181,Data!P:P)=0,#N/A,SUMIF(Data!$I:$I,$A181,Data!P:P)),#N/A)","v":{"$error":"#N/A"}},{"$f":"IF(H$6,IF(SUMIF(Data!$I:$I,$A181,Data!Q:Q)=0,#N/A,SUMIF(Data!$I:$I,$A181,Data!Q:Q)),#N/A)","v":{"$error":"#N/A"}},{"$f":"IF(I$6,IF(SUMIF(Data!$I:$I,$A181,Data!R:R)=0,#N/A,SUMIF(Data!$I:$I,$A181,Data!R:R)),#N/A)","v":{"$error":"#N/A"}},{"$f":"IF(J$6,IF(SUMIF(Data!$I:$I,$A181,Data!S:S)=0,#N/A,SUMIF(Data!$I:$I,$A181,Data!S:S)),#N/A)","v":{"$error":"#N/A"}},{"$f":"IF(K$6,IF(SUMIF(Data!$I:$I,$A181,Data!T:T)=0,#N/A,SUMIF(Data!$I:$I,$A181,Data!T:T)),#N/A)","v":{"$error":"#N/A"}}]
[{"$error":"#N/A"},{"$f":"IF(B$6,IF(SUMIF(Data!$I:$I,$A182,Data!K:K)=0,#N/A,SUMIF(Data!$I:$I,$A182,Data!K:K)),#N/A)","v":{"$error":"#N/A"}},{"$f":"IF(C$6,IF(SUMIF(Data!$I:$I,$A182,Data!L:L)=0,#N/A,SUMIF(Data!$I:$I,$A182,Data!L:L)),#N/A)","v":{"$error":"#N/A"}},{"$f":"IF(D$6,IF(SUMIF(Data!$I:$I,$A182,Data!M:M)=0,#N/A,SUMIF(Data!$I:$I,$A182,Data!M:M)),#N/A)","v":{"$error":"#N/A"}},{"$f":"IF(E$6,IF(SUMIF(Data!$I:$I,$A182,Data!N:N)=0,#N/A,SUMIF(Data!$I:$I,$A182,Data!N:N)),#N/A)","v":{"$error":"#N/A"}},{"$f":"IF(F$6,IF(SUMIF(Data!$I:$I,$A182,Data!O:O)=0,#N/A,SUMIF(Data!$I:$I,$A182,Data!O:O)),#N/A)","v":{"$error":"#N/A"}},{"$f":"IF(G$6,IF(SUMIF(Data!$I:$I,$A182,Data!P:P)=0,#N/A,SUMIF(Data!$I:$I,$A182,Data!P:P)),#N/A)","v":{"$error":"#N/A"}},{"$f":"IF(H$6,IF(SUMIF(Data!$I:$I,$A182,Data!Q:Q)=0,#N/A,SUMIF(Data!$I:$I,$A182,Data!Q:Q)),#N/A)","v":{"$error":"#N/A"}},{"$f":"IF(I$6,IF(SUMIF(Data!$I:$I,$A182,Data!R:R)=0,#N/A,SUMIF(Data!$I:$I,$A182,Data!R:R)),#N/A)","v":{"$error":"#N/A"}},{"$f":"IF(J$6,IF(SUMIF(Data!$I:$I,$A182,Data!S:S)=0,#N/A,SUMIF(Data!$I:$I,$A182,Data!S:S)),#N/A)","v":{"$error":"#N/A"}},{"$f":"IF(K$6,IF(SUMIF(Data!$I:$I,$A182,Data!T:T)=0,#N/A,SUMIF(Data!$I:$I,$A182,Data!T:T)),#N/A)","v":{"$error":"#N/A"}}]
[{"$error":"#N/A"},{"$f":"IF(B$6,IF(SUMIF(Data!$I:$I,$A183,Data!K:K)=0,#N/A,SUMIF(Data!$I:$I,$A183,Data!K:K)),#N/A)","v":{"$error":"#N/A"}},{"$f":"IF(C$6,IF(SUMIF(Data!$I:$I,$A183,Data!L:L)=0,#N/A,SUMIF(Data!$I:$I,$A183,Data!L:L)),#N/A)","v":{"$error":"#N/A"}},{"$f":"IF(D$6,IF(SUMIF(Data!$I:$I,$A183,Data!M:M)=0,#N/A,SUMIF(Data!$I:$I,$A183,Data!M:M)),#N/A)","v":{"$error":"#N/A"}},{"$f":"IF(E$6,IF(SUMIF(Data!$I:$I,$A183,Data!N:N)=0,#N/A,SUMIF(Data!$I:$I,$A183,Data!N:N)),#N/A)","v":{"$error":"#N/A"}},{"$f":"IF(F$6,IF(SUMIF(Data!$I:$I,$A183,Data!O:O)=0,#N/A,SUMIF(Data!$I:$I,$A183,Data!O:O)),#N/A)","v":{"$error":"#N/A"}},{"$f":"IF(G$6,IF(SUMIF(Data!$I:$I,$A183,Data!P:P)=0,#N/A,SUMIF(Data!$I:$I,$A183,Data!P:P)),#N/A)","v":{"$error":"#N/A"}},{"$f":"IF(H$6,IF(SUMIF(Data!$I:$I,$A183,Data!Q:Q)=0,#N/A,SUMIF(Data!$I:$I,$A183,Data!Q:Q)),#N/A)","v":{"$error":"#N/A"}},{"$f":"IF(I$6,IF(SUMIF(Data!$I:$I,$A183,Data!R:R)=0,#N/A,SUMIF(Data!$I:$I,$A183,Data!R:R)),#N/A)","v":{"$error":"#N/A"}},{"$f":"IF(J$6,IF(SUMIF(Data!$I:$I,$A183,Data!S:S)=0,#N/A,SUMIF(Data!$I:$I,$A183,Data!S:S)),#N/A)","v":{"$error":"#N/A"}},{"$f":"IF(K$6,IF(SUMIF(Data!$I:$I,$A183,Data!T:T)=0,#N/A,SUMIF(Data!$I:$I,$A183,Data!T:T)),#N/A)","v":{"$error":"#N/A"}}]
[{"$error":"#N/A"},{"$f":"IF(B$6,IF(SUMIF(Data!$I:$I,$A184,Data!K:K)=0,#N/A,SUMIF(Data!$I:$I,$A184,Data!K:K)),#N/A)","v":{"$error":"#N/A"}},{"$f":"IF(C$6,IF(SUMIF(Data!$I:$I,$A184,Data!L:L)=0,#N/A,SUMIF(Data!$I:$I,$A184,Data!L:L)),#N/A)","v":{"$error":"#N/A"}},{"$f":"IF(D$6,IF(SUMIF(Data!$I:$I,$A184,Data!M:M)=0,#N/A,SUMIF(Data!$I:$I,$A184,Data!M:M)),#N/A)","v":{"$error":"#N/A"}},{"$f":"IF(E$6,IF(SUMIF(Data!$I:$I,$A184,Data!N:N)=0,#N/A,SUMIF(Data!$I:$I,$A184,Data!N:N)),#N/A)","v":{"$error":"#N/A"}},{"$f":"IF(F$6,IF(SUMIF(Data!$I:$I,$A184,Data!O:O)=0,#N/A,SUMIF(Data!$I:$I,$A184,Data!O:O)),#N/A)","v":{"$error":"#N/A"}},{"$f":"IF(G$6,IF(SUMIF(Data!$I:$I,$A184,Data!P:P)=0,#N/A,SUMIF(Data!$I:$I,$A184,Data!P:P)),#N/A)","v":{"$error":"#N/A"}},{"$f":"IF(H$6,IF(SUMIF(Data!$I:$I,$A184,Data!Q:Q)=0,#N/A,SUMIF(Data!$I:$I,$A184,Data!Q:Q)),#N/A)","v":{"$error":"#N/A"}},{"$f":"IF(I$6,IF(SUMIF(Data!$I:$I,$A184,Data!R:R)=0,#N/A,SUMIF(Data!$I:$I,$A184,Data!R:R)),#N/A)","v":{"$error":"#N/A"}},{"$f":"IF(J$6,IF(SUMIF(Data!$I:$I,$A184,Data!S:S)=0,#N/A,SUMIF(Data!$I:$I,$A184,Data!S:S)),#N/A)","v":{"$error":"#N/A"}},{"$f":"IF(K$6,IF(SUMIF(Data!$I:$I,$A184,Data!T:T)=0,#N/A,SUMIF(Data!$I:$I,$A184,Data!T:T)),#N/A)","v":{"$error":"#N/A"}}]
[{"$error":"#N/A"},{"$f":"IF(B$6,IF(SUMIF(Data!$I:$I,$A185,Data!K:K)=0,#N/A,SUMIF(Data!$I:$I,$A185,Data!K:K)),#N/A)","v":{"$error":"#N/A"}},{"$f":"IF(C$6,IF(SUMIF(Data!$I:$I,$A185,Data!L:L)=0,#N/A,SUMIF(Data!$I:$I,$A185,Data!L:L)),#N/A)","v":{"$error":"#N/A"}},{"$f":"IF(D$6,IF(SUMIF(Data!$I:$I,$A185,Data!M:M)=0,#N/A,SUMIF(Data!$I:$I,$A185,Data!M:M)),#N/A)","v":{"$error":"#N/A"}},{"$f":"IF(E$6,IF(SUMIF(Data!$I:$I,$A185,Data!N:N)=0,#N/A,SUMIF(Data!$I:$I,$A185,Data!N:N)),#N/A)","v":{"$error":"#N/A"}},{"$f":"IF(F$6,IF(SUMIF(Data!$I:$I,$A185,Data!O:O)=0,#N/A,SUMIF(Data!$I:$I,$A185,Data!O:O)),#N/A)","v":{"$error":"#N/A"}},{"$f":"IF(G$6,IF(SUMIF(Data!$I:$I,$A185,Data!P:P)=0,#N/A,SUMIF(Data!$I:$I,$A185,Data!P:P)),#N/A)","v":{"$error":"#N/A"}},{"$f":"IF(H$6,IF(SUMIF(Data!$I:$I,$A185,Data!Q:Q)=0,#N/A,SUMIF(Data!$I:$I,$A185,Data!Q:Q)),#N/A)","v":{"$error":"#N/A"}},{"$f":"IF(I$6,IF(SUMIF(Data!$I:$I,$A185,Data!R:R)=0,#N/A,SUMIF(Data!$I:$I,$A185,Data!R:R)),#N/A)","v":{"$error":"#N/A"}},{"$f":"IF(J$6,IF(SUMIF(Data!$I:$I,$A185,Data!S:S)=0,#N/A,SUMIF(Data!$I:$I,$A185,Data!S:S)),#N/A)","v":{"$error":"#N/A"}},{"$f":"IF(K$6,IF(SUMIF(Data!$I:$I,$A185,Data!T:T)=0,#N/A,SUMIF(Data!$I:$I,$A185,Data!T:T)),#N/A)","v":{"$error":"#N/A"}}]
[{"$error":"#N/A"},{"$f":"IF(B$6,IF(SUMIF(Data!$I:$I,$A186,Data!K:K)=0,#N/A,SUMIF(Data!$I:$I,$A186,Data!K:K)),#N/A)","v":{"$error":"#N/A"}},{"$f":"IF(C$6,IF(SUMIF(Data!$I:$I,$A186,Data!L:L)=0,#N/A,SUMIF(Data!$I:$I,$A186,Data!L:L)),#N/A)","v":{"$error":"#N/A"}},{"$f":"IF(D$6,IF(SUMIF(Data!$I:$I,$A186,Data!M:M)=0,#N/A,SUMIF(Data!$I:$I,$A186,Data!M:M)),#N/A)","v":{"$error":"#N/A"}},{"$f":"IF(E$6,IF(SUMIF(Data!$I:$I,$A186,Data!N:N)=0,#N/A,SUMIF(Data!$I:$I,$A186,Data!N:N)),#N/A)","v":{"$error":"#N/A"}},{"$f":"IF(F$6,IF(SUMIF(Data!$I:$I,$A186,Data!O:O)=0,#N/A,SUMIF(Data!$I:$I,$A186,Data!O:O)),#N/A)","v":{"$error":"#N/A"}},{"$f":"IF(G$6,IF(SUMIF(Data!$I:$I,$A186,Data!P:P)=0,#N/A,SUMIF(Data!$I:$I,$A186,Data!P:P)),#N/A)","v":{"$error":"#N/A"}},{"$f":"IF(H$6,IF(SUMIF(Data!$I:$I,$A186,Data!Q:Q)=0,#N/A,SUMIF(Data!$I:$I,$A186,Data!Q:Q)),#N/A)","v":{"$error":"#N/A"}},{"$f":"IF(I$6,IF(SUMIF(Data!$I:$I,$A186,Data!R:R)=0,#N/A,SUMIF(Data!$I:$I,$A186,Data!R:R)),#N/A)","v":{"$error":"#N/A"}},{"$f":"IF(J$6,IF(SUMIF(Data!$I:$I,$A186,Data!S:S)=0,#N/A,SUMIF(Data!$I:$I,$A186,Data!S:S)),#N/A)","v":{"$error":"#N/A"}},{"$f":"IF(K$6,IF(SUMIF(Data!$I:$I,$A186,Data!T:T)=0,#N/A,SUMIF(Data!$I:$I,$A186,Data!T:T)),#N/A)","v":{"$error":"#N/A"}}]
[{"$error":"#N/A"},{"$f":"IF(B$6,IF(SUMIF(Data!$I:$I,$A187,Data!K:K)=0,#N/A,SUMIF(Data!$I:$I,$A187,Data!K:K)),#N/A)","v":{"$error":"#N/A"}},{"$f":"IF(C$6,IF(SUMIF(Data!$I:$I,$A187,Data!L:L)=0,#N/A,SUMIF(Data!$I:$I,$A187,Data!L:L)),#N/A)","v":{"$error":"#N/A"}},{"$f":"IF(D$6,IF(SUMIF(Data!$I:$I,$A187,Data!M:M)=0,#N/A,SUMIF(Data!$I:$I,$A187,Data!M:M)),#N/A)","v":{"$error":"#N/A"}},{"$f":"IF(E$6,IF(SUMIF(Data!$I:$I,$A187,Data!N:N)=0,#N/A,SUMIF(Data!$I:$I,$A187,Data!N:N)),#N/A)","v":{"$error":"#N/A"}},{"$f":"IF(F$6,IF(SUMIF(Data!$I:$I,$A187,Data!O:O)=0,#N/A,SUMIF(Data!$I:$I,$A187,Data!O:O)),#N/A)","v":{"$error":"#N/A"}},{"$f":"IF(G$6,IF(SUMIF(Data!$I:$I,$A187,Data!P:P)=0,#N/A,SUMIF(Data!$I:$I,$A187,Data!P:P)),#N/A)","v":{"$error":"#N/A"}},{"$f":"IF(H$6,IF(SUMIF(Data!$I:$I,$A187,Data!Q:Q)=0,#N/A,SUMIF(Data!$I:$I,$A187,Data!Q:Q)),#N/A)","v":{"$error":"#N/A"}},{"$f":"IF(I$6,IF(SUMIF(Data!$I:$I,$A187,Data!R:R)=0,#N/A,SUMIF(Data!$I:$I,$A187,Data!R:R)),#N/A)","v":{"$error":"#N/A"}},{"$f":"IF(J$6,IF(SUMIF(Data!$I:$I,$A187,Data!S:S)=0,#N/A,SUMIF(Data!$I:$I,$A187,Data!S:S)),#N/A)","v":{"$error":"#N/A"}},{"$f":"IF(K$6,IF(SUMIF(Data!$I:$I,$A187,Data!T:T)=0,#N/A,SUMIF(Data!$I:$I,$A187,Data!T:T)),#N/A)","v":{"$error":"#N/A"}}]
[{"$error":"#N/A"},{"$f":"IF(B$6,IF(SUMIF(Data!$I:$I,$A188,Data!K:K)=0,#N/A,SUMIF(Data!$I:$I,$A188,Data!K:K)),#N/A)","v":{"$error":"#N/A"}},{"$f":"IF(C$6,IF(SUMIF(Data!$I:$I,$A188,Data!L:L)=0,#N/A,SUMIF(Data!$I:$I,$A188,Data!L:L)),#N/A)","v":{"$error":"#N/A"}},{"$f":"IF(D$6,IF(SUMIF(Data!$I:$I,$A188,Data!M:M)=0,#N/A,SUMIF(Data!$I:$I,$A188,Data!M:M)),#N/A)","v":{"$error":"#N/A"}},{"$f":"IF(E$6,IF(SUMIF(Data!$I:$I,$A188,Data!N:N)=0,#N/A,SUMIF(Data!$I:$I,$A188,Data!N:N)),#N/A)","v":{"$error":"#N/A"}},{"$f":"IF(F$6,IF(SUMIF(Data!$I:$I,$A188,Data!O:O)=0,#N/A,SUMIF(Data!$I:$I,$A188,Data!O:O)),#N/A)","v":{"$error":"#N/A"}},{"$f":"IF(G$6,IF(SUMIF(Data!$I:$I,$A188,Data!P:P)=0,#N/A,SUMIF(Data!$I:$I,$A188,Data!P:P)),#N/A)","v":{"$error":"#N/A"}},{"$f":"IF(H$6,IF(SUMIF(Data!$I:$I,$A188,Data!Q:Q)=0,#N/A,SUMIF(Data!$I:$I,$A188,Data!Q:Q)),#N/A)","v":{"$error":"#N/A"}},{"$f":"IF(I$6,IF(SUMIF(Data!$I:$I,$A188,Data!R:R)=0,#N/A,SUMIF(Data!$I:$I,$A188,Data!R:R)),#N/A)","v":{"$error":"#N/A"}},{"$f":"IF(J$6,IF(SUMIF(Data!$I:$I,$A188,Data!S:S)=0,#N/A,SUMIF(Data!$I:$I,$A188,Data!S:S)),#N/A)","v":{"$error":"#N/A"}},{"$f":"IF(K$6,IF(SUMIF(Data!$I:$I,$A188,Data!T:T)=0,#N/A,SUMIF(Data!$I:$I,$A188,Data!T:T)),#N/A)","v":{"$error":"#N/A"}}]
[{"$error":"#N/A"},{"$f":"IF(B$6,IF(SUMIF(Data!$I:$I,$A189,Data!K:K)=0,#N/A,SUMIF(Data!$I:$I,$A189,Data!K:K)),#N/A)","v":{"$error":"#N/A"}},{"$f":"IF(C$6,IF(SUMIF(Data!$I:$I,$A189,Data!L:L)=0,#N/A,SUMIF(Data!$I:$I,$A189,Data!L:L)),#N/A)","v":{"$error":"#N/A"}},{"$f":"IF(D$6,IF(SUMIF(Data!$I:$I,$A189,Data!M:M)=0,#N/A,SUMIF(Data!$I:$I,$A189,Data!M:M)),#N/A)","v":{"$error":"#N/A"}},{"$f":"IF(E$6,IF(SUMIF(Data!$I:$I,$A189,Data!N:N)=0,#N/A,SUMIF(Data!$I:$I,$A189,Data!N:N)),#N/A)","v":{"$error":"#N/A"}},{"$f":"IF(F$6,IF(SUMIF(Data!$I:$I,$A189,Data!O:O)=0,#N/A,SUMIF(Data!$I:$I,$A189,Data!O:O)),#N/A)","v":{"$error":"#N/A"}},{"$f":"IF(G$6,IF(SUMIF(Data!$I:$I,$A189,Data!P:P)=0,#N/A,SUMIF(Data!$I:$I,$A189,Data!P:P)),#N/A)","v":{"$error":"#N/A"}},{"$f":"IF(H$6,IF(SUMIF(Data!$I:$I,$A189,Data!Q:Q)=0,#N/A,SUMIF(Data!$I:$I,$A189,Data!Q:Q)),#N/A)","v":{"$error":"#N/A"}},{"$f":"IF(I$6,IF(SUMIF(Data!$I:$I,$A189,Data!R:R)=0,#N/A,SUMIF(Data!$I:$I,$A189,Data!R:R)),#N/A)","v":{"$error":"#N/A"}},{"$f":"IF(J$6,IF(SUMIF(Data!$I:$I,$A189,Data!S:S)=0,#N/A,SUMIF(Data!$I:$I,$A189,Data!S:S)),#N/A)","v":{"$error":"#N/A"}},{"$f":"IF(K$6,IF(SUMIF(Data!$I:$I,$A189,Data!T:T)=0,#N/A,SUMIF(Data!$I:$I,$A189,Data!T:T)),#N/A)","v":{"$error":"#N/A"}}]
[{"$error":"#N/A"},{"$f":"IF(B$6,IF(SUMIF(Data!$I:$I,$A190,Data!K:K)=0,#N/A,SUMIF(Data!$I:$I,$A190,Data!K:K)),#N/A)","v":{"$error":"#N/A"}},{"$f":"IF(C$6,IF(SUMIF(Data!$I:$I,$A190,Data!L:L)=0,#N/A,SUMIF(Data!$I:$I,$A190,Data!L:L)),#N/A)","v":{"$error":"#N/A"}},{"$f":"IF(D$6,IF(SUMIF(Data!$I:$I,$A190,Data!M:M)=0,#N/A,SUMIF(Data!$I:$I,$A190,Data!M:M)),#N/A)","v":{"$error":"#N/A"}},{"$f":"IF(E$6,IF(SUMIF(Data!$I:$I,$A190,Data!N:N)=0,#N/A,SUMIF(Data!$I:$I,$A190,Data!N:N)),#N/A)","v":{"$error":"#N/A"}},{"$f":"IF(F$6,IF(SUMIF(Data!$I:$I,$A190,Data!O:O)=0,#N/A,SUMIF(Data!$I:$I,$A190,Data!O:O)),#N/A)","v":{"$error":"#N/A"}},{"$f":"IF(G$6,IF(SUMIF(Data!$I:$I,$A190,Data!P:P)=0,#N/A,SUMIF(Data!$I:$I,$A190,Data!P:P)),#N/A)","v":{"$error":"#N/A"}},{"$f":"IF(H$6,IF(SUMIF(Data!$I:$I,$A190,Data!Q:Q)=0,#N/A,SUMIF(Data!$I:$I,$A190,Data!Q:Q)),#N/A)","v":{"$error":"#N/A"}},{"$f":"IF(I$6,IF(SUMIF(Data!$I:$I,$A190,Data!R:R)=0,#N/A,SUMIF(Data!$I:$I,$A190,Data!R:R)),#N/A)","v":{"$error":"#N/A"}},{"$f":"IF(J$6,IF(SUMIF(Data!$I:$I,$A190,Data!S:S)=0,#N/A,SUMIF(Data!$I:$I,$A190,Data!S:S)),#N/A)","v":{"$error":"#N/A"}},{"$f":"IF(K$6,IF(SUMIF(Data!$I:$I,$A190,Data!T:T)=0,#N/A,SUMIF(Data!$I:$I,$A190,Data!T:T)),#N/A)","v":{"$error":"#N/A"}}]
[{"$error":"#N/A"},{"$f":"IF(B$6,IF(SUMIF(Data!$I:$I,$A191,Data!K:K)=0,#N/A,SUMIF(Data!$I:$I,$A191,Data!K:K)),#N/A)","v":{"$error":"#N/A"}},{"$f":"IF(C$6,IF(SUMIF(Data!$I:$I,$A191,Data!L:L)=0,#N/A,SUMIF(Data!$I:$I,$A191,Data!L:L)),#N/A)","v":{"$error":"#N/A"}},{"$f":"IF(D$6,IF(SUMIF(Data!$I:$I,$A191,Data!M:M)=0,#N/A,SUMIF(Data!$I:$I,$A191,Data!M:M)),#N/A)","v":{"$error":"#N/A"}},{"$f":"IF(E$6,IF(SUMIF(Data!$I:$I,$A191,Data!N:N)=0,#N/A,SUMIF(Data!$I:$I,$A191,Data!N:N)),#N/A)","v":{"$error":"#N/A"}},{"$f":"IF(F$6,IF(SUMIF(Data!$I:$I,$A191,Data!O:O)=0,#N/A,SUMIF(Data!$I:$I,$A191,Data!O:O)),#N/A)","v":{"$error":"#N/A"}},{"$f":"IF(G$6,IF(SUMIF(Data!$I:$I,$A191,Data!P:P)=0,#N/A,SUMIF(Data!$I:$I,$A191,Data!P:P)),#N/A)","v":{"$error":"#N/A"}},{"$f":"IF(H$6,IF(SUMIF(Data!$I:$I,$A191,Data!Q:Q)=0,#N/A,SUMIF(Data!$I:$I,$A191,Data!Q:Q)),#N/A)","v":{"$error":"#N/A"}},{"$f":"IF(I$6,IF(SUMIF(Data!$I:$I,$A191,Data!R:R)=0,#N/A,SUMIF(Data!$I:$I,$A191,Data!R:R)),#N/A)","v":{"$error":"#N/A"}},{"$f":"IF(J$6,IF(SUMIF(Data!$I:$I,$A191,Data!S:S)=0,#N/A,SUMIF(Data!$I:$I,$A191,Data!S:S)),#N/A)","v":{"$error":"#N/A"}},{"$f":"IF(K$6,IF(SUMIF(Data!$I:$I,$A191,Data!T:T)=0,#N/A,SUMIF(Data!$I:$I,$A191,Data!T:T)),#N/A)","v":{"$error":"#N/A"}}]
[{"$error":"#N/A"},{"$f":"IF(B$6,IF(SUMIF(Data!$I:$I,$A192,Data!K:K)=0,#N/A,SUMIF(Data!$I:$I,$A192,Data!K:K)),#N/A)","v":{"$error":"#N/A"}},{"$f":"IF(C$6,IF(SUMIF(Data!$I:$I,$A192,Data!L:L)=0,#N/A,SUMIF(Data!$I:$I,$A192,Data!L:L)),#N/A)","v":{"$error":"#N/A"}},{"$f":"IF(D$6,IF(SUMIF(Data!$I:$I,$A192,Data!M:M)=0,#N/A,SUMIF(Data!$I:$I,$A192,Data!M:M)),#N/A)","v":{"$error":"#N/A"}},{"$f":"IF(E$6,IF(SUMIF(Data!$I:$I,$A192,Data!N:N)=0,#N/A,SUMIF(Data!$I:$I,$A192,Data!N:N)),#N/A)","v":{"$error":"#N/A"}},{"$f":"IF(F$6,IF(SUMIF(Data!$I:$I,$A192,Data!O:O)=0,#N/A,SUMIF(Data!$I:$I,$A192,Data!O:O)),#N/A)","v":{"$error":"#N/A"}},{"$f":"IF(G$6,IF(SUMIF(Data!$I:$I,$A192,Data!P:P)=0,#N/A,SUMIF(Data!$I:$I,$A192,Data!P:P)),#N/A)","v":{"$error":"#N/A"}},{"$f":"IF(H$6,IF(SUMIF(Data!$I:$I,$A192,Data!Q:Q)=0,#N/A,SUMIF(Data!$I:$I,$A192,Data!Q:Q)),#N/A)","v":{"$error":"#N/A"}},{"$f":"IF(I$6,IF(SUMIF(Data!$I:$I,$A192,Data!R:R)=0,#N/A,SUMIF(Data!$I:$I,$A192,Data!R:R)),#N/A)","v":{"$error":"#N/A"}},{"$f":"IF(J$6,IF(SUMIF(Data!$I:$I,$A192,Data!S:S)=0,#N/A,SUMIF(Data!$I:$I,$A192,Data!S:S)),#N/A)","v":{"$error":"#N/A"}},{"$f":"IF(K$6,IF(SUMIF(Data!$I:$I,$A192,Data!T:T)=0,#N/A,SUMIF(Data!$I:$I,$A192,Data!T:T)),#N/A)","v":{"$error":"#N/A"}}]
[{"$error":"#N/A"},{"$f":"IF(B$6,IF(SUMIF(Data!$I:$I,$A193,Data!K:K)=0,#N/A,SUMIF(Data!$I:$I,$A193,Data!K:K)),#N/A)","v":{"$error":"#N/A"}},{"$f":"IF(C$6,IF(SUMIF(Data!$I:$I,$A193,Data!L:L)=0,#N/A,SUMIF(Data!$I:$I,$A193,Data!L:L)),#N/A)","v":{"$error":"#N/A"}},{"$f":"IF(D$6,IF(SUMIF(Data!$I:$I,$A193,Data!M:M)=0,#N/A,SUMIF(Data!$I:$I,$A193,Data!M:M)),#N/A)","v":{"$error":"#N/A"}},{"$f":"IF(E$6,IF(SUMIF(Data!$I:$I,$A193,Data!N:N)=0,#N/A,SUMIF(Data!$I:$I,$A193,Data!N:N)),#N/A)","v":{"$error":"#N/A"}},{"$f":"IF(F$6,IF(SUMIF(Data!$I:$I,$A193,Data!O:O)=0,#N/A,SUMIF(Data!$I:$I,$A193,Data!O:O)),#N/A)","v":{"$error":"#N/A"}},{"$f":"IF(G$6,IF(SUMIF(Data!$I:$I,$A193,Data!P:P)=0,#N/A,SUMIF(Data!$I:$I,$A193,Data!P:P)),#N/A)","v":{"$error":"#N/A"}},{"$f":"IF(H$6,IF(SUMIF(Data!$I:$I,$A193,Data!Q:Q)=0,#N/A,SUMIF(Data!$I:$I,$A193,Data!Q:Q)),#N/A)","v":{"$error":"#N/A"}},{"$f":"IF(I$6,IF(SUMIF(Data!$I:$I,$A193,Data!R:R)=0,#N/A,SUMIF(Data!$I:$I,$A193,Data!R:R)),#N/A)","v":{"$error":"#N/A"}},{"$f":"IF(J$6,IF(SUMIF(Data!$I:$I,$A193,Data!S:S)=0,#N/A,SUMIF(Data!$I:$I,$A193,Data!S:S)),#N/A)","v":{"$error":"#N/A"}},{"$f":"IF(K$6,IF(SUMIF(Data!$I:$I,$A193,Data!T:T)=0,#N/A,SUMIF(Data!$I:$I,$A193,Data!T:T)),#N/A)","v":{"$error":"#N/A"}}]
[{"$error":"#N/A"},{"$f":"IF(B$6,IF(SUMIF(Data!$I:$I,$A194,Data!K:K)=0,#N/A,SUMIF(Data!$I:$I,$A194,Data!K:K)),#N/A)","v":{"$error":"#N/A"}},{"$f":"IF(C$6,IF(SUMIF(Data!$I:$I,$A194,Data!L:L)=0,#N/A,SUMIF(Data!$I:$I,$A194,Data!L:L)),#N/A)","v":{"$error":"#N/A"}},{"$f":"IF(D$6,IF(SUMIF(Data!$I:$I,$A194,Data!M:M)=0,#N/A,SUMIF(Data!$I:$I,$A194,Data!M:M)),#N/A)","v":{"$error":"#N/A"}},{"$f":"IF(E$6,IF(SUMIF(Data!$I:$I,$A194,Data!N:N)=0,#N/A,SUMIF(Data!$I:$I,$A194,Data!N:N)),#N/A)","v":{"$error":"#N/A"}},{"$f":"IF(F$6,IF(SUMIF(Data!$I:$I,$A194,Data!O:O)=0,#N/A,SUMIF(Data!$I:$I,$A194,Data!O:O)),#N/A)","v":{"$error":"#N/A"}},{"$f":"IF(G$6,IF(SUMIF(Data!$I:$I,$A194,Data!P:P)=0,#N/A,SUMIF(Data!$I:$I,$A194,Data!P:P)),#N/A)","v":{"$error":"#N/A"}},{"$f":"IF(H$6,IF(SUMIF(Data!$I:$I,$A194,Data!Q:Q)=0,#N/A,SUMIF(Data!$I:$I,$A194,Data!Q:Q)),#N/A)","v":{"$error":"#N/A"}},{"$f":"IF(I$6,IF(SUMIF(Data!$I:$I,$A194,Data!R:R)=0,#N/A,SUMIF(Data!$I:$I,$A194,Data!R:R)),#N/A)","v":{"$error":"#N/A"}},{"$f":"IF(J$6,IF(SUMIF(Data!$I:$I,$A194,Data!S:S)=0,#N/A,SUMIF(Data!$I:$I,$A194,Data!S:S)),#N/A)","v":{"$error":"#N/A"}},{"$f":"IF(K$6,IF(SUMIF(Data!$I:$I,$A194,Data!T:T)=0,#N/A,SUMIF(Data!$I:$I,$A194,Data!T:T)),#N/A)","v":{"$error":"#N/A"}}]
[{"$error":"#N/A"},{"$f":"IF(B$6,IF(SUMIF(Data!$I:$I,$A195,Data!K:K)=0,#N/A,SUMIF(Data!$I:$I,$A195,Data!K:K)),#N/A)","v":{"$error":"#N/A"}},{"$f":"IF(C$6,IF(SUMIF(Data!$I:$I,$A195,Data!L:L)=0,#N/A,SUMIF(Data!$I:$I,$A195,Data!L:L)),#N/A)","v":{"$error":"#N/A"}},{"$f":"IF(D$6,IF(SUMIF(Data!$I:$I,$A195,Data!M:M)=0,#N/A,SUMIF(Data!$I:$I,$A195,Data!M:M)),#N/A)","v":{"$error":"#N/A"}},{"$f":"IF(E$6,IF(SUMIF(Data!$I:$I,$A195,Data!N:N)=0,#N/A,SUMIF(Data!$I:$I,$A195,Data!N:N)),#N/A)","v":{"$error":"#N/A"}},{"$f":"IF(F$6,IF(SUMIF(Data!$I:$I,$A195,Data!O:O)=0,#N/A,SUMIF(Data!$I:$I,$A195,Data!O:O)),#N/A)","v":{"$error":"#N/A"}},{"$f":"IF(G$6,IF(SUMIF(Data!$I:$I,$A195,Data!P:P)=0,#N/A,SUMIF(Data!$I:$I,$A195,Data!P:P)),#N/A)","v":{"$error":"#N/A"}},{"$f":"IF(H$6,IF(SUMIF(Data!$I:$I,$A195,Data!Q:Q)=0,#N/A,SUMIF(Data!$I:$I,$A195,Data!Q:Q)),#N/A)","v":{"$error":"#N/A"}},{"$f":"IF(I$6,IF(SUMIF(Data!$I:$I,$A195,Data!R:R)=0,#N/A,SUMIF(Data!$I:$I,$A195,Data!R:R)),#N/A)","v":{"$error":"#N/A"}},{"$f":"IF(J$6,IF(SUMIF(Data!$I:$I,$A195,Data!S:S)=0,#N/A,SUMIF(Data!$I:$I,$A195,Data!S:S)),#N/A)","v":{"$error":"#N/A"}},{"$f":"IF(K$6,IF(SUMIF(Data!$I:$I,$A195,Data!T:T)=0,#N/A,SUMIF(Data!$I:$I,$A195,Data!T:T)),#N/A)","v":{"$error":"#N/A"}}]
[{"$error":"#N/A"},{"$f":"IF(B$6,IF(SUMIF(Data!$I:$I,$A196,Data!K:K)=0,#N/A,SUMIF(Data!$I:$I,$A196,Data!K:K)),#N/A)","v":{"$error":"#N/A"}},{"$f":"IF(C$6,IF(SUMIF(Data!$I:$I,$A196,Data!L:L)=0,#N/A,SUMIF(Data!$I:$I,$A196,Data!L:L)),#N/A)","v":{"$error":"#N/A"}},{"$f":"IF(D$6,IF(SUMIF(Data!$I:$I,$A196,Data!M:M)=0,#N/A,SUMIF(Data!$I:$I,$A196,Data!M:M)),#N/A)","v":{"$error":"#N/A"}},{"$f":"IF(E$6,IF(SUMIF(Data!$I:$I,$A196,Data!N:N)=0,#N/A,SUMIF(Data!$I:$I,$A196,Data!N:N)),#N/A)","v":{"$error":"#N/A"}},{"$f":"IF(F$6,IF(SUMIF(Data!$I:$I,$A196,Data!O:O)=0,#N/A,SUMIF(Data!$I:$I,$A196,Data!O:O)),#N/A)","v":{"$error":"#N/A"}},{"$f":"IF(G$6,IF(SUMIF(Data!$I:$I,$A196,Data!P:P)=0,#N/A,SUMIF(Data!$I:$I,$A196,Data!P:P)),#N/A)","v":{"$error":"#N/A"}},{"$f":"IF(H$6,IF(SUMIF(Data!$I:$I,$A196,Data!Q:Q)=0,#N/A,SUMIF(Data!$I:$I,$A196,Data!Q:Q)),#N/A)","v":{"$error":"#N/A"}},{"$f":"IF(I$6,IF(SUMIF(Data!$I:$I,$A196,Data!R:R)=0,#N/A,SUMIF(Data!$I:$I,$A196,Data!R:R)),#N/A)","v":{"$error":"#N/A"}},{"$f":"IF(J$6,IF(SUMIF(Data!$I:$I,$A196,Data!S:S)=0,#N/A,SUMIF(Data!$I:$I,$A196,Data!S:S)),#N/A)","v":{"$error":"#N/A"}},{"$f":"IF(K$6,IF(SUMIF(Data!$I:$I,$A196,Data!T:T)=0,#N/A,SUMIF(Data!$I:$I,$A196,Data!T:T)),#N/A)","v":{"$error":"#N/A"}}]
[{"$error":"#N/A"},{"$f":"IF(B$6,IF(SUMIF(Data!$I:$I,$A197,Data!K:K)=0,#N/A,SUMIF(Data!$I:$I,$A197,Data!K:K)),#N/A)","v":{"$error":"#N/A"}},{"$f":"IF(C$6,IF(SUMIF(Data!$I:$I,$A197,Data!L:L)=0,#N/A,SUMIF(Data!$I:$I,$A197,Data!L:L)),#N/A)","v":{"$error":"#N/A"}},{"$f":"IF(D$6,IF(SUMIF(Data!$I:$I,$A197,Data!M:M)=0,#N/A,SUMIF(Data!$I:$I,$A197,Data!M:M)),#N/A)","v":{"$error":"#N/A"}},{"$f":"IF(E$6,IF(SUMIF(Data!$I:$I,$A197,Data!N:N)=0,#N/A,SUMIF(Data!$I:$I,$A197,Data!N:N)),#N/A)","v":{"$error":"#N/A"}},{"$f":"IF(F$6,IF(SUMIF(Data!$I:$I,$A197,Data!O:O)=0,#N/A,SUMIF(Data!$I:$I,$A197,Data!O:O)),#N/A)","v":{"$error":"#N/A"}},{"$f":"IF(G$6,IF(SUMIF(Data!$I:$I,$A197,Data!P:P)=0,#N/A,SUMIF(Data!$I:$I,$A197,Data!P:P)),#N/A)","v":{"$error":"#N/A"}},{"$f":"IF(H$6,IF(SUMIF(Data!$I:$I,$A197,Data!Q:Q)=0,#N/A,SUMIF(Data!$I:$I,$A197,Data!Q:Q)),#N/A)","v":{"$error":"#N/A"}},{"$f":"IF(I$6,IF(SUMIF(Data!$I:$I,$A197,Data!R:R)=0,#N/A,SUMIF(Data!$I:$I,$A197,Data!R:R)),#N/A)","v":{"$error":"#N/A"}},{"$f":"IF(J$6,IF(SUMIF(Data!$I:$I,$A197,Data!S:S)=0,#N/A,SUMIF(Data!$I:$I,$A197,Data!S:S)),#N/A)","v":{"$error":"#N/A"}},{"$f":"IF(K$6,IF(SUMIF(Data!$I:$I,$A197,Data!T:T)=0,#N/A,SUMIF(Data!$I:$I,$A197,Data!T:T)),#N/A)","v":{"$error":"#N/A"}}]
[{"$error":"#N/A"},{"$f":"IF(B$6,IF(SUMIF(Data!$I:$I,$A198,Data!K:K)=0,#N/A,SUMIF(Data!$I:$I,$A198,Data!K:K)),#N/A)","v":{"$error":"#N/A"}},{"$f":"IF(C$6,IF(SUMIF(Data!$I:$I,$A198,Data!L:L)=0,#N/A,SUMIF(Data!$I:$I,$A198,Data!L:L)),#N/A)","v":{"$error":"#N/A"}},{"$f":"IF(D$6,IF(SUMIF(Data!$I:$I,$A198,Data!M:M)=0,#N/A,SUMIF(Data!$I:$I,$A198,Data!M:M)),#N/A)","v":{"$error":"#N/A"}},{"$f":"IF(E$6,IF(SUMIF(Data!$I:$I,$A198,Data!N:N)=0,#N/A,SUMIF(Data!$I:$I,$A198,Data!N:N)),#N/A)","v":{"$error":"#N/A"}},{"$f":"IF(F$6,IF(SUMIF(Data!$I:$I,$A198,Data!O:O)=0,#N/A,SUMIF(Data!$I:$I,$A198,Data!O:O)),#N/A)","v":{"$error":"#N/A"}},{"$f":"IF(G$6,IF(SUMIF(Data!$I:$I,$A198,Data!P:P)=0,#N/A,SUMIF(Data!$I:$I,$A198,Data!P:P)),#N/A)","v":{"$error":"#N/A"}},{"$f":"IF(H$6,IF(SUMIF(Data!$I:$I,$A198,Data!Q:Q)=0,#N/A,SUMIF(Data!$I:$I,$A198,Data!Q:Q)),#N/A)","v":{"$error":"#N/A"}},{"$f":"IF(I$6,IF(SUMIF(Data!$I:$I,$A198,Data!R:R)=0,#N/A,SUMIF(Data!$I:$I,$A198,Data!R:R)),#N/A)","v":{"$error":"#N/A"}},{"$f":"IF(J$6,IF(SUMIF(Data!$I:$I,$A198,Data!S:S)=0,#N/A,SUMIF(Data!$I:$I,$A198,Data!S:S)),#N/A)","v":{"$error":"#N/A"}},{"$f":"IF(K$6,IF(SUMIF(Data!$I:$I,$A198,Data!T:T)=0,#N/A,SUMIF(Data!$I:$I,$A198,Data!T:T)),#N/A)","v":{"$error":"#N/A"}}]
[{"$error":"#N/A"},{"$f":"IF(B$6,IF(SUMIF(Data!$I:$I,$A199,Data!K:K)=0,#N/A,SUMIF(Data!$I:$I,$A199,Data!K:K)),#N/A)","v":{"$error":"#N/A"}},{"$f":"IF(C$6,IF(SUMIF(Data!$I:$I,$A199,Data!L:L)=0,#N/A,SUMIF(Data!$I:$I,$A199,Data!L:L)),#N/A)","v":{"$error":"#N/A"}},{"$f":"IF(D$6,IF(SUMIF(Data!$I:$I,$A199,Data!M:M)=0,#N/A,SUMIF(Data!$I:$I,$A199,Data!M:M)),#N/A)","v":{"$error":"#N/A"}},{"$f":"IF(E$6,IF(SUMIF(Data!$I:$I,$A199,Data!N:N)=0,#N/A,SUMIF(Data!$I:$I,$A199,Data!N:N)),#N/A)","v":{"$error":"#N/A"}},{"$f":"IF(F$6,IF(SUMIF(Data!$I:$I,$A199,Data!O:O)=0,#N/A,SUMIF(Data!$I:$I,$A199,Data!O:O)),#N/A)","v":{"$error":"#N/A"}},{"$f":"IF(G$6,IF(SUMIF(Data!$I:$I,$A199,Data!P:P)=0,#N/A,SUMIF(Data!$I:$I,$A199,Data!P:P)),#N/A)","v":{"$error":"#N/A"}},{"$f":"IF(H$6,IF(SUMIF(Data!$I:$I,$A199,Data!Q:Q)=0,#N/A,SUMIF(Data!$I:$I,$A199,Data!Q:Q)),#N/A)","v":{"$error":"#N/A"}},{"$f":"IF(I$6,IF(SUMIF(Data!$I:$I,$A199,Data!R:R)=0,#N/A,SUMIF(Data!$I:$I,$A199,Data!R:R)),#N/A)","v":{"$error":"#N/A"}},{"$f":"IF(J$6,IF(SUMIF(Data!$I:$I,$A199,Data!S:S)=0,#N/A,SUMIF(Data!$I:$I,$A199,Data!S:S)),#N/A)","v":{"$error":"#N/A"}},{"$f":"IF(K$6,IF(SUMIF(Data!$I:$I,$A199,Data!T:T)=0,#N/A,SUMIF(Data!$I:$I,$A199,Data!T:T)),#N/A)","v":{"$error":"#N/A"}}]
[{"$error":"#N/A"},{"$f":"IF(B$6,IF(SUMIF(Data!$I:$I,$A200,Data!K:K)=0,#N/A,SUMIF(Data!$I:$I,$A200,Data!K:K)),#N/A)","v":{"$error":"#N/A"}},{"$f":"IF(C$6,IF(SUMIF(Data!$I:$I,$A200,Data!L:L)=0,#N/A,SUMIF(Data!$I:$I,$A200,Data!L:L)),#N/A)","v":{"$error":"#N/A"}},{"$f":"IF(D$6,IF(SUMIF(Data!$I:$I,$A200,Data!M:M)=0,#N/A,SUMIF(Data!$I:$I,$A200,Data!M:M)),#N/A)","v":{"$error":"#N/A"}},{"$f":"IF(E$6,IF(SUMIF(Data!$I:$I,$A200,Data!N:N)=0,#N/A,SUMIF(Data!$I:$I,$A200,Data!N:N)),#N/A)","v":{"$error":"#N/A"}},{"$f":"IF(F$6,IF(SUMIF(Data!$I:$I,$A200,Data!O:O)=0,#N/A,SUMIF(Data!$I:$I,$A200,Data!O:O)),#N/A)","v":{"$error":"#N/A"}},{"$f":"IF(G$6,IF(SUMIF(Data!$I:$I,$A200,Data!P:P)=0,#N/A,SUMIF(Data!$I:$I,$A200,Data!P:P)),#N/A)","v":{"$error":"#N/A"}},{"$f":"IF(H$6,IF(SUMIF(Data!$I:$I,$A200,Data!Q:Q)=0,#N/A,SUMIF(Data!$I:$I,$A200,Data!Q:Q)),#N/A)","v":{"$error":"#N/A"}},{"$f":"IF(I$6,IF(SUMIF(Data!$I:$I,$A200,Data!R:R)=0,#N/A,SUMIF(Data!$I:$I,$A200,Data!R:R)),#N/A)","v":{"$error":"#N/A"}},{"$f":"IF(J$6,IF(SUMIF(Data!$I:$I,$A200,Data!S:S)=0,#N/A,SUMIF(Data!$I:$I,$A200,Data!S:S)),#N/A)","v":{"$error":"#N/A"}},{"$f":"IF(K$6,IF(SUMIF(Data!$I:$I,$A200,Data!T:T)=0,#N/A,SUMIF(Data!$I:$I,$A200,Data!T:T)),#N/A)","v":{"$error":"#N/A"}}]
[{"$error":"#N/A"},{"$f":"IF(B$6,IF(SUMIF(Data!$I:$I,$A201,Data!K:K)=0,#N/A,SUMIF(Data!$I:$I,$A201,Data!K:K)),#N/A)","v":{"$error":"#N/A"}},{"$f":"IF(C$6,IF(SUMIF(Data!$I:$I,$A201,Data!L:L)=0,#N/A,SUMIF(Data!$I:$I,$A201,Data!L:L)),#N/A)","v":{"$error":"#N/A"}},{"$f":"IF(D$6,IF(SUMIF(Data!$I:$I,$A201,Data!M:M)=0,#N/A,SUMIF(Data!$I:$I,$A201,Data!M:M)),#N/A)","v":{"$error":"#N/A"}},{"$f":"IF(E$6,IF(SUMIF(Data!$I:$I,$A201,Data!N:N)=0,#N/A,SUMIF(Data!$I:$I,$A201,Data!N:N)),#N/A)","v":{"$error":"#N/A"}},{"$f":"IF(F$6,IF(SUMIF(Data!$I:$I,$A201,Data!O:O)=0,#N/A,SUMIF(Data!$I:$I,$A201,Data!O:O)),#N/A)","v":{"$error":"#N/A"}},{"$f":"IF(G$6,IF(SUMIF(Data!$I:$I,$A201,Data!P:P)=0,#N/A,SUMIF(Data!$I:$I,$A201,Data!P:P)),#N/A)","v":{"$error":"#N/A"}},{"$f":"IF(H$6,IF(SUMIF(Data!$I:$I,$A201,Data!Q:Q)=0,#N/A,SUMIF(Data!$I:$I,$A201,Data!Q:Q)),#N/A)","v":{"$error":"#N/A"}},{"$f":"IF(I$6,IF(SUMIF(Data!$I:$I,$A201,Data!R:R)=0,#N/A,SUMIF(Data!$I:$I,$A201,Data!R:R)),#N/A)","v":{"$error":"#N/A"}},{"$f":"IF(J$6,IF(SUMIF(Data!$I:$I,$A201,Data!S:S)=0,#N/A,SUMIF(Data!$I:$I,$A201,Data!S:S)),#N/A)","v":{"$error":"#N/A"}},{"$f":"IF(K$6,IF(SUMIF(Data!$I:$I,$A201,Data!T:T)=0,#N/A,SUMIF(Data!$I:$I,$A201,Data!T:T)),#N/A)","v":{"$error":"#N/A"}}]
[{"$error":"#N/A"},{"$f":"IF(B$6,IF(SUMIF(Data!$I:$I,$A202,Data!K:K)=0,#N/A,SUMIF(Data!$I:$I,$A202,Data!K:K)),#N/A)","v":{"$error":"#N/A"}},{"$f":"IF(C$6,IF(SUMIF(Data!$I:$I,$A202,Data!L:L)=0,#N/A,SUMIF(Data!$I:$I,$A202,Data!L:L)),#N/A)","v":{"$error":"#N/A"}},{"$f":"IF(D$6,IF(SUMIF(Data!$I:$I,$A202,Data!M:M)=0,#N/A,SUMIF(Data!$I:$I,$A202,Data!M:M)),#N/A)","v":{"$error":"#N/A"}},{"$f":"IF(E$6,IF(SUMIF(Data!$I:$I,$A202,Data!N:N)=0,#N/A,SUMIF(Data!$I:$I,$A202,Data!N:N)),#N/A)","v":{"$error":"#N/A"}},{"$f":"IF(F$6,IF(SUMIF(Data!$I:$I,$A202,Data!O:O)=0,#N/A,SUMIF(Data!$I:$I,$A202,Data!O:O)),#N/A)","v":{"$error":"#N/A"}},{"$f":"IF(G$6,IF(SUMIF(Data!$I:$I,$A202,Data!P:P)=0,#N/A,SUMIF(Data!$I:$I,$A202,Data!P:P)),#N/A)","v":{"$error":"#N/A"}},{"$f":"IF(H$6,IF(SUMIF(Data!$I:$I,$A202,Data!Q:Q)=0,#N/A,SUMIF(Data!$I:$I,$A202,Data!Q:Q)),#N/A)","v":{"$error":"#N/A"}},{"$f":"IF(I$6,IF(SUMIF(Data!$I:$I,$A202,Data!R:R)=0,#N/A,SUMIF(Data!$I:$I,$A202,Data!R:R)),#N/A)","v":{"$error":"#N/A"}},{"$f":"IF(J$6,IF(SUMIF(Data!$I:$I,$A202,Data!S:S)=0,#N/A,SUMIF(Data!$I:$I,$A202,Data!S:S)),#N/A)","v":{"$error":"#N/A"}},{"$f":"IF(K$6,IF(SUMIF(Data!$I:$I,$A202,Data!T:T)=0,#N/A,SUMIF(Data!$I:$I,$A202,Data!T:T)),#N/A)","v":{"$error":"#N/A"}}]
[{"$f":"IF(A202+1<$B$3,A202+1,#N/A)","v":{"$error":"#N/A"}},{"$f":"IF(B$6,IF(SUMIF(Data!$I:$I,$A203,Data!K:K)=0,#N/A,SUMIF(Data!$I:$I,$A203,Data!K:K)),#N/A)","v":{"$error":"#N/A"}},{"$f":"IF(C$6,IF(SUMIF(Data!$I:$I,$A203,Data!L:L)=0,#N/A,SUMIF(Data!$I:$I,$A203,Data!L:L)),#N/A)","v":{"$error":"#N/A"}},{"$f":"IF(D$6,IF(SUMIF(Data!$I:$I,$A203,Data!M:M)=0,#N/A,SUMIF(Data!$I:$I,$A203,Data!M:M)),#N/A)","v":{"$error":"#N/A"}},{"$f":"IF(E$6,IF(SUMIF(Data!$I:$I,$A203,Data!N:N)=0,#N/A,SUMIF(Data!$I:$I,$A203,Data!N:N)),#N/A)","v":{"$error":"#N/A"}},{"$f":"IF(F$6,IF(SUMIF(Data!$I:$I,$A203,Data!O:O)=0,#N/A,SUMIF(Data!$I:$I,$A203,Data!O:O)),#N/A)","v":{"$error":"#N/A"}},{"$f":"IF(G$6,IF(SUMIF(Data!$I:$I,$A203,Data!P:P)=0,#N/A,SUMIF(Data!$I:$I,$A203,Data!P:P)),#N/A)","v":{"$error":"#N/A"}},{"$f":"IF(H$6,IF(SUMIF(Data!$I:$I,$A203,Data!Q:Q)=0,#N/A,SUMIF(Data!$I:$I,$A203,Data!Q:Q)),#N/A)","v":{"$error":"#N/A"}},{"$f":"IF(I$6,IF(SUMIF(Data!$I:$I,$A203,Data!R:R)=0,#N/A,SUMIF(Data!$I:$I,$A203,Data!R:R)),#N/A)","v":{"$error":"#N/A"}},{"$f":"IF(J$6,IF(SUMIF(Data!$I:$I,$A203,Data!S:S)=0,#N/A,SUMIF(Data!$I:$I,$A203,Data!S:S)),#N/A)","v":{"$error":"#N/A"}},{"$f":"IF(K$6,IF(SUMIF(Data!$I:$I,$A203,Data!T:T)=0,#N/A,SUMIF(Data!$I:$I,$A203,Data!T:T)),#N/A)","v":{"$error":"#N/A"}}]
[{"$error":"#N/A"},{"$f":"IF(B$6,IF(SUMIF(Data!$I:$I,$A204,Data!K:K)=0,#N/A,SUMIF(Data!$I:$I,$A204,Data!K:K)),#N/A)","v":{"$error":"#N/A"}},{"$f":"IF(C$6,IF(SUMIF(Data!$I:$I,$A204,Data!L:L)=0,#N/A,SUMIF(Data!$I:$I,$A204,Data!L:L)),#N/A)","v":{"$error":"#N/A"}},{"$f":"IF(D$6,IF(SUMIF(Data!$I:$I,$A204,Data!M:M)=0,#N/A,SUMIF(Data!$I:$I,$A204,Data!M:M)),#N/A)","v":{"$error":"#N/A"}},{"$f":"IF(E$6,IF(SUMIF(Data!$I:$I,$A204,Data!N:N)=0,#N/A,SUMIF(Data!$I:$I,$A204,Data!N:N)),#N/A)","v":{"$error":"#N/A"}},{"$f":"IF(F$6,IF(SUMIF(Data!$I:$I,$A204,Data!O:O)=0,#N/A,SUMIF(Data!$I:$I,$A204,Data!O:O)),#N/A)","v":{"$error":"#N/A"}},{"$f":"IF(G$6,IF(SUMIF(Data!$I:$I,$A204,Data!P:P)=0,#N/A,SUMIF(Data!$I:$I,$A204,Data!P:P)),#N/A)","v":{"$error":"#N/A"}},{"$f":"IF(H$6,IF(SUMIF(Data!$I:$I,$A204,Data!Q:Q)=0,#N/A,SUMIF(Data!$I:$I,$A204,Data!Q:Q)),#N/A)","v":{"$error":"#N/A"}},{"$f":"IF(I$6,IF(SUMIF(Data!$I:$I,$A204,Data!R:R)=0,#N/A,SUMIF(Data!$I:$I,$A204,Data!R:R)),#N/A)","v":{"$error":"#N/A"}},{"$f":"IF(J$6,IF(SUMIF(Data!$I:$I,$A204,Data!S:S)=0,#N/A,SUMIF(Data!$I:$I,$A204,Data!S:S)),#N/A)","v":{"$error":"#N/A"}},{"$f":"IF(K$6,IF(SUMIF(Data!$I:$I,$A204,Data!T:T)=0,#N/A,SUMIF(Data!$I:$I,$A204,Data!T:T)),#N/A)","v":{"$error":"#N/A"}}]
[{"$error":"#N/A"},{"$f":"IF(B$6,IF(SUMIF(Data!$I:$I,$A205,Data!K:K)=0,#N/A,SUMIF(Data!$I:$I,$A205,Data!K:K)),#N/A)","v":{"$error":"#N/A"}},{"$f":"IF(C$6,IF(SUMIF(Data!$I:$I,$A205,Data!L:L)=0,#N/A,SUMIF(Data!$I:$I,$A205,Data!L:L)),#N/A)","v":{"$error":"#N/A"}},{"$f":"IF(D$6,IF(SUMIF(Data!$I:$I,$A205,Data!M:M)=0,#N/A,SUMIF(Data!$I:$I,$A205,Data!M:M)),#N/A)","v":{"$error":"#N/A"}},{"$f":"IF(E$6,IF(SUMIF(Data!$I:$I,$A205,Data!N:N)=0,#N/A,SUMIF(Data!$I:$I,$A205,Data!N:N)),#N/A)","v":{"$error":"#N/A"}},{"$f":"IF(F$6,IF(SUMIF(Data!$I:$I,$A205,Data!O:O)=0,#N/A,SUMIF(Data!$I:$I,$A205,Data!O:O)),#N/A)","v":{"$error":"#N/A"}},{"$f":"IF(G$6,IF(SUMIF(Data!$I:$I,$A205,Data!P:P)=0,#N/A,SUMIF(Data!$I:$I,$A205,Data!P:P)),#N/A)","v":{"$error":"#N/A"}},{"$f":"IF(H$6,IF(SUMIF(Data!$I:$I,$A205,Data!Q:Q)=0,#N/A,SUMIF(Data!$I:$I,$A205,Data!Q:Q)),#N/A)","v":{"$error":"#N/A"}},{"$f":"IF(I$6,IF(SUMIF(Data!$I:$I,$A205,Data!R:R)=0,#N/A,SUMIF(Data!$I:$I,$A205,Data!R:R)),#N/A)","v":{"$error":"#N/A"}},{"$f":"IF(J$6,IF(SUMIF(Data!$I:$I,$A205,Data!S:S)=0,#N/A,SUMIF(Data!$I:$I,$A205,Data!S:S)),#N/A)","v":{"$error":"#N/A"}},{"$f":"IF(K$6,IF(SUMIF(Data!$I:$I,$A205,Data!T:T)=0,#N/A,SUMIF(Data!$I:$I,$A205,Data!T:T)),#N/A)","v":{"$error":"#N/A"}}]
[{"$error":"#N/A"},{"$f":"IF(B$6,IF(SUMIF(Data!$I:$I,$A206,Data!K:K)=0,#N/A,SUMIF(Data!$I:$I,$A206,Data!K:K)),#N/A)","v":{"$error":"#N/A"}},{"$f":"IF(C$6,IF(SUMIF(Data!$I:$I,$A206,Data!L:L)=0,#N/A,SUMIF(Data!$I:$I,$A206,Data!L:L)),#N/A)","v":{"$error":"#N/A"}},{"$f":"IF(D$6,IF(SUMIF(Data!$I:$I,$A206,Data!M:M)=0,#N/A,SUMIF(Data!$I:$I,$A206,Data!M:M)),#N/A)","v":{"$error":"#N/A"}},{"$f":"IF(E$6,IF(SUMIF(Data!$I:$I,$A206,Data!N:N)=0,#N/A,SUMIF(Data!$I:$I,$A206,Data!N:N)),#N/A)","v":{"$error":"#N/A"}},{"$f":"IF(F$6,IF(SUMIF(Data!$I:$I,$A206,Data!O:O)=0,#N/A,SUMIF(Data!$I:$I,$A206,Data!O:O)),#N/A)","v":{"$error":"#N/A"}},{"$f":"IF(G$6,IF(SUMIF(Data!$I:$I,$A206,Data!P:P)=0,#N/A,SUMIF(Data!$I:$I,$A206,Data!P:P)),#N/A)","v":{"$error":"#N/A"}},{"$f":"IF(H$6,IF(SUMIF(Data!$I:$I,$A206,Data!Q:Q)=0,#N/A,SUMIF(Data!$I:$I,$A206,Data!Q:Q)),#N/A)","v":{"$error":"#N/A"}},{"$f":"IF(I$6,IF(SUMIF(Data!$I:$I,$A206,Data!R:R)=0,#N/A,SUMIF(Data!$I:$I,$A206,Data!R:R)),#N/A)","v":{"$error":"#N/A"}},{"$f":"IF(J$6,IF(SUMIF(Data!$I:$I,$A206,Data!S:S)=0,#N/A,SUMIF(Data!$I:$I,$A206,Data!S:S)),#N/A)","v":{"$error":"#N/A"}},{"$f":"IF(K$6,IF(SUMIF(Data!$I:$I,$A206,Data!T:T)=0,#N/A,SUMIF(Data!$I:$I,$A206,Data!T:T)),#N/A)","v":{"$error":"#N/A"}}]
[{"$error":"#N/A"},{"$f":"IF(B$6,IF(SUMIF(Data!$I:$I,$A207,Data!K:K)=0,#N/A,SUMIF(Data!$I:$I,$A207,Data!K:K)),#N/A)","v":{"$error":"#N/A"}},{"$f":"IF(C$6,IF(SUMIF(Data!$I:$I,$A207,Data!L:L)=0,#N/A,SUMIF(Data!$I:$I,$A207,Data!L:L)),#N/A)","v":{"$error":"#N/A"}},{"$f":"IF(D$6,IF(SUMIF(Data!$I:$I,$A207,Data!M:M)=0,#N/A,SUMIF(Data!$I:$I,$A207,Data!M:M)),#N/A)","v":{"$error":"#N/A"}},{"$f":"IF(E$6,IF(SUMIF(Data!$I:$I,$A207,Data!N:N)=0,#N/A,SUMIF(Data!$I:$I,$A207,Data!N:N)),#N/A)","v":{"$error":"#N/A"}},{"$f":"IF(F$6,IF(SUMIF(Data!$I:$I,$A207,Data!O:O)=0,#N/A,SUMIF(Data!$I:$I,$A207,Data!O:O)),#N/A)","v":{"$error":"#N/A"}},{"$f":"IF(G$6,IF(SUMIF(Data!$I:$I,$A207,Data!P:P)=0,#N/A,SUMIF(Data!$I:$I,$A207,Data!P:P)),#N/A)","v":{"$error":"#N/A"}},{"$f":"IF(H$6,IF(SUMIF(Data!$I:$I,$A207,Data!Q:Q)=0,#N/A,SUMIF(Data!$I:$I,$A207,Data!Q:Q)),#N/A)","v":{"$error":"#N/A"}},{"$f":"IF(I$6,IF(SUMIF(Data!$I:$I,$A207,Data!R:R)=0,#N/A,SUMIF(Data!$I:$I,$A207,Data!R:R)),#N/A)","v":{"$error":"#N/A"}},{"$f":"IF(J$6,IF(SUMIF(Data!$I:$I,$A207,Data!S:S)=0,#N/A,SUMIF(Data!$I:$I,$A207,Data!S:S)),#N/A)","v":{"$error":"#N/A"}},{"$f":"IF(K$6,IF(SUMIF(Data!$I:$I,$A207,Data!T:T)=0,#N/A,SUMIF(Data!$I:$I,$A207,Data!T:T)),#N/A)","v":{"$error":"#N/A"}}]
[{"$error":"#N/A"},{"$f":"IF(B$6,IF(SUMIF(Data!$I:$I,$A208,Data!K:K)=0,#N/A,SUMIF(Data!$I:$I,$A208,Data!K:K)),#N/A)","v":{"$error":"#N/A"}},{"$f":"IF(C$6,IF(SUMIF(Data!$I:$I,$A208,Data!L:L)=0,#N/A,SUMIF(Data!$I:$I,$A208,Data!L:L)),#N/A)","v":{"$error":"#N/A"}},{"$f":"IF(D$6,IF(SUMIF(Data!$I:$I,$A208,Data!M:M)=0,#N/A,SUMIF(Data!$I:$I,$A208,Data!M:M)),#N/A)","v":{"$error":"#N/A"}},{"$f":"IF(E$6,IF(SUMIF(Data!$I:$I,$A208,Data!N:N)=0,#N/A,SUMIF(Data!$I:$I,$A208,Data!N:N)),#N/A)","v":{"$error":"#N/A"}},{"$f":"IF(F$6,IF(SUMIF(Data!$I:$I,$A208,Data!O:O)=0,#N/A,SUMIF(Data!$I:$I,$A208,Data!O:O)),#N/A)","v":{"$error":"#N/A"}},{"$f":"IF(G$6,IF(SUMIF(Data!$I:$I,$A208,Data!P:P)=0,#N/A,SUMIF(Data!$I:$I,$A208,Data!P:P)),#N/A)","v":{"$error":"#N/A"}},{"$f":"IF(H$6,IF(SUMIF(Data!$I:$I,$A208,Data!Q:Q)=0,#N/A,SUMIF(Data!$I:$I,$A208,Data!Q:Q)),#N/A)","v":{"$error":"#N/A"}},{"$f":"IF(I$6,IF(SUMIF(Data!$I:$I,$A208,Data!R:R)=0,#N/A,SUMIF(Data!$I:$I,$A208,Data!R:R)),#N/A)","v":{"$error":"#N/A"}},{"$f":"IF(J$6,IF(SUMIF(Data!$I:$I,$A208,Data!S:S)=0,#N/A,SUMIF(Data!$I:$I,$A208,Data!S:S)),#N/A)","v":{"$error":"#N/A"}},{"$f":"IF(K$6,IF(SUMIF(Data!$I:$I,$A208,Data!T:T)=0,#N/A,SUMIF(Data!$I:$I,$A208,Data!T:T)),#N/A)","v":{"$error":"#N/A"}}]
[{"$error":"#N/A"},{"$f":"IF(B$6,IF(SUMIF(Data!$I:$I,$A209,Data!K:K)=0,#N/A,SUMIF(Data!$I:$I,$A209,Data!K:K)),#N/A)","v":{"$error":"#N/A"}},{"$f":"IF(C$6,IF(SUMIF(Data!$I:$I,$A209,Data!L:L)=0,#N/A,SUMIF(Data!$I:$I,$A209,Data!L:L)),#N/A)","v":{"$error":"#N/A"}},{"$f":"IF(D$6,IF(SUMIF(Data!$I:$I,$A209,Data!M:M)=0,#N/A,SUMIF(Data!$I:$I,$A209,Data!M:M)),#N/A)","v":{"$error":"#N/A"}},{"$f":"IF(E$6,IF(SUMIF(Data!$I:$I,$A209,Data!N:N)=0,#N/A,SUMIF(Data!$I:$I,$A209,Data!N:N)),#N/A)","v":{"$error":"#N/A"}},{"$f":"IF(F$6,IF(SUMIF(Data!$I:$I,$A209,Data!O:O)=0,#N/A,SUMIF(Data!$I:$I,$A209,Data!O:O)),#N/A)","v":{"$error":"#N/A"}},{"$f":"IF(G$6,IF(SUMIF(Data!$I:$I,$A209,Data!P:P)=0,#N/A,SUMIF(Data!$I:$I,$A209,Data!P:P)),#N/A)","v":{"$error":"#N/A"}},{"$f":"IF(H$6,IF(SUMIF(Data!$I:$I,$A209,Data!Q:Q)=0,#N/A,SUMIF(Data!$I:$I,$A209,Data!Q:Q)),#N/A)","v":{"$error":"#N/A"}},{"$f":"IF(I$6,IF(SUMIF(Data!$I:$I,$A209,Data!R:R)=0,#N/A,SUMIF(Data!$I:$I,$A209,Data!R:R)),#N/A)","v":{"$error":"#N/A"}},{"$f":"IF(J$6,IF(SUMIF(Data!$I:$I,$A209,Data!S:S)=0,#N/A,SUMIF(Data!$I:$I,$A209,Data!S:S)),#N/A)","v":{"$error":"#N/A"}},{"$f":"IF(K$6,IF(SUMIF(Data!$I:$I,$A209,Data!T:T)=0,#N/A,SUMIF(Data!$I:$I,$A209,Data!T:T)),#N/A)","v":{"$error":"#N/A"}}]
[{"$error":"#N/A"},{"$f":"IF(B$6,IF(SUMIF(Data!$I:$I,$A210,Data!K:K)=0,#N/A,SUMIF(Data!$I:$I,$A210,Data!K:K)),#N/A)","v":{"$error":"#N/A"}},{"$f":"IF(C$6,IF(SUMIF(Data!$I:$I,$A210,Data!L:L)=0,#N/A,SUMIF(Data!$I:$I,$A210,Data!L:L)),#N/A)","v":{"$error":"#N/A"}},{"$f":"IF(D$6,IF(SUMIF(Data!$I:$I,$A210,Data!M:M)=0,#N/A,SUMIF(Data!$I:$I,$A210,Data!M:M)),#N/A)","v":{"$error":"#N/A"}},{"$f":"IF(E$6,IF(SUMIF(Data!$I:$I,$A210,Data!N:N)=0,#N/A,SUMIF(Data!$I:$I,$A210,Data!N:N)),#N/A)","v":{"$error":"#N/A"}},{"$f":"IF(F$6,IF(SUMIF(Data!$I:$I,$A210,Data!O:O)=0,#N/A,SUMIF(Data!$I:$I,$A210,Data!O:O)),#N/A)","v":{"$error":"#N/A"}},{"$f":"IF(G$6,IF(SUMIF(Data!$I:$I,$A210,Data!P:P)=0,#N/A,SUMIF(Data!$I:$I,$A210,Data!P:P)),#N/A)","v":{"$error":"#N/A"}},{"$f":"IF(H$6,IF(SUMIF(Data!$I:$I,$A210,Data!Q:Q)=0,#N/A,SUMIF(Data!$I:$I,$A210,Data!Q:Q)),#N/A)","v":{"$error":"#N/A"}},{"$f":"IF(I$6,IF(SUMIF(Data!$I:$I,$A210,Data!R:R)=0,#N/A,SUMIF(Data!$I:$I,$A210,Data!R:R)),#N/A)","v":{"$error":"#N/A"}},{"$f":"IF(J$6,IF(SUMIF(Data!$I:$I,$A210,Data!S:S)=0,#N/A,SUMIF(Data!$I:$I,$A210,Data!S:S)),#N/A)","v":{"$error":"#N/A"}},{"$f":"IF(K$6,IF(SUMIF(Data!$I:$I,$A210,Data!T:T)=0,#N/A,SUMIF(Data!$I:$I,$A210,Data!T:T)),#N/A)","v":{"$error":"#N/A"}}]
[{"$error":"#N/A"},{"$f":"IF(B$6,IF(SUMIF(Data!$I:$I,$A211,Data!K:K)=0,#N/A,SUMIF(Data!$I:$I,$A211,Data!K:K)),#N/A)","v":{"$error":"#N/A"}},{"$f":"IF(C$6,IF(SUMIF(Data!$I:$I,$A211,Data!L:L)=0,#N/A,SUMIF(Data!$I:$I,$A211,Data!L:L)),#N/A)","v":{"$error":"#N/A"}},{"$f":"IF(D$6,IF(SUMIF(Data!$I:$I,$A211,Data!M:M)=0,#N/A,SUMIF(Data!$I:$I,$A211,Data!M:M)),#N/A)","v":{"$error":"#N/A"}},{"$f":"IF(E$6,IF(SUMIF(Data!$I:$I,$A211,Data!N:N)=0,#N/A,SUMIF(Data!$I:$I,$A211,Data!N:N)),#N/A)","v":{"$error":"#N/A"}},{"$f":"IF(F$6,IF(SUMIF(Data!$I:$I,$A211,Data!O:O)=0,#N/A,SUMIF(Data!$I:$I,$A211,Data!O:O)),#N/A)","v":{"$error":"#N/A"}},{"$f":"IF(G$6,IF(SUMIF(Data!$I:$I,$A211,Data!P:P)=0,#N/A,SUMIF(Data!$I:$I,$A211,Data!P:P)),#N/A)","v":{"$error":"#N/A"}},{"$f":"IF(H$6,IF(SUMIF(Data!$I:$I,$A211,Data!Q:Q)=0,#N/A,SUMIF(Data!$I:$I,$A211,Data!Q:Q)),#N/A)","v":{"$error":"#N/A"}},{"$f":"IF(I$6,IF(SUMIF(Data!$I:$I,$A211,Data!R:R)=0,#N/A,SUMIF(Data!$I:$I,$A211,Data!R:R)),#N/A)","v":{"$error":"#N/A"}},{"$f":"IF(J$6,IF(SUMIF(Data!$I:$I,$A211,Data!S:S)=0,#N/A,SUMIF(Data!$I:$I,$A211,Data!S:S)),#N/A)","v":{"$error":"#N/A"}},{"$f":"IF(K$6,IF(SUMIF(Data!$I:$I,$A211,Data!T:T)=0,#N/A,SUMIF(Data!$I:$I,$A211,Data!T:T)),#N/A)","v":{"$error":"#N/A"}}]
[{"$error":"#N/A"},{"$f":"IF(B$6,IF(SUMIF(Data!$I:$I,$A212,Data!K:K)=0,#N/A,SUMIF(Data!$I:$I,$A212,Data!K:K)),#N/A)","v":{"$error":"#N/A"}},{"$f":"IF(C$6,IF(SUMIF(Data!$I:$I,$A212,Data!L:L)=0,#N/A,SUMIF(Data!$I:$I,$A212,Data!L:L)),#N/A)","v":{"$error":"#N/A"}},{"$f":"IF(D$6,IF(SUMIF(Data!$I:$I,$A212,Data!M:M)=0,#N/A,SUMIF(Data!$I:$I,$A212,Data!M:M)),#N/A)","v":{"$error":"#N/A"}},{"$f":"IF(E$6,IF(SUMIF(Data!$I:$I,$A212,Data!N:N)=0,#N/A,SUMIF(Data!$I:$I,$A212,Data!N:N)),#N/A)","v":{"$error":"#N/A"}},{"$f":"IF(F$6,IF(SUMIF(Data!$I:$I,$A212,Data!O:O)=0,#N/A,SUMIF(Data!$I:$I,$A212,Data!O:O)),#N/A)","v":{"$error":"#N/A"}},{"$f":"IF(G$6,IF(SUMIF(Data!$I:$I,$A212,Data!P:P)=0,#N/A,SUMIF(Data!$I:$I,$A212,Data!P:P)),#N/A)","v":{"$error":"#N/A"}},{"$f":"IF(H$6,IF(SUMIF(Data!$I:$I,$A212,Data!Q:Q)=0,#N/A,SUMIF(Data!$I:$I,$A212,Data!Q:Q)),#N/A)","v":{"$error":"#N/A"}},{"$f":"IF(I$6,IF(SUMIF(Data!$I:$I,$A212,Data!R:R)=0,#N/A,SUMIF(Data!$I:$I,$A212,Data!R:R)),#N/A)","v":{"$error":"#N/A"}},{"$f":"IF(J$6,IF(SUMIF(Data!$I:$I,$A212,Data!S:S)=0,#N/A,SUMIF(Data!$I:$I,$A212,Data!S:S)),#N/A)","v":{"$error":"#N/A"}},{"$f":"IF(K$6,IF(SUMIF(Data!$I:$I,$A212,Data!T:T)=0,#N/A,SUMIF(Data!$I:$I,$A212,Data!T:T)),#N/A)","v":{"$error":"#N/A"}}]
[{"$error":"#N/A"},{"$f":"IF(B$6,IF(SUMIF(Data!$I:$I,$A213,Data!K:K)=0,#N/A,SUMIF(Data!$I:$I,$A213,Data!K:K)),#N/A)","v":{"$error":"#N/A"}},{"$f":"IF(C$6,IF(SUMIF(Data!$I:$I,$A213,Data!L:L)=0,#N/A,SUMIF(Data!$I:$I,$A213,Data!L:L)),#N/A)","v":{"$error":"#N/A"}},{"$f":"IF(D$6,IF(SUMIF(Data!$I:$I,$A213,Data!M:M)=0,#N/A,SUMIF(Data!$I:$I,$A213,Data!M:M)),#N/A)","v":{"$error":"#N/A"}},{"$f":"IF(E$6,IF(SUMIF(Data!$I:$I,$A213,Data!N:N)=0,#N/A,SUMIF(Data!$I:$I,$A213,Data!N:N)),#N/A)","v":{"$error":"#N/A"}},{"$f":"IF(F$6,IF(SUMIF(Data!$I:$I,$A213,Data!O:O)=0,#N/A,SUMIF(Data!$I:$I,$A213,Data!O:O)),#N/A)","v":{"$error":"#N/A"}},{"$f":"IF(G$6,IF(SUMIF(Data!$I:$I,$A213,Data!P:P)=0,#N/A,SUMIF(Data!$I:$I,$A213,Data!P:P)),#N/A)","v":{"$error":"#N/A"}},{"$f":"IF(H$6,IF(SUMIF(Data!$I:$I,$A213,Data!Q:Q)=0,#N/A,SUMIF(Data!$I:$I,$A213,Data!Q:Q)),#N/A)","v":{"$error":"#N/A"}},{"$f":"IF(I$6,IF(SUMIF(Data!$I:$I,$A213,Data!R:R)=0,#N/A,SUMIF(Data!$I:$I,$A213,Data!R:R)),#N/A)","v":{"$error":"#N/A"}},{"$f":"IF(J$6,IF(SUMIF(Data!$I:$I,$A213,Data!S:S)=0,#N/A,SUMIF(Data!$I:$I,$A213,Data!S:S)),#N/A)","v":{"$error":"#N/A"}},{"$f":"IF(K$6,IF(SUMIF(Data!$I:$I,$A213,Data!T:T)=0,#N/A,SUMIF(Data!$I:$I,$A213,Data!T:T)),#N/A)","v":{"$error":"#N/A"}}]
[{"$error":"#N/A"},{"$f":"IF(B$6,IF(SUMIF(Data!$I:$I,$A214,Data!K:K)=0,#N/A,SUMIF(Data!$I:$I,$A214,Data!K:K)),#N/A)","v":{"$error":"#N/A"}},{"$f":"IF(C$6,IF(SUMIF(Data!$I:$I,$A214,Data!L:L)=0,#N/A,SUMIF(Data!$I:$I,$A214,Data!L:L)),#N/A)","v":{"$error":"#N/A"}},{"$f":"IF(D$6,IF(SUMIF(Data!$I:$I,$A214,Data!M:M)=0,#N/A,SUMIF(Data!$I:$I,$A214,Data!M:M)),#N/A)","v":{"$error":"#N/A"}},{"$f":"IF(E$6,IF(SUMIF(Data!$I:$I,$A214,Data!N:N)=0,#N/A,SUMIF(Data!$I:$I,$A214,Data!N:N)),#N/A)","v":{"$error":"#N/A"}},{"$f":"IF(F$6,IF(SUMIF(Data!$I:$I,$A214,Data!O:O)=0,#N/A,SUMIF(Data!$I:$I,$A214,Data!O:O)),#N/A)","v":{"$error":"#N/A"}},{"$f":"IF(G$6,IF(SUMIF(Data!$I:$I,$A214,Data!P:P)=0,#N/A,SUMIF(Data!$I:$I,$A214,Data!P:P)),#N/A)","v":{"$error":"#N/A"}},{"$f":"IF(H$6,IF(SUMIF(Data!$I:$I,$A214,Data!Q:Q)=0,#N/A,SUMIF(Data!$I:$I,$A214,Data!Q:Q)),#N/A)","v":{"$error":"#N/A"}},{"$f":"IF(I$6,IF(SUMIF(Data!$I:$I,$A214,Data!R:R)=0,#N/A,SUMIF(Data!$I:$I,$A214,Data!R:R)),#N/A)","v":{"$error":"#N/A"}},{"$f":"IF(J$6,IF(SUMIF(Data!$I:$I,$A214,Data!S:S)=0,#N/A,SUMIF(Data!$I:$I,$A214,Data!S:S)),#N/A)","v":{"$error":"#N/A"}},{"$f":"IF(K$6,IF(SUMIF(Data!$I:$I,$A214,Data!T:T)=0,#N/A,SUMIF(Data!$I:$I,$A214,Data!T:T)),#N/A)","v":{"$error":"#N/A"}}]
[{"$error":"#N/A"},{"$f":"IF(B$6,IF(SUMIF(Data!$I:$I,$A215,Data!K:K)=0,#N/A,SUMIF(Data!$I:$I,$A215,Data!K:K)),#N/A)","v":{"$error":"#N/A"}},{"$f":"IF(C$6,IF(SUMIF(Data!$I:$I,$A215,Data!L:L)=0,#N/A,SUMIF(Data!$I:$I,$A215,Data!L:L)),#N/A)","v":{"$error":"#N/A"}},{"$f":"IF(D$6,IF(SUMIF(Data!$I:$I,$A215,Data!M:M)=0,#N/A,SUMIF(Data!$I:$I,$A215,Data!M:M)),#N/A)","v":{"$error":"#N/A"}},{"$f":"IF(E$6,IF(SUMIF(Data!$I:$I,$A215,Data!N:N)=0,#N/A,SUMIF(Data!$I:$I,$A215,Data!N:N)),#N/A)","v":{"$error":"#N/A"}},{"$f":"IF(F$6,IF(SUMIF(Data!$I:$I,$A215,Data!O:O)=0,#N/A,SUMIF(Data!$I:$I,$A215,Data!O:O)),#N/A)","v":{"$error":"#N/A"}},{"$f":"IF(G$6,IF(SUMIF(Data!$I:$I,$A215,Data!P:P)=0,#N/A,SUMIF(Data!$I:$I,$A215,Data!P:P)),#N/A)","v":{"$error":"#N/A"}},{"$f":"IF(H$6,IF(SUMIF(Data!$I:$I,$A215,Data!Q:Q)=0,#N/A,SUMIF(Data!$I:$I,$A215,Data!Q:Q)),#N/A)","v":{"$error":"#N/A"}},{"$f":"IF(I$6,IF(SUMIF(Data!$I:$I,$A215,Data!R:R)=0,#N/A,SUMIF(Data!$I:$I,$A215,Data!R:R)),#N/A)","v":{"$error":"#N/A"}},{"$f":"IF(J$6,IF(SUMIF(Data!$I:$I,$A215,Data!S:S)=0,#N/A,SUMIF(Data!$I:$I,$A215,Data!S:S)),#N/A)","v":{"$error":"#N/A"}},{"$f":"IF(K$6,IF(SUMIF(Data!$I:$I,$A215,Data!T:T)=0,#N/A,SUMIF(Data!$I:$I,$A215,Data!T:T)),#N/A)","v":{"$error":"#N/A"}}]
[{"$error":"#N/A"},{"$f":"IF(B$6,IF(SUMIF(Data!$I:$I,$A216,Data!K:K)=0,#N/A,SUMIF(Data!$I:$I,$A216,Data!K:K)),#N/A)","v":{"$error":"#N/A"}},{"$f":"IF(C$6,IF(SUMIF(Data!$I:$I,$A216,Data!L:L)=0,#N/A,SUMIF(Data!$I:$I,$A216,Data!L:L)),#N/A)","v":{"$error":"#N/A"}},{"$f":"IF(D$6,IF(SUMIF(Data!$I:$I,$A216,Data!M:M)=0,#N/A,SUMIF(Data!$I:$I,$A216,Data!M:M)),#N/A)","v":{"$error":"#N/A"}},{"$f":"IF(E$6,IF(SUMIF(Data!$I:$I,$A216,Data!N:N)=0,#N/A,SUMIF(Data!$I:$I,$A216,Data!N:N)),#N/A)","v":{"$error":"#N/A"}},{"$f":"IF(F$6,IF(SUMIF(Data!$I:$I,$A216,Data!O:O)=0,#N/A,SUMIF(Data!$I:$I,$A216,Data!O:O)),#N/A)","v":{"$error":"#N/A"}},{"$f":"IF(G$6,IF(SUMIF(Data!$I:$I,$A216,Data!P:P)=0,#N/A,SUMIF(Data!$I:$I,$A216,Data!P:P)),#N/A)","v":{"$error":"#N/A"}},{"$f":"IF(H$6,IF(SUMIF(Data!$I:$I,$A216,Data!Q:Q)=0,#N/A,SUMIF(Data!$I:$I,$A216,Data!Q:Q)),#N/A)","v":{"$error":"#N/A"}},{"$f":"IF(I$6,IF(SUMIF(Data!$I:$I,$A216,Data!R:R)=0,#N/A,SUMIF(Data!$I:$I,$A216,Data!R:R)),#N/A)","v":{"$error":"#N/A"}},{"$f":"IF(J$6,IF(SUMIF(Data!$I:$I,$A216,Data!S:S)=0,#N/A,SUMIF(Data!$I:$I,$A216,Data!S:S)),#N/A)","v":{"$error":"#N/A"}},{"$f":"IF(K$6,IF(SUMIF(Data!$I:$I,$A216,Data!T:T)=0,#N/A,SUMIF(Data!$I:$I,$A216,Data!T:T)),#N/A)","v":{"$error":"#N/A"}}]
[{"$error":"#N/A"},{"$f":"IF(B$6,IF(SUMIF(Data!$I:$I,$A217,Data!K:K)=0,#N/A,SUMIF(Data!$I:$I,$A217,Data!K:K)),#N/A)","v":{"$error":"#N/A"}},{"$f":"IF(C$6,IF(SUMIF(Data!$I:$I,$A217,Data!L:L)=0,#N/A,SUMIF(Data!$I:$I,$A217,Data!L:L)),#N/A)","v":{"$error":"#N/A"}},{"$f":"IF(D$6,IF(SUMIF(Data!$I:$I,$A217,Data!M:M)=0,#N/A,SUMIF(Data!$I:$I,$A217,Data!M:M)),#N/A)","v":{"$error":"#N/A"}},{"$f":"IF(E$6,IF(SUMIF(Data!$I:$I,$A217,Data!N:N)=0,#N/A,SUMIF(Data!$I:$I,$A217,Data!N:N)),#N/A)","v":{"$error":"#N/A"}},{"$f":"IF(F$6,IF(SUMIF(Data!$I:$I,$A217,Data!O:O)=0,#N/A,SUMIF(Data!$I:$I,$A217,Data!O:O)),#N/A)","v":{"$error":"#N/A"}},{"$f":"IF(G$6,IF(SUMIF(Data!$I:$I,$A217,Data!P:P)=0,#N/A,SUMIF(Data!$I:$I,$A217,Data!P:P)),#N/A)","v":{"$error":"#N/A"}},{"$f":"IF(H$6,IF(SUMIF(Data!$I:$I,$A217,Data!Q:Q)=0,#N/A,SUMIF(Data!$I:$I,$A217,Data!Q:Q)),#N/A)","v":{"$error":"#N/A"}},{"$f":"IF(I$6,IF(SUMIF(Data!$I:$I,$A217,Data!R:R)=0,#N/A,SUMIF(Data!$I:$I,$A217,Data!R:R)),#N/A)","v":{"$error":"#N/A"}},{"$f":"IF(J$6,IF(SUMIF(Data!$I:$I,$A217,Data!S:S)=0,#N/A,SUMIF(Data!$I:$I,$A217,Data!S:S)),#N/A)","v":{"$error":"#N/A"}},{"$f":"IF(K$6,IF(SUMIF(Data!$I:$I,$A217,Data!T:T)=0,#N/A,SUMIF(Data!$I:$I,$A217,Data!T:T)),#N/A)","v":{"$error":"#N/A"}}]
[{"$error":"#N/A"},{"$f":"IF(B$6,IF(SUMIF(Data!$I:$I,$A218,Data!K:K)=0,#N/A,SUMIF(Data!$I:$I,$A218,Data!K:K)),#N/A)","v":{"$error":"#N/A"}},{"$f":"IF(C$6,IF(SUMIF(Data!$I:$I,$A218,Data!L:L)=0,#N/A,SUMIF(Data!$I:$I,$A218,Data!L:L)),#N/A)","v":{"$error":"#N/A"}},{"$f":"IF(D$6,IF(SUMIF(Data!$I:$I,$A218,Data!M:M)=0,#N/A,SUMIF(Data!$I:$I,$A218,Data!M:M)),#N/A)","v":{"$error":"#N/A"}},{"$f":"IF(E$6,IF(SUMIF(Data!$I:$I,$A218,Data!N:N)=0,#N/A,SUMIF(Data!$I:$I,$A218,Data!N:N)),#N/A)","v":{"$error":"#N/A"}},{"$f":"IF(F$6,IF(SUMIF(Data!$I:$I,$A218,Data!O:O)=0,#N/A,SUMIF(Data!$I:$I,$A218,Data!O:O)),#N/A)","v":{"$error":"#N/A"}},{"$f":"IF(G$6,IF(SUMIF(Data!$I:$I,$A218,Data!P:P)=0,#N/A,SUMIF(Data!$I:$I,$A218,Data!P:P)),#N/A)","v":{"$error":"#N/A"}},{"$f":"IF(H$6,IF(SUMIF(Data!$I:$I,$A218,Data!Q:Q)=0,#N/A,SUMIF(Data!$I:$I,$A218,Data!Q:Q)),#N/A)","v":{"$error":"#N/A"}},{"$f":"IF(I$6,IF(SUMIF(Data!$I:$I,$A218,Data!R:R)=0,#N/A,SUMIF(Data!$I:$I,$A218,Data!R:R)),#N/A)","v":{"$error":"#N/A"}},{"$f":"IF(J$6,IF(SUMIF(Data!$I:$I,$A218,Data!S:S)=0,#N/A,SUMIF(Data!$I:$I,$A218,Data!S:S)),#N/A)","v":{"$error":"#N/A"}},{"$f":"IF(K$6,IF(SUMIF(Data!$I:$I,$A218,Data!T:T)=0,#N/A,SUMIF(Data!$I:$I,$A218,Data!T:T)),#N/A)","v":{"$error":"#N/A"}}]
[{"$error":"#N/A"},{"$f":"IF(B$6,IF(SUMIF(Data!$I:$I,$A219,Data!K:K)=0,#N/A,SUMIF(Data!$I:$I,$A219,Data!K:K)),#N/A)","v":{"$error":"#N/A"}},{"$f":"IF(C$6,IF(SUMIF(Data!$I:$I,$A219,Data!L:L)=0,#N/A,SUMIF(Data!$I:$I,$A219,Data!L:L)),#N/A)","v":{"$error":"#N/A"}},{"$f":"IF(D$6,IF(SUMIF(Data!$I:$I,$A219,Data!M:M)=0,#N/A,SUMIF(Data!$I:$I,$A219,Data!M:M)),#N/A)","v":{"$error":"#N/A"}},{"$f":"IF(E$6,IF(SUMIF(Data!$I:$I,$A219,Data!N:N)=0,#N/A,SUMIF(Data!$I:$I,$A219,Data!N:N)),#N/A)","v":{"$error":"#N/A"}},{"$f":"IF(F$6,IF(SUMIF(Data!$I:$I,$A219,Data!O:O)=0,#N/A,SUMIF(Data!$I:$I,$A219,Data!O:O)),#N/A)","v":{"$error":"#N/A"}},{"$f":"IF(G$6,IF(SUMIF(Data!$I:$I,$A219,Data!P:P)=0,#N/A,SUMIF(Data!$I:$I,$A219,Data!P:P)),#N/A)","v":{"$error":"#N/A"}},{"$f":"IF(H$6,IF(SUMIF(Data!$I:$I,$A219,Data!Q:Q)=0,#N/A,SUMIF(Data!$I:$I,$A219,Data!Q:Q)),#N/A)","v":{"$error":"#N/A"}},{"$f":"IF(I$6,IF(SUMIF(Data!$I:$I,$A219,Data!R:R)=0,#N/A,SUMIF(Data!$I:$I,$A219,Data!R:R)),#N/A)","v":{"$error":"#N/A"}},{"$f":"IF(J$6,IF(SUMIF(Data!$I:$I,$A219,Data!S:S)=0,#N/A,SUMIF(Data!$I:$I,$A219,Data!S:S)),#N/A)","v":{"$error":"#N/A"}},{"$f":"IF(K$6,IF(SUMIF(Data!$I:$I,$A219,Data!T:T)=0,#N/A,SUMIF(Data!$I:$I,$A219,Data!T:T)),#N/A)","v":{"$error":"#N/A"}}]
[{"$error":"#N/A"},{"$f":"IF(B$6,IF(SUMIF(Data!$I:$I,$A220,Data!K:K)=0,#N/A,SUMIF(Data!$I:$I,$A220,Data!K:K)),#N/A)","v":{"$error":"#N/A"}},{"$f":"IF(C$6,IF(SUMIF(Data!$I:$I,$A220,Data!L:L)=0,#N/A,SUMIF(Data!$I:$I,$A220,Data!L:L)),#N/A)","v":{"$error":"#N/A"}},{"$f":"IF(D$6,IF(SUMIF(Data!$I:$I,$A220,Data!M:M)=0,#N/A,SUMIF(Data!$I:$I,$A220,Data!M:M)),#N/A)","v":{"$error":"#N/A"}},{"$f":"IF(E$6,IF(SUMIF(Data!$I:$I,$A220,Data!N:N)=0,#N/A,SUMIF(Data!$I:$I,$A220,Data!N:N)),#N/A)","v":{"$error":"#N/A"}},{"$f":"IF(F$6,IF(SUMIF(Data!$I:$I,$A220,Data!O:O)=0,#N/A,SUMIF(Data!$I:$I,$A220,Data!O:O)),#N/A)","v":{"$error":"#N/A"}},{"$f":"IF(G$6,IF(SUMIF(Data!$I:$I,$A220,Data!P:P)=0,#N/A,SUMIF(Data!$I:$I,$A220,Data!P:P)),#N/A)","v":{"$error":"#N/A"}},{"$f":"IF(H$6,IF(SUMIF(Data!$I:$I,$A220,Data!Q:Q)=0,#N/A,SUMIF(Data!$I:$I,$A220,Data!Q:Q)),#N/A)","v":{"$error":"#N/A"}},{"$f":"IF(I$6,IF(SUMIF(Data!$I:$I,$A220,Data!R:R)=0,#N/A,SUMIF(Data!$I:$I,$A220,Data!R:R)),#N/A)","v":{"$error":"#N/A"}},{"$f":"IF(J$6,IF(SUMIF(Data!$I:$I,$A220,Data!S:S)=0,#N/A,SUMIF(Data!$I:$I,$A220,Data!S:S)),#N/A)","v":{"$error":"#N/A"}},{"$f":"IF(K$6,IF(SUMIF(Data!$I:$I,$A220,Data!T:T)=0,#N/A,SUMIF(Data!$I:$I,$A220,Data!T:T)),#N/A)","v":{"$error":"#N/A"}}]
[{"$error":"#N/A"},{"$f":"IF(B$6,IF(SUMIF(Data!$I:$I,$A221,Data!K:K)=0,#N/A,SUMIF(Data!$I:$I,$A221,Data!K:K)),#N/A)","v":{"$error":"#N/A"}},{"$f":"IF(C$6,IF(SUMIF(Data!$I:$I,$A221,Data!L:L)=0,#N/A,SUMIF(Data!$I:$I,$A221,Data!L:L)),#N/A)","v":{"$error":"#N/A"}},{"$f":"IF(D$6,IF(SUMIF(Data!$I:$I,$A221,Data!M:M)=0,#N/A,SUMIF(Data!$I:$I,$A221,Data!M:M)),#N/A)","v":{"$error":"#N/A"}},{"$f":"IF(E$6,IF(SUMIF(Data!$I:$I,$A221,Data!N:N)=0,#N/A,SUMIF(Data!$I:$I,$A221,Data!N:N)),#N/A)","v":{"$error":"#N/A"}},{"$f":"IF(F$6,IF(SUMIF(Data!$I:$I,$A221,Data!O:O)=0,#N/A,SUMIF(Data!$I:$I,$A221,Data!O:O)),#N/A)","v":{"$error":"#N/A"}},{"$f":"IF(G$6,IF(SUMIF(Data!$I:$I,$A221,Data!P:P)=0,#N/A,SUMIF(Data!$I:$I,$A221,Data!P:P)),#N/A)","v":{"$error":"#N/A"}},{"$f":"IF(H$6,IF(SUMIF(Data!$I:$I,$A221,Data!Q:Q)=0,#N/A,SUMIF(Data!$I:$I,$A221,Data!Q:Q)),#N/A)","v":{"$error":"#N/A"}},{"$f":"IF(I$6,IF(SUMIF(Data!$I:$I,$A221,Data!R:R)=0,#N/A,SUMIF(Data!$I:$I,$A221,Data!R:R)),#N/A)","v":{"$error":"#N/A"}},{"$f":"IF(J$6,IF(SUMIF(Data!$I:$I,$A221,Data!S:S)=0,#N/A,SUMIF(Data!$I:$I,$A221,Data!S:S)),#N/A)","v":{"$error":"#N/A"}},{"$f":"IF(K$6,IF(SUMIF(Data!$I:$I,$A221,Data!T:T)=0,#N/A,SUMIF(Data!$I:$I,$A221,Data!T:T)),#N/A)","v":{"$error":"#N/A"}}]
[{"$error":"#N/A"},{"$f":"IF(B$6,IF(SUMIF(Data!$I:$I,$A222,Data!K:K)=0,#N/A,SUMIF(Data!$I:$I,$A222,Data!K:K)),#N/A)","v":{"$error":"#N/A"}},{"$f":"IF(C$6,IF(SUMIF(Data!$I:$I,$A222,Data!L:L)=0,#N/A,SUMIF(Data!$I:$I,$A222,Data!L:L)),#N/A)","v":{"$error":"#N/A"}},{"$f":"IF(D$6,IF(SUMIF(Data!$I:$I,$A222,Data!M:M)=0,#N/A,SUMIF(Data!$I:$I,$A222,Data!M:M)),#N/A)","v":{"$error":"#N/A"}},{"$f":"IF(E$6,IF(SUMIF(Data!$I:$I,$A222,Data!N:N)=0,#N/A,SUMIF(Data!$I:$I,$A222,Data!N:N)),#N/A)","v":{"$error":"#N/A"}},{"$f":"IF(F$6,IF(SUMIF(Data!$I:$I,$A222,Data!O:O)=0,#N/A,SUMIF(Data!$I:$I,$A222,Data!O:O)),#N/A)","v":{"$error":"#N/A"}},{"$f":"IF(G$6,IF(SUMIF(Data!$I:$I,$A222,Data!P:P)=0,#N/A,SUMIF(Data!$I:$I,$A222,Data!P:P)),#N/A)","v":{"$error":"#N/A"}},{"$f":"IF(H$6,IF(SUMIF(Data!$I:$I,$A222,Data!Q:Q)=0,#N/A,SUMIF(Data!$I:$I,$A222,Data!Q:Q)),#N/A)","v":{"$error":"#N/A"}},{"$f":"IF(I$6,IF(SUMIF(Data!$I:$I,$A222,Data!R:R)=0,#N/A,SUMIF(Data!$I:$I,$A222,Data!R:R)),#N/A)","v":{"$error":"#N/A"}},{"$f":"IF(J$6,IF(SUMIF(Data!$I:$I,$A222,Data!S:S)=0,#N/A,SUMIF(Data!$I:$I,$A222,Data!S:S)),#N/A)","v":{"$error":"#N/A"}},{"$f":"IF(K$6,IF(SUMIF(Data!$I:$I,$A222,Data!T:T)=0,#N/A,SUMIF(Data!$I:$I,$A222,Data!T:T)),#N/A)","v":{"$error":"#N/A"}}]
[{"$error":"#N/A"},{"$f":"IF(B$6,IF(SUMIF(Data!$I:$I,$A223,Data!K:K)=0,#N/A,SUMIF(Data!$I:$I,$A223,Data!K:K)),#N/A)","v":{"$error":"#N/A"}},{"$f":"IF(C$6,IF(SUMIF(Data!$I:$I,$A223,Data!L:L)=0,#N/A,SUMIF(Data!$I:$I,$A223,Data!L:L)),#N/A)","v":{"$error":"#N/A"}},{"$f":"IF(D$6,IF(SUMIF(Data!$I:$I,$A223,Data!M:M)=0,#N/A,SUMIF(Data!$I:$I,$A223,Data!M:M)),#N/A)","v":{"$error":"#N/A"}},{"$f":"IF(E$6,IF(SUMIF(Data!$I:$I,$A223,Data!N:N)=0,#N/A,SUMIF(Data!$I:$I,$A223,Data!N:N)),#N/A)","v":{"$error":"#N/A"}},{"$f":"IF(F$6,IF(SUMIF(Data!$I:$I,$A223,Data!O:O)=0,#N/A,SUMIF(Data!$I:$I,$A223,Data!O:O)),#N/A)","v":{"$error":"#N/A"}},{"$f":"IF(G$6,IF(SUMIF(Data!$I:$I,$A223,Data!P:P)=0,#N/A,SUMIF(Data!$I:$I,$A223,Data!P:P)),#N/A)","v":{"$error":"#N/A"}},{"$f":"IF(H$6,IF(SUMIF(Data!$I:$I,$A223,Data!Q:Q)=0,#N/A,SUMIF(Data!$I:$I,$A223,Data!Q:Q)),#N/A)","v":{"$error":"#N/A"}},{"$f":"IF(I$6,IF(SUMIF(Data!$I:$I,$A223,Data!R:R)=0,#N/A,SUMIF(Data!$I:$I,$A223,Data!R:R)),#N/A)","v":{"$error":"#N/A"}},{"$f":"IF(J$6,IF(SUMIF(Data!$I:$I,$A223,Data!S:S)=0,#N/A,SUMIF(Data!$I:$I,$A223,Data!S:S)),#N/A)","v":{"$error":"#N/A"}},{"$f":"IF(K$6,IF(SUMIF(Data!$I:$I,$A223,Data!T:T)=0,#N/A,SUMIF(Data!$I:$I,$A223,Data!T:T)),#N/A)","v":{"$error":"#N/A"}}]
[{"$error":"#N/A"},{"$f":"IF(B$6,IF(SUMIF(Data!$I:$I,$A224,Data!K:K)=0,#N/A,SUMIF(Data!$I:$I,$A224,Data!K:K)),#N/A)","v":{"$error":"#N/A"}},{"$f":"IF(C$6,IF(SUMIF(Data!$I:$I,$A224,Data!L:L)=0,#N/A,SUMIF(Data!$I:$I,$A224,Data!L:L)),#N/A)","v":{"$error":"#N/A"}},{"$f":"IF(D$6,IF(SUMIF(Data!$I:$I,$A224,Data!M:M)=0,#N/A,SUMIF(Data!$I:$I,$A224,Data!M:M)),#N/A)","v":{"$error":"#N/A"}},{"$f":"IF(E$6,IF(SUMIF(Data!$I:$I,$A224,Data!N:N)=0,#N/A,SUMIF(Data!$I:$I,$A224,Data!N:N)),#N/A)","v":{"$error":"#N/A"}},{"$f":"IF(F$6,IF(SUMIF(Data!$I:$I,$A224,Data!O:O)=0,#N/A,SUMIF(Data!$I:$I,$A224,Data!O:O)),#N/A)","v":{"$error":"#N/A"}},{"$f":"IF(G$6,IF(SUMIF(Data!$I:$I,$A224,Data!P:P)=0,#N/A,SUMIF(Data!$I:$I,$A224,Data!P:P)),#N/A)","v":{"$error":"#N/A"}},{"$f":"IF(H$6,IF(SUMIF(Data!$I:$I,$A224,Data!Q:Q)=0,#N/A,SUMIF(Data!$I:$I,$A224,Data!Q:Q)),#N/A)","v":{"$error":"#N/A"}},{"$f":"IF(I$6,IF(SUMIF(Data!$I:$I,$A224,Data!R:R)=0,#N/A,SUMIF(Data!$I:$I,$A224,Data!R:R)),#N/A)","v":{"$error":"#N/A"}},{"$f":"IF(J$6,IF(SUMIF(Data!$I:$I,$A224,Data!S:S)=0,#N/A,SUMIF(Data!$I:$I,$A224,Data!S:S)),#N/A)","v":{"$error":"#N/A"}},{"$f":"IF(K$6,IF(SUMIF(Data!$I:$I,$A224,Data!T:T)=0,#N/A,SUMIF(Data!$I:$I,$A224,Data!T:T)),#N/A)","v":{"$error":"#N/A"}}]
[{"$error":"#N/A"},{"$f":"IF(B$6,IF(SUMIF(Data!$I:$I,$A225,Data!K:K)=0,#N/A,SUMIF(Data!$I:$I,$A225,Data!K:K)),#N/A)","v":{"$error":"#N/A"}},{"$f":"IF(C$6,IF(SUMIF(Data!$I:$I,$A225,Data!L:L)=0,#N/A,SUMIF(Data!$I:$I,$A225,Data!L:L)),#N/A)","v":{"$error":"#N/A"}},{"$f":"IF(D$6,IF(SUMIF(Data!$I:$I,$A225,Data!M:M)=0,#N/A,SUMIF(Data!$I:$I,$A225,Data!M:M)),#N/A)","v":{"$error":"#N/A"}},{"$f":"IF(E$6,IF(SUMIF(Data!$I:$I,$A225,Data!N:N)=0,#N/A,SUMIF(Data!$I:$I,$A225,Data!N:N)),#N/A)","v":{"$error":"#N/A"}},{"$f":"IF(F$6,IF(SUMIF(Data!$I:$I,$A225,Data!O:O)=0,#N/A,SUMIF(Data!$I:$I,$A225,Data!O:O)),#N/A)","v":{"$error":"#N/A"}},{"$f":"IF(G$6,IF(SUMIF(Data!$I:$I,$A225,Data!P:P)=0,#N/A,SUMIF(Data!$I:$I,$A225,Data!P:P)),#N/A)","v":{"$error":"#N/A"}},{"$f":"IF(H$6,IF(SUMIF(Data!$I:$I,$A225,Data!Q:Q)=0,#N/A,SUMIF(Data!$I:$I,$A225,Data!Q:Q)),#N/A)","v":{"$error":"#N/A"}},{"$f":"IF(I$6,IF(SUMIF(Data!$I:$I,$A225,Data!R:R)=0,#N/A,SUMIF(Data!$I:$I,$A225,Data!R:R)),#N/A)","v":{"$error":"#N/A"}},{"$f":"IF(J$6,IF(SUMIF(Data!$I:$I,$A225,Data!S:S)=0,#N/A,SUMIF(Data!$I:$I,$A225,Data!S:S)),#N/A)","v":{"$error":"#N/A"}},{"$f":"IF(K$6,IF(SUMIF(Data!$I:$I,$A225,Data!T:T)=0,#N/A,SUMIF(Data!$I:$I,$A225,Data!T:T)),#N/A)","v":{"$error":"#N/A"}}]
[{"$error":"#N/A"},{"$f":"IF(B$6,IF(SUMIF(Data!$I:$I,$A226,Data!K:K)=0,#N/A,SUMIF(Data!$I:$I,$A226,Data!K:K)),#N/A)","v":{"$error":"#N/A"}},{"$f":"IF(C$6,IF(SUMIF(Data!$I:$I,$A226,Data!L:L)=0,#N/A,SUMIF(Data!$I:$I,$A226,Data!L:L)),#N/A)","v":{"$error":"#N/A"}},{"$f":"IF(D$6,IF(SUMIF(Data!$I:$I,$A226,Data!M:M)=0,#N/A,SUMIF(Data!$I:$I,$A226,Data!M:M)),#N/A)","v":{"$error":"#N/A"}},{"$f":"IF(E$6,IF(SUMIF(Data!$I:$I,$A226,Data!N:N)=0,#N/A,SUMIF(Data!$I:$I,$A226,Data!N:N)),#N/A)","v":{"$error":"#N/A"}},{"$f":"IF(F$6,IF(SUMIF(Data!$I:$I,$A226,Data!O:O)=0,#N/A,SUMIF(Data!$I:$I,$A226,Data!O:O)),#N/A)","v":{"$error":"#N/A"}},{"$f":"IF(G$6,IF(SUMIF(Data!$I:$I,$A226,Data!P:P)=0,#N/A,SUMIF(Data!$I:$I,$A226,Data!P:P)),#N/A)","v":{"$error":"#N/A"}},{"$f":"IF(H$6,IF(SUMIF(Data!$I:$I,$A226,Data!Q:Q)=0,#N/A,SUMIF(Data!$I:$I,$A226,Data!Q:Q)),#N/A)","v":{"$error":"#N/A"}},{"$f":"IF(I$6,IF(SUMIF(Data!$I:$I,$A226,Data!R:R)=0,#N/A,SUMIF(Data!$I:$I,$A226,Data!R:R)),#N/A)","v":{"$error":"#N/A"}},{"$f":"IF(J$6,IF(SUMIF(Data!$I:$I,$A226,Data!S:S)=0,#N/A,SUMIF(Data!$I:$I,$A226,Data!S:S)),#N/A)","v":{"$error":"#N/A"}},{"$f":"IF(K$6,IF(SUMIF(Data!$I:$I,$A226,Data!T:T)=0,#N/A,SUMIF(Data!$I:$I,$A226,Data!T:T)),#N/A)","v":{"$error":"#N/A"}}]
[{"$error":"#N/A"},{"$f":"IF(B$6,IF(SUMIF(Data!$I:$I,$A227,Data!K:K)=0,#N/A,SUMIF(Data!$I:$I,$A227,Data!K:K)),#N/A)","v":{"$error":"#N/A"}},{"$f":"IF(C$6,IF(SUMIF(Data!$I:$I,$A227,Data!L:L)=0,#N/A,SUMIF(Data!$I:$I,$A227,Data!L:L)),#N/A)","v":{"$error":"#N/A"}},{"$f":"IF(D$6,IF(SUMIF(Data!$I:$I,$A227,Data!M:M)=0,#N/A,SUMIF(Data!$I:$I,$A227,Data!M:M)),#N/A)","v":{"$error":"#N/A"}},{"$f":"IF(E$6,IF(SUMIF(Data!$I:$I,$A227,Data!N:N)=0,#N/A,SUMIF(Data!$I:$I,$A227,Data!N:N)),#N/A)","v":{"$error":"#N/A"}},{"$f":"IF(F$6,IF(SUMIF(Data!$I:$I,$A227,Data!O:O)=0,#N/A,SUMIF(Data!$I:$I,$A227,Data!O:O)),#N/A)","v":{"$error":"#N/A"}},{"$f":"IF(G$6,IF(SUMIF(Data!$I:$I,$A227,Data!P:P)=0,#N/A,SUMIF(Data!$I:$I,$A227,Data!P:P)),#N/A)","v":{"$error":"#N/A"}},{"$f":"IF(H$6,IF(SUMIF(Data!$I:$I,$A227,Data!Q:Q)=0,#N/A,SUMIF(Data!$I:$I,$A227,Data!Q:Q)),#N/A)","v":{"$error":"#N/A"}},{"$f":"IF(I$6,IF(SUMIF(Data!$I:$I,$A227,Data!R:R)=0,#N/A,SUMIF(Data!$I:$I,$A227,Data!R:R)),#N/A)","v":{"$error":"#N/A"}},{"$f":"IF(J$6,IF(SUMIF(Data!$I:$I,$A227,Data!S:S)=0,#N/A,SUMIF(Data!$I:$I,$A227,Data!S:S)),#N/A)","v":{"$error":"#N/A"}},{"$f":"IF(K$6,IF(SUMIF(Data!$I:$I,$A227,Data!T:T)=0,#N/A,SUMIF(Data!$I:$I,$A227,Data!T:T)),#N/A)","v":{"$error":"#N/A"}}]
[{"$error":"#N/A"},{"$f":"IF(B$6,IF(SUMIF(Data!$I:$I,$A228,Data!K:K)=0,#N/A,SUMIF(Data!$I:$I,$A228,Data!K:K)),#N/A)","v":{"$error":"#N/A"}},{"$f":"IF(C$6,IF(SUMIF(Data!$I:$I,$A228,Data!L:L)=0,#N/A,SUMIF(Data!$I:$I,$A228,Data!L:L)),#N/A)","v":{"$error":"#N/A"}},{"$f":"IF(D$6,IF(SUMIF(Data!$I:$I,$A228,Data!M:M)=0,#N/A,SUMIF(Data!$I:$I,$A228,Data!M:M)),#N/A)","v":{"$error":"#N/A"}},{"$f":"IF(E$6,IF(SUMIF(Data!$I:$I,$A228,Data!N:N)=0,#N/A,SUMIF(Data!$I:$I,$A228,Data!N:N)),#N/A)","v":{"$error":"#N/A"}},{"$f":"IF(F$6,IF(SUMIF(Data!$I:$I,$A228,Data!O:O)=0,#N/A,SUMIF(Data!$I:$I,$A228,Data!O:O)),#N/A)","v":{"$error":"#N/A"}},{"$f":"IF(G$6,IF(SUMIF(Data!$I:$I,$A228,Data!P:P)=0,#N/A,SUMIF(Data!$I:$I,$A228,Data!P:P)),#N/A)","v":{"$error":"#N/A"}},{"$f":"IF(H$6,IF(SUMIF(Data!$I:$I,$A228,Data!Q:Q)=0,#N/A,SUMIF(Data!$I:$I,$A228,Data!Q:Q)),#N/A)","v":{"$error":"#N/A"}},{"$f":"IF(I$6,IF(SUMIF(Data!$I:$I,$A228,Data!R:R)=0,#N/A,SUMIF(Data!$I:$I,$A228,Data!R:R)),#N/A)","v":{"$error":"#N/A"}},{"$f":"IF(J$6,IF(SUMIF(Data!$I:$I,$A228,Data!S:S)=0,#N/A,SUMIF(Data!$I:$I,$A228,Data!S:S)),#N/A)","v":{"$error":"#N/A"}},{"$f":"IF(K$6,IF(SUMIF(Data!$I:$I,$A228,Data!T:T)=0,#N/A,SUMIF(Data!$I:$I,$A228,Data!T:T)),#N/A)","v":{"$error":"#N/A"}}]
[{"$error":"#N/A"},{"$f":"IF(B$6,IF(SUMIF(Data!$I:$I,$A229,Data!K:K)=0,#N/A,SUMIF(Data!$I:$I,$A229,Data!K:K)),#N/A)","v":{"$error":"#N/A"}},{"$f":"IF(C$6,IF(SUMIF(Data!$I:$I,$A229,Data!L:L)=0,#N/A,SUMIF(Data!$I:$I,$A229,Data!L:L)),#N/A)","v":{"$error":"#N/A"}},{"$f":"IF(D$6,IF(SUMIF(Data!$I:$I,$A229,Data!M:M)=0,#N/A,SUMIF(Data!$I:$I,$A229,Data!M:M)),#N/A)","v":{"$error":"#N/A"}},{"$f":"IF(E$6,IF(SUMIF(Data!$I:$I,$A229,Data!N:N)=0,#N/A,SUMIF(Data!$I:$I,$A229,Data!N:N)),#N/A)","v":{"$error":"#N/A"}},{"$f":"IF(F$6,IF(SUMIF(Data!$I:$I,$A229,Data!O:O)=0,#N/A,SUMIF(Data!$I:$I,$A229,Data!O:O)),#N/A)","v":{"$error":"#N/A"}},{"$f":"IF(G$6,IF(SUMIF(Data!$I:$I,$A229,Data!P:P)=0,#N/A,SUMIF(Data!$I:$I,$A229,Data!P:P)),#N/A)","v":{"$error":"#N/A"}},{"$f":"IF(H$6,IF(SUMIF(Data!$I:$I,$A229,Data!Q:Q)=0,#N/A,SUMIF(Data!$I:$I,$A229,Data!Q:Q)),#N/A)","v":{"$error":"#N/A"}},{"$f":"IF(I$6,IF(SUMIF(Data!$I:$I,$A229,Data!R:R)=0,#N/A,SUMIF(Data!$I:$I,$A229,Data!R:R)),#N/A)","v":{"$error":"#N/A"}},{"$f":"IF(J$6,IF(SUMIF(Data!$I:$I,$A229,Data!S:S)=0,#N/A,SUMIF(Data!$I:$I,$A229,Data!S:S)),#N/A)","v":{"$error":"#N/A"}},{"$f":"IF(K$6,IF(SUMIF(Data!$I:$I,$A229,Data!T:T)=0,#N/A,SUMIF(Data!$I:$I,$A229,Data!T:T)),#N/A)","v":{"$error":"#N/A"}}]
[{"$error":"#N/A"},{"$f":"IF(B$6,IF(SUMIF(Data!$I:$I,$A230,Data!K:K)=0,#N/A,SUMIF(Data!$I:$I,$A230,Data!K:K)),#N/A)","v":{"$error":"#N/A"}},{"$f":"IF(C$6,IF(SUMIF(Data!$I:$I,$A230,Data!L:L)=0,#N/A,SUMIF(Data!$I:$I,$A230,Data!L:L)),#N/A)","v":{"$error":"#N/A"}},{"$f":"IF(D$6,IF(SUMIF(Data!$I:$I,$A230,Data!M:M)=0,#N/A,SUMIF(Data!$I:$I,$A230,Data!M:M)),#N/A)","v":{"$error":"#N/A"}},{"$f":"IF(E$6,IF(SUMIF(Data!$I:$I,$A230,Data!N:N)=0,#N/A,SUMIF(Data!$I:$I,$A230,Data!N:N)),#N/A)","v":{"$error":"#N/A"}},{"$f":"IF(F$6,IF(SUMIF(Data!$I:$I,$A230,Data!O:O)=0,#N/A,SUMIF(Data!$I:$I,$A230,Data!O:O)),#N/A)","v":{"$error":"#N/A"}},{"$f":"IF(G$6,IF(SUMIF(Data!$I:$I,$A230,Data!P:P)=0,#N/A,SUMIF(Data!$I:$I,$A230,Data!P:P)),#N/A)","v":{"$error":"#N/A"}},{"$f":"IF(H$6,IF(SUMIF(Data!$I:$I,$A230,Data!Q:Q)=0,#N/A,SUMIF(Data!$I:$I,$A230,Data!Q:Q)),#N/A)","v":{"$error":"#N/A"}},{"$f":"IF(I$6,IF(SUMIF(Data!$I:$I,$A230,Data!R:R)=0,#N/A,SUMIF(Data!$I:$I,$A230,Data!R:R)),#N/A)","v":{"$error":"#N/A"}},{"$f":"IF(J$6,IF(SUMIF(Data!$I:$I,$A230,Data!S:S)=0,#N/A,SUMIF(Data!$I:$I,$A230,Data!S:S)),#N/A)","v":{"$error":"#N/A"}},{"$f":"IF(K$6,IF(SUMIF(Data!$I:$I,$A230,Data!T:T)=0,#N/A,SUMIF(Data!$I:$I,$A230,Data!T:T)),#N/A)","v":{"$error":"#N/A"}}]
[{"$error":"#N/A"},{"$f":"IF(B$6,IF(SUMIF(Data!$I:$I,$A231,Data!K:K)=0,#N/A,SUMIF(Data!$I:$I,$A231,Data!K:K)),#N/A)","v":{"$error":"#N/A"}},{"$f":"IF(C$6,IF(SUMIF(Data!$I:$I,$A231,Data!L:L)=0,#N/A,SUMIF(Data!$I:$I,$A231,Data!L:L)),#N/A)","v":{"$error":"#N/A"}},{"$f":"IF(D$6,IF(SUMIF(Data!$I:$I,$A231,Data!M:M)=0,#N/A,SUMIF(Data!$I:$I,$A231,Data!M:M)),#N/A)","v":{"$error":"#N/A"}},{"$f":"IF(E$6,IF(SUMIF(Data!$I:$I,$A231,Data!N:N)=0,#N/A,SUMIF(Data!$I:$I,$A231,Data!N:N)),#N/A)","v":{"$error":"#N/A"}},{"$f":"IF(F$6,IF(SUMIF(Data!$I:$I,$A231,Data!O:O)=0,#N/A,SUMIF(Data!$I:$I,$A231,Data!O:O)),#N/A)","v":{"$error":"#N/A"}},{"$f":"IF(G$6,IF(SUMIF(Data!$I:$I,$A231,Data!P:P)=0,#N/A,SUMIF(Data!$I:$I,$A231,Data!P:P)),#N/A)","v":{"$error":"#N/A"}},{"$f":"IF(H$6,IF(SUMIF(Data!$I:$I,$A231,Data!Q:Q)=0,#N/A,SUMIF(Data!$I:$I,$A231,Data!Q:Q)),#N/A)","v":{"$error":"#N/A"}},{"$f":"IF(I$6,IF(SUMIF(Data!$I:$I,$A231,Data!R:R)=0,#N/A,SUMIF(Data!$I:$I,$A231,Data!R:R)),#N/A)","v":{"$error":"#N/A"}},{"$f":"IF(J$6,IF(SUMIF(Data!$I:$I,$A231,Data!S:S)=0,#N/A,SUMIF(Data!$I:$I,$A231,Data!S:S)),#N/A)","v":{"$error":"#N/A"}},{"$f":"IF(K$6,IF(SUMIF(Data!$I:$I,$A231,Data!T:T)=0,#N/A,SUMIF(Data!$I:$I,$A231,Data!T:T)),#N/A)","v":{"$error":"#N/A"}}]
[{"$error":"#N/A"},{"$f":"IF(B$6,IF(SUMIF(Data!$I:$I,$A232,Data!K:K)=0,#N/A,SUMIF(Data!$I:$I,$A232,Data!K:K)),#N/A)","v":{"$error":"#N/A"}},{"$f":"IF(C$6,IF(SUMIF(Data!$I:$I,$A232,Data!L:L)=0,#N/A,SUMIF(Data!$I:$I,$A232,Data!L:L)),#N/A)","v":{"$error":"#N/A"}},{"$f":"IF(D$6,IF(SUMIF(Data!$I:$I,$A232,Data!M:M)=0,#N/A,SUMIF(Data!$I:$I,$A232,Data!M:M)),#N/A)","v":{"$error":"#N/A"}},{"$f":"IF(E$6,IF(SUMIF(Data!$I:$I,$A232,Data!N:N)=0,#N/A,SUMIF(Data!$I:$I,$A232,Data!N:N)),#N/A)","v":{"$error":"#N/A"}},{"$f":"IF(F$6,IF(SUMIF(Data!$I:$I,$A232,Data!O:O)=0,#N/A,SUMIF(Data!$I:$I,$A232,Data!O:O)),#N/A)","v":{"$error":"#N/A"}},{"$f":"IF(G$6,IF(SUMIF(Data!$I:$I,$A232,Data!P:P)=0,#N/A,SUMIF(Data!$I:$I,$A232,Data!P:P)),#N/A)","v":{"$error":"#N/A"}},{"$f":"IF(H$6,IF(SUMIF(Data!$I:$I,$A232,Data!Q:Q)=0,#N/A,SUMIF(Data!$I:$I,$A232,Data!Q:Q)),#N/A)","v":{"$error":"#N/A"}},{"$f":"IF(I$6,IF(SUMIF(Data!$I:$I,$A232,Data!R:R)=0,#N/A,SUMIF(Data!$I:$I,$A232,Data!R:R)),#N/A)","v":{"$error":"#N/A"}},{"$f":"IF(J$6,IF(SUMIF(Data!$I:$I,$A232,Data!S:S)=0,#N/A,SUMIF(Data!$I:$I,$A232,Data!S:S)),#N/A)","v":{"$error":"#N/A"}},{"$f":"IF(K$6,IF(SUMIF(Data!$I:$I,$A232,Data!T:T)=0,#N/A,SUMIF(Data!$I:$I,$A232,Data!T:T)),#N/A)","v":{"$error":"#N/A"}}]
[{"$error":"#N/A"},{"$f":"IF(B$6,IF(SUMIF(Data!$I:$I,$A233,Data!K:K)=0,#N/A,SUMIF(Data!$I:$I,$A233,Data!K:K)),#N/A)","v":{"$error":"#N/A"}},{"$f":"IF(C$6,IF(SUMIF(Data!$I:$I,$A233,Data!L:L)=0,#N/A,SUMIF(Data!$I:$I,$A233,Data!L:L)),#N/A)","v":{"$error":"#N/A"}},{"$f":"IF(D$6,IF(SUMIF(Data!$I:$I,$A233,Data!M:M)=0,#N/A,SUMIF(Data!$I:$I,$A233,Data!M:M)),#N/A)","v":{"$error":"#N/A"}},{"$f":"IF(E$6,IF(SUMIF(Data!$I:$I,$A233,Data!N:N)=0,#N/A,SUMIF(Data!$I:$I,$A233,Data!N:N)),#N/A)","v":{"$error":"#N/A"}},{"$f":"IF(F$6,IF(SUMIF(Data!$I:$I,$A233,Data!O:O)=0,#N/A,SUMIF(Data!$I:$I,$A233,Data!O:O)),#N/A)","v":{"$error":"#N/A"}},{"$f":"IF(G$6,IF(SUMIF(Data!$I:$I,$A233,Data!P:P)=0,#N/A,SUMIF(Data!$I:$I,$A233,Data!P:P)),#N/A)","v":{"$error":"#N/A"}},{"$f":"IF(H$6,IF(SUMIF(Data!$I:$I,$A233,Data!Q:Q)=0,#N/A,SUMIF(Data!$I:$I,$A233,Data!Q:Q)),#N/A)","v":{"$error":"#N/A"}},{"$f":"IF(I$6,IF(SUMIF(Data!$I:$I,$A233,Data!R:R)=0,#N/A,SUMIF(Data!$I:$I,$A233,Data!R:R)),#N/A)","v":{"$error":"#N/A"}},{"$f":"IF(J$6,IF(SUMIF(Data!$I:$I,$A233,Data!S:S)=0,#N/A,SUMIF(Data!$I:$I,$A233,Data!S:S)),#N/A)","v":{"$error":"#N/A"}},{"$f":"IF(K$6,IF(SUMIF(Data!$I:$I,$A233,Data!T:T)=0,#N/A,SUMIF(Data!$I:$I,$A233,Data!T:T)),#N/A)","v":{"$error":"#N/A"}}]
[{"$error":"#N/A"},{"$f":"IF(B$6,IF(SUMIF(Data!$I:$I,$A234,Data!K:K)=0,#N/A,SUMIF(Data!$I:$I,$A234,Data!K:K)),#N/A)","v":{"$error":"#N/A"}},{"$f":"IF(C$6,IF(SUMIF(Data!$I:$I,$A234,Data!L:L)=0,#N/A,SUMIF(Data!$I:$I,$A234,Data!L:L)),#N/A)","v":{"$error":"#N/A"}},{"$f":"IF(D$6,IF(SUMIF(Data!$I:$I,$A234,Data!M:M)=0,#N/A,SUMIF(Data!$I:$I,$A234,Data!M:M)),#N/A)","v":{"$error":"#N/A"}},{"$f":"IF(E$6,IF(SUMIF(Data!$I:$I,$A234,Data!N:N)=0,#N/A,SUMIF(Data!$I:$I,$A234,Data!N:N)),#N/A)","v":{"$error":"#N/A"}},{"$f":"IF(F$6,IF(SUMIF(Data!$I:$I,$A234,Data!O:O)=0,#N/A,SUMIF(Data!$I:$I,$A234,Data!O:O)),#N/A)","v":{"$error":"#N/A"}},{"$f":"IF(G$6,IF(SUMIF(Data!$I:$I,$A234,Data!P:P)=0,#N/A,SUMIF(Data!$I:$I,$A234,Data!P:P)),#N/A)","v":{"$error":"#N/A"}},{"$f":"IF(H$6,IF(SUMIF(Data!$I:$I,$A234,Data!Q:Q)=0,#N/A,SUMIF(Data!$I:$I,$A234,Data!Q:Q)),#N/A)","v":{"$error":"#N/A"}},{"$f":"IF(I$6,IF(SUMIF(Data!$I:$I,$A234,Data!R:R)=0,#N/A,SUMIF(Data!$I:$I,$A234,Data!R:R)),#N/A)","v":{"$error":"#N/A"}},{"$f":"IF(J$6,IF(SUMIF(Data!$I:$I,$A234,Data!S:S)=0,#N/A,SUMIF(Data!$I:$I,$A234,Data!S:S)),#N/A)","v":{"$error":"#N/A"}},{"$f":"IF(K$6,IF(SUMIF(Data!$I:$I,$A234,Data!T:T)=0,#N/A,SUMIF(Data!$I:$I,$A234,Data!T:T)),#N/A)","v":{"$error":"#N/A"}}]
[{"$error":"#N/A"},{"$f":"IF(B$6,IF(SUMIF(Data!$I:$I,$A235,Data!K:K)=0,#N/A,SUMIF(Data!$I:$I,$A235,Data!K:K)),#N/A)","v":{"$error":"#N/A"}},{"$f":"IF(C$6,IF(SUMIF(Data!$I:$I,$A235,Data!L:L)=0,#N/A,SUMIF(Data!$I:$I,$A235,Data!L:L)),#N/A)","v":{"$error":"#N/A"}},{"$f":"IF(D$6,IF(SUMIF(Data!$I:$I,$A235,Data!M:M)=0,#N/A,SUMIF(Data!$I:$I,$A235,Data!M:M)),#N/A)","v":{"$error":"#N/A"}},{"$f":"IF(E$6,IF(SUMIF(Data!$I:$I,$A235,Data!N:N)=0,#N/A,SUMIF(Data!$I:$I,$A235,Data!N:N)),#N/A)","v":{"$error":"#N/A"}},{"$f":"IF(F$6,IF(SUMIF(Data!$I:$I,$A235,Data!O:O)=0,#N/A,SUMIF(Data!$I:$I,$A235,Data!O:O)),#N/A)","v":{"$error":"#N/A"}},{"$f":"IF(G$6,IF(SUMIF(Data!$I:$I,$A235,Data!P:P)=0,#N/A,SUMIF(Data!$I:$I,$A235,Data!P:P)),#N/A)","v":{"$error":"#N/A"}},{"$f":"IF(H$6,IF(SUMIF(Data!$I:$I,$A235,Data!Q:Q)=0,#N/A,SUMIF(Data!$I:$I,$A235,Data!Q:Q)),#N/A)","v":{"$error":"#N/A"}},{"$f":"IF(I$6,IF(SUMIF(Data!$I:$I,$A235,Data!R:R)=0,#N/A,SUMIF(Data!$I:$I,$A235,Data!R:R)),#N/A)","v":{"$error":"#N/A"}},{"$f":"IF(J$6,IF(SUMIF(Data!$I:$I,$A235,Data!S:S)=0,#N/A,SUMIF(Data!$I:$I,$A235,Data!S:S)),#N/A)","v":{"$error":"#N/A"}},{"$f":"IF(K$6,IF(SUMIF(Data!$I:$I,$A235,Data!T:T)=0,#N/A,SUMIF(Data!$I:$I,$A235,Data!T:T)),#N/A)","v":{"$error":"#N/A"}}]
[{"$error":"#N/A"},{"$f":"IF(B$6,IF(SUMIF(Data!$I:$I,$A236,Data!K:K)=0,#N/A,SUMIF(Data!$I:$I,$A236,Data!K:K)),#N/A)","v":{"$error":"#N/A"}},{"$f":"IF(C$6,IF(SUMIF(Data!$I:$I,$A236,Data!L:L)=0,#N/A,SUMIF(Data!$I:$I,$A236,Data!L:L)),#N/A)","v":{"$error":"#N/A"}},{"$f":"IF(D$6,IF(SUMIF(Data!$I:$I,$A236,Data!M:M)=0,#N/A,SUMIF(Data!$I:$I,$A236,Data!M:M)),#N/A)","v":{"$error":"#N/A"}},{"$f":"IF(E$6,IF(SUMIF(Data!$I:$I,$A236,Data!N:N)=0,#N/A,SUMIF(Data!$I:$I,$A236,Data!N:N)),#N/A)","v":{"$error":"#N/A"}},{"$f":"IF(F$6,IF(SUMIF(Data!$I:$I,$A236,Data!O:O)=0,#N/A,SUMIF(Data!$I:$I,$A236,Data!O:O)),#N/A)","v":{"$error":"#N/A"}},{"$f":"IF(G$6,IF(SUMIF(Data!$I:$I,$A236,Data!P:P)=0,#N/A,SUMIF(Data!$I:$I,$A236,Data!P:P)),#N/A)","v":{"$error":"#N/A"}},{"$f":"IF(H$6,IF(SUMIF(Data!$I:$I,$A236,Data!Q:Q)=0,#N/A,SUMIF(Data!$I:$I,$A236,Data!Q:Q)),#N/A)","v":{"$error":"#N/A"}},{"$f":"IF(I$6,IF(SUMIF(Data!$I:$I,$A236,Data!R:R)=0,#N/A,SUMIF(Data!$I:$I,$A236,Data!R:R)),#N/A)","v":{"$error":"#N/A"}},{"$f":"IF(J$6,IF(SUMIF(Data!$I:$I,$A236,Data!S:S)=0,#N/A,SUMIF(Data!$I:$I,$A236,Data!S:S)),#N/A)","v":{"$error":"#N/A"}},{"$f":"IF(K$6,IF(SUMIF(Data!$I:$I,$A236,Data!T:T)=0,#N/A,SUMIF(Data!$I:$I,$A236,Data!T:T)),#N/A)","v":{"$error":"#N/A"}}]
[{"$error":"#N/A"},{"$f":"IF(B$6,IF(SUMIF(Data!$I:$I,$A237,Data!K:K)=0,#N/A,SUMIF(Data!$I:$I,$A237,Data!K:K)),#N/A)","v":{"$error":"#N/A"}},{"$f":"IF(C$6,IF(SUMIF(Data!$I:$I,$A237,Data!L:L)=0,#N/A,SUMIF(Data!$I:$I,$A237,Data!L:L)),#N/A)","v":{"$error":"#N/A"}},{"$f":"IF(D$6,IF(SUMIF(Data!$I:$I,$A237,Data!M:M)=0,#N/A,SUMIF(Data!$I:$I,$A237,Data!M:M)),#N/A)","v":{"$error":"#N/A"}},{"$f":"IF(E$6,IF(SUMIF(Data!$I:$I,$A237,Data!N:N)=0,#N/A,SUMIF(Data!$I:$I,$A237,Data!N:N)),#N/A)","v":{"$error":"#N/A"}},{"$f":"IF(F$6,IF(SUMIF(Data!$I:$I,$A237,Data!O:O)=0,#N/A,SUMIF(Data!$I:$I,$A237,Data!O:O)),#N/A)","v":{"$error":"#N/A"}},{"$f":"IF(G$6,IF(SUMIF(Data!$I:$I,$A237,Data!P:P)=0,#N/A,SUMIF(Data!$I:$I,$A237,Data!P:P)),#N/A)","v":{"$error":"#N/A"}},{"$f":"IF(H$6,IF(SUMIF(Data!$I:$I,$A237,Data!Q:Q)=0,#N/A,SUMIF(Data!$I:$I,$A237,Data!Q:Q)),#N/A)","v":{"$error":"#N/A"}},{"$f":"IF(I$6,IF(SUMIF(Data!$I:$I,$A237,Data!R:R)=0,#N/A,SUMIF(Data!$I:$I,$A237,Data!R:R)),#N/A)","v":{"$error":"#N/A"}},{"$f":"IF(J$6,IF(SUMIF(Data!$I:$I,$A237,Data!S:S)=0,#N/A,SUMIF(Data!$I:$I,$A237,Data!S:S)),#N/A)","v":{"$error":"#N/A"}},{"$f":"IF(K$6,IF(SUMIF(Data!$I:$I,$A237,Data!T:T)=0,#N/A,SUMIF(Data!$I:$I,$A237,Data!T:T)),#N/A)","v":{"$error":"#N/A"}}]
[{"$error":"#N/A"},{"$f":"IF(B$6,IF(SUMIF(Data!$I:$I,$A238,Data!K:K)=0,#N/A,SUMIF(Data!$I:$I,$A238,Data!K:K)),#N/A)","v":{"$error":"#N/A"}},{"$f":"IF(C$6,IF(SUMIF(Data!$I:$I,$A238,Data!L:L)=0,#N/A,SUMIF(Data!$I:$I,$A238,Data!L:L)),#N/A)","v":{"$error":"#N/A"}},{"$f":"IF(D$6,IF(SUMIF(Data!$I:$I,$A238,Data!M:M)=0,#N/A,SUMIF(Data!$I:$I,$A238,Data!M:M)),#N/A)","v":{"$error":"#N/A"}},{"$f":"IF(E$6,IF(SUMIF(Data!$I:$I,$A238,Data!N:N)=0,#N/A,SUMIF(Data!$I:$I,$A238,Data!N:N)),#N/A)","v":{"$error":"#N/A"}},{"$f":"IF(F$6,IF(SUMIF(Data!$I:$I,$A238,Data!O:O)=0,#N/A,SUMIF(Data!$I:$I,$A238,Data!O:O)),#N/A)","v":{"$error":"#N/A"}},{"$f":"IF(G$6,IF(SUMIF(Data!$I:$I,$A238,Data!P:P)=0,#N/A,SUMIF(Data!$I:$I,$A238,Data!P:P)),#N/A)","v":{"$error":"#N/A"}},{"$f":"IF(H$6,IF(SUMIF(Data!$I:$I,$A238,Data!Q:Q)=0,#N/A,SUMIF(Data!$I:$I,$A238,Data!Q:Q)),#N/A)","v":{"$error":"#N/A"}},{"$f":"IF(I$6,IF(SUMIF(Data!$I:$I,$A238,Data!R:R)=0,#N/A,SUMIF(Data!$I:$I,$A238,Data!R:R)),#N/A)","v":{"$error":"#N/A"}},{"$f":"IF(J$6,IF(SUMIF(Data!$I:$I,$A238,Data!S:S)=0,#N/A,SUMIF(Data!$I:$I,$A238,Data!S:S)),#N/A)","v":{"$error":"#N/A"}},{"$f":"IF(K$6,IF(SUMIF(Data!$I:$I,$A238,Data!T:T)=0,#N/A,SUMIF(Data!$I:$I,$A238,Data!T:T)),#N/A)","v":{"$error":"#N/A"}}]
[{"$error":"#N/A"},{"$f":"IF(B$6,IF(SUMIF(Data!$I:$I,$A239,Data!K:K)=0,#N/A,SUMIF(Data!$I:$I,$A239,Data!K:K)),#N/A)","v":{"$error":"#N/A"}},{"$f":"IF(C$6,IF(SUMIF(Data!$I:$I,$A239,Data!L:L)=0,#N/A,SUMIF(Data!$I:$I,$A239,Data!L:L)),#N/A)","v":{"$error":"#N/A"}},{"$f":"IF(D$6,IF(SUMIF(Data!$I:$I,$A239,Data!M:M)=0,#N/A,SUMIF(Data!$I:$I,$A239,Data!M:M)),#N/A)","v":{"$error":"#N/A"}},{"$f":"IF(E$6,IF(SUMIF(Data!$I:$I,$A239,Data!N:N)=0,#N/A,SUMIF(Data!$I:$I,$A239,Data!N:N)),#N/A)","v":{"$error":"#N/A"}},{"$f":"IF(F$6,IF(SUMIF(Data!$I:$I,$A239,Data!O:O)=0,#N/A,SUMIF(Data!$I:$I,$A239,Data!O:O)),#N/A)","v":{"$error":"#N/A"}},{"$f":"IF(G$6,IF(SUMIF(Data!$I:$I,$A239,Data!P:P)=0,#N/A,SUMIF(Data!$I:$I,$A239,Data!P:P)),#N/A)","v":{"$error":"#N/A"}},{"$f":"IF(H$6,IF(SUMIF(Data!$I:$I,$A239,Data!Q:Q)=0,#N/A,SUMIF(Data!$I:$I,$A239,Data!Q:Q)),#N/A)","v":{"$error":"#N/A"}},{"$f":"IF(I$6,IF(SUMIF(Data!$I:$I,$A239,Data!R:R)=0,#N/A,SUMIF(Data!$I:$I,$A239,Data!R:R)),#N/A)","v":{"$error":"#N/A"}},{"$f":"IF(J$6,IF(SUMIF(Data!$I:$I,$A239,Data!S:S)=0,#N/A,SUMIF(Data!$I:$I,$A239,Data!S:S)),#N/A)","v":{"$error":"#N/A"}},{"$f":"IF(K$6,IF(SUMIF(Data!$I:$I,$A239,Data!T:T)=0,#N/A,SUMIF(Data!$I:$I,$A239,Data!T:T)),#N/A)","v":{"$error":"#N/A"}}]
[{"$error":"#N/A"},{"$f":"IF(B$6,IF(SUMIF(Data!$I:$I,$A240,Data!K:K)=0,#N/A,SUMIF(Data!$I:$I,$A240,Data!K:K)),#N/A)","v":{"$error":"#N/A"}},{"$f":"IF(C$6,IF(SUMIF(Data!$I:$I,$A240,Data!L:L)=0,#N/A,SUMIF(Data!$I:$I,$A240,Data!L:L)),#N/A)","v":{"$error":"#N/A"}},{"$f":"IF(D$6,IF(SUMIF(Data!$I:$I,$A240,Data!M:M)=0,#N/A,SUMIF(Data!$I:$I,$A240,Data!M:M)),#N/A)","v":{"$error":"#N/A"}},{"$f":"IF(E$6,IF(SUMIF(Data!$I:$I,$A240,Data!N:N)=0,#N/A,SUMIF(Data!$I:$I,$A240,Data!N:N)),#N/A)","v":{"$error":"#N/A"}},{"$f":"IF(F$6,IF(SUMIF(Data!$I:$I,$A240,Data!O:O)=0,#N/A,SUMIF(Data!$I:$I,$A240,Data!O:O)),#N/A)","v":{"$error":"#N/A"}},{"$f":"IF(G$6,IF(SUMIF(Data!$I:$I,$A240,Data!P:P)=0,#N/A,SUMIF(Data!$I:$I,$A240,Data!P:P)),#N/A)","v":{"$error":"#N/A"}},{"$f":"IF(H$6,IF(SUMIF(Data!$I:$I,$A240,Data!Q:Q)=0,#N/A,SUMIF(Data!$I:$I,$A240,Data!Q:Q)),#N/A)","v":{"$error":"#N/A"}},{"$f":"IF(I$6,IF(SUMIF(Data!$I:$I,$A240,Data!R:R)=0,#N/A,SUMIF(Data!$I:$I,$A240,Data!R:R)),#N/A)","v":{"$error":"#N/A"}},{"$f":"IF(J$6,IF(SUMIF(Data!$I:$I,$A240,Data!S:S)=0,#N/A,SUMIF(Data!$I:$I,$A240,Data!S:S)),#N/A)","v":{"$error":"#N/A"}},{"$f":"IF(K$6,IF(SUMIF(Data!$I:$I,$A240,Data!T:T)=0,#N/A,SUMIF(Data!$I:$I,$A240,Data!T:T)),#N/A)","v":{"$error":"#N/A"}}]
[{"$error":"#N/A"},{"$f":"IF(B$6,IF(SUMIF(Data!$I:$I,$A241,Data!K:K)=0,#N/A,SUMIF(Data!$I:$I,$A241,Data!K:K)),#N/A)","v":{"$error":"#N/A"}},{"$f":"IF(C$6,IF(SUMIF(Data!$I:$I,$A241,Data!L:L)=0,#N/A,SUMIF(Data!$I:$I,$A241,Data!L:L)),#N/A)","v":{"$error":"#N/A"}},{"$f":"IF(D$6,IF(SUMIF(Data!$I:$I,$A241,Data!M:M)=0,#N/A,SUMIF(Data!$I:$I,$A241,Data!M:M)),#N/A)","v":{"$error":"#N/A"}},{"$f":"IF(E$6,IF(SUMIF(Data!$I:$I,$A241,Data!N:N)=0,#N/A,SUMIF(Data!$I:$I,$A241,Data!N:N)),#N/A)","v":{"$error":"#N/A"}},{"$f":"IF(F$6,IF(SUMIF(Data!$I:$I,$A241,Data!O:O)=0,#N/A,SUMIF(Data!$I:$I,$A241,Data!O:O)),#N/A)","v":{"$error":"#N/A"}},{"$f":"IF(G$6,IF(SUMIF(Data!$I:$I,$A241,Data!P:P)=0,#N/A,SUMIF(Data!$I:$I,$A241,Data!P:P)),#N/A)","v":{"$error":"#N/A"}},{"$f":"IF(H$6,IF(SUMIF(Data!$I:$I,$A241,Data!Q:Q)=0,#N/A,SUMIF(Data!$I:$I,$A241,Data!Q:Q)),#N/A)","v":{"$error":"#N/A"}},{"$f":"IF(I$6,IF(SUMIF(Data!$I:$I,$A241,Data!R:R)=0,#N/A,SUMIF(Data!$I:$I,$A241,Data!R:R)),#N/A)","v":{"$error":"#N/A"}},{"$f":"IF(J$6,IF(SUMIF(Data!$I:$I,$A241,Data!S:S)=0,#N/A,SUMIF(Data!$I:$I,$A241,Data!S:S)),#N/A)","v":{"$error":"#N/A"}},{"$f":"IF(K$6,IF(SUMIF(Data!$I:$I,$A241,Data!T:T)=0,#N/A,SUMIF(Data!$I:$I,$A241,Data!T:T)),#N/A)","v":{"$error":"#N/A"}}]
[{"$error":"#N/A"},{"$f":"IF(B$6,IF(SUMIF(Data!$I:$I,$A242,Data!K:K)=0,#N/A,SUMIF(Data!$I:$I,$A242,Data!K:K)),#N/A)","v":{"$error":"#N/A"}},{"$f":"IF(C$6,IF(SUMIF(Data!$I:$I,$A242,Data!L:L)=0,#N/A,SUMIF(Data!$I:$I,$A242,Data!L:L)),#N/A)","v":{"$error":"#N/A"}},{"$f":"IF(D$6,IF(SUMIF(Data!$I:$I,$A242,Data!M:M)=0,#N/A,SUMIF(Data!$I:$I,$A242,Data!M:M)),#N/A)","v":{"$error":"#N/A"}},{"$f":"IF(E$6,IF(SUMIF(Data!$I:$I,$A242,Data!N:N)=0,#N/A,SUMIF(Data!$I:$I,$A242,Data!N:N)),#N/A)","v":{"$error":"#N/A"}},{"$f":"IF(F$6,IF(SUMIF(Data!$I:$I,$A242,Data!O:O)=0,#N/A,SUMIF(Data!$I:$I,$A242,Data!O:O)),#N/A)","v":{"$error":"#N/A"}},{"$f":"IF(G$6,IF(SUMIF(Data!$I:$I,$A242,Data!P:P)=0,#N/A,SUMIF(Data!$I:$I,$A242,Data!P:P)),#N/A)","v":{"$error":"#N/A"}},{"$f":"IF(H$6,IF(SUMIF(Data!$I:$I,$A242,Data!Q:Q)=0,#N/A,SUMIF(Data!$I:$I,$A242,Data!Q:Q)),#N/A)","v":{"$error":"#N/A"}},{"$f":"IF(I$6,IF(SUMIF(Data!$I:$I,$A242,Data!R:R)=0,#N/A,SUMIF(Data!$I:$I,$A242,Data!R:R)),#N/A)","v":{"$error":"#N/A"}},{"$f":"IF(J$6,IF(SUMIF(Data!$I:$I,$A242,Data!S:S)=0,#N/A,SUMIF(Data!$I:$I,$A242,Data!S:S)),#N/A)","v":{"$error":"#N/A"}},{"$f":"IF(K$6,IF(SUMIF(Data!$I:$I,$A242,Data!T:T)=0,#N/A,SUMIF(Data!$I:$I,$A242,Data!T:T)),#N/A)","v":{"$error":"#N/A"}}]
[{"$error":"#N/A"},{"$f":"IF(B$6,IF(SUMIF(Data!$I:$I,$A243,Data!K:K)=0,#N/A,SUMIF(Data!$I:$I,$A243,Data!K:K)),#N/A)","v":{"$error":"#N/A"}},{"$f":"IF(C$6,IF(SUMIF(Data!$I:$I,$A243,Data!L:L)=0,#N/A,SUMIF(Data!$I:$I,$A243,Data!L:L)),#N/A)","v":{"$error":"#N/A"}},{"$f":"IF(D$6,IF(SUMIF(Data!$I:$I,$A243,Data!M:M)=0,#N/A,SUMIF(Data!$I:$I,$A243,Data!M:M)),#N/A)","v":{"$error":"#N/A"}},{"$f":"IF(E$6,IF(SUMIF(Data!$I:$I,$A243,Data!N:N)=0,#N/A,SUMIF(Data!$I:$I,$A243,Data!N:N)),#N/A)","v":{"$error":"#N/A"}},{"$f":"IF(F$6,IF(SUMIF(Data!$I:$I,$A243,Data!O:O)=0,#N/A,SUMIF(Data!$I:$I,$A243,Data!O:O)),#N/A)","v":{"$error":"#N/A"}},{"$f":"IF(G$6,IF(SUMIF(Data!$I:$I,$A243,Data!P:P)=0,#N/A,SUMIF(Data!$I:$I,$A243,Data!P:P)),#N/A)","v":{"$error":"#N/A"}},{"$f":"IF(H$6,IF(SUMIF(Data!$I:$I,$A243,Data!Q:Q)=0,#N/A,SUMIF(Data!$I:$I,$A243,Data!Q:Q)),#N/A)","v":{"$error":"#N/A"}},{"$f":"IF(I$6,IF(SUMIF(Data!$I:$I,$A243,Data!R:R)=0,#N/A,SUMIF(Data!$I:$I,$A243,Data!R:R)),#N/A)","v":{"$error":"#N/A"}},{"$f":"IF(J$6,IF(SUMIF(Data!$I:$I,$A243,Data!S:S)=0,#N/A,SUMIF(Data!$I:$I,$A243,Data!S:S)),#N/A)","v":{"$error":"#N/A"}},{"$f":"IF(K$6,IF(SUMIF(Data!$I:$I,$A243,Data!T:T)=0,#N/A,SUMIF(Data!$I:$I,$A243,Data!T:T)),#N/A)","v":{"$error":"#N/A"}}]
[{"$error":"#N/A"},{"$f":"IF(B$6,IF(SUMIF(Data!$I:$I,$A244,Data!K:K)=0,#N/A,SUMIF(Data!$I:$I,$A244,Data!K:K)),#N/A)","v":{"$error":"#N/A"}},{"$f":"IF(C$6,IF(SUMIF(Data!$I:$I,$A244,Data!L:L)=0,#N/A,SUMIF(Data!$I:$I,$A244,Data!L:L)),#N/A)","v":{"$error":"#N/A"}},{"$f":"IF(D$6,IF(SUMIF(Data!$I:$I,$A244,Data!M:M)=0,#N/A,SUMIF(Data!$I:$I,$A244,Data!M:M)),#N/A)","v":{"$error":"#N/A"}},{"$f":"IF(E$6,IF(SUMIF(Data!$I:$I,$A244,Data!N:N)=0,#N/A,SUMIF(Data!$I:$I,$A244,Data!N:N)),#N/A)","v":{"$error":"#N/A"}},{"$f":"IF(F$6,IF(SUMIF(Data!$I:$I,$A244,Data!O:O)=0,#N/A,SUMIF(Data!$I:$I,$A244,Data!O:O)),#N/A)","v":{"$error":"#N/A"}},{"$f":"IF(G$6,IF(SUMIF(Data!$I:$I,$A244,Data!P:P)=0,#N/A,SUMIF(Data!$I:$I,$A244,Data!P:P)),#N/A)","v":{"$error":"#N/A"}},{"$f":"IF(H$6,IF(SUMIF(Data!$I:$I,$A244,Data!Q:Q)=0,#N/A,SUMIF(Data!$I:$I,$A244,Data!Q:Q)),#N/A)","v":{"$error":"#N/A"}},{"$f":"IF(I$6,IF(SUMIF(Data!$I:$I,$A244,Data!R:R)=0,#N/A,SUMIF(Data!$I:$I,$A244,Data!R:R)),#N/A)","v":{"$error":"#N/A"}},{"$f":"IF(J$6,IF(SUMIF(Data!$I:$I,$A244,Data!S:S)=0,#N/A,SUMIF(Data!$I:$I,$A244,Data!S:S)),#N/A)","v":{"$error":"#N/A"}},{"$f":"IF(K$6,IF(SUMIF(Data!$I:$I,$A244,Data!T:T)=0,#N/A,SUMIF(Data!$I:$I,$A244,Data!T:T)),#N/A)","v":{"$error":"#N/A"}}]
[{"$error":"#N/A"},{"$f":"IF(B$6,IF(SUMIF(Data!$I:$I,$A245,Data!K:K)=0,#N/A,SUMIF(Data!$I:$I,$A245,Data!K:K)),#N/A)","v":{"$error":"#N/A"}},{"$f":"IF(C$6,IF(SUMIF(Data!$I:$I,$A245,Data!L:L)=0,#N/A,SUMIF(Data!$I:$I,$A245,Data!L:L)),#N/A)","v":{"$error":"#N/A"}},{"$f":"IF(D$6,IF(SUMIF(Data!$I:$I,$A245,Data!M:M)=0,#N/A,SUMIF(Data!$I:$I,$A245,Data!M:M)),#N/A)","v":{"$error":"#N/A"}},{"$f":"IF(E$6,IF(SUMIF(Data!$I:$I,$A245,Data!N:N)=0,#N/A,SUMIF(Data!$I:$I,$A245,Data!N:N)),#N/A)","v":{"$error":"#N/A"}},{"$f":"IF(F$6,IF(SUMIF(Data!$I:$I,$A245,Data!O:O)=0,#N/A,SUMIF(Data!$I:$I,$A245,Data!O:O)),#N/A)","v":{"$error":"#N/A"}},{"$f":"IF(G$6,IF(SUMIF(Data!$I:$I,$A245,Data!P:P)=0,#N/A,SUMIF(Data!$I:$I,$A245,Data!P:P)),#N/A)","v":{"$error":"#N/A"}},{"$f":"IF(H$6,IF(SUMIF(Data!$I:$I,$A245,Data!Q:Q)=0,#N/A,SUMIF(Data!$I:$I,$A245,Data!Q:Q)),#N/A)","v":{"$error":"#N/A"}},{"$f":"IF(I$6,IF(SUMIF(Data!$I:$I,$A245,Data!R:R)=0,#N/A,SUMIF(Data!$I:$I,$A245,Data!R:R)),#N/A)","v":{"$error":"#N/A"}},{"$f":"IF(J$6,IF(SUMIF(Data!$I:$I,$A245,Data!S:S)=0,#N/A,SUMIF(Data!$I:$I,$A245,Data!S:S)),#N/A)","v":{"$error":"#N/A"}},{"$f":"IF(K$6,IF(SUMIF(Data!$I:$I,$A245,Data!T:T)=0,#N/A,SUMIF(Data!$I:$I,$A245,Data!T:T)),#N/A)","v":{"$error":"#N/A"}}]
[{"$error":"#N/A"},{"$f":"IF(B$6,IF(SUMIF(Data!$I:$I,$A246,Data!K:K)=0,#N/A,SUMIF(Data!$I:$I,$A246,Data!K:K)),#N/A)","v":{"$error":"#N/A"}},{"$f":"IF(C$6,IF(SUMIF(Data!$I:$I,$A246,Data!L:L)=0,#N/A,SUMIF(Data!$I:$I,$A246,Data!L:L)),#N/A)","v":{"$error":"#N/A"}},{"$f":"IF(D$6,IF(SUMIF(Data!$I:$I,$A246,Data!M:M)=0,#N/A,SUMIF(Data!$I:$I,$A246,Data!M:M)),#N/A)","v":{"$error":"#N/A"}},{"$f":"IF(E$6,IF(SUMIF(Data!$I:$I,$A246,Data!N:N)=0,#N/A,SUMIF(Data!$I:$I,$A246,Data!N:N)),#N/A)","v":{"$error":"#N/A"}},{"$f":"IF(F$6,IF(SUMIF(Data!$I:$I,$A246,Data!O:O)=0,#N/A,SUMIF(Data!$I:$I,$A246,Data!O:O)),#N/A)","v":{"$error":"#N/A"}},{"$f":"IF(G$6,IF(SUMIF(Data!$I:$I,$A246,Data!P:P)=0,#N/A,SUMIF(Data!$I:$I,$A246,Data!P:P)),#N/A)","v":{"$error":"#N/A"}},{"$f":"IF(H$6,IF(SUMIF(Data!$I:$I,$A246,Data!Q:Q)=0,#N/A,SUMIF(Data!$I:$I,$A246,Data!Q:Q)),#N/A)","v":{"$error":"#N/A"}},{"$f":"IF(I$6,IF(SUMIF(Data!$I:$I,$A246,Data!R:R)=0,#N/A,SUMIF(Data!$I:$I,$A246,Data!R:R)),#N/A)","v":{"$error":"#N/A"}},{"$f":"IF(J$6,IF(SUMIF(Data!$I:$I,$A246,Data!S:S)=0,#N/A,SUMIF(Data!$I:$I,$A246,Data!S:S)),#N/A)","v":{"$error":"#N/A"}},{"$f":"IF(K$6,IF(SUMIF(Data!$I:$I,$A246,Data!T:T)=0,#N/A,SUMIF(Data!$I:$I,$A246,Data!T:T)),#N/A)","v":{"$error":"#N/A"}}]
[{"$error":"#N/A"},{"$f":"IF(B$6,IF(SUMIF(Data!$I:$I,$A247,Data!K:K)=0,#N/A,SUMIF(Data!$I:$I,$A247,Data!K:K)),#N/A)","v":{"$error":"#N/A"}},{"$f":"IF(C$6,IF(SUMIF(Data!$I:$I,$A247,Data!L:L)=0,#N/A,SUMIF(Data!$I:$I,$A247,Data!L:L)),#N/A)","v":{"$error":"#N/A"}},{"$f":"IF(D$6,IF(SUMIF(Data!$I:$I,$A247,Data!M:M)=0,#N/A,SUMIF(Data!$I:$I,$A247,Data!M:M)),#N/A)","v":{"$error":"#N/A"}},{"$f":"IF(E$6,IF(SUMIF(Data!$I:$I,$A247,Data!N:N)=0,#N/A,SUMIF(Data!$I:$I,$A247,Data!N:N)),#N/A)","v":{"$error":"#N/A"}},{"$f":"IF(F$6,IF(SUMIF(Data!$I:$I,$A247,Data!O:O)=0,#N/A,SUMIF(Data!$I:$I,$A247,Data!O:O)),#N/A)","v":{"$error":"#N/A"}},{"$f":"IF(G$6,IF(SUMIF(Data!$I:$I,$A247,Data!P:P)=0,#N/A,SUMIF(Data!$I:$I,$A247,Data!P:P)),#N/A)","v":{"$error":"#N/A"}},{"$f":"IF(H$6,IF(SUMIF(Data!$I:$I,$A247,Data!Q:Q)=0,#N/A,SUMIF(Data!$I:$I,$A247,Data!Q:Q)),#N/A)","v":{"$error":"#N/A"}},{"$f":"IF(I$6,IF(SUMIF(Data!$I:$I,$A247,Data!R:R)=0,#N/A,SUMIF(Data!$I:$I,$A247,Data!R:R)),#N/A)","v":{"$error":"#N/A"}},{"$f":"IF(J$6,IF(SUMIF(Data!$I:$I,$A247,Data!S:S)=0,#N/A,SUMIF(Data!$I:$I,$A247,Data!S:S)),#N/A)","v":{"$error":"#N/A"}},{"$f":"IF(K$6,IF(SUMIF(Data!$I:$I,$A247,Data!T:T)=0,#N/A,SUMIF(Data!$I:$I,$A247,Data!T:T)),#N/A)","v":{"$error":"#N/A"}}]
[{"$error":"#N/A"},{"$f":"IF(B$6,IF(SUMIF(Data!$I:$I,$A248,Data!K:K)=0,#N/A,SUMIF(Data!$I:$I,$A248,Data!K:K)),#N/A)","v":{"$error":"#N/A"}},{"$f":"IF(C$6,IF(SUMIF(Data!$I:$I,$A248,Data!L:L)=0,#N/A,SUMIF(Data!$I:$I,$A248,Data!L:L)),#N/A)","v":{"$error":"#N/A"}},{"$f":"IF(D$6,IF(SUMIF(Data!$I:$I,$A248,Data!M:M)=0,#N/A,SUMIF(Data!$I:$I,$A248,Data!M:M)),#N/A)","v":{"$error":"#N/A"}},{"$f":"IF(E$6,IF(SUMIF(Data!$I:$I,$A248,Data!N:N)=0,#N/A,SUMIF(Data!$I:$I,$A248,Data!N:N)),#N/A)","v":{"$error":"#N/A"}},{"$f":"IF(F$6,IF(SUMIF(Data!$I:$I,$A248,Data!O:O)=0,#N/A,SUMIF(Data!$I:$I,$A248,Data!O:O)),#N/A)","v":{"$error":"#N/A"}},{"$f":"IF(G$6,IF(SUMIF(Data!$I:$I,$A248,Data!P:P)=0,#N/A,SUMIF(Data!$I:$I,$A248,Data!P:P)),#N/A)","v":{"$error":"#N/A"}},{"$f":"IF(H$6,IF(SUMIF(Data!$I:$I,$A248,Data!Q:Q)=0,#N/A,SUMIF(Data!$I:$I,$A248,Data!Q:Q)),#N/A)","v":{"$error":"#N/A"}},{"$f":"IF(I$6,IF(SUMIF(Data!$I:$I,$A248,Data!R:R)=0,#N/A,SUMIF(Data!$I:$I,$A248,Data!R:R)),#N/A)","v":{"$error":"#N/A"}},{"$f":"IF(J$6,IF(SUMIF(Data!$I:$I,$A248,Data!S:S)=0,#N/A,SUMIF(Data!$I:$I,$A248,Data!S:S)),#N/A)","v":{"$error":"#N/A"}},{"$f":"IF(K$6,IF(SUMIF(Data!$I:$I,$A248,Data!T:T)=0,#N/A,SUMIF(Data!$I:$I,$A248,Data!T:T)),#N/A)","v":{"$error":"#N/A"}}]
[{"$error":"#N/A"},{"$f":"IF(B$6,IF(SUMIF(Data!$I:$I,$A249,Data!K:K)=0,#N/A,SUMIF(Data!$I:$I,$A249,Data!K:K)),#N/A)","v":{"$error":"#N/A"}},{"$f":"IF(C$6,IF(SUMIF(Data!$I:$I,$A249,Data!L:L)=0,#N/A,SUMIF(Data!$I:$I,$A249,Data!L:L)),#N/A)","v":{"$error":"#N/A"}},{"$f":"IF(D$6,IF(SUMIF(Data!$I:$I,$A249,Data!M:M)=0,#N/A,SUMIF(Data!$I:$I,$A249,Data!M:M)),#N/A)","v":{"$error":"#N/A"}},{"$f":"IF(E$6,IF(SUMIF(Data!$I:$I,$A249,Data!N:N)=0,#N/A,SUMIF(Data!$I:$I,$A249,Data!N:N)),#N/A)","v":{"$error":"#N/A"}},{"$f":"IF(F$6,IF(SUMIF(Data!$I:$I,$A249,Data!O:O)=0,#N/A,SUMIF(Data!$I:$I,$A249,Data!O:O)),#N/A)","v":{"$error":"#N/A"}},{"$f":"IF(G$6,IF(SUMIF(Data!$I:$I,$A249,Data!P:P)=0,#N/A,SUMIF(Data!$I:$I,$A249,Data!P:P)),#N/A)","v":{"$error":"#N/A"}},{"$f":"IF(H$6,IF(SUMIF(Data!$I:$I,$A249,Data!Q:Q)=0,#N/A,SUMIF(Data!$I:$I,$A249,Data!Q:Q)),#N/A)","v":{"$error":"#N/A"}},{"$f":"IF(I$6,IF(SUMIF(Data!$I:$I,$A249,Data!R:R)=0,#N/A,SUMIF(Data!$I:$I,$A249,Data!R:R)),#N/A)","v":{"$error":"#N/A"}},{"$f":"IF(J$6,IF(SUMIF(Data!$I:$I,$A249,Data!S:S)=0,#N/A,SUMIF(Data!$I:$I,$A249,Data!S:S)),#N/A)","v":{"$error":"#N/A"}},{"$f":"IF(K$6,IF(SUMIF(Data!$I:$I,$A249,Data!T:T)=0,#N/A,SUMIF(Data!$I:$I,$A249,Data!T:T)),#N/A)","v":{"$error":"#N/A"}}]
[{"$error":"#N/A"},{"$f":"IF(B$6,IF(SUMIF(Data!$I:$I,$A250,Data!K:K)=0,#N/A,SUMIF(Data!$I:$I,$A250,Data!K:K)),#N/A)","v":{"$error":"#N/A"}},{"$f":"IF(C$6,IF(SUMIF(Data!$I:$I,$A250,Data!L:L)=0,#N/A,SUMIF(Data!$I:$I,$A250,Data!L:L)),#N/A)","v":{"$error":"#N/A"}},{"$f":"IF(D$6,IF(SUMIF(Data!$I:$I,$A250,Data!M:M)=0,#N/A,SUMIF(Data!$I:$I,$A250,Data!M:M)),#N/A)","v":{"$error":"#N/A"}},{"$f":"IF(E$6,IF(SUMIF(Data!$I:$I,$A250,Data!N:N)=0,#N/A,SUMIF(Data!$I:$I,$A250,Data!N:N)),#N/A)","v":{"$error":"#N/A"}},{"$f":"IF(F$6,IF(SUMIF(Data!$I:$I,$A250,Data!O:O)=0,#N/A,SUMIF(Data!$I:$I,$A250,Data!O:O)),#N/A)","v":{"$error":"#N/A"}},{"$f":"IF(G$6,IF(SUMIF(Data!$I:$I,$A250,Data!P:P)=0,#N/A,SUMIF(Data!$I:$I,$A250,Data!P:P)),#N/A)","v":{"$error":"#N/A"}},{"$f":"IF(H$6,IF(SUMIF(Data!$I:$I,$A250,Data!Q:Q)=0,#N/A,SUMIF(Data!$I:$I,$A250,Data!Q:Q)),#N/A)","v":{"$error":"#N/A"}},{"$f":"IF(I$6,IF(SUMIF(Data!$I:$I,$A250,Data!R:R)=0,#N/A,SUMIF(Data!$I:$I,$A250,Data!R:R)),#N/A)","v":{"$error":"#N/A"}},{"$f":"IF(J$6,IF(SUMIF(Data!$I:$I,$A250,Data!S:S)=0,#N/A,SUMIF(Data!$I:$I,$A250,Data!S:S)),#N/A)","v":{"$error":"#N/A"}},{"$f":"IF(K$6,IF(SUMIF(Data!$I:$I,$A250,Data!T:T)=0,#N/A,SUMIF(Data!$I:$I,$A250,Data!T:T)),#N/A)","v":{"$error":"#N/A"}}]
[{"$error":"#N/A"},{"$f":"IF(B$6,IF(SUMIF(Data!$I:$I,$A251,Data!K:K)=0,#N/A,SUMIF(Data!$I:$I,$A251,Data!K:K)),#N/A)","v":{"$error":"#N/A"}},{"$f":"IF(C$6,IF(SUMIF(Data!$I:$I,$A251,Data!L:L)=0,#N/A,SUMIF(Data!$I:$I,$A251,Data!L:L)),#N/A)","v":{"$error":"#N/A"}},{"$f":"IF(D$6,IF(SUMIF(Data!$I:$I,$A251,Data!M:M)=0,#N/A,SUMIF(Data!$I:$I,$A251,Data!M:M)),#N/A)","v":{"$error":"#N/A"}},{"$f":"IF(E$6,IF(SUMIF(Data!$I:$I,$A251,Data!N:N)=0,#N/A,SUMIF(Data!$I:$I,$A251,Data!N:N)),#N/A)","v":{"$error":"#N/A"}},{"$f":"IF(F$6,IF(SUMIF(Data!$I:$I,$A251,Data!O:O)=0,#N/A,SUMIF(Data!$I:$I,$A251,Data!O:O)),#N/A)","v":{"$error":"#N/A"}},{"$f":"IF(G$6,IF(SUMIF(Data!$I:$I,$A251,Data!P:P)=0,#N/A,SUMIF(Data!$I:$I,$A251,Data!P:P)),#N/A)","v":{"$error":"#N/A"}},{"$f":"IF(H$6,IF(SUMIF(Data!$I:$I,$A251,Data!Q:Q)=0,#N/A,SUMIF(Data!$I:$I,$A251,Data!Q:Q)),#N/A)","v":{"$error":"#N/A"}},{"$f":"IF(I$6,IF(SUMIF(Data!$I:$I,$A251,Data!R:R)=0,#N/A,SUMIF(Data!$I:$I,$A251,Data!R:R)),#N/A)","v":{"$error":"#N/A"}},{"$f":"IF(J$6,IF(SUMIF(Data!$I:$I,$A251,Data!S:S)=0,#N/A,SUMIF(Data!$I:$I,$A251,Data!S:S)),#N/A)","v":{"$error":"#N/A"}},{"$f":"IF(K$6,IF(SUMIF(Data!$I:$I,$A251,Data!T:T)=0,#N/A,SUMIF(Data!$I:$I,$A251,Data!T:T)),#N/A)","v":{"$error":"#N/A"}}]
[{"$error":"#N/A"},{"$f":"IF(B$6,IF(SUMIF(Data!$I:$I,$A252,Data!K:K)=0,#N/A,SUMIF(Data!$I:$I,$A252,Data!K:K)),#N/A)","v":{"$error":"#N/A"}},{"$f":"IF(C$6,IF(SUMIF(Data!$I:$I,$A252,Data!L:L)=0,#N/A,SUMIF(Data!$I:$I,$A252,Data!L:L)),#N/A)","v":{"$error":"#N/A"}},{"$f":"IF(D$6,IF(SUMIF(Data!$I:$I,$A252,Data!M:M)=0,#N/A,SUMIF(Data!$I:$I,$A252,Data!M:M)),#N/A)","v":{"$error":"#N/A"}},{"$f":"IF(E$6,IF(SUMIF(Data!$I:$I,$A252,Data!N:N)=0,#N/A,SUMIF(Data!$I:$I,$A252,Data!N:N)),#N/A)","v":{"$error":"#N/A"}},{"$f":"IF(F$6,IF(SUMIF(Data!$I:$I,$A252,Data!O:O)=0,#N/A,SUMIF(Data!$I:$I,$A252,Data!O:O)),#N/A)","v":{"$error":"#N/A"}},{"$f":"IF(G$6,IF(SUMIF(Data!$I:$I,$A252,Data!P:P)=0,#N/A,SUMIF(Data!$I:$I,$A252,Data!P:P)),#N/A)","v":{"$error":"#N/A"}},{"$f":"IF(H$6,IF(SUMIF(Data!$I:$I,$A252,Data!Q:Q)=0,#N/A,SUMIF(Data!$I:$I,$A252,Data!Q:Q)),#N/A)","v":{"$error":"#N/A"}},{"$f":"IF(I$6,IF(SUMIF(Data!$I:$I,$A252,Data!R:R)=0,#N/A,SUMIF(Data!$I:$I,$A252,Data!R:R)),#N/A)","v":{"$error":"#N/A"}},{"$f":"IF(J$6,IF(SUMIF(Data!$I:$I,$A252,Data!S:S)=0,#N/A,SUMIF(Data!$I:$I,$A252,Data!S:S)),#N/A)","v":{"$error":"#N/A"}},{"$f":"IF(K$6,IF(SUMIF(Data!$I:$I,$A252,Data!T:T)=0,#N/A,SUMIF(Data!$I:$I,$A252,Data!T:T)),#N/A)","v":{"$error":"#N/A"}}]
[{"$error":"#N/A"},{"$f":"IF(B$6,IF(SUMIF(Data!$I:$I,$A253,Data!K:K)=0,#N/A,SUMIF(Data!$I:$I,$A253,Data!K:K)),#N/A)","v":{"$error":"#N/A"}},{"$f":"IF(C$6,IF(SUMIF(Data!$I:$I,$A253,Data!L:L)=0,#N/A,SUMIF(Data!$I:$I,$A253,Data!L:L)),#N/A)","v":{"$error":"#N/A"}},{"$f":"IF(D$6,IF(SUMIF(Data!$I:$I,$A253,Data!M:M)=0,#N/A,SUMIF(Data!$I:$I,$A253,Data!M:M)),#N/A)","v":{"$error":"#N/A"}},{"$f":"IF(E$6,IF(SUMIF(Data!$I:$I,$A253,Data!N:N)=0,#N/A,SUMIF(Data!$I:$I,$A253,Data!N:N)),#N/A)","v":{"$error":"#N/A"}},{"$f":"IF(F$6,IF(SUMIF(Data!$I:$I,$A253,Data!O:O)=0,#N/A,SUMIF(Data!$I:$I,$A253,Data!O:O)),#N/A)","v":{"$error":"#N/A"}},{"$f":"IF(G$6,IF(SUMIF(Data!$I:$I,$A253,Data!P:P)=0,#N/A,SUMIF(Data!$I:$I,$A253,Data!P:P)),#N/A)","v":{"$error":"#N/A"}},{"$f":"IF(H$6,IF(SUMIF(Data!$I:$I,$A253,Data!Q:Q)=0,#N/A,SUMIF(Data!$I:$I,$A253,Data!Q:Q)),#N/A)","v":{"$error":"#N/A"}},{"$f":"IF(I$6,IF(SUMIF(Data!$I:$I,$A253,Data!R:R)=0,#N/A,SUMIF(Data!$I:$I,$A253,Data!R:R)),#N/A)","v":{"$error":"#N/A"}},{"$f":"IF(J$6,IF(SUMIF(Data!$I:$I,$A253,Data!S:S)=0,#N/A,SUMIF(Data!$I:$I,$A253,Data!S:S)),#N/A)","v":{"$error":"#N/A"}},{"$f":"IF(K$6,IF(SUMIF(Data!$I:$I,$A253,Data!T:T)=0,#N/A,SUMIF(Data!$I:$I,$A253,Data!T:T)),#N/A)","v":{"$error":"#N/A"}}]
[{"$error":"#N/A"},{"$f":"IF(B$6,IF(SUMIF(Data!$I:$I,$A254,Data!K:K)=0,#N/A,SUMIF(Data!$I:$I,$A254,Data!K:K)),#N/A)","v":{"$error":"#N/A"}},{"$f":"IF(C$6,IF(SUMIF(Data!$I:$I,$A254,Data!L:L)=0,#N/A,SUMIF(Data!$I:$I,$A254,Data!L:L)),#N/A)","v":{"$error":"#N/A"}},{"$f":"IF(D$6,IF(SUMIF(Data!$I:$I,$A254,Data!M:M)=0,#N/A,SUMIF(Data!$I:$I,$A254,Data!M:M)),#N/A)","v":{"$error":"#N/A"}},{"$f":"IF(E$6,IF(SUMIF(Data!$I:$I,$A254,Data!N:N)=0,#N/A,SUMIF(Data!$I:$I,$A254,Data!N:N)),#N/A)","v":{"$error":"#N/A"}},{"$f":"IF(F$6,IF(SUMIF(Data!$I:$I,$A254,Data!O:O)=0,#N/A,SUMIF(Data!$I:$I,$A254,Data!O:O)),#N/A)","v":{"$error":"#N/A"}},{"$f":"IF(G$6,IF(SUMIF(Data!$I:$I,$A254,Data!P:P)=0,#N/A,SUMIF(Data!$I:$I,$A254,Data!P:P)),#N/A)","v":{"$error":"#N/A"}},{"$f":"IF(H$6,IF(SUMIF(Data!$I:$I,$A254,Data!Q:Q)=0,#N/A,SUMIF(Data!$I:$I,$A254,Data!Q:Q)),#N/A)","v":{"$error":"#N/A"}},{"$f":"IF(I$6,IF(SUMIF(Data!$I:$I,$A254,Data!R:R)=0,#N/A,SUMIF(Data!$I:$I,$A254,Data!R:R)),#N/A)","v":{"$error":"#N/A"}},{"$f":"IF(J$6,IF(SUMIF(Data!$I:$I,$A254,Data!S:S)=0,#N/A,SUMIF(Data!$I:$I,$A254,Data!S:S)),#N/A)","v":{"$error":"#N/A"}},{"$f":"IF(K$6,IF(SUMIF(Data!$I:$I,$A254,Data!T:T)=0,#N/A,SUMIF(Data!$I:$I,$A254,Data!T:T)),#N/A)","v":{"$error":"#N/A"}}]
[{"$error":"#N/A"},{"$f":"IF(B$6,IF(SUMIF(Data!$I:$I,$A255,Data!K:K)=0,#N/A,SUMIF(Data!$I:$I,$A255,Data!K:K)),#N/A)","v":{"$error":"#N/A"}},{"$f":"IF(C$6,IF(SUMIF(Data!$I:$I,$A255,Data!L:L)=0,#N/A,SUMIF(Data!$I:$I,$A255,Data!L:L)),#N/A)","v":{"$error":"#N/A"}},{"$f":"IF(D$6,IF(SUMIF(Data!$I:$I,$A255,Data!M:M)=0,#N/A,SUMIF(Data!$I:$I,$A255,Data!M:M)),#N/A)","v":{"$error":"#N/A"}},{"$f":"IF(E$6,IF(SUMIF(Data!$I:$I,$A255,Data!N:N)=0,#N/A,SUMIF(Data!$I:$I,$A255,Data!N:N)),#N/A)","v":{"$error":"#N/A"}},{"$f":"IF(F$6,IF(SUMIF(Data!$I:$I,$A255,Data!O:O)=0,#N/A,SUMIF(Data!$I:$I,$A255,Data!O:O)),#N/A)","v":{"$error":"#N/A"}},{"$f":"IF(G$6,IF(SUMIF(Data!$I:$I,$A255,Data!P:P)=0,#N/A,SUMIF(Data!$I:$I,$A255,Data!P:P)),#N/A)","v":{"$error":"#N/A"}},{"$f":"IF(H$6,IF(SUMIF(Data!$I:$I,$A255,Data!Q:Q)=0,#N/A,SUMIF(Data!$I:$I,$A255,Data!Q:Q)),#N/A)","v":{"$error":"#N/A"}},{"$f":"IF(I$6,IF(SUMIF(Data!$I:$I,$A255,Data!R:R)=0,#N/A,SUMIF(Data!$I:$I,$A255,Data!R:R)),#N/A)","v":{"$error":"#N/A"}},{"$f":"IF(J$6,IF(SUMIF(Data!$I:$I,$A255,Data!S:S)=0,#N/A,SUMIF(Data!$I:$I,$A255,Data!S:S)),#N/A)","v":{"$error":"#N/A"}},{"$f":"IF(K$6,IF(SUMIF(Data!$I:$I,$A255,Data!T:T)=0,#N/A,SUMIF(Data!$I:$I,$A255,Data!T:T)),#N/A)","v":{"$error":"#N/A"}}]
[{"$error":"#N/A"},{"$f":"IF(B$6,IF(SUMIF(Data!$I:$I,$A256,Data!K:K)=0,#N/A,SUMIF(Data!$I:$I,$A256,Data!K:K)),#N/A)","v":{"$error":"#N/A"}},{"$f":"IF(C$6,IF(SUMIF(Data!$I:$I,$A256,Data!L:L)=0,#N/A,SUMIF(Data!$I:$I,$A256,Data!L:L)),#N/A)","v":{"$error":"#N/A"}},{"$f":"IF(D$6,IF(SUMIF(Data!$I:$I,$A256,Data!M:M)=0,#N/A,SUMIF(Data!$I:$I,$A256,Data!M:M)),#N/A)","v":{"$error":"#N/A"}},{"$f":"IF(E$6,IF(SUMIF(Data!$I:$I,$A256,Data!N:N)=0,#N/A,SUMIF(Data!$I:$I,$A256,Data!N:N)),#N/A)","v":{"$error":"#N/A"}},{"$f":"IF(F$6,IF(SUMIF(Data!$I:$I,$A256,Data!O:O)=0,#N/A,SUMIF(Data!$I:$I,$A256,Data!O:O)),#N/A)","v":{"$error":"#N/A"}},{"$f":"IF(G$6,IF(SUMIF(Data!$I:$I,$A256,Data!P:P)=0,#N/A,SUMIF(Data!$I:$I,$A256,Data!P:P)),#N/A)","v":{"$error":"#N/A"}},{"$f":"IF(H$6,IF(SUMIF(Data!$I:$I,$A256,Data!Q:Q)=0,#N/A,SUMIF(Data!$I:$I,$A256,Data!Q:Q)),#N/A)","v":{"$error":"#N/A"}},{"$f":"IF(I$6,IF(SUMIF(Data!$I:$I,$A256,Data!R:R)=0,#N/A,SUMIF(Data!$I:$I,$A256,Data!R:R)),#N/A)","v":{"$error":"#N/A"}},{"$f":"IF(J$6,IF(SUMIF(Data!$I:$I,$A256,Data!S:S)=0,#N/A,SUMIF(Data!$I:$I,$A256,Data!S:S)),#N/A)","v":{"$error":"#N/A"}},{"$f":"IF(K$6,IF(SUMIF(Data!$I:$I,$A256,Data!T:T)=0,#N/A,SUMIF(Data!$I:$I,$A256,Data!T:T)),#N/A)","v":{"$error":"#N/A"}}]
[{"$error":"#N/A"},{"$f":"IF(B$6,IF(SUMIF(Data!$I:$I,$A257,Data!K:K)=0,#N/A,SUMIF(Data!$I:$I,$A257,Data!K:K)),#N/A)","v":{"$error":"#N/A"}},{"$f":"IF(C$6,IF(SUMIF(Data!$I:$I,$A257,Data!L:L)=0,#N/A,SUMIF(Data!$I:$I,$A257,Data!L:L)),#N/A)","v":{"$error":"#N/A"}},{"$f":"IF(D$6,IF(SUMIF(Data!$I:$I,$A257,Data!M:M)=0,#N/A,SUMIF(Data!$I:$I,$A257,Data!M:M)),#N/A)","v":{"$error":"#N/A"}},{"$f":"IF(E$6,IF(SUMIF(Data!$I:$I,$A257,Data!N:N)=0,#N/A,SUMIF(Data!$I:$I,$A257,Data!N:N)),#N/A)","v":{"$error":"#N/A"}},{"$f":"IF(F$6,IF(SUMIF(Data!$I:$I,$A257,Data!O:O)=0,#N/A,SUMIF(Data!$I:$I,$A257,Data!O:O)),#N/A)","v":{"$error":"#N/A"}},{"$f":"IF(G$6,IF(SUMIF(Data!$I:$I,$A257,Data!P:P)=0,#N/A,SUMIF(Data!$I:$I,$A257,Data!P:P)),#N/A)","v":{"$error":"#N/A"}},{"$f":"IF(H$6,IF(SUMIF(Data!$I:$I,$A257,Data!Q:Q)=0,#N/A,SUMIF(Data!$I:$I,$A257,Data!Q:Q)),#N/A)","v":{"$error":"#N/A"}},{"$f":"IF(I$6,IF(SUMIF(Data!$I:$I,$A257,Data!R:R)=0,#N/A,SUMIF(Data!$I:$I,$A257,Data!R:R)),#N/A)","v":{"$error":"#N/A"}},{"$f":"IF(J$6,IF(SUMIF(Data!$I:$I,$A257,Data!S:S)=0,#N/A,SUMIF(Data!$I:$I,$A257,Data!S:S)),#N/A)","v":{"$error":"#N/A"}},{"$f":"IF(K$6,IF(SUMIF(Data!$I:$I,$A257,Data!T:T)=0,#N/A,SUMIF(Data!$I:$I,$A257,Data!T:T)),#N/A)","v":{"$error":"#N/A"}}]
[{"$error":"#N/A"},{"$f":"IF(B$6,IF(SUMIF(Data!$I:$I,$A258,Data!K:K)=0,#N/A,SUMIF(Data!$I:$I,$A258,Data!K:K)),#N/A)","v":{"$error":"#N/A"}},{"$f":"IF(C$6,IF(SUMIF(Data!$I:$I,$A258,Data!L:L)=0,#N/A,SUMIF(Data!$I:$I,$A258,Data!L:L)),#N/A)","v":{"$error":"#N/A"}},{"$f":"IF(D$6,IF(SUMIF(Data!$I:$I,$A258,Data!M:M)=0,#N/A,SUMIF(Data!$I:$I,$A258,Data!M:M)),#N/A)","v":{"$error":"#N/A"}},{"$f":"IF(E$6,IF(SUMIF(Data!$I:$I,$A258,Data!N:N)=0,#N/A,SUMIF(Data!$I:$I,$A258,Data!N:N)),#N/A)","v":{"$error":"#N/A"}},{"$f":"IF(F$6,IF(SUMIF(Data!$I:$I,$A258,Data!O:O)=0,#N/A,SUMIF(Data!$I:$I,$A258,Data!O:O)),#N/A)","v":{"$error":"#N/A"}},{"$f":"IF(G$6,IF(SUMIF(Data!$I:$I,$A258,Data!P:P)=0,#N/A,SUMIF(Data!$I:$I,$A258,Data!P:P)),#N/A)","v":{"$error":"#N/A"}},{"$f":"IF(H$6,IF(SUMIF(Data!$I:$I,$A258,Data!Q:Q)=0,#N/A,SUMIF(Data!$I:$I,$A258,Data!Q:Q)),#N/A)","v":{"$error":"#N/A"}},{"$f":"IF(I$6,IF(SUMIF(Data!$I:$I,$A258,Data!R:R)=0,#N/A,SUMIF(Data!$I:$I,$A258,Data!R:R)),#N/A)","v":{"$error":"#N/A"}},{"$f":"IF(J$6,IF(SUMIF(Data!$I:$I,$A258,Data!S:S)=0,#N/A,SUMIF(Data!$I:$I,$A258,Data!S:S)),#N/A)","v":{"$error":"#N/A"}},{"$f":"IF(K$6,IF(SUMIF(Data!$I:$I,$A258,Data!T:T)=0,#N/A,SUMIF(Data!$I:$I,$A258,Data!T:T)),#N/A)","v":{"$error":"#N/A"}}]
[{"$error":"#N/A"},{"$f":"IF(B$6,IF(SUMIF(Data!$I:$I,$A259,Data!K:K)=0,#N/A,SUMIF(Data!$I:$I,$A259,Data!K:K)),#N/A)","v":{"$error":"#N/A"}},{"$f":"IF(C$6,IF(SUMIF(Data!$I:$I,$A259,Data!L:L)=0,#N/A,SUMIF(Data!$I:$I,$A259,Data!L:L)),#N/A)","v":{"$error":"#N/A"}},{"$f":"IF(D$6,IF(SUMIF(Data!$I:$I,$A259,Data!M:M)=0,#N/A,SUMIF(Data!$I:$I,$A259,Data!M:M)),#N/A)","v":{"$error":"#N/A"}},{"$f":"IF(E$6,IF(SUMIF(Data!$I:$I,$A259,Data!N:N)=0,#N/A,SUMIF(Data!$I:$I,$A259,Data!N:N)),#N/A)","v":{"$error":"#N/A"}},{"$f":"IF(F$6,IF(SUMIF(Data!$I:$I,$A259,Data!O:O)=0,#N/A,SUMIF(Data!$I:$I,$A259,Data!O:O)),#N/A)","v":{"$error":"#N/A"}},{"$f":"IF(G$6,IF(SUMIF(Data!$I:$I,$A259,Data!P:P)=0,#N/A,SUMIF(Data!$I:$I,$A259,Data!P:P)),#N/A)","v":{"$error":"#N/A"}},{"$f":"IF(H$6,IF(SUMIF(Data!$I:$I,$A259,Data!Q:Q)=0,#N/A,SUMIF(Data!$I:$I,$A259,Data!Q:Q)),#N/A)","v":{"$error":"#N/A"}},{"$f":"IF(I$6,IF(SUMIF(Data!$I:$I,$A259,Data!R:R)=0,#N/A,SUMIF(Data!$I:$I,$A259,Data!R:R)),#N/A)","v":{"$error":"#N/A"}},{"$f":"IF(J$6,IF(SUMIF(Data!$I:$I,$A259,Data!S:S)=0,#N/A,SUMIF(Data!$I:$I,$A259,Data!S:S)),#N/A)","v":{"$error":"#N/A"}},{"$f":"IF(K$6,IF(SUMIF(Data!$I:$I,$A259,Data!T:T)=0,#N/A,SUMIF(Data!$I:$I,$A259,Data!T:T)),#N/A)","v":{"$error":"#N/A"}}]
[{"$error":"#N/A"},{"$f":"IF(B$6,IF(SUMIF(Data!$I:$I,$A260,Data!K:K)=0,#N/A,SUMIF(Data!$I:$I,$A260,Data!K:K)),#N/A)","v":{"$error":"#N/A"}},{"$f":"IF(C$6,IF(SUMIF(Data!$I:$I,$A260,Data!L:L)=0,#N/A,SUMIF(Data!$I:$I,$A260,Data!L:L)),#N/A)","v":{"$error":"#N/A"}},{"$f":"IF(D$6,IF(SUMIF(Data!$I:$I,$A260,Data!M:M)=0,#N/A,SUMIF(Data!$I:$I,$A260,Data!M:M)),#N/A)","v":{"$error":"#N/A"}},{"$f":"IF(E$6,IF(SUMIF(Data!$I:$I,$A260,Data!N:N)=0,#N/A,SUMIF(Data!$I:$I,$A260,Data!N:N)),#N/A)","v":{"$error":"#N/A"}},{"$f":"IF(F$6,IF(SUMIF(Data!$I:$I,$A260,Data!O:O)=0,#N/A,SUMIF(Data!$I:$I,$A260,Data!O:O)),#N/A)","v":{"$error":"#N/A"}},{"$f":"IF(G$6,IF(SUMIF(Data!$I:$I,$A260,Data!P:P)=0,#N/A,SUMIF(Data!$I:$I,$A260,Data!P:P)),#N/A)","v":{"$error":"#N/A"}},{"$f":"IF(H$6,IF(SUMIF(Data!$I:$I,$A260,Data!Q:Q)=0,#N/A,SUMIF(Data!$I:$I,$A260,Data!Q:Q)),#N/A)","v":{"$error":"#N/A"}},{"$f":"IF(I$6,IF(SUMIF(Data!$I:$I,$A260,Data!R:R)=0,#N/A,SUMIF(Data!$I:$I,$A260,Data!R:R)),#N/A)","v":{"$error":"#N/A"}},{"$f":"IF(J$6,IF(SUMIF(Data!$I:$I,$A260,Data!S:S)=0,#N/A,SUMIF(Data!$I:$I,$A260,Data!S:S)),#N/A)","v":{"$error":"#N/A"}},{"$f":"IF(K$6,IF(SUMIF(Data!$I:$I,$A260,Data!T:T)=0,#N/A,SUMIF(Data!$I:$I,$A260,Data!T:T)),#N/A)","v":{"$error":"#N/A"}}]
[{"$error":"#N/A"},{"$f":"IF(B$6,IF(SUMIF(Data!$I:$I,$A261,Data!K:K)=0,#N/A,SUMIF(Data!$I:$I,$A261,Data!K:K)),#N/A)","v":{"$error":"#N/A"}},{"$f":"IF(C$6,IF(SUMIF(Data!$I:$I,$A261,Data!L:L)=0,#N/A,SUMIF(Data!$I:$I,$A261,Data!L:L)),#N/A)","v":{"$error":"#N/A"}},{"$f":"IF(D$6,IF(SUMIF(Data!$I:$I,$A261,Data!M:M)=0,#N/A,SUMIF(Data!$I:$I,$A261,Data!M:M)),#N/A)","v":{"$error":"#N/A"}},{"$f":"IF(E$6,IF(SUMIF(Data!$I:$I,$A261,Data!N:N)=0,#N/A,SUMIF(Data!$I:$I,$A261,Data!N:N)),#N/A)","v":{"$error":"#N/A"}},{"$f":"IF(F$6,IF(SUMIF(Data!$I:$I,$A261,Data!O:O)=0,#N/A,SUMIF(Data!$I:$I,$A261,Data!O:O)),#N/A)","v":{"$error":"#N/A"}},{"$f":"IF(G$6,IF(SUMIF(Data!$I:$I,$A261,Data!P:P)=0,#N/A,SUMIF(Data!$I:$I,$A261,Data!P:P)),#N/A)","v":{"$error":"#N/A"}},{"$f":"IF(H$6,IF(SUMIF(Data!$I:$I,$A261,Data!Q:Q)=0,#N/A,SUMIF(Data!$I:$I,$A261,Data!Q:Q)),#N/A)","v":{"$error":"#N/A"}},{"$f":"IF(I$6,IF(SUMIF(Data!$I:$I,$A261,Data!R:R)=0,#N/A,SUMIF(Data!$I:$I,$A261,Data!R:R)),#N/A)","v":{"$error":"#N/A"}},{"$f":"IF(J$6,IF(SUMIF(Data!$I:$I,$A261,Data!S:S)=0,#N/A,SUMIF(Data!$I:$I,$A261,Data!S:S)),#N/A)","v":{"$error":"#N/A"}},{"$f":"IF(K$6,IF(SUMIF(Data!$I:$I,$A261,Data!T:T)=0,#N/A,SUMIF(Data!$I:$I,$A261,Data!T:T)),#N/A)","v":{"$error":"#N/A"}}]
[{"$error":"#N/A"},{"$f":"IF(B$6,IF(SUMIF(Data!$I:$I,$A262,Data!K:K)=0,#N/A,SUMIF(Data!$I:$I,$A262,Data!K:K)),#N/A)","v":{"$error":"#N/A"}},{"$f":"IF(C$6,IF(SUMIF(Data!$I:$I,$A262,Data!L:L)=0,#N/A,SUMIF(Data!$I:$I,$A262,Data!L:L)),#N/A)","v":{"$error":"#N/A"}},{"$f":"IF(D$6,IF(SUMIF(Data!$I:$I,$A262,Data!M:M)=0,#N/A,SUMIF(Data!$I:$I,$A262,Data!M:M)),#N/A)","v":{"$error":"#N/A"}},{"$f":"IF(E$6,IF(SUMIF(Data!$I:$I,$A262,Data!N:N)=0,#N/A,SUMIF(Data!$I:$I,$A262,Data!N:N)),#N/A)","v":{"$error":"#N/A"}},{"$f":"IF(F$6,IF(SUMIF(Data!$I:$I,$A262,Data!O:O)=0,#N/A,SUMIF(Data!$I:$I,$A262,Data!O:O)),#N/A)","v":{"$error":"#N/A"}},{"$f":"IF(G$6,IF(SUMIF(Data!$I:$I,$A262,Data!P:P)=0,#N/A,SUMIF(Data!$I:$I,$A262,Data!P:P)),#N/A)","v":{"$error":"#N/A"}},{"$f":"IF(H$6,IF(SUMIF(Data!$I:$I,$A262,Data!Q:Q)=0,#N/A,SUMIF(Data!$I:$I,$A262,Data!Q:Q)),#N/A)","v":{"$error":"#N/A"}},{"$f":"IF(I$6,IF(SUMIF(Data!$I:$I,$A262,Data!R:R)=0,#N/A,SUMIF(Data!$I:$I,$A262,Data!R:R)),#N/A)","v":{"$error":"#N/A"}},{"$f":"IF(J$6,IF(SUMIF(Data!$I:$I,$A262,Data!S:S)=0,#N/A,SUMIF(Data!$I:$I,$A262,Data!S:S)),#N/A)","v":{"$error":"#N/A"}},{"$f":"IF(K$6,IF(SUMIF(Data!$I:$I,$A262,Data!T:T)=0,#N/A,SUMIF(Data!$I:$I,$A262,Data!T:T)),#N/A)","v":{"$error":"#N/A"}}]
[{"$error":"#N/A"},{"$f":"IF(B$6,IF(SUMIF(Data!$I:$I,$A263,Data!K:K)=0,#N/A,SUMIF(Data!$I:$I,$A263,Data!K:K)),#N/A)","v":{"$error":"#N/A"}},{"$f":"IF(C$6,IF(SUMIF(Data!$I:$I,$A263,Data!L:L)=0,#N/A,SUMIF(Data!$I:$I,$A263,Data!L:L)),#N/A)","v":{"$error":"#N/A"}},{"$f":"IF(D$6,IF(SUMIF(Data!$I:$I,$A263,Data!M:M)=0,#N/A,SUMIF(Data!$I:$I,$A263,Data!M:M)),#N/A)","v":{"$error":"#N/A"}},{"$f":"IF(E$6,IF(SUMIF(Data!$I:$I,$A263,Data!N:N)=0,#N/A,SUMIF(Data!$I:$I,$A263,Data!N:N)),#N/A)","v":{"$error":"#N/A"}},{"$f":"IF(F$6,IF(SUMIF(Data!$I:$I,$A263,Data!O:O)=0,#N/A,SUMIF(Data!$I:$I,$A263,Data!O:O)),#N/A)","v":{"$error":"#N/A"}},{"$f":"IF(G$6,IF(SUMIF(Data!$I:$I,$A263,Data!P:P)=0,#N/A,SUMIF(Data!$I:$I,$A263,Data!P:P)),#N/A)","v":{"$error":"#N/A"}},{"$f":"IF(H$6,IF(SUMIF(Data!$I:$I,$A263,Data!Q:Q)=0,#N/A,SUMIF(Data!$I:$I,$A263,Data!Q:Q)),#N/A)","v":{"$error":"#N/A"}},{"$f":"IF(I$6,IF(SUMIF(Data!$I:$I,$A263,Data!R:R)=0,#N/A,SUMIF(Data!$I:$I,$A263,Data!R:R)),#N/A)","v":{"$error":"#N/A"}},{"$f":"IF(J$6,IF(SUMIF(Data!$I:$I,$A263,Data!S:S)=0,#N/A,SUMIF(Data!$I:$I,$A263,Data!S:S)),#N/A)","v":{"$error":"#N/A"}},{"$f":"IF(K$6,IF(SUMIF(Data!$I:$I,$A263,Data!T:T)=0,#N/A,SUMIF(Data!$I:$I,$A263,Data!T:T)),#N/A)","v":{"$error":"#N/A"}}]
[{"$error":"#N/A"},{"$f":"IF(B$6,IF(SUMIF(Data!$I:$I,$A264,Data!K:K)=0,#N/A,SUMIF(Data!$I:$I,$A264,Data!K:K)),#N/A)","v":{"$error":"#N/A"}},{"$f":"IF(C$6,IF(SUMIF(Data!$I:$I,$A264,Data!L:L)=0,#N/A,SUMIF(Data!$I:$I,$A264,Data!L:L)),#N/A)","v":{"$error":"#N/A"}},{"$f":"IF(D$6,IF(SUMIF(Data!$I:$I,$A264,Data!M:M)=0,#N/A,SUMIF(Data!$I:$I,$A264,Data!M:M)),#N/A)","v":{"$error":"#N/A"}},{"$f":"IF(E$6,IF(SUMIF(Data!$I:$I,$A264,Data!N:N)=0,#N/A,SUMIF(Data!$I:$I,$A264,Data!N:N)),#N/A)","v":{"$error":"#N/A"}},{"$f":"IF(F$6,IF(SUMIF(Data!$I:$I,$A264,Data!O:O)=0,#N/A,SUMIF(Data!$I:$I,$A264,Data!O:O)),#N/A)","v":{"$error":"#N/A"}},{"$f":"IF(G$6,IF(SUMIF(Data!$I:$I,$A264,Data!P:P)=0,#N/A,SUMIF(Data!$I:$I,$A264,Data!P:P)),#N/A)","v":{"$error":"#N/A"}},{"$f":"IF(H$6,IF(SUMIF(Data!$I:$I,$A264,Data!Q:Q)=0,#N/A,SUMIF(Data!$I:$I,$A264,Data!Q:Q)),#N/A)","v":{"$error":"#N/A"}},{"$f":"IF(I$6,IF(SUMIF(Data!$I:$I,$A264,Data!R:R)=0,#N/A,SUMIF(Data!$I:$I,$A264,Data!R:R)),#N/A)","v":{"$error":"#N/A"}},{"$f":"IF(J$6,IF(SUMIF(Data!$I:$I,$A264,Data!S:S)=0,#N/A,SUMIF(Data!$I:$I,$A264,Data!S:S)),#N/A)","v":{"$error":"#N/A"}},{"$f":"IF(K$6,IF(SUMIF(Data!$I:$I,$A264,Data!T:T)=0,#N/A,SUMIF(Data!$I:$I,$A264,Data!T:T)),#N/A)","v":{"$error":"#N/A"}}]
[{"$error":"#N/A"},{"$f":"IF(B$6,IF(SUMIF(Data!$I:$I,$A265,Data!K:K)=0,#N/A,SUMIF(Data!$I:$I,$A265,Data!K:K)),#N/A)","v":{"$error":"#N/A"}},{"$f":"IF(C$6,IF(SUMIF(Data!$I:$I,$A265,Data!L:L)=0,#N/A,SUMIF(Data!$I:$I,$A265,Data!L:L)),#N/A)","v":{"$error":"#N/A"}},{"$f":"IF(D$6,IF(SUMIF(Data!$I:$I,$A265,Data!M:M)=0,#N/A,SUMIF(Data!$I:$I,$A265,Data!M:M)),#N/A)","v":{"$error":"#N/A"}},{"$f":"IF(E$6,IF(SUMIF(Data!$I:$I,$A265,Data!N:N)=0,#N/A,SUMIF(Data!$I:$I,$A265,Data!N:N)),#N/A)","v":{"$error":"#N/A"}},{"$f":"IF(F$6,IF(SUMIF(Data!$I:$I,$A265,Data!O:O)=0,#N/A,SUMIF(Data!$I:$I,$A265,Data!O:O)),#N/A)","v":{"$error":"#N/A"}},{"$f":"IF(G$6,IF(SUMIF(Data!$I:$I,$A265,Data!P:P)=0,#N/A,SUMIF(Data!$I:$I,$A265,Data!P:P)),#N/A)","v":{"$error":"#N/A"}},{"$f":"IF(H$6,IF(SUMIF(Data!$I:$I,$A265,Data!Q:Q)=0,#N/A,SUMIF(Data!$I:$I,$A265,Data!Q:Q)),#N/A)","v":{"$error":"#N/A"}},{"$f":"IF(I$6,IF(SUMIF(Data!$I:$I,$A265,Data!R:R)=0,#N/A,SUMIF(Data!$I:$I,$A265,Data!R:R)),#N/A)","v":{"$error":"#N/A"}},{"$f":"IF(J$6,IF(SUMIF(Data!$I:$I,$A265,Data!S:S)=0,#N/A,SUMIF(Data!$I:$I,$A265,Data!S:S)),#N/A)","v":{"$error":"#N/A"}},{"$f":"IF(K$6,IF(SUMIF(Data!$I:$I,$A265,Data!T:T)=0,#N/A,SUMIF(Data!$I:$I,$A265,Data!T:T)),#N/A)","v":{"$error":"#N/A"}}]
[{"$error":"#N/A"},{"$f":"IF(B$6,IF(SUMIF(Data!$I:$I,$A266,Data!K:K)=0,#N/A,SUMIF(Data!$I:$I,$A266,Data!K:K)),#N/A)","v":{"$error":"#N/A"}},{"$f":"IF(C$6,IF(SUMIF(Data!$I:$I,$A266,Data!L:L)=0,#N/A,SUMIF(Data!$I:$I,$A266,Data!L:L)),#N/A)","v":{"$error":"#N/A"}},{"$f":"IF(D$6,IF(SUMIF(Data!$I:$I,$A266,Data!M:M)=0,#N/A,SUMIF(Data!$I:$I,$A266,Data!M:M)),#N/A)","v":{"$error":"#N/A"}},{"$f":"IF(E$6,IF(SUMIF(Data!$I:$I,$A266,Data!N:N)=0,#N/A,SUMIF(Data!$I:$I,$A266,Data!N:N)),#N/A)","v":{"$error":"#N/A"}},{"$f":"IF(F$6,IF(SUMIF(Data!$I:$I,$A266,Data!O:O)=0,#N/A,SUMIF(Data!$I:$I,$A266,Data!O:O)),#N/A)","v":{"$error":"#N/A"}},{"$f":"IF(G$6,IF(SUMIF(Data!$I:$I,$A266,Data!P:P)=0,#N/A,SUMIF(Data!$I:$I,$A266,Data!P:P)),#N/A)","v":{"$error":"#N/A"}},{"$f":"IF(H$6,IF(SUMIF(Data!$I:$I,$A266,Data!Q:Q)=0,#N/A,SUMIF(Data!$I:$I,$A266,Data!Q:Q)),#N/A)","v":{"$error":"#N/A"}},{"$f":"IF(I$6,IF(SUMIF(Data!$I:$I,$A266,Data!R:R)=0,#N/A,SUMIF(Data!$I:$I,$A266,Data!R:R)),#N/A)","v":{"$error":"#N/A"}},{"$f":"IF(J$6,IF(SUMIF(Data!$I:$I,$A266,Data!S:S)=0,#N/A,SUMIF(Data!$I:$I,$A266,Data!S:S)),#N/A)","v":{"$error":"#N/A"}},{"$f":"IF(K$6,IF(SUMIF(Data!$I:$I,$A266,Data!T:T)=0,#N/A,SUMIF(Data!$I:$I,$A266,Data!T:T)),#N/A)","v":{"$error":"#N/A"}}]
[{"$f":"IF(A266+1<$B$3,A266+1,#N/A)","v":{"$error":"#N/A"}},{"$f":"IF(B$6,IF(SUMIF(Data!$I:$I,$A267,Data!K:K)=0,#N/A,SUMIF(Data!$I:$I,$A267,Data!K:K)),#N/A)","v":{"$error":"#N/A"}},{"$f":"IF(C$6,IF(SUMIF(Data!$I:$I,$A267,Data!L:L)=0,#N/A,SUMIF(Data!$I:$I,$A267,Data!L:L)),#N/A)","v":{"$error":"#N/A"}},{"$f":"IF(D$6,IF(SUMIF(Data!$I:$I,$A267,Data!M:M)=0,#N/A,SUMIF(Data!$I:$I,$A267,Data!M:M)),#N/A)","v":{"$error":"#N/A"}},{"$f":"IF(E$6,IF(SUMIF(Data!$I:$I,$A267,Data!N:N)=0,#N/A,SUMIF(Data!$I:$I,$A267,Data!N:N)),#N/A)","v":{"$error":"#N/A"}},{"$f":"IF(F$6,IF(SUMIF(Data!$I:$I,$A267,Data!O:O)=0,#N/A,SUMIF(Data!$I:$I,$A267,Data!O:O)),#N/A)","v":{"$error":"#N/A"}},{"$f":"IF(G$6,IF(SUMIF(Data!$I:$I,$A267,Data!P:P)=0,#N/A,SUMIF(Data!$I:$I,$A267,Data!P:P)),#N/A)","v":{"$error":"#N/A"}},{"$f":"IF(H$6,IF(SUMIF(Data!$I:$I,$A267,Data!Q:Q)=0,#N/A,SUMIF(Data!$I:$I,$A267,Data!Q:Q)),#N/A)","v":{"$error":"#N/A"}},{"$f":"IF(I$6,IF(SUMIF(Data!$I:$I,$A267,Data!R:R)=0,#N/A,SUMIF(Data!$I:$I,$A267,Data!R:R)),#N/A)","v":{"$error":"#N/A"}},{"$f":"IF(J$6,IF(SUMIF(Data!$I:$I,$A267,Data!S:S)=0,#N/A,SUMIF(Data!$I:$I,$A267,Data!S:S)),#N/A)","v":{"$error":"#N/A"}},{"$f":"IF(K$6,IF(SUMIF(Data!$I:$I,$A267,Data!T:T)=0,#N/A,SUMIF(Data!$I:$I,$A267,Data!T:T)),#N/A)","v":{"$error":"#N/A"}}]
[{"$error":"#N/A"},{"$f":"IF(B$6,IF(SUMIF(Data!$I:$I,$A268,Data!K:K)=0,#N/A,SUMIF(Data!$I:$I,$A268,Data!K:K)),#N/A)","v":{"$error":"#N/A"}},{"$f":"IF(C$6,IF(SUMIF(Data!$I:$I,$A268,Data!L:L)=0,#N/A,SUMIF(Data!$I:$I,$A268,Data!L:L)),#N/A)","v":{"$error":"#N/A"}},{"$f":"IF(D$6,IF(SUMIF(Data!$I:$I,$A268,Data!M:M)=0,#N/A,SUMIF(Data!$I:$I,$A268,Data!M:M)),#N/A)","v":{"$error":"#N/A"}},{"$f":"IF(E$6,IF(SUMIF(Data!$I:$I,$A268,Data!N:N)=0,#N/A,SUMIF(Data!$I:$I,$A268,Data!N:N)),#N/A)","v":{"$error":"#N/A"}},{"$f":"IF(F$6,IF(SUMIF(Data!$I:$I,$A268,Data!O:O)=0,#N/A,SUMIF(Data!$I:$I,$A268,Data!O:O)),#N/A)","v":{"$error":"#N/A"}},{"$f":"IF(G$6,IF(SUMIF(Data!$I:$I,$A268,Data!P:P)=0,#N/A,SUMIF(Data!$I:$I,$A268,Data!P:P)),#N/A)","v":{"$error":"#N/A"}},{"$f":"IF(H$6,IF(SUMIF(Data!$I:$I,$A268,Data!Q:Q)=0,#N/A,SUMIF(Data!$I:$I,$A268,Data!Q:Q)),#N/A)","v":{"$error":"#N/A"}},{"$f":"IF(I$6,IF(SUMIF(Data!$I:$I,$A268,Data!R:R)=0,#N/A,SUMIF(Data!$I:$I,$A268,Data!R:R)),#N/A)","v":{"$error":"#N/A"}},{"$f":"IF(J$6,IF(SUMIF(Data!$I:$I,$A268,Data!S:S)=0,#N/A,SUMIF(Data!$I:$I,$A268,Data!S:S)),#N/A)","v":{"$error":"#N/A"}},{"$f":"IF(K$6,IF(SUMIF(Data!$I:$I,$A268,Data!T:T)=0,#N/A,SUMIF(Data!$I:$I,$A268,Data!T:T)),#N/A)","v":{"$error":"#N/A"}}]
[{"$error":"#N/A"},{"$f":"IF(B$6,IF(SUMIF(Data!$I:$I,$A269,Data!K:K)=0,#N/A,SUMIF(Data!$I:$I,$A269,Data!K:K)),#N/A)","v":{"$error":"#N/A"}},{"$f":"IF(C$6,IF(SUMIF(Data!$I:$I,$A269,Data!L:L)=0,#N/A,SUMIF(Data!$I:$I,$A269,Data!L:L)),#N/A)","v":{"$error":"#N/A"}},{"$f":"IF(D$6,IF(SUMIF(Data!$I:$I,$A269,Data!M:M)=0,#N/A,SUMIF(Data!$I:$I,$A269,Data!M:M)),#N/A)","v":{"$error":"#N/A"}},{"$f":"IF(E$6,IF(SUMIF(Data!$I:$I,$A269,Data!N:N)=0,#N/A,SUMIF(Data!$I:$I,$A269,Data!N:N)),#N/A)","v":{"$error":"#N/A"}},{"$f":"IF(F$6,IF(SUMIF(Data!$I:$I,$A269,Data!O:O)=0,#N/A,SUMIF(Data!$I:$I,$A269,Data!O:O)),#N/A)","v":{"$error":"#N/A"}},{"$f":"IF(G$6,IF(SUMIF(Data!$I:$I,$A269,Data!P:P)=0,#N/A,SUMIF(Data!$I:$I,$A269,Data!P:P)),#N/A)","v":{"$error":"#N/A"}},{"$f":"IF(H$6,IF(SUMIF(Data!$I:$I,$A269,Data!Q:Q)=0,#N/A,SUMIF(Data!$I:$I,$A269,Data!Q:Q)),#N/A)","v":{"$error":"#N/A"}},{"$f":"IF(I$6,IF(SUMIF(Data!$I:$I,$A269,Data!R:R)=0,#N/A,SUMIF(Data!$I:$I,$A269,Data!R:R)),#N/A)","v":{"$error":"#N/A"}},{"$f":"IF(J$6,IF(SUMIF(Data!$I:$I,$A269,Data!S:S)=0,#N/A,SUMIF(Data!$I:$I,$A269,Data!S:S)),#N/A)","v":{"$error":"#N/A"}},{"$f":"IF(K$6,IF(SUMIF(Data!$I:$I,$A269,Data!T:T)=0,#N/A,SUMIF(Data!$I:$I,$A269,Data!T:T)),#N/A)","v":{"$error":"#N/A"}}]
[{"$error":"#N/A"},{"$f":"IF(B$6,IF(SUMIF(Data!$I:$I,$A270,Data!K:K)=0,#N/A,SUMIF(Data!$I:$I,$A270,Data!K:K)),#N/A)","v":{"$error":"#N/A"}},{"$f":"IF(C$6,IF(SUMIF(Data!$I:$I,$A270,Data!L:L)=0,#N/A,SUMIF(Data!$I:$I,$A270,Data!L:L)),#N/A)","v":{"$error":"#N/A"}},{"$f":"IF(D$6,IF(SUMIF(Data!$I:$I,$A270,Data!M:M)=0,#N/A,SUMIF(Data!$I:$I,$A270,Data!M:M)),#N/A)","v":{"$error":"#N/A"}},{"$f":"IF(E$6,IF(SUMIF(Data!$I:$I,$A270,Data!N:N)=0,#N/A,SUMIF(Data!$I:$I,$A270,Data!N:N)),#N/A)","v":{"$error":"#N/A"}},{"$f":"IF(F$6,IF(SUMIF(Data!$I:$I,$A270,Data!O:O)=0,#N/A,SUMIF(Data!$I:$I,$A270,Data!O:O)),#N/A)","v":{"$error":"#N/A"}},{"$f":"IF(G$6,IF(SUMIF(Data!$I:$I,$A270,Data!P:P)=0,#N/A,SUMIF(Data!$I:$I,$A270,Data!P:P)),#N/A)","v":{"$error":"#N/A"}},{"$f":"IF(H$6,IF(SUMIF(Data!$I:$I,$A270,Data!Q:Q)=0,#N/A,SUMIF(Data!$I:$I,$A270,Data!Q:Q)),#N/A)","v":{"$error":"#N/A"}},{"$f":"IF(I$6,IF(SUMIF(Data!$I:$I,$A270,Data!R:R)=0,#N/A,SUMIF(Data!$I:$I,$A270,Data!R:R)),#N/A)","v":{"$error":"#N/A"}},{"$f":"IF(J$6,IF(SUMIF(Data!$I:$I,$A270,Data!S:S)=0,#N/A,SUMIF(Data!$I:$I,$A270,Data!S:S)),#N/A)","v":{"$error":"#N/A"}},{"$f":"IF(K$6,IF(SUMIF(Data!$I:$I,$A270,Data!T:T)=0,#N/A,SUMIF(Data!$I:$I,$A270,Data!T:T)),#N/A)","v":{"$error":"#N/A"}}]
[{"$error":"#N/A"},{"$f":"IF(B$6,IF(SUMIF(Data!$I:$I,$A271,Data!K:K)=0,#N/A,SUMIF(Data!$I:$I,$A271,Data!K:K)),#N/A)","v":{"$error":"#N/A"}},{"$f":"IF(C$6,IF(SUMIF(Data!$I:$I,$A271,Data!L:L)=0,#N/A,SUMIF(Data!$I:$I,$A271,Data!L:L)),#N/A)","v":{"$error":"#N/A"}},{"$f":"IF(D$6,IF(SUMIF(Data!$I:$I,$A271,Data!M:M)=0,#N/A,SUMIF(Data!$I:$I,$A271,Data!M:M)),#N/A)","v":{"$error":"#N/A"}},{"$f":"IF(E$6,IF(SUMIF(Data!$I:$I,$A271,Data!N:N)=0,#N/A,SUMIF(Data!$I:$I,$A271,Data!N:N)),#N/A)","v":{"$error":"#N/A"}},{"$f":"IF(F$6,IF(SUMIF(Data!$I:$I,$A271,Data!O:O)=0,#N/A,SUMIF(Data!$I:$I,$A271,Data!O:O)),#N/A)","v":{"$error":"#N/A"}},{"$f":"IF(G$6,IF(SUMIF(Data!$I:$I,$A271,Data!P:P)=0,#N/A,SUMIF(Data!$I:$I,$A271,Data!P:P)),#N/A)","v":{"$error":"#N/A"}},{"$f":"IF(H$6,IF(SUMIF(Data!$I:$I,$A271,Data!Q:Q)=0,#N/A,SUMIF(Data!$I:$I,$A271,Data!Q:Q)),#N/A)","v":{"$error":"#N/A"}},{"$f":"IF(I$6,IF(SUMIF(Data!$I:$I,$A271,Data!R:R)=0,#N/A,SUMIF(Data!$I:$I,$A271,Data!R:R)),#N/A)","v":{"$error":"#N/A"}},{"$f":"IF(J$6,IF(SUMIF(Data!$I:$I,$A271,Data!S:S)=0,#N/A,SUMIF(Data!$I:$I,$A271,Data!S:S)),#N/A)","v":{"$error":"#N/A"}},{"$f":"IF(K$6,IF(SUMIF(Data!$I:$I,$A271,Data!T:T)=0,#N/A,SUMIF(Data!$I:$I,$A271,Data!T:T)),#N/A)","v":{"$error":"#N/A"}}]
[{"$error":"#N/A"},{"$f":"IF(B$6,IF(SUMIF(Data!$I:$I,$A272,Data!K:K)=0,#N/A,SUMIF(Data!$I:$I,$A272,Data!K:K)),#N/A)","v":{"$error":"#N/A"}},{"$f":"IF(C$6,IF(SUMIF(Data!$I:$I,$A272,Data!L:L)=0,#N/A,SUMIF(Data!$I:$I,$A272,Data!L:L)),#N/A)","v":{"$error":"#N/A"}},{"$f":"IF(D$6,IF(SUMIF(Data!$I:$I,$A272,Data!M:M)=0,#N/A,SUMIF(Data!$I:$I,$A272,Data!M:M)),#N/A)","v":{"$error":"#N/A"}},{"$f":"IF(E$6,IF(SUMIF(Data!$I:$I,$A272,Data!N:N)=0,#N/A,SUMIF(Data!$I:$I,$A272,Data!N:N)),#N/A)","v":{"$error":"#N/A"}},{"$f":"IF(F$6,IF(SUMIF(Data!$I:$I,$A272,Data!O:O)=0,#N/A,SUMIF(Data!$I:$I,$A272,Data!O:O)),#N/A)","v":{"$error":"#N/A"}},{"$f":"IF(G$6,IF(SUMIF(Data!$I:$I,$A272,Data!P:P)=0,#N/A,SUMIF(Data!$I:$I,$A272,Data!P:P)),#N/A)","v":{"$error":"#N/A"}},{"$f":"IF(H$6,IF(SUMIF(Data!$I:$I,$A272,Data!Q:Q)=0,#N/A,SUMIF(Data!$I:$I,$A272,Data!Q:Q)),#N/A)","v":{"$error":"#N/A"}},{"$f":"IF(I$6,IF(SUMIF(Data!$I:$I,$A272,Data!R:R)=0,#N/A,SUMIF(Data!$I:$I,$A272,Data!R:R)),#N/A)","v":{"$error":"#N/A"}},{"$f":"IF(J$6,IF(SUMIF(Data!$I:$I,$A272,Data!S:S)=0,#N/A,SUMIF(Data!$I:$I,$A272,Data!S:S)),#N/A)","v":{"$error":"#N/A"}},{"$f":"IF(K$6,IF(SUMIF(Data!$I:$I,$A272,Data!T:T)=0,#N/A,SUMIF(Data!$I:$I,$A272,Data!T:T)),#N/A)","v":{"$error":"#N/A"}}]
[{"$error":"#N/A"},{"$f":"IF(B$6,IF(SUMIF(Data!$I:$I,$A273,Data!K:K)=0,#N/A,SUMIF(Data!$I:$I,$A273,Data!K:K)),#N/A)","v":{"$error":"#N/A"}},{"$f":"IF(C$6,IF(SUMIF(Data!$I:$I,$A273,Data!L:L)=0,#N/A,SUMIF(Data!$I:$I,$A273,Data!L:L)),#N/A)","v":{"$error":"#N/A"}},{"$f":"IF(D$6,IF(SUMIF(Data!$I:$I,$A273,Data!M:M)=0,#N/A,SUMIF(Data!$I:$I,$A273,Data!M:M)),#N/A)","v":{"$error":"#N/A"}},{"$f":"IF(E$6,IF(SUMIF(Data!$I:$I,$A273,Data!N:N)=0,#N/A,SUMIF(Data!$I:$I,$A273,Data!N:N)),#N/A)","v":{"$error":"#N/A"}},{"$f":"IF(F$6,IF(SUMIF(Data!$I:$I,$A273,Data!O:O)=0,#N/A,SUMIF(Data!$I:$I,$A273,Data!O:O)),#N/A)","v":{"$error":"#N/A"}},{"$f":"IF(G$6,IF(SUMIF(Data!$I:$I,$A273,Data!P:P)=0,#N/A,SUMIF(Data!$I:$I,$A273,Data!P:P)),#N/A)","v":{"$error":"#N/A"}},{"$f":"IF(H$6,IF(SUMIF(Data!$I:$I,$A273,Data!Q:Q)=0,#N/A,SUMIF(Data!$I:$I,$A273,Data!Q:Q)),#N/A)","v":{"$error":"#N/A"}},{"$f":"IF(I$6,IF(SUMIF(Data!$I:$I,$A273,Data!R:R)=0,#N/A,SUMIF(Data!$I:$I,$A273,Data!R:R)),#N/A)","v":{"$error":"#N/A"}},{"$f":"IF(J$6,IF(SUMIF(Data!$I:$I,$A273,Data!S:S)=0,#N/A,SUMIF(Data!$I:$I,$A273,Data!S:S)),#N/A)","v":{"$error":"#N/A"}},{"$f":"IF(K$6,IF(SUMIF(Data!$I:$I,$A273,Data!T:T)=0,#N/A,SUMIF(Data!$I:$I,$A273,Data!T:T)),#N/A)","v":{"$error":"#N/A"}}]
[{"$error":"#N/A"},{"$f":"IF(B$6,IF(SUMIF(Data!$I:$I,$A274,Data!K:K)=0,#N/A,SUMIF(Data!$I:$I,$A274,Data!K:K)),#N/A)","v":{"$error":"#N/A"}},{"$f":"IF(C$6,IF(SUMIF(Data!$I:$I,$A274,Data!L:L)=0,#N/A,SUMIF(Data!$I:$I,$A274,Data!L:L)),#N/A)","v":{"$error":"#N/A"}},{"$f":"IF(D$6,IF(SUMIF(Data!$I:$I,$A274,Data!M:M)=0,#N/A,SUMIF(Data!$I:$I,$A274,Data!M:M)),#N/A)","v":{"$error":"#N/A"}},{"$f":"IF(E$6,IF(SUMIF(Data!$I:$I,$A274,Data!N:N)=0,#N/A,SUMIF(Data!$I:$I,$A274,Data!N:N)),#N/A)","v":{"$error":"#N/A"}},{"$f":"IF(F$6,IF(SUMIF(Data!$I:$I,$A274,Data!O:O)=0,#N/A,SUMIF(Data!$I:$I,$A274,Data!O:O)),#N/A)","v":{"$error":"#N/A"}},{"$f":"IF(G$6,IF(SUMIF(Data!$I:$I,$A274,Data!P:P)=0,#N/A,SUMIF(Data!$I:$I,$A274,Data!P:P)),#N/A)","v":{"$error":"#N/A"}},{"$f":"IF(H$6,IF(SUMIF(Data!$I:$I,$A274,Data!Q:Q)=0,#N/A,SUMIF(Data!$I:$I,$A274,Data!Q:Q)),#N/A)","v":{"$error":"#N/A"}},{"$f":"IF(I$6,IF(SUMIF(Data!$I:$I,$A274,Data!R:R)=0,#N/A,SUMIF(Data!$I:$I,$A274,Data!R:R)),#N/A)","v":{"$error":"#N/A"}},{"$f":"IF(J$6,IF(SUMIF(Data!$I:$I,$A274,Data!S:S)=0,#N/A,SUMIF(Data!$I:$I,$A274,Data!S:S)),#N/A)","v":{"$error":"#N/A"}},{"$f":"IF(K$6,IF(SUMIF(Data!$I:$I,$A274,Data!T:T)=0,#N/A,SUMIF(Data!$I:$I,$A274,Data!T:T)),#N/A)","v":{"$error":"#N/A"}}]
[{"$error":"#N/A"},{"$f":"IF(B$6,IF(SUMIF(Data!$I:$I,$A275,Data!K:K)=0,#N/A,SUMIF(Data!$I:$I,$A275,Data!K:K)),#N/A)","v":{"$error":"#N/A"}},{"$f":"IF(C$6,IF(SUMIF(Data!$I:$I,$A275,Data!L:L)=0,#N/A,SUMIF(Data!$I:$I,$A275,Data!L:L)),#N/A)","v":{"$error":"#N/A"}},{"$f":"IF(D$6,IF(SUMIF(Data!$I:$I,$A275,Data!M:M)=0,#N/A,SUMIF(Data!$I:$I,$A275,Data!M:M)),#N/A)","v":{"$error":"#N/A"}},{"$f":"IF(E$6,IF(SUMIF(Data!$I:$I,$A275,Data!N:N)=0,#N/A,SUMIF(Data!$I:$I,$A275,Data!N:N)),#N/A)","v":{"$error":"#N/A"}},{"$f":"IF(F$6,IF(SUMIF(Data!$I:$I,$A275,Data!O:O)=0,#N/A,SUMIF(Data!$I:$I,$A275,Data!O:O)),#N/A)","v":{"$error":"#N/A"}},{"$f":"IF(G$6,IF(SUMIF(Data!$I:$I,$A275,Data!P:P)=0,#N/A,SUMIF(Data!$I:$I,$A275,Data!P:P)),#N/A)","v":{"$error":"#N/A"}},{"$f":"IF(H$6,IF(SUMIF(Data!$I:$I,$A275,Data!Q:Q)=0,#N/A,SUMIF(Data!$I:$I,$A275,Data!Q:Q)),#N/A)","v":{"$error":"#N/A"}},{"$f":"IF(I$6,IF(SUMIF(Data!$I:$I,$A275,Data!R:R)=0,#N/A,SUMIF(Data!$I:$I,$A275,Data!R:R)),#N/A)","v":{"$error":"#N/A"}},{"$f":"IF(J$6,IF(SUMIF(Data!$I:$I,$A275,Data!S:S)=0,#N/A,SUMIF(Data!$I:$I,$A275,Data!S:S)),#N/A)","v":{"$error":"#N/A"}},{"$f":"IF(K$6,IF(SUMIF(Data!$I:$I,$A275,Data!T:T)=0,#N/A,SUMIF(Data!$I:$I,$A275,Data!T:T)),#N/A)","v":{"$error":"#N/A"}}]
[{"$error":"#N/A"},{"$f":"IF(B$6,IF(SUMIF(Data!$I:$I,$A276,Data!K:K)=0,#N/A,SUMIF(Data!$I:$I,$A276,Data!K:K)),#N/A)","v":{"$error":"#N/A"}},{"$f":"IF(C$6,IF(SUMIF(Data!$I:$I,$A276,Data!L:L)=0,#N/A,SUMIF(Data!$I:$I,$A276,Data!L:L)),#N/A)","v":{"$error":"#N/A"}},{"$f":"IF(D$6,IF(SUMIF(Data!$I:$I,$A276,Data!M:M)=0,#N/A,SUMIF(Data!$I:$I,$A276,Data!M:M)),#N/A)","v":{"$error":"#N/A"}},{"$f":"IF(E$6,IF(SUMIF(Data!$I:$I,$A276,Data!N:N)=0,#N/A,SUMIF(Data!$I:$I,$A276,Data!N:N)),#N/A)","v":{"$error":"#N/A"}},{"$f":"IF(F$6,IF(SUMIF(Data!$I:$I,$A276,Data!O:O)=0,#N/A,SUMIF(Data!$I:$I,$A276,Data!O:O)),#N/A)","v":{"$error":"#N/A"}},{"$f":"IF(G$6,IF(SUMIF(Data!$I:$I,$A276,Data!P:P)=0,#N/A,SUMIF(Data!$I:$I,$A276,Data!P:P)),#N/A)","v":{"$error":"#N/A"}},{"$f":"IF(H$6,IF(SUMIF(Data!$I:$I,$A276,Data!Q:Q)=0,#N/A,SUMIF(Data!$I:$I,$A276,Data!Q:Q)),#N/A)","v":{"$error":"#N/A"}},{"$f":"IF(I$6,IF(SUMIF(Data!$I:$I,$A276,Data!R:R)=0,#N/A,SUMIF(Data!$I:$I,$A276,Data!R:R)),#N/A)","v":{"$error":"#N/A"}},{"$f":"IF(J$6,IF(SUMIF(Data!$I:$I,$A276,Data!S:S)=0,#N/A,SUMIF(Data!$I:$I,$A276,Data!S:S)),#N/A)","v":{"$error":"#N/A"}},{"$f":"IF(K$6,IF(SUMIF(Data!$I:$I,$A276,Data!T:T)=0,#N/A,SUMIF(Data!$I:$I,$A276,Data!T:T)),#N/A)","v":{"$error":"#N/A"}}]
[{"$error":"#N/A"},{"$f":"IF(B$6,IF(SUMIF(Data!$I:$I,$A277,Data!K:K)=0,#N/A,SUMIF(Data!$I:$I,$A277,Data!K:K)),#N/A)","v":{"$error":"#N/A"}},{"$f":"IF(C$6,IF(SUMIF(Data!$I:$I,$A277,Data!L:L)=0,#N/A,SUMIF(Data!$I:$I,$A277,Data!L:L)),#N/A)","v":{"$error":"#N/A"}},{"$f":"IF(D$6,IF(SUMIF(Data!$I:$I,$A277,Data!M:M)=0,#N/A,SUMIF(Data!$I:$I,$A277,Data!M:M)),#N/A)","v":{"$error":"#N/A"}},{"$f":"IF(E$6,IF(SUMIF(Data!$I:$I,$A277,Data!N:N)=0,#N/A,SUMIF(Data!$I:$I,$A277,Data!N:N)),#N/A)","v":{"$error":"#N/A"}},{"$f":"IF(F$6,IF(SUMIF(Data!$I:$I,$A277,Data!O:O)=0,#N/A,SUMIF(Data!$I:$I,$A277,Data!O:O)),#N/A)","v":{"$error":"#N/A"}},{"$f":"IF(G$6,IF(SUMIF(Data!$I:$I,$A277,Data!P:P)=0,#N/A,SUMIF(Data!$I:$I,$A277,Data!P:P)),#N/A)","v":{"$error":"#N/A"}},{"$f":"IF(H$6,IF(SUMIF(Data!$I:$I,$A277,Data!Q:Q)=0,#N/A,SUMIF(Data!$I:$I,$A277,Data!Q:Q)),#N/A)","v":{"$error":"#N/A"}},{"$f":"IF(I$6,IF(SUMIF(Data!$I:$I,$A277,Data!R:R)=0,#N/A,SUMIF(Data!$I:$I,$A277,Data!R:R)),#N/A)","v":{"$error":"#N/A"}},{"$f":"IF(J$6,IF(SUMIF(Data!$I:$I,$A277,Data!S:S)=0,#N/A,SUMIF(Data!$I:$I,$A277,Data!S:S)),#N/A)","v":{"$error":"#N/A"}},{"$f":"IF(K$6,IF(SUMIF(Data!$I:$I,$A277,Data!T:T)=0,#N/A,SUMIF(Data!$I:$I,$A277,Data!T:T)),#N/A)","v":{"$error":"#N/A"}}]
[{"$error":"#N/A"},{"$f":"IF(B$6,IF(SUMIF(Data!$I:$I,$A278,Data!K:K)=0,#N/A,SUMIF(Data!$I:$I,$A278,Data!K:K)),#N/A)","v":{"$error":"#N/A"}},{"$f":"IF(C$6,IF(SUMIF(Data!$I:$I,$A278,Data!L:L)=0,#N/A,SUMIF(Data!$I:$I,$A278,Data!L:L)),#N/A)","v":{"$error":"#N/A"}},{"$f":"IF(D$6,IF(SUMIF(Data!$I:$I,$A278,Data!M:M)=0,#N/A,SUMIF(Data!$I:$I,$A278,Data!M:M)),#N/A)","v":{"$error":"#N/A"}},{"$f":"IF(E$6,IF(SUMIF(Data!$I:$I,$A278,Data!N:N)=0,#N/A,SUMIF(Data!$I:$I,$A278,Data!N:N)),#N/A)","v":{"$error":"#N/A"}},{"$f":"IF(F$6,IF(SUMIF(Data!$I:$I,$A278,Data!O:O)=0,#N/A,SUMIF(Data!$I:$I,$A278,Data!O:O)),#N/A)","v":{"$error":"#N/A"}},{"$f":"IF(G$6,IF(SUMIF(Data!$I:$I,$A278,Data!P:P)=0,#N/A,SUMIF(Data!$I:$I,$A278,Data!P:P)),#N/A)","v":{"$error":"#N/A"}},{"$f":"IF(H$6,IF(SUMIF(Data!$I:$I,$A278,Data!Q:Q)=0,#N/A,SUMIF(Data!$I:$I,$A278,Data!Q:Q)),#N/A)","v":{"$error":"#N/A"}},{"$f":"IF(I$6,IF(SUMIF(Data!$I:$I,$A278,Data!R:R)=0,#N/A,SUMIF(Data!$I:$I,$A278,Data!R:R)),#N/A)","v":{"$error":"#N/A"}},{"$f":"IF(J$6,IF(SUMIF(Data!$I:$I,$A278,Data!S:S)=0,#N/A,SUMIF(Data!$I:$I,$A278,Data!S:S)),#N/A)","v":{"$error":"#N/A"}},{"$f":"IF(K$6,IF(SUMIF(Data!$I:$I,$A278,Data!T:T)=0,#N/A,SUMIF(Data!$I:$I,$A278,Data!T:T)),#N/A)","v":{"$error":"#N/A"}}]
[{"$error":"#N/A"},{"$f":"IF(B$6,IF(SUMIF(Data!$I:$I,$A279,Data!K:K)=0,#N/A,SUMIF(Data!$I:$I,$A279,Data!K:K)),#N/A)","v":{"$error":"#N/A"}},{"$f":"IF(C$6,IF(SUMIF(Data!$I:$I,$A279,Data!L:L)=0,#N/A,SUMIF(Data!$I:$I,$A279,Data!L:L)),#N/A)","v":{"$error":"#N/A"}},{"$f":"IF(D$6,IF(SUMIF(Data!$I:$I,$A279,Data!M:M)=0,#N/A,SUMIF(Data!$I:$I,$A279,Data!M:M)),#N/A)","v":{"$error":"#N/A"}},{"$f":"IF(E$6,IF(SUMIF(Data!$I:$I,$A279,Data!N:N)=0,#N/A,SUMIF(Data!$I:$I,$A279,Data!N:N)),#N/A)","v":{"$error":"#N/A"}},{"$f":"IF(F$6,IF(SUMIF(Data!$I:$I,$A279,Data!O:O)=0,#N/A,SUMIF(Data!$I:$I,$A279,Data!O:O)),#N/A)","v":{"$error":"#N/A"}},{"$f":"IF(G$6,IF(SUMIF(Data!$I:$I,$A279,Data!P:P)=0,#N/A,SUMIF(Data!$I:$I,$A279,Data!P:P)),#N/A)","v":{"$error":"#N/A"}},{"$f":"IF(H$6,IF(SUMIF(Data!$I:$I,$A279,Data!Q:Q)=0,#N/A,SUMIF(Data!$I:$I,$A279,Data!Q:Q)),#N/A)","v":{"$error":"#N/A"}},{"$f":"IF(I$6,IF(SUMIF(Data!$I:$I,$A279,Data!R:R)=0,#N/A,SUMIF(Data!$I:$I,$A279,Data!R:R)),#N/A)","v":{"$error":"#N/A"}},{"$f":"IF(J$6,IF(SUMIF(Data!$I:$I,$A279,Data!S:S)=0,#N/A,SUMIF(Data!$I:$I,$A279,Data!S:S)),#N/A)","v":{"$error":"#N/A"}},{"$f":"IF(K$6,IF(SUMIF(Data!$I:$I,$A279,Data!T:T)=0,#N/A,SUMIF(Data!$I:$I,$A279,Data!T:T)),#N/A)","v":{"$error":"#N/A"}}]
[{"$error":"#N/A"},{"$f":"IF(B$6,IF(SUMIF(Data!$I:$I,$A280,Data!K:K)=0,#N/A,SUMIF(Data!$I:$I,$A280,Data!K:K)),#N/A)","v":{"$error":"#N/A"}},{"$f":"IF(C$6,IF(SUMIF(Data!$I:$I,$A280,Data!L:L)=0,#N/A,SUMIF(Data!$I:$I,$A280,Data!L:L)),#N/A)","v":{"$error":"#N/A"}},{"$f":"IF(D$6,IF(SUMIF(Data!$I:$I,$A280,Data!M:M)=0,#N/A,SUMIF(Data!$I:$I,$A280,Data!M:M)),#N/A)","v":{"$error":"#N/A"}},{"$f":"IF(E$6,IF(SUMIF(Data!$I:$I,$A280,Data!N:N)=0,#N/A,SUMIF(Data!$I:$I,$A280,Data!N:N)),#N/A)","v":{"$error":"#N/A"}},{"$f":"IF(F$6,IF(SUMIF(Data!$I:$I,$A280,Data!O:O)=0,#N/A,SUMIF(Data!$I:$I,$A280,Data!O:O)),#N/A)","v":{"$error":"#N/A"}},{"$f":"IF(G$6,IF(SUMIF(Data!$I:$I,$A280,Data!P:P)=0,#N/A,SUMIF(Data!$I:$I,$A280,Data!P:P)),#N/A)","v":{"$error":"#N/A"}},{"$f":"IF(H$6,IF(SUMIF(Data!$I:$I,$A280,Data!Q:Q)=0,#N/A,SUMIF(Data!$I:$I,$A280,Data!Q:Q)),#N/A)","v":{"$error":"#N/A"}},{"$f":"IF(I$6,IF(SUMIF(Data!$I:$I,$A280,Data!R:R)=0,#N/A,SUMIF(Data!$I:$I,$A280,Data!R:R)),#N/A)","v":{"$error":"#N/A"}},{"$f":"IF(J$6,IF(SUMIF(Data!$I:$I,$A280,Data!S:S)=0,#N/A,SUMIF(Data!$I:$I,$A280,Data!S:S)),#N/A)","v":{"$error":"#N/A"}},{"$f":"IF(K$6,IF(SUMIF(Data!$I:$I,$A280,Data!T:T)=0,#N/A,SUMIF(Data!$I:$I,$A280,Data!T:T)),#N/A)","v":{"$error":"#N/A"}}]
[{"$error":"#N/A"},{"$f":"IF(B$6,IF(SUMIF(Data!$I:$I,$A281,Data!K:K)=0,#N/A,SUMIF(Data!$I:$I,$A281,Data!K:K)),#N/A)","v":{"$error":"#N/A"}},{"$f":"IF(C$6,IF(SUMIF(Data!$I:$I,$A281,Data!L:L)=0,#N/A,SUMIF(Data!$I:$I,$A281,Data!L:L)),#N/A)","v":{"$error":"#N/A"}},{"$f":"IF(D$6,IF(SUMIF(Data!$I:$I,$A281,Data!M:M)=0,#N/A,SUMIF(Data!$I:$I,$A281,Data!M:M)),#N/A)","v":{"$error":"#N/A"}},{"$f":"IF(E$6,IF(SUMIF(Data!$I:$I,$A281,Data!N:N)=0,#N/A,SUMIF(Data!$I:$I,$A281,Data!N:N)),#N/A)","v":{"$error":"#N/A"}},{"$f":"IF(F$6,IF(SUMIF(Data!$I:$I,$A281,Data!O:O)=0,#N/A,SUMIF(Data!$I:$I,$A281,Data!O:O)),#N/A)","v":{"$error":"#N/A"}},{"$f":"IF(G$6,IF(SUMIF(Data!$I:$I,$A281,Data!P:P)=0,#N/A,SUMIF(Data!$I:$I,$A281,Data!P:P)),#N/A)","v":{"$error":"#N/A"}},{"$f":"IF(H$6,IF(SUMIF(Data!$I:$I,$A281,Data!Q:Q)=0,#N/A,SUMIF(Data!$I:$I,$A281,Data!Q:Q)),#N/A)","v":{"$error":"#N/A"}},{"$f":"IF(I$6,IF(SUMIF(Data!$I:$I,$A281,Data!R:R)=0,#N/A,SUMIF(Data!$I:$I,$A281,Data!R:R)),#N/A)","v":{"$error":"#N/A"}},{"$f":"IF(J$6,IF(SUMIF(Data!$I:$I,$A281,Data!S:S)=0,#N/A,SUMIF(Data!$I:$I,$A281,Data!S:S)),#N/A)","v":{"$error":"#N/A"}},{"$f":"IF(K$6,IF(SUMIF(Data!$I:$I,$A281,Data!T:T)=0,#N/A,SUMIF(Data!$I:$I,$A281,Data!T:T)),#N/A)","v":{"$error":"#N/A"}}]
[{"$error":"#N/A"},{"$f":"IF(B$6,IF(SUMIF(Data!$I:$I,$A282,Data!K:K)=0,#N/A,SUMIF(Data!$I:$I,$A282,Data!K:K)),#N/A)","v":{"$error":"#N/A"}},{"$f":"IF(C$6,IF(SUMIF(Data!$I:$I,$A282,Data!L:L)=0,#N/A,SUMIF(Data!$I:$I,$A282,Data!L:L)),#N/A)","v":{"$error":"#N/A"}},{"$f":"IF(D$6,IF(SUMIF(Data!$I:$I,$A282,Data!M:M)=0,#N/A,SUMIF(Data!$I:$I,$A282,Data!M:M)),#N/A)","v":{"$error":"#N/A"}},{"$f":"IF(E$6,IF(SUMIF(Data!$I:$I,$A282,Data!N:N)=0,#N/A,SUMIF(Data!$I:$I,$A282,Data!N:N)),#N/A)","v":{"$error":"#N/A"}},{"$f":"IF(F$6,IF(SUMIF(Data!$I:$I,$A282,Data!O:O)=0,#N/A,SUMIF(Data!$I:$I,$A282,Data!O:O)),#N/A)","v":{"$error":"#N/A"}},{"$f":"IF(G$6,IF(SUMIF(Data!$I:$I,$A282,Data!P:P)=0,#N/A,SUMIF(Data!$I:$I,$A282,Data!P:P)),#N/A)","v":{"$error":"#N/A"}},{"$f":"IF(H$6,IF(SUMIF(Data!$I:$I,$A282,Data!Q:Q)=0,#N/A,SUMIF(Data!$I:$I,$A282,Data!Q:Q)),#N/A)","v":{"$error":"#N/A"}},{"$f":"IF(I$6,IF(SUMIF(Data!$I:$I,$A282,Data!R:R)=0,#N/A,SUMIF(Data!$I:$I,$A282,Data!R:R)),#N/A)","v":{"$error":"#N/A"}},{"$f":"IF(J$6,IF(SUMIF(Data!$I:$I,$A282,Data!S:S)=0,#N/A,SUMIF(Data!$I:$I,$A282,Data!S:S)),#N/A)","v":{"$error":"#N/A"}},{"$f":"IF(K$6,IF(SUMIF(Data!$I:$I,$A282,Data!T:T)=0,#N/A,SUMIF(Data!$I:$I,$A282,Data!T:T)),#N/A)","v":{"$error":"#N/A"}}]
[{"$error":"#N/A"},{"$f":"IF(B$6,IF(SUMIF(Data!$I:$I,$A283,Data!K:K)=0,#N/A,SUMIF(Data!$I:$I,$A283,Data!K:K)),#N/A)","v":{"$error":"#N/A"}},{"$f":"IF(C$6,IF(SUMIF(Data!$I:$I,$A283,Data!L:L)=0,#N/A,SUMIF(Data!$I:$I,$A283,Data!L:L)),#N/A)","v":{"$error":"#N/A"}},{"$f":"IF(D$6,IF(SUMIF(Data!$I:$I,$A283,Data!M:M)=0,#N/A,SUMIF(Data!$I:$I,$A283,Data!M:M)),#N/A)","v":{"$error":"#N/A"}},{"$f":"IF(E$6,IF(SUMIF(Data!$I:$I,$A283,Data!N:N)=0,#N/A,SUMIF(Data!$I:$I,$A283,Data!N:N)),#N/A)","v":{"$error":"#N/A"}},{"$f":"IF(F$6,IF(SUMIF(Data!$I:$I,$A283,Data!O:O)=0,#N/A,SUMIF(Data!$I:$I,$A283,Data!O:O)),#N/A)","v":{"$error":"#N/A"}},{"$f":"IF(G$6,IF(SUMIF(Data!$I:$I,$A283,Data!P:P)=0,#N/A,SUMIF(Data!$I:$I,$A283,Data!P:P)),#N/A)","v":{"$error":"#N/A"}},{"$f":"IF(H$6,IF(SUMIF(Data!$I:$I,$A283,Data!Q:Q)=0,#N/A,SUMIF(Data!$I:$I,$A283,Data!Q:Q)),#N/A)","v":{"$error":"#N/A"}},{"$f":"IF(I$6,IF(SUMIF(Data!$I:$I,$A283,Data!R:R)=0,#N/A,SUMIF(Data!$I:$I,$A283,Data!R:R)),#N/A)","v":{"$error":"#N/A"}},{"$f":"IF(J$6,IF(SUMIF(Data!$I:$I,$A283,Data!S:S)=0,#N/A,SUMIF(Data!$I:$I,$A283,Data!S:S)),#N/A)","v":{"$error":"#N/A"}},{"$f":"IF(K$6,IF(SUMIF(Data!$I:$I,$A283,Data!T:T)=0,#N/A,SUMIF(Data!$I:$I,$A283,Data!T:T)),#N/A)","v":{"$error":"#N/A"}}]
[{"$error":"#N/A"},{"$f":"IF(B$6,IF(SUMIF(Data!$I:$I,$A284,Data!K:K)=0,#N/A,SUMIF(Data!$I:$I,$A284,Data!K:K)),#N/A)","v":{"$error":"#N/A"}},{"$f":"IF(C$6,IF(SUMIF(Data!$I:$I,$A284,Data!L:L)=0,#N/A,SUMIF(Data!$I:$I,$A284,Data!L:L)),#N/A)","v":{"$error":"#N/A"}},{"$f":"IF(D$6,IF(SUMIF(Data!$I:$I,$A284,Data!M:M)=0,#N/A,SUMIF(Data!$I:$I,$A284,Data!M:M)),#N/A)","v":{"$error":"#N/A"}},{"$f":"IF(E$6,IF(SUMIF(Data!$I:$I,$A284,Data!N:N)=0,#N/A,SUMIF(Data!$I:$I,$A284,Data!N:N)),#N/A)","v":{"$error":"#N/A"}},{"$f":"IF(F$6,IF(SUMIF(Data!$I:$I,$A284,Data!O:O)=0,#N/A,SUMIF(Data!$I:$I,$A284,Data!O:O)),#N/A)","v":{"$error":"#N/A"}},{"$f":"IF(G$6,IF(SUMIF(Data!$I:$I,$A284,Data!P:P)=0,#N/A,SUMIF(Data!$I:$I,$A284,Data!P:P)),#N/A)","v":{"$error":"#N/A"}},{"$f":"IF(H$6,IF(SUMIF(Data!$I:$I,$A284,Data!Q:Q)=0,#N/A,SUMIF(Data!$I:$I,$A284,Data!Q:Q)),#N/A)","v":{"$error":"#N/A"}},{"$f":"IF(I$6,IF(SUMIF(Data!$I:$I,$A284,Data!R:R)=0,#N/A,SUMIF(Data!$I:$I,$A284,Data!R:R)),#N/A)","v":{"$error":"#N/A"}},{"$f":"IF(J$6,IF(SUMIF(Data!$I:$I,$A284,Data!S:S)=0,#N/A,SUMIF(Data!$I:$I,$A284,Data!S:S)),#N/A)","v":{"$error":"#N/A"}},{"$f":"IF(K$6,IF(SUMIF(Data!$I:$I,$A284,Data!T:T)=0,#N/A,SUMIF(Data!$I:$I,$A284,Data!T:T)),#N/A)","v":{"$error":"#N/A"}}]
[{"$error":"#N/A"},{"$f":"IF(B$6,IF(SUMIF(Data!$I:$I,$A285,Data!K:K)=0,#N/A,SUMIF(Data!$I:$I,$A285,Data!K:K)),#N/A)","v":{"$error":"#N/A"}},{"$f":"IF(C$6,IF(SUMIF(Data!$I:$I,$A285,Data!L:L)=0,#N/A,SUMIF(Data!$I:$I,$A285,Data!L:L)),#N/A)","v":{"$error":"#N/A"}},{"$f":"IF(D$6,IF(SUMIF(Data!$I:$I,$A285,Data!M:M)=0,#N/A,SUMIF(Data!$I:$I,$A285,Data!M:M)),#N/A)","v":{"$error":"#N/A"}},{"$f":"IF(E$6,IF(SUMIF(Data!$I:$I,$A285,Data!N:N)=0,#N/A,SUMIF(Data!$I:$I,$A285,Data!N:N)),#N/A)","v":{"$error":"#N/A"}},{"$f":"IF(F$6,IF(SUMIF(Data!$I:$I,$A285,Data!O:O)=0,#N/A,SUMIF(Data!$I:$I,$A285,Data!O:O)),#N/A)","v":{"$error":"#N/A"}},{"$f":"IF(G$6,IF(SUMIF(Data!$I:$I,$A285,Data!P:P)=0,#N/A,SUMIF(Data!$I:$I,$A285,Data!P:P)),#N/A)","v":{"$error":"#N/A"}},{"$f":"IF(H$6,IF(SUMIF(Data!$I:$I,$A285,Data!Q:Q)=0,#N/A,SUMIF(Data!$I:$I,$A285,Data!Q:Q)),#N/A)","v":{"$error":"#N/A"}},{"$f":"IF(I$6,IF(SUMIF(Data!$I:$I,$A285,Data!R:R)=0,#N/A,SUMIF(Data!$I:$I,$A285,Data!R:R)),#N/A)","v":{"$error":"#N/A"}},{"$f":"IF(J$6,IF(SUMIF(Data!$I:$I,$A285,Data!S:S)=0,#N/A,SUMIF(Data!$I:$I,$A285,Data!S:S)),#N/A)","v":{"$error":"#N/A"}},{"$f":"IF(K$6,IF(SUMIF(Data!$I:$I,$A285,Data!T:T)=0,#N/A,SUMIF(Data!$I:$I,$A285,Data!T:T)),#N/A)","v":{"$error":"#N/A"}}]
[{"$error":"#N/A"},{"$f":"IF(B$6,IF(SUMIF(Data!$I:$I,$A286,Data!K:K)=0,#N/A,SUMIF(Data!$I:$I,$A286,Data!K:K)),#N/A)","v":{"$error":"#N/A"}},{"$f":"IF(C$6,IF(SUMIF(Data!$I:$I,$A286,Data!L:L)=0,#N/A,SUMIF(Data!$I:$I,$A286,Data!L:L)),#N/A)","v":{"$error":"#N/A"}},{"$f":"IF(D$6,IF(SUMIF(Data!$I:$I,$A286,Data!M:M)=0,#N/A,SUMIF(Data!$I:$I,$A286,Data!M:M)),#N/A)","v":{"$error":"#N/A"}},{"$f":"IF(E$6,IF(SUMIF(Data!$I:$I,$A286,Data!N:N)=0,#N/A,SUMIF(Data!$I:$I,$A286,Data!N:N)),#N/A)","v":{"$error":"#N/A"}},{"$f":"IF(F$6,IF(SUMIF(Data!$I:$I,$A286,Data!O:O)=0,#N/A,SUMIF(Data!$I:$I,$A286,Data!O:O)),#N/A)","v":{"$error":"#N/A"}},{"$f":"IF(G$6,IF(SUMIF(Data!$I:$I,$A286,Data!P:P)=0,#N/A,SUMIF(Data!$I:$I,$A286,Data!P:P)),#N/A)","v":{"$error":"#N/A"}},{"$f":"IF(H$6,IF(SUMIF(Data!$I:$I,$A286,Data!Q:Q)=0,#N/A,SUMIF(Data!$I:$I,$A286,Data!Q:Q)),#N/A)","v":{"$error":"#N/A"}},{"$f":"IF(I$6,IF(SUMIF(Data!$I:$I,$A286,Data!R:R)=0,#N/A,SUMIF(Data!$I:$I,$A286,Data!R:R)),#N/A)","v":{"$error":"#N/A"}},{"$f":"IF(J$6,IF(SUMIF(Data!$I:$I,$A286,Data!S:S)=0,#N/A,SUMIF(Data!$I:$I,$A286,Data!S:S)),#N/A)","v":{"$error":"#N/A"}},{"$f":"IF(K$6,IF(SUMIF(Data!$I:$I,$A286,Data!T:T)=0,#N/A,SUMIF(Data!$I:$I,$A286,Data!T:T)),#N/A)","v":{"$error":"#N/A"}}]
[{"$error":"#N/A"},{"$f":"IF(B$6,IF(SUMIF(Data!$I:$I,$A287,Data!K:K)=0,#N/A,SUMIF(Data!$I:$I,$A287,Data!K:K)),#N/A)","v":{"$error":"#N/A"}},{"$f":"IF(C$6,IF(SUMIF(Data!$I:$I,$A287,Data!L:L)=0,#N/A,SUMIF(Data!$I:$I,$A287,Data!L:L)),#N/A)","v":{"$error":"#N/A"}},{"$f":"IF(D$6,IF(SUMIF(Data!$I:$I,$A287,Data!M:M)=0,#N/A,SUMIF(Data!$I:$I,$A287,Data!M:M)),#N/A)","v":{"$error":"#N/A"}},{"$f":"IF(E$6,IF(SUMIF(Data!$I:$I,$A287,Data!N:N)=0,#N/A,SUMIF(Data!$I:$I,$A287,Data!N:N)),#N/A)","v":{"$error":"#N/A"}},{"$f":"IF(F$6,IF(SUMIF(Data!$I:$I,$A287,Data!O:O)=0,#N/A,SUMIF(Data!$I:$I,$A287,Data!O:O)),#N/A)","v":{"$error":"#N/A"}},{"$f":"IF(G$6,IF(SUMIF(Data!$I:$I,$A287,Data!P:P)=0,#N/A,SUMIF(Data!$I:$I,$A287,Data!P:P)),#N/A)","v":{"$error":"#N/A"}},{"$f":"IF(H$6,IF(SUMIF(Data!$I:$I,$A287,Data!Q:Q)=0,#N/A,SUMIF(Data!$I:$I,$A287,Data!Q:Q)),#N/A)","v":{"$error":"#N/A"}},{"$f":"IF(I$6,IF(SUMIF(Data!$I:$I,$A287,Data!R:R)=0,#N/A,SUMIF(Data!$I:$I,$A287,Data!R:R)),#N/A)","v":{"$error":"#N/A"}},{"$f":"IF(J$6,IF(SUMIF(Data!$I:$I,$A287,Data!S:S)=0,#N/A,SUMIF(Data!$I:$I,$A287,Data!S:S)),#N/A)","v":{"$error":"#N/A"}},{"$f":"IF(K$6,IF(SUMIF(Data!$I:$I,$A287,Data!T:T)=0,#N/A,SUMIF(Data!$I:$I,$A287,Data!T:T)),#N/A)","v":{"$error":"#N/A"}}]
[{"$error":"#N/A"},{"$f":"IF(B$6,IF(SUMIF(Data!$I:$I,$A288,Data!K:K)=0,#N/A,SUMIF(Data!$I:$I,$A288,Data!K:K)),#N/A)","v":{"$error":"#N/A"}},{"$f":"IF(C$6,IF(SUMIF(Data!$I:$I,$A288,Data!L:L)=0,#N/A,SUMIF(Data!$I:$I,$A288,Data!L:L)),#N/A)","v":{"$error":"#N/A"}},{"$f":"IF(D$6,IF(SUMIF(Data!$I:$I,$A288,Data!M:M)=0,#N/A,SUMIF(Data!$I:$I,$A288,Data!M:M)),#N/A)","v":{"$error":"#N/A"}},{"$f":"IF(E$6,IF(SUMIF(Data!$I:$I,$A288,Data!N:N)=0,#N/A,SUMIF(Data!$I:$I,$A288,Data!N:N)),#N/A)","v":{"$error":"#N/A"}},{"$f":"IF(F$6,IF(SUMIF(Data!$I:$I,$A288,Data!O:O)=0,#N/A,SUMIF(Data!$I:$I,$A288,Data!O:O)),#N/A)","v":{"$error":"#N/A"}},{"$f":"IF(G$6,IF(SUMIF(Data!$I:$I,$A288,Data!P:P)=0,#N/A,SUMIF(Data!$I:$I,$A288,Data!P:P)),#N/A)","v":{"$error":"#N/A"}},{"$f":"IF(H$6,IF(SUMIF(Data!$I:$I,$A288,Data!Q:Q)=0,#N/A,SUMIF(Data!$I:$I,$A288,Data!Q:Q)),#N/A)","v":{"$error":"#N/A"}},{"$f":"IF(I$6,IF(SUMIF(Data!$I:$I,$A288,Data!R:R)=0,#N/A,SUMIF(Data!$I:$I,$A288,Data!R:R)),#N/A)","v":{"$error":"#N/A"}},{"$f":"IF(J$6,IF(SUMIF(Data!$I:$I,$A288,Data!S:S)=0,#N/A,SUMIF(Data!$I:$I,$A288,Data!S:S)),#N/A)","v":{"$error":"#N/A"}},{"$f":"IF(K$6,IF(SUMIF(Data!$I:$I,$A288,Data!T:T)=0,#N/A,SUMIF(Data!$I:$I,$A288,Data!T:T)),#N/A)","v":{"$error":"#N/A"}}]
[{"$error":"#N/A"},{"$f":"IF(B$6,IF(SUMIF(Data!$I:$I,$A289,Data!K:K)=0,#N/A,SUMIF(Data!$I:$I,$A289,Data!K:K)),#N/A)","v":{"$error":"#N/A"}},{"$f":"IF(C$6,IF(SUMIF(Data!$I:$I,$A289,Data!L:L)=0,#N/A,SUMIF(Data!$I:$I,$A289,Data!L:L)),#N/A)","v":{"$error":"#N/A"}},{"$f":"IF(D$6,IF(SUMIF(Data!$I:$I,$A289,Data!M:M)=0,#N/A,SUMIF(Data!$I:$I,$A289,Data!M:M)),#N/A)","v":{"$error":"#N/A"}},{"$f":"IF(E$6,IF(SUMIF(Data!$I:$I,$A289,Data!N:N)=0,#N/A,SUMIF(Data!$I:$I,$A289,Data!N:N)),#N/A)","v":{"$error":"#N/A"}},{"$f":"IF(F$6,IF(SUMIF(Data!$I:$I,$A289,Data!O:O)=0,#N/A,SUMIF(Data!$I:$I,$A289,Data!O:O)),#N/A)","v":{"$error":"#N/A"}},{"$f":"IF(G$6,IF(SUMIF(Data!$I:$I,$A289,Data!P:P)=0,#N/A,SUMIF(Data!$I:$I,$A289,Data!P:P)),#N/A)","v":{"$error":"#N/A"}},{"$f":"IF(H$6,IF(SUMIF(Data!$I:$I,$A289,Data!Q:Q)=0,#N/A,SUMIF(Data!$I:$I,$A289,Data!Q:Q)),#N/A)","v":{"$error":"#N/A"}},{"$f":"IF(I$6,IF(SUMIF(Data!$I:$I,$A289,Data!R:R)=0,#N/A,SUMIF(Data!$I:$I,$A289,Data!R:R)),#N/A)","v":{"$error":"#N/A"}},{"$f":"IF(J$6,IF(SUMIF(Data!$I:$I,$A289,Data!S:S)=0,#N/A,SUMIF(Data!$I:$I,$A289,Data!S:S)),#N/A)","v":{"$error":"#N/A"}},{"$f":"IF(K$6,IF(SUMIF(Data!$I:$I,$A289,Data!T:T)=0,#N/A,SUMIF(Data!$I:$I,$A289,Data!T:T)),#N/A)","v":{"$error":"#N/A"}}]
[{"$error":"#N/A"},{"$f":"IF(B$6,IF(SUMIF(Data!$I:$I,$A290,Data!K:K)=0,#N/A,SUMIF(Data!$I:$I,$A290,Data!K:K)),#N/A)","v":{"$error":"#N/A"}},{"$f":"IF(C$6,IF(SUMIF(Data!$I:$I,$A290,Data!L:L)=0,#N/A,SUMIF(Data!$I:$I,$A290,Data!L:L)),#N/A)","v":{"$error":"#N/A"}},{"$f":"IF(D$6,IF(SUMIF(Data!$I:$I,$A290,Data!M:M)=0,#N/A,SUMIF(Data!$I:$I,$A290,Data!M:M)),#N/A)","v":{"$error":"#N/A"}},{"$f":"IF(E$6,IF(SUMIF(Data!$I:$I,$A290,Data!N:N)=0,#N/A,SUMIF(Data!$I:$I,$A290,Data!N:N)),#N/A)","v":{"$error":"#N/A"}},{"$f":"IF(F$6,IF(SUMIF(Data!$I:$I,$A290,Data!O:O)=0,#N/A,SUMIF(Data!$I:$I,$A290,Data!O:O)),#N/A)","v":{"$error":"#N/A"}},{"$f":"IF(G$6,IF(SUMIF(Data!$I:$I,$A290,Data!P:P)=0,#N/A,SUMIF(Data!$I:$I,$A290,Data!P:P)),#N/A)","v":{"$error":"#N/A"}},{"$f":"IF(H$6,IF(SUMIF(Data!$I:$I,$A290,Data!Q:Q)=0,#N/A,SUMIF(Data!$I:$I,$A290,Data!Q:Q)),#N/A)","v":{"$error":"#N/A"}},{"$f":"IF(I$6,IF(SUMIF(Data!$I:$I,$A290,Data!R:R)=0,#N/A,SUMIF(Data!$I:$I,$A290,Data!R:R)),#N/A)","v":{"$error":"#N/A"}},{"$f":"IF(J$6,IF(SUMIF(Data!$I:$I,$A290,Data!S:S)=0,#N/A,SUMIF(Data!$I:$I,$A290,Data!S:S)),#N/A)","v":{"$error":"#N/A"}},{"$f":"IF(K$6,IF(SUMIF(Data!$I:$I,$A290,Data!T:T)=0,#N/A,SUMIF(Data!$I:$I,$A290,Data!T:T)),#N/A)","v":{"$error":"#N/A"}}]
[{"$error":"#N/A"},{"$f":"IF(B$6,IF(SUMIF(Data!$I:$I,$A291,Data!K:K)=0,#N/A,SUMIF(Data!$I:$I,$A291,Data!K:K)),#N/A)","v":{"$error":"#N/A"}},{"$f":"IF(C$6,IF(SUMIF(Data!$I:$I,$A291,Data!L:L)=0,#N/A,SUMIF(Data!$I:$I,$A291,Data!L:L)),#N/A)","v":{"$error":"#N/A"}},{"$f":"IF(D$6,IF(SUMIF(Data!$I:$I,$A291,Data!M:M)=0,#N/A,SUMIF(Data!$I:$I,$A291,Data!M:M)),#N/A)","v":{"$error":"#N/A"}},{"$f":"IF(E$6,IF(SUMIF(Data!$I:$I,$A291,Data!N:N)=0,#N/A,SUMIF(Data!$I:$I,$A291,Data!N:N)),#N/A)","v":{"$error":"#N/A"}},{"$f":"IF(F$6,IF(SUMIF(Data!$I:$I,$A291,Data!O:O)=0,#N/A,SUMIF(Data!$I:$I,$A291,Data!O:O)),#N/A)","v":{"$error":"#N/A"}},{"$f":"IF(G$6,IF(SUMIF(Data!$I:$I,$A291,Data!P:P)=0,#N/A,SUMIF(Data!$I:$I,$A291,Data!P:P)),#N/A)","v":{"$error":"#N/A"}},{"$f":"IF(H$6,IF(SUMIF(Data!$I:$I,$A291,Data!Q:Q)=0,#N/A,SUMIF(Data!$I:$I,$A291,Data!Q:Q)),#N/A)","v":{"$error":"#N/A"}},{"$f":"IF(I$6,IF(SUMIF(Data!$I:$I,$A291,Data!R:R)=0,#N/A,SUMIF(Data!$I:$I,$A291,Data!R:R)),#N/A)","v":{"$error":"#N/A"}},{"$f":"IF(J$6,IF(SUMIF(Data!$I:$I,$A291,Data!S:S)=0,#N/A,SUMIF(Data!$I:$I,$A291,Data!S:S)),#N/A)","v":{"$error":"#N/A"}},{"$f":"IF(K$6,IF(SUMIF(Data!$I:$I,$A291,Data!T:T)=0,#N/A,SUMIF(Data!$I:$I,$A291,Data!T:T)),#N/A)","v":{"$error":"#N/A"}}]
[{"$error":"#N/A"},{"$f":"IF(B$6,IF(SUMIF(Data!$I:$I,$A292,Data!K:K)=0,#N/A,SUMIF(Data!$I:$I,$A292,Data!K:K)),#N/A)","v":{"$error":"#N/A"}},{"$f":"IF(C$6,IF(SUMIF(Data!$I:$I,$A292,Data!L:L)=0,#N/A,SUMIF(Data!$I:$I,$A292,Data!L:L)),#N/A)","v":{"$error":"#N/A"}},{"$f":"IF(D$6,IF(SUMIF(Data!$I:$I,$A292,Data!M:M)=0,#N/A,SUMIF(Data!$I:$I,$A292,Data!M:M)),#N/A)","v":{"$error":"#N/A"}},{"$f":"IF(E$6,IF(SUMIF(Data!$I:$I,$A292,Data!N:N)=0,#N/A,SUMIF(Data!$I:$I,$A292,Data!N:N)),#N/A)","v":{"$error":"#N/A"}},{"$f":"IF(F$6,IF(SUMIF(Data!$I:$I,$A292,Data!O:O)=0,#N/A,SUMIF(Data!$I:$I,$A292,Data!O:O)),#N/A)","v":{"$error":"#N/A"}},{"$f":"IF(G$6,IF(SUMIF(Data!$I:$I,$A292,Data!P:P)=0,#N/A,SUMIF(Data!$I:$I,$A292,Data!P:P)),#N/A)","v":{"$error":"#N/A"}},{"$f":"IF(H$6,IF(SUMIF(Data!$I:$I,$A292,Data!Q:Q)=0,#N/A,SUMIF(Data!$I:$I,$A292,Data!Q:Q)),#N/A)","v":{"$error":"#N/A"}},{"$f":"IF(I$6,IF(SUMIF(Data!$I:$I,$A292,Data!R:R)=0,#N/A,SUMIF(Data!$I:$I,$A292,Data!R:R)),#N/A)","v":{"$error":"#N/A"}},{"$f":"IF(J$6,IF(SUMIF(Data!$I:$I,$A292,Data!S:S)=0,#N/A,SUMIF(Data!$I:$I,$A292,Data!S:S)),#N/A)","v":{"$error":"#N/A"}},{"$f":"IF(K$6,IF(SUMIF(Data!$I:$I,$A292,Data!T:T)=0,#N/A,SUMIF(Data!$I:$I,$A292,Data!T:T)),#N/A)","v":{"$error":"#N/A"}}]
[{"$error":"#N/A"},{"$f":"IF(B$6,IF(SUMIF(Data!$I:$I,$A293,Data!K:K)=0,#N/A,SUMIF(Data!$I:$I,$A293,Data!K:K)),#N/A)","v":{"$error":"#N/A"}},{"$f":"IF(C$6,IF(SUMIF(Data!$I:$I,$A293,Data!L:L)=0,#N/A,SUMIF(Data!$I:$I,$A293,Data!L:L)),#N/A)","v":{"$error":"#N/A"}},{"$f":"IF(D$6,IF(SUMIF(Data!$I:$I,$A293,Data!M:M)=0,#N/A,SUMIF(Data!$I:$I,$A293,Data!M:M)),#N/A)","v":{"$error":"#N/A"}},{"$f":"IF(E$6,IF(SUMIF(Data!$I:$I,$A293,Data!N:N)=0,#N/A,SUMIF(Data!$I:$I,$A293,Data!N:N)),#N/A)","v":{"$error":"#N/A"}},{"$f":"IF(F$6,IF(SUMIF(Data!$I:$I,$A293,Data!O:O)=0,#N/A,SUMIF(Data!$I:$I,$A293,Data!O:O)),#N/A)","v":{"$error":"#N/A"}},{"$f":"IF(G$6,IF(SUMIF(Data!$I:$I,$A293,Data!P:P)=0,#N/A,SUMIF(Data!$I:$I,$A293,Data!P:P)),#N/A)","v":{"$error":"#N/A"}},{"$f":"IF(H$6,IF(SUMIF(Data!$I:$I,$A293,Data!Q:Q)=0,#N/A,SUMIF(Data!$I:$I,$A293,Data!Q:Q)),#N/A)","v":{"$error":"#N/A"}},{"$f":"IF(I$6,IF(SUMIF(Data!$I:$I,$A293,Data!R:R)=0,#N/A,SUMIF(Data!$I:$I,$A293,Data!R:R)),#N/A)","v":{"$error":"#N/A"}},{"$f":"IF(J$6,IF(SUMIF(Data!$I:$I,$A293,Data!S:S)=0,#N/A,SUMIF(Data!$I:$I,$A293,Data!S:S)),#N/A)","v":{"$error":"#N/A"}},{"$f":"IF(K$6,IF(SUMIF(Data!$I:$I,$A293,Data!T:T)=0,#N/A,SUMIF(Data!$I:$I,$A293,Data!T:T)),#N/A)","v":{"$error":"#N/A"}}]
[{"$error":"#N/A"},{"$f":"IF(B$6,IF(SUMIF(Data!$I:$I,$A294,Data!K:K)=0,#N/A,SUMIF(Data!$I:$I,$A294,Data!K:K)),#N/A)","v":{"$error":"#N/A"}},{"$f":"IF(C$6,IF(SUMIF(Data!$I:$I,$A294,Data!L:L)=0,#N/A,SUMIF(Data!$I:$I,$A294,Data!L:L)),#N/A)","v":{"$error":"#N/A"}},{"$f":"IF(D$6,IF(SUMIF(Data!$I:$I,$A294,Data!M:M)=0,#N/A,SUMIF(Data!$I:$I,$A294,Data!M:M)),#N/A)","v":{"$error":"#N/A"}},{"$f":"IF(E$6,IF(SUMIF(Data!$I:$I,$A294,Data!N:N)=0,#N/A,SUMIF(Data!$I:$I,$A294,Data!N:N)),#N/A)","v":{"$error":"#N/A"}},{"$f":"IF(F$6,IF(SUMIF(Data!$I:$I,$A294,Data!O:O)=0,#N/A,SUMIF(Data!$I:$I,$A294,Data!O:O)),#N/A)","v":{"$error":"#N/A"}},{"$f":"IF(G$6,IF(SUMIF(Data!$I:$I,$A294,Data!P:P)=0,#N/A,SUMIF(Data!$I:$I,$A294,Data!P:P)),#N/A)","v":{"$error":"#N/A"}},{"$f":"IF(H$6,IF(SUMIF(Data!$I:$I,$A294,Data!Q:Q)=0,#N/A,SUMIF(Data!$I:$I,$A294,Data!Q:Q)),#N/A)","v":{"$error":"#N/A"}},{"$f":"IF(I$6,IF(SUMIF(Data!$I:$I,$A294,Data!R:R)=0,#N/A,SUMIF(Data!$I:$I,$A294,Data!R:R)),#N/A)","v":{"$error":"#N/A"}},{"$f":"IF(J$6,IF(SUMIF(Data!$I:$I,$A294,Data!S:S)=0,#N/A,SUMIF(Data!$I:$I,$A294,Data!S:S)),#N/A)","v":{"$error":"#N/A"}},{"$f":"IF(K$6,IF(SUMIF(Data!$I:$I,$A294,Data!T:T)=0,#N/A,SUMIF(Data!$I:$I,$A294,Data!T:T)),#N/A)","v":{"$error":"#N/A"}}]
[{"$error":"#N/A"},{"$f":"IF(B$6,IF(SUMIF(Data!$I:$I,$A295,Data!K:K)=0,#N/A,SUMIF(Data!$I:$I,$A295,Data!K:K)),#N/A)","v":{"$error":"#N/A"}},{"$f":"IF(C$6,IF(SUMIF(Data!$I:$I,$A295,Data!L:L)=0,#N/A,SUMIF(Data!$I:$I,$A295,Data!L:L)),#N/A)","v":{"$error":"#N/A"}},{"$f":"IF(D$6,IF(SUMIF(Data!$I:$I,$A295,Data!M:M)=0,#N/A,SUMIF(Data!$I:$I,$A295,Data!M:M)),#N/A)","v":{"$error":"#N/A"}},{"$f":"IF(E$6,IF(SUMIF(Data!$I:$I,$A295,Data!N:N)=0,#N/A,SUMIF(Data!$I:$I,$A295,Data!N:N)),#N/A)","v":{"$error":"#N/A"}},{"$f":"IF(F$6,IF(SUMIF(Data!$I:$I,$A295,Data!O:O)=0,#N/A,SUMIF(Data!$I:$I,$A295,Data!O:O)),#N/A)","v":{"$error":"#N/A"}},{"$f":"IF(G$6,IF(SUMIF(Data!$I:$I,$A295,Data!P:P)=0,#N/A,SUMIF(Data!$I:$I,$A295,Data!P:P)),#N/A)","v":{"$error":"#N/A"}},{"$f":"IF(H$6,IF(SUMIF(Data!$I:$I,$A295,Data!Q:Q)=0,#N/A,SUMIF(Data!$I:$I,$A295,Data!Q:Q)),#N/A)","v":{"$error":"#N/A"}},{"$f":"IF(I$6,IF(SUMIF(Data!$I:$I,$A295,Data!R:R)=0,#N/A,SUMIF(Data!$I:$I,$A295,Data!R:R)),#N/A)","v":{"$error":"#N/A"}},{"$f":"IF(J$6,IF(SUMIF(Data!$I:$I,$A295,Data!S:S)=0,#N/A,SUMIF(Data!$I:$I,$A295,Data!S:S)),#N/A)","v":{"$error":"#N/A"}},{"$f":"IF(K$6,IF(SUMIF(Data!$I:$I,$A295,Data!T:T)=0,#N/A,SUMIF(Data!$I:$I,$A295,Data!T:T)),#N/A)","v":{"$error":"#N/A"}}]
[{"$error":"#N/A"},{"$f":"IF(B$6,IF(SUMIF(Data!$I:$I,$A296,Data!K:K)=0,#N/A,SUMIF(Data!$I:$I,$A296,Data!K:K)),#N/A)","v":{"$error":"#N/A"}},{"$f":"IF(C$6,IF(SUMIF(Data!$I:$I,$A296,Data!L:L)=0,#N/A,SUMIF(Data!$I:$I,$A296,Data!L:L)),#N/A)","v":{"$error":"#N/A"}},{"$f":"IF(D$6,IF(SUMIF(Data!$I:$I,$A296,Data!M:M)=0,#N/A,SUMIF(Data!$I:$I,$A296,Data!M:M)),#N/A)","v":{"$error":"#N/A"}},{"$f":"IF(E$6,IF(SUMIF(Data!$I:$I,$A296,Data!N:N)=0,#N/A,SUMIF(Data!$I:$I,$A296,Data!N:N)),#N/A)","v":{"$error":"#N/A"}},{"$f":"IF(F$6,IF(SUMIF(Data!$I:$I,$A296,Data!O:O)=0,#N/A,SUMIF(Data!$I:$I,$A296,Data!O:O)),#N/A)","v":{"$error":"#N/A"}},{"$f":"IF(G$6,IF(SUMIF(Data!$I:$I,$A296,Data!P:P)=0,#N/A,SUMIF(Data!$I:$I,$A296,Data!P:P)),#N/A)","v":{"$error":"#N/A"}},{"$f":"IF(H$6,IF(SUMIF(Data!$I:$I,$A296,Data!Q:Q)=0,#N/A,SUMIF(Data!$I:$I,$A296,Data!Q:Q)),#N/A)","v":{"$error":"#N/A"}},{"$f":"IF(I$6,IF(SUMIF(Data!$I:$I,$A296,Data!R:R)=0,#N/A,SUMIF(Data!$I:$I,$A296,Data!R:R)),#N/A)","v":{"$error":"#N/A"}},{"$f":"IF(J$6,IF(SUMIF(Data!$I:$I,$A296,Data!S:S)=0,#N/A,SUMIF(Data!$I:$I,$A296,Data!S:S)),#N/A)","v":{"$error":"#N/A"}},{"$f":"IF(K$6,IF(SUMIF(Data!$I:$I,$A296,Data!T:T)=0,#N/A,SUMIF(Data!$I:$I,$A296,Data!T:T)),#N/A)","v":{"$error":"#N/A"}}]
[{"$error":"#N/A"},{"$f":"IF(B$6,IF(SUMIF(Data!$I:$I,$A297,Data!K:K)=0,#N/A,SUMIF(Data!$I:$I,$A297,Data!K:K)),#N/A)","v":{"$error":"#N/A"}},{"$f":"IF(C$6,IF(SUMIF(Data!$I:$I,$A297,Data!L:L)=0,#N/A,SUMIF(Data!$I:$I,$A297,Data!L:L)),#N/A)","v":{"$error":"#N/A"}},{"$f":"IF(D$6,IF(SUMIF(Data!$I:$I,$A297,Data!M:M)=0,#N/A,SUMIF(Data!$I:$I,$A297,Data!M:M)),#N/A)","v":{"$error":"#N/A"}},{"$f":"IF(E$6,IF(SUMIF(Data!$I:$I,$A297,Data!N:N)=0,#N/A,SUMIF(Data!$I:$I,$A297,Data!N:N)),#N/A)","v":{"$error":"#N/A"}},{"$f":"IF(F$6,IF(SUMIF(Data!$I:$I,$A297,Data!O:O)=0,#N/A,SUMIF(Data!$I:$I,$A297,Data!O:O)),#N/A)","v":{"$error":"#N/A"}},{"$f":"IF(G$6,IF(SUMIF(Data!$I:$I,$A297,Data!P:P)=0,#N/A,SUMIF(Data!$I:$I,$A297,Data!P:P)),#N/A)","v":{"$error":"#N/A"}},{"$f":"IF(H$6,IF(SUMIF(Data!$I:$I,$A297,Data!Q:Q)=0,#N/A,SUMIF(Data!$I:$I,$A297,Data!Q:Q)),#N/A)","v":{"$error":"#N/A"}},{"$f":"IF(I$6,IF(SUMIF(Data!$I:$I,$A297,Data!R:R)=0,#N/A,SUMIF(Data!$I:$I,$A297,Data!R:R)),#N/A)","v":{"$error":"#N/A"}},{"$f":"IF(J$6,IF(SUMIF(Data!$I:$I,$A297,Data!S:S)=0,#N/A,SUMIF(Data!$I:$I,$A297,Data!S:S)),#N/A)","v":{"$error":"#N/A"}},{"$f":"IF(K$6,IF(SUMIF(Data!$I:$I,$A297,Data!T:T)=0,#N/A,SUMIF(Data!$I:$I,$A297,Data!T:T)),#N/A)","v":{"$error":"#N/A"}}]
[{"$error":"#N/A"},{"$f":"IF(B$6,IF(SUMIF(Data!$I:$I,$A298,Data!K:K)=0,#N/A,SUMIF(Data!$I:$I,$A298,Data!K:K)),#N/A)","v":{"$error":"#N/A"}},{"$f":"IF(C$6,IF(SUMIF(Data!$I:$I,$A298,Data!L:L)=0,#N/A,SUMIF(Data!$I:$I,$A298,Data!L:L)),#N/A)","v":{"$error":"#N/A"}},{"$f":"IF(D$6,IF(SUMIF(Data!$I:$I,$A298,Data!M:M)=0,#N/A,SUMIF(Data!$I:$I,$A298,Data!M:M)),#N/A)","v":{"$error":"#N/A"}},{"$f":"IF(E$6,IF(SUMIF(Data!$I:$I,$A298,Data!N:N)=0,#N/A,SUMIF(Data!$I:$I,$A298,Data!N:N)),#N/A)","v":{"$error":"#N/A"}},{"$f":"IF(F$6,IF(SUMIF(Data!$I:$I,$A298,Data!O:O)=0,#N/A,SUMIF(Data!$I:$I,$A298,Data!O:O)),#N/A)","v":{"$error":"#N/A"}},{"$f":"IF(G$6,IF(SUMIF(Data!$I:$I,$A298,Data!P:P)=0,#N/A,SUMIF(Data!$I:$I,$A298,Data!P:P)),#N/A)","v":{"$error":"#N/A"}},{"$f":"IF(H$6,IF(SUMIF(Data!$I:$I,$A298,Data!Q:Q)=0,#N/A,SUMIF(Data!$I:$I,$A298,Data!Q:Q)),#N/A)","v":{"$error":"#N/A"}},{"$f":"IF(I$6,IF(SUMIF(Data!$I:$I,$A298,Data!R:R)=0,#N/A,SUMIF(Data!$I:$I,$A298,Data!R:R)),#N/A)","v":{"$error":"#N/A"}},{"$f":"IF(J$6,IF(SUMIF(Data!$I:$I,$A298,Data!S:S)=0,#N/A,SUMIF(Data!$I:$I,$A298,Data!S:S)),#N/A)","v":{"$error":"#N/A"}},{"$f":"IF(K$6,IF(SUMIF(Data!$I:$I,$A298,Data!T:T)=0,#N/A,SUMIF(Data!$I:$I,$A298,Data!T:T)),#N/A)","v":{"$error":"#N/A"}}]
[{"$error":"#N/A"},{"$f":"IF(B$6,IF(SUMIF(Data!$I:$I,$A299,Data!K:K)=0,#N/A,SUMIF(Data!$I:$I,$A299,Data!K:K)),#N/A)","v":{"$error":"#N/A"}},{"$f":"IF(C$6,IF(SUMIF(Data!$I:$I,$A299,Data!L:L)=0,#N/A,SUMIF(Data!$I:$I,$A299,Data!L:L)),#N/A)","v":{"$error":"#N/A"}},{"$f":"IF(D$6,IF(SUMIF(Data!$I:$I,$A299,Data!M:M)=0,#N/A,SUMIF(Data!$I:$I,$A299,Data!M:M)),#N/A)","v":{"$error":"#N/A"}},{"$f":"IF(E$6,IF(SUMIF(Data!$I:$I,$A299,Data!N:N)=0,#N/A,SUMIF(Data!$I:$I,$A299,Data!N:N)),#N/A)","v":{"$error":"#N/A"}},{"$f":"IF(F$6,IF(SUMIF(Data!$I:$I,$A299,Data!O:O)=0,#N/A,SUMIF(Data!$I:$I,$A299,Data!O:O)),#N/A)","v":{"$error":"#N/A"}},{"$f":"IF(G$6,IF(SUMIF(Data!$I:$I,$A299,Data!P:P)=0,#N/A,SUMIF(Data!$I:$I,$A299,Data!P:P)),#N/A)","v":{"$error":"#N/A"}},{"$f":"IF(H$6,IF(SUMIF(Data!$I:$I,$A299,Data!Q:Q)=0,#N/A,SUMIF(Data!$I:$I,$A299,Data!Q:Q)),#N/A)","v":{"$error":"#N/A"}},{"$f":"IF(I$6,IF(SUMIF(Data!$I:$I,$A299,Data!R:R)=0,#N/A,SUMIF(Data!$I:$I,$A299,Data!R:R)),#N/A)","v":{"$error":"#N/A"}},{"$f":"IF(J$6,IF(SUMIF(Data!$I:$I,$A299,Data!S:S)=0,#N/A,SUMIF(Data!$I:$I,$A299,Data!S:S)),#N/A)","v":{"$error":"#N/A"}},{"$f":"IF(K$6,IF(SUMIF(Data!$I:$I,$A299,Data!T:T)=0,#N/A,SUMIF(Data!$I:$I,$A299,Data!T:T)),#N/A)","v":{"$error":"#N/A"}}]
[{"$error":"#N/A"},{"$f":"IF(B$6,IF(SUMIF(Data!$I:$I,$A300,Data!K:K)=0,#N/A,SUMIF(Data!$I:$I,$A300,Data!K:K)),#N/A)","v":{"$error":"#N/A"}},{"$f":"IF(C$6,IF(SUMIF(Data!$I:$I,$A300,Data!L:L)=0,#N/A,SUMIF(Data!$I:$I,$A300,Data!L:L)),#N/A)","v":{"$error":"#N/A"}},{"$f":"IF(D$6,IF(SUMIF(Data!$I:$I,$A300,Data!M:M)=0,#N/A,SUMIF(Data!$I:$I,$A300,Data!M:M)),#N/A)","v":{"$error":"#N/A"}},{"$f":"IF(E$6,IF(SUMIF(Data!$I:$I,$A300,Data!N:N)=0,#N/A,SUMIF(Data!$I:$I,$A300,Data!N:N)),#N/A)","v":{"$error":"#N/A"}},{"$f":"IF(F$6,IF(SUMIF(Data!$I:$I,$A300,Data!O:O)=0,#N/A,SUMIF(Data!$I:$I,$A300,Data!O:O)),#N/A)","v":{"$error":"#N/A"}},{"$f":"IF(G$6,IF(SUMIF(Data!$I:$I,$A300,Data!P:P)=0,#N/A,SUMIF(Data!$I:$I,$A300,Data!P:P)),#N/A)","v":{"$error":"#N/A"}},{"$f":"IF(H$6,IF(SUMIF(Data!$I:$I,$A300,Data!Q:Q)=0,#N/A,SUMIF(Data!$I:$I,$A300,Data!Q:Q)),#N/A)","v":{"$error":"#N/A"}},{"$f":"IF(I$6,IF(SUMIF(Data!$I:$I,$A300,Data!R:R)=0,#N/A,SUMIF(Data!$I:$I,$A300,Data!R:R)),#N/A)","v":{"$error":"#N/A"}},{"$f":"IF(J$6,IF(SUMIF(Data!$I:$I,$A300,Data!S:S)=0,#N/A,SUMIF(Data!$I:$I,$A300,Data!S:S)),#N/A)","v":{"$error":"#N/A"}},{"$f":"IF(K$6,IF(SUMIF(Data!$I:$I,$A300,Data!T:T)=0,#N/A,SUMIF(Data!$I:$I,$A300,Data!T:T)),#N/A)","v":{"$error":"#N/A"}}]
[{"$error":"#N/A"},{"$f":"IF(B$6,IF(SUMIF(Data!$I:$I,$A301,Data!K:K)=0,#N/A,SUMIF(Data!$I:$I,$A301,Data!K:K)),#N/A)","v":{"$error":"#N/A"}},{"$f":"IF(C$6,IF(SUMIF(Data!$I:$I,$A301,Data!L:L)=0,#N/A,SUMIF(Data!$I:$I,$A301,Data!L:L)),#N/A)","v":{"$error":"#N/A"}},{"$f":"IF(D$6,IF(SUMIF(Data!$I:$I,$A301,Data!M:M)=0,#N/A,SUMIF(Data!$I:$I,$A301,Data!M:M)),#N/A)","v":{"$error":"#N/A"}},{"$f":"IF(E$6,IF(SUMIF(Data!$I:$I,$A301,Data!N:N)=0,#N/A,SUMIF(Data!$I:$I,$A301,Data!N:N)),#N/A)","v":{"$error":"#N/A"}},{"$f":"IF(F$6,IF(SUMIF(Data!$I:$I,$A301,Data!O:O)=0,#N/A,SUMIF(Data!$I:$I,$A301,Data!O:O)),#N/A)","v":{"$error":"#N/A"}},{"$f":"IF(G$6,IF(SUMIF(Data!$I:$I,$A301,Data!P:P)=0,#N/A,SUMIF(Data!$I:$I,$A301,Data!P:P)),#N/A)","v":{"$error":"#N/A"}},{"$f":"IF(H$6,IF(SUMIF(Data!$I:$I,$A301,Data!Q:Q)=0,#N/A,SUMIF(Data!$I:$I,$A301,Data!Q:Q)),#N/A)","v":{"$error":"#N/A"}},{"$f":"IF(I$6,IF(SUMIF(Data!$I:$I,$A301,Data!R:R)=0,#N/A,SUMIF(Data!$I:$I,$A301,Data!R:R)),#N/A)","v":{"$error":"#N/A"}},{"$f":"IF(J$6,IF(SUMIF(Data!$I:$I,$A301,Data!S:S)=0,#N/A,SUMIF(Data!$I:$I,$A301,Data!S:S)),#N/A)","v":{"$error":"#N/A"}},{"$f":"IF(K$6,IF(SUMIF(Data!$I:$I,$A301,Data!T:T)=0,#N/A,SUMIF(Data!$I:$I,$A301,Data!T:T)),#N/A)","v":{"$error":"#N/A"}}]
[{"$error":"#N/A"},{"$f":"IF(B$6,IF(SUMIF(Data!$I:$I,$A302,Data!K:K)=0,#N/A,SUMIF(Data!$I:$I,$A302,Data!K:K)),#N/A)","v":{"$error":"#N/A"}},{"$f":"IF(C$6,IF(SUMIF(Data!$I:$I,$A302,Data!L:L)=0,#N/A,SUMIF(Data!$I:$I,$A302,Data!L:L)),#N/A)","v":{"$error":"#N/A"}},{"$f":"IF(D$6,IF(SUMIF(Data!$I:$I,$A302,Data!M:M)=0,#N/A,SUMIF(Data!$I:$I,$A302,Data!M:M)),#N/A)","v":{"$error":"#N/A"}},{"$f":"IF(E$6,IF(SUMIF(Data!$I:$I,$A302,Data!N:N)=0,#N/A,SUMIF(Data!$I:$I,$A302,Data!N:N)),#N/A)","v":{"$error":"#N/A"}},{"$f":"IF(F$6,IF(SUMIF(Data!$I:$I,$A302,Data!O:O)=0,#N/A,SUMIF(Data!$I:$I,$A302,Data!O:O)),#N/A)","v":{"$error":"#N/A"}},{"$f":"IF(G$6,IF(SUMIF(Data!$I:$I,$A302,Data!P:P)=0,#N/A,SUMIF(Data!$I:$I,$A302,Data!P:P)),#N/A)","v":{"$error":"#N/A"}},{"$f":"IF(H$6,IF(SUMIF(Data!$I:$I,$A302,Data!Q:Q)=0,#N/A,SUMIF(Data!$I:$I,$A302,Data!Q:Q)),#N/A)","v":{"$error":"#N/A"}},{"$f":"IF(I$6,IF(SUMIF(Data!$I:$I,$A302,Data!R:R)=0,#N/A,SUMIF(Data!$I:$I,$A302,Data!R:R)),#N/A)","v":{"$error":"#N/A"}},{"$f":"IF(J$6,IF(SUMIF(Data!$I:$I,$A302,Data!S:S)=0,#N/A,SUMIF(Data!$I:$I,$A302,Data!S:S)),#N/A)","v":{"$error":"#N/A"}},{"$f":"IF(K$6,IF(SUMIF(Data!$I:$I,$A302,Data!T:T)=0,#N/A,SUMIF(Data!$I:$I,$A302,Data!T:T)),#N/A)","v":{"$error":"#N/A"}}]
[{"$error":"#N/A"},{"$f":"IF(B$6,IF(SUMIF(Data!$I:$I,$A303,Data!K:K)=0,#N/A,SUMIF(Data!$I:$I,$A303,Data!K:K)),#N/A)","v":{"$error":"#N/A"}},{"$f":"IF(C$6,IF(SUMIF(Data!$I:$I,$A303,Data!L:L)=0,#N/A,SUMIF(Data!$I:$I,$A303,Data!L:L)),#N/A)","v":{"$error":"#N/A"}},{"$f":"IF(D$6,IF(SUMIF(Data!$I:$I,$A303,Data!M:M)=0,#N/A,SUMIF(Data!$I:$I,$A303,Data!M:M)),#N/A)","v":{"$error":"#N/A"}},{"$f":"IF(E$6,IF(SUMIF(Data!$I:$I,$A303,Data!N:N)=0,#N/A,SUMIF(Data!$I:$I,$A303,Data!N:N)),#N/A)","v":{"$error":"#N/A"}},{"$f":"IF(F$6,IF(SUMIF(Data!$I:$I,$A303,Data!O:O)=0,#N/A,SUMIF(Data!$I:$I,$A303,Data!O:O)),#N/A)","v":{"$error":"#N/A"}},{"$f":"IF(G$6,IF(SUMIF(Data!$I:$I,$A303,Data!P:P)=0,#N/A,SUMIF(Data!$I:$I,$A303,Data!P:P)),#N/A)","v":{"$error":"#N/A"}},{"$f":"IF(H$6,IF(SUMIF(Data!$I:$I,$A303,Data!Q:Q)=0,#N/A,SUMIF(Data!$I:$I,$A303,Data!Q:Q)),#N/A)","v":{"$error":"#N/A"}},{"$f":"IF(I$6,IF(SUMIF(Data!$I:$I,$A303,Data!R:R)=0,#N/A,SUMIF(Data!$I:$I,$A303,Data!R:R)),#N/A)","v":{"$error":"#N/A"}},{"$f":"IF(J$6,IF(SUMIF(Data!$I:$I,$A303,Data!S:S)=0,#N/A,SUMIF(Data!$I:$I,$A303,Data!S:S)),#N/A)","v":{"$error":"#N/A"}},{"$f":"IF(K$6,IF(SUMIF(Data!$I:$I,$A303,Data!T:T)=0,#N/A,SUMIF(Data!$I:$I,$A303,Data!T:T)),#N/A)","v":{"$error":"#N/A"}}]
[{"$error":"#N/A"},{"$f":"IF(B$6,IF(SUMIF(Data!$I:$I,$A304,Data!K:K)=0,#N/A,SUMIF(Data!$I:$I,$A304,Data!K:K)),#N/A)","v":{"$error":"#N/A"}},{"$f":"IF(C$6,IF(SUMIF(Data!$I:$I,$A304,Data!L:L)=0,#N/A,SUMIF(Data!$I:$I,$A304,Data!L:L)),#N/A)","v":{"$error":"#N/A"}},{"$f":"IF(D$6,IF(SUMIF(Data!$I:$I,$A304,Data!M:M)=0,#N/A,SUMIF(Data!$I:$I,$A304,Data!M:M)),#N/A)","v":{"$error":"#N/A"}},{"$f":"IF(E$6,IF(SUMIF(Data!$I:$I,$A304,Data!N:N)=0,#N/A,SUMIF(Data!$I:$I,$A304,Data!N:N)),#N/A)","v":{"$error":"#N/A"}},{"$f":"IF(F$6,IF(SUMIF(Data!$I:$I,$A304,Data!O:O)=0,#N/A,SUMIF(Data!$I:$I,$A304,Data!O:O)),#N/A)","v":{"$error":"#N/A"}},{"$f":"IF(G$6,IF(SUMIF(Data!$I:$I,$A304,Data!P:P)=0,#N/A,SUMIF(Data!$I:$I,$A304,Data!P:P)),#N/A)","v":{"$error":"#N/A"}},{"$f":"IF(H$6,IF(SUMIF(Data!$I:$I,$A304,Data!Q:Q)=0,#N/A,SUMIF(Data!$I:$I,$A304,Data!Q:Q)),#N/A)","v":{"$error":"#N/A"}},{"$f":"IF(I$6,IF(SUMIF(Data!$I:$I,$A304,Data!R:R)=0,#N/A,SUMIF(Data!$I:$I,$A304,Data!R:R)),#N/A)","v":{"$error":"#N/A"}},{"$f":"IF(J$6,IF(SUMIF(Data!$I:$I,$A304,Data!S:S)=0,#N/A,SUMIF(Data!$I:$I,$A304,Data!S:S)),#N/A)","v":{"$error":"#N/A"}},{"$f":"IF(K$6,IF(SUMIF(Data!$I:$I,$A304,Data!T:T)=0,#N/A,SUMIF(Data!$I:$I,$A304,Data!T:T)),#N/A)","v":{"$error":"#N/A"}}]
[{"$error":"#N/A"},{"$f":"IF(B$6,IF(SUMIF(Data!$I:$I,$A305,Data!K:K)=0,#N/A,SUMIF(Data!$I:$I,$A305,Data!K:K)),#N/A)","v":{"$error":"#N/A"}},{"$f":"IF(C$6,IF(SUMIF(Data!$I:$I,$A305,Data!L:L)=0,#N/A,SUMIF(Data!$I:$I,$A305,Data!L:L)),#N/A)","v":{"$error":"#N/A"}},{"$f":"IF(D$6,IF(SUMIF(Data!$I:$I,$A305,Data!M:M)=0,#N/A,SUMIF(Data!$I:$I,$A305,Data!M:M)),#N/A)","v":{"$error":"#N/A"}},{"$f":"IF(E$6,IF(SUMIF(Data!$I:$I,$A305,Data!N:N)=0,#N/A,SUMIF(Data!$I:$I,$A305,Data!N:N)),#N/A)","v":{"$error":"#N/A"}},{"$f":"IF(F$6,IF(SUMIF(Data!$I:$I,$A305,Data!O:O)=0,#N/A,SUMIF(Data!$I:$I,$A305,Data!O:O)),#N/A)","v":{"$error":"#N/A"}},{"$f":"IF(G$6,IF(SUMIF(Data!$I:$I,$A305,Data!P:P)=0,#N/A,SUMIF(Data!$I:$I,$A305,Data!P:P)),#N/A)","v":{"$error":"#N/A"}},{"$f":"IF(H$6,IF(SUMIF(Data!$I:$I,$A305,Data!Q:Q)=0,#N/A,SUMIF(Data!$I:$I,$A305,Data!Q:Q)),#N/A)","v":{"$error":"#N/A"}},{"$f":"IF(I$6,IF(SUMIF(Data!$I:$I,$A305,Data!R:R)=0,#N/A,SUMIF(Data!$I:$I,$A305,Data!R:R)),#N/A)","v":{"$error":"#N/A"}},{"$f":"IF(J$6,IF(SUMIF(Data!$I:$I,$A305,Data!S:S)=0,#N/A,SUMIF(Data!$I:$I,$A305,Data!S:S)),#N/A)","v":{"$error":"#N/A"}},{"$f":"IF(K$6,IF(SUMIF(Data!$I:$I,$A305,Data!T:T)=0,#N/A,SUMIF(Data!$I:$I,$A305,Data!T:T)),#N/A)","v":{"$error":"#N/A"}}]
[{"$error":"#N/A"},{"$f":"IF(B$6,IF(SUMIF(Data!$I:$I,$A306,Data!K:K)=0,#N/A,SUMIF(Data!$I:$I,$A306,Data!K:K)),#N/A)","v":{"$error":"#N/A"}},{"$f":"IF(C$6,IF(SUMIF(Data!$I:$I,$A306,Data!L:L)=0,#N/A,SUMIF(Data!$I:$I,$A306,Data!L:L)),#N/A)","v":{"$error":"#N/A"}},{"$f":"IF(D$6,IF(SUMIF(Data!$I:$I,$A306,Data!M:M)=0,#N/A,SUMIF(Data!$I:$I,$A306,Data!M:M)),#N/A)","v":{"$error":"#N/A"}},{"$f":"IF(E$6,IF(SUMIF(Data!$I:$I,$A306,Data!N:N)=0,#N/A,SUMIF(Data!$I:$I,$A306,Data!N:N)),#N/A)","v":{"$error":"#N/A"}},{"$f":"IF(F$6,IF(SUMIF(Data!$I:$I,$A306,Data!O:O)=0,#N/A,SUMIF(Data!$I:$I,$A306,Data!O:O)),#N/A)","v":{"$error":"#N/A"}},{"$f":"IF(G$6,IF(SUMIF(Data!$I:$I,$A306,Data!P:P)=0,#N/A,SUMIF(Data!$I:$I,$A306,Data!P:P)),#N/A)","v":{"$error":"#N/A"}},{"$f":"IF(H$6,IF(SUMIF(Data!$I:$I,$A306,Data!Q:Q)=0,#N/A,SUMIF(Data!$I:$I,$A306,Data!Q:Q)),#N/A)","v":{"$error":"#N/A"}},{"$f":"IF(I$6,IF(SUMIF(Data!$I:$I,$A306,Data!R:R)=0,#N/A,SUMIF(Data!$I:$I,$A306,Data!R:R)),#N/A)","v":{"$error":"#N/A"}},{"$f":"IF(J$6,IF(SUMIF(Data!$I:$I,$A306,Data!S:S)=0,#N/A,SUMIF(Data!$I:$I,$A306,Data!S:S)),#N/A)","v":{"$error":"#N/A"}},{"$f":"IF(K$6,IF(SUMIF(Data!$I:$I,$A306,Data!T:T)=0,#N/A,SUMIF(Data!$I:$I,$A306,Data!T:T)),#N/A)","v":{"$error":"#N/A"}}]
[{"$error":"#N/A"},{"$f":"IF(B$6,IF(SUMIF(Data!$I:$I,$A307,Data!K:K)=0,#N/A,SUMIF(Data!$I:$I,$A307,Data!K:K)),#N/A)","v":{"$error":"#N/A"}},{"$f":"IF(C$6,IF(SUMIF(Data!$I:$I,$A307,Data!L:L)=0,#N/A,SUMIF(Data!$I:$I,$A307,Data!L:L)),#N/A)","v":{"$error":"#N/A"}},{"$f":"IF(D$6,IF(SUMIF(Data!$I:$I,$A307,Data!M:M)=0,#N/A,SUMIF(Data!$I:$I,$A307,Data!M:M)),#N/A)","v":{"$error":"#N/A"}},{"$f":"IF(E$6,IF(SUMIF(Data!$I:$I,$A307,Data!N:N)=0,#N/A,SUMIF(Data!$I:$I,$A307,Data!N:N)),#N/A)","v":{"$error":"#N/A"}},{"$f":"IF(F$6,IF(SUMIF(Data!$I:$I,$A307,Data!O:O)=0,#N/A,SUMIF(Data!$I:$I,$A307,Data!O:O)),#N/A)","v":{"$error":"#N/A"}},{"$f":"IF(G$6,IF(SUMIF(Data!$I:$I,$A307,Data!P:P)=0,#N/A,SUMIF(Data!$I:$I,$A307,Data!P:P)),#N/A)","v":{"$error":"#N/A"}},{"$f":"IF(H$6,IF(SUMIF(Data!$I:$I,$A307,Data!Q:Q)=0,#N/A,SUMIF(Data!$I:$I,$A307,Data!Q:Q)),#N/A)","v":{"$error":"#N/A"}},{"$f":"IF(I$6,IF(SUMIF(Data!$I:$I,$A307,Data!R:R)=0,#N/A,SUMIF(Data!$I:$I,$A307,Data!R:R)),#N/A)","v":{"$error":"#N/A"}},{"$f":"IF(J$6,IF(SUMIF(Data!$I:$I,$A307,Data!S:S)=0,#N/A,SUMIF(Data!$I:$I,$A307,Data!S:S)),#N/A)","v":{"$error":"#N/A"}},{"$f":"IF(K$6,IF(SUMIF(Data!$I:$I,$A307,Data!T:T)=0,#N/A,SUMIF(Data!$I:$I,$A307,Data!T:T)),#N/A)","v":{"$error":"#N/A"}}]
[{"$error":"#N/A"},{"$f":"IF(B$6,IF(SUMIF(Data!$I:$I,$A308,Data!K:K)=0,#N/A,SUMIF(Data!$I:$I,$A308,Data!K:K)),#N/A)","v":{"$error":"#N/A"}},{"$f":"IF(C$6,IF(SUMIF(Data!$I:$I,$A308,Data!L:L)=0,#N/A,SUMIF(Data!$I:$I,$A308,Data!L:L)),#N/A)","v":{"$error":"#N/A"}},{"$f":"IF(D$6,IF(SUMIF(Data!$I:$I,$A308,Data!M:M)=0,#N/A,SUMIF(Data!$I:$I,$A308,Data!M:M)),#N/A)","v":{"$error":"#N/A"}},{"$f":"IF(E$6,IF(SUMIF(Data!$I:$I,$A308,Data!N:N)=0,#N/A,SUMIF(Data!$I:$I,$A308,Data!N:N)),#N/A)","v":{"$error":"#N/A"}},{"$f":"IF(F$6,IF(SUMIF(Data!$I:$I,$A308,Data!O:O)=0,#N/A,SUMIF(Data!$I:$I,$A308,Data!O:O)),#N/A)","v":{"$error":"#N/A"}},{"$f":"IF(G$6,IF(SUMIF(Data!$I:$I,$A308,Data!P:P)=0,#N/A,SUMIF(Data!$I:$I,$A308,Data!P:P)),#N/A)","v":{"$error":"#N/A"}},{"$f":"IF(H$6,IF(SUMIF(Data!$I:$I,$A308,Data!Q:Q)=0,#N/A,SUMIF(Data!$I:$I,$A308,Data!Q:Q)),#N/A)","v":{"$error":"#N/A"}},{"$f":"IF(I$6,IF(SUMIF(Data!$I:$I,$A308,Data!R:R)=0,#N/A,SUMIF(Data!$I:$I,$A308,Data!R:R)),#N/A)","v":{"$error":"#N/A"}},{"$f":"IF(J$6,IF(SUMIF(Data!$I:$I,$A308,Data!S:S)=0,#N/A,SUMIF(Data!$I:$I,$A308,Data!S:S)),#N/A)","v":{"$error":"#N/A"}},{"$f":"IF(K$6,IF(SUMIF(Data!$I:$I,$A308,Data!T:T)=0,#N/A,SUMIF(Data!$I:$I,$A308,Data!T:T)),#N/A)","v":{"$error":"#N/A"}}]
[{"$error":"#N/A"},{"$f":"IF(B$6,IF(SUMIF(Data!$I:$I,$A309,Data!K:K)=0,#N/A,SUMIF(Data!$I:$I,$A309,Data!K:K)),#N/A)","v":{"$error":"#N/A"}},{"$f":"IF(C$6,IF(SUMIF(Data!$I:$I,$A309,Data!L:L)=0,#N/A,SUMIF(Data!$I:$I,$A309,Data!L:L)),#N/A)","v":{"$error":"#N/A"}},{"$f":"IF(D$6,IF(SUMIF(Data!$I:$I,$A309,Data!M:M)=0,#N/A,SUMIF(Data!$I:$I,$A309,Data!M:M)),#N/A)","v":{"$error":"#N/A"}},{"$f":"IF(E$6,IF(SUMIF(Data!$I:$I,$A309,Data!N:N)=0,#N/A,SUMIF(Data!$I:$I,$A309,Data!N:N)),#N/A)","v":{"$error":"#N/A"}},{"$f":"IF(F$6,IF(SUMIF(Data!$I:$I,$A309,Data!O:O)=0,#N/A,SUMIF(Data!$I:$I,$A309,Data!O:O)),#N/A)","v":{"$error":"#N/A"}},{"$f":"IF(G$6,IF(SUMIF(Data!$I:$I,$A309,Data!P:P)=0,#N/A,SUMIF(Data!$I:$I,$A309,Data!P:P)),#N/A)","v":{"$error":"#N/A"}},{"$f":"IF(H$6,IF(SUMIF(Data!$I:$I,$A309,Data!Q:Q)=0,#N/A,SUMIF(Data!$I:$I,$A309,Data!Q:Q)),#N/A)","v":{"$error":"#N/A"}},{"$f":"IF(I$6,IF(SUMIF(Data!$I:$I,$A309,Data!R:R)=0,#N/A,SUMIF(Data!$I:$I,$A309,Data!R:R)),#N/A)","v":{"$error":"#N/A"}},{"$f":"IF(J$6,IF(SUMIF(Data!$I:$I,$A309,Data!S:S)=0,#N/A,SUMIF(Data!$I:$I,$A309,Data!S:S)),#N/A)","v":{"$error":"#N/A"}},{"$f":"IF(K$6,IF(SUMIF(Data!$I:$I,$A309,Data!T:T)=0,#N/A,SUMIF(Data!$I:$I,$A309,Data!T:T)),#N/A)","v":{"$error":"#N/A"}}]
[{"$error":"#N/A"},{"$f":"IF(B$6,IF(SUMIF(Data!$I:$I,$A310,Data!K:K)=0,#N/A,SUMIF(Data!$I:$I,$A310,Data!K:K)),#N/A)","v":{"$error":"#N/A"}},{"$f":"IF(C$6,IF(SUMIF(Data!$I:$I,$A310,Data!L:L)=0,#N/A,SUMIF(Data!$I:$I,$A310,Data!L:L)),#N/A)","v":{"$error":"#N/A"}},{"$f":"IF(D$6,IF(SUMIF(Data!$I:$I,$A310,Data!M:M)=0,#N/A,SUMIF(Data!$I:$I,$A310,Data!M:M)),#N/A)","v":{"$error":"#N/A"}},{"$f":"IF(E$6,IF(SUMIF(Data!$I:$I,$A310,Data!N:N)=0,#N/A,SUMIF(Data!$I:$I,$A310,Data!N:N)),#N/A)","v":{"$error":"#N/A"}},{"$f":"IF(F$6,IF(SUMIF(Data!$I:$I,$A310,Data!O:O)=0,#N/A,SUMIF(Data!$I:$I,$A310,Data!O:O)),#N/A)","v":{"$error":"#N/A"}},{"$f":"IF(G$6,IF(SUMIF(Data!$I:$I,$A310,Data!P:P)=0,#N/A,SUMIF(Data!$I:$I,$A310,Data!P:P)),#N/A)","v":{"$error":"#N/A"}},{"$f":"IF(H$6,IF(SUMIF(Data!$I:$I,$A310,Data!Q:Q)=0,#N/A,SUMIF(Data!$I:$I,$A310,Data!Q:Q)),#N/A)","v":{"$error":"#N/A"}},{"$f":"IF(I$6,IF(SUMIF(Data!$I:$I,$A310,Data!R:R)=0,#N/A,SUMIF(Data!$I:$I,$A310,Data!R:R)),#N/A)","v":{"$error":"#N/A"}},{"$f":"IF(J$6,IF(SUMIF(Data!$I:$I,$A310,Data!S:S)=0,#N/A,SUMIF(Data!$I:$I,$A310,Data!S:S)),#N/A)","v":{"$error":"#N/A"}},{"$f":"IF(K$6,IF(SUMIF(Data!$I:$I,$A310,Data!T:T)=0,#N/A,SUMIF(Data!$I:$I,$A310,Data!T:T)),#N/A)","v":{"$error":"#N/A"}}]
[{"$error":"#N/A"},{"$f":"IF(B$6,IF(SUMIF(Data!$I:$I,$A311,Data!K:K)=0,#N/A,SUMIF(Data!$I:$I,$A311,Data!K:K)),#N/A)","v":{"$error":"#N/A"}},{"$f":"IF(C$6,IF(SUMIF(Data!$I:$I,$A311,Data!L:L)=0,#N/A,SUMIF(Data!$I:$I,$A311,Data!L:L)),#N/A)","v":{"$error":"#N/A"}},{"$f":"IF(D$6,IF(SUMIF(Data!$I:$I,$A311,Data!M:M)=0,#N/A,SUMIF(Data!$I:$I,$A311,Data!M:M)),#N/A)","v":{"$error":"#N/A"}},{"$f":"IF(E$6,IF(SUMIF(Data!$I:$I,$A311,Data!N:N)=0,#N/A,SUMIF(Data!$I:$I,$A311,Data!N:N)),#N/A)","v":{"$error":"#N/A"}},{"$f":"IF(F$6,IF(SUMIF(Data!$I:$I,$A311,Data!O:O)=0,#N/A,SUMIF(Data!$I:$I,$A311,Data!O:O)),#N/A)","v":{"$error":"#N/A"}},{"$f":"IF(G$6,IF(SUMIF(Data!$I:$I,$A311,Data!P:P)=0,#N/A,SUMIF(Data!$I:$I,$A311,Data!P:P)),#N/A)","v":{"$error":"#N/A"}},{"$f":"IF(H$6,IF(SUMIF(Data!$I:$I,$A311,Data!Q:Q)=0,#N/A,SUMIF(Data!$I:$I,$A311,Data!Q:Q)),#N/A)","v":{"$error":"#N/A"}},{"$f":"IF(I$6,IF(SUMIF(Data!$I:$I,$A311,Data!R:R)=0,#N/A,SUMIF(Data!$I:$I,$A311,Data!R:R)),#N/A)","v":{"$error":"#N/A"}},{"$f":"IF(J$6,IF(SUMIF(Data!$I:$I,$A311,Data!S:S)=0,#N/A,SUMIF(Data!$I:$I,$A311,Data!S:S)),#N/A)","v":{"$error":"#N/A"}},{"$f":"IF(K$6,IF(SUMIF(Data!$I:$I,$A311,Data!T:T)=0,#N/A,SUMIF(Data!$I:$I,$A311,Data!T:T)),#N/A)","v":{"$error":"#N/A"}}]
[{"$error":"#N/A"},{"$f":"IF(B$6,IF(SUMIF(Data!$I:$I,$A312,Data!K:K)=0,#N/A,SUMIF(Data!$I:$I,$A312,Data!K:K)),#N/A)","v":{"$error":"#N/A"}},{"$f":"IF(C$6,IF(SUMIF(Data!$I:$I,$A312,Data!L:L)=0,#N/A,SUMIF(Data!$I:$I,$A312,Data!L:L)),#N/A)","v":{"$error":"#N/A"}},{"$f":"IF(D$6,IF(SUMIF(Data!$I:$I,$A312,Data!M:M)=0,#N/A,SUMIF(Data!$I:$I,$A312,Data!M:M)),#N/A)","v":{"$error":"#N/A"}},{"$f":"IF(E$6,IF(SUMIF(Data!$I:$I,$A312,Data!N:N)=0,#N/A,SUMIF(Data!$I:$I,$A312,Data!N:N)),#N/A)","v":{"$error":"#N/A"}},{"$f":"IF(F$6,IF(SUMIF(Data!$I:$I,$A312,Data!O:O)=0,#N/A,SUMIF(Data!$I:$I,$A312,Data!O:O)),#N/A)","v":{"$error":"#N/A"}},{"$f":"IF(G$6,IF(SUMIF(Data!$I:$I,$A312,Data!P:P)=0,#N/A,SUMIF(Data!$I:$I,$A312,Data!P:P)),#N/A)","v":{"$error":"#N/A"}},{"$f":"IF(H$6,IF(SUMIF(Data!$I:$I,$A312,Data!Q:Q)=0,#N/A,SUMIF(Data!$I:$I,$A312,Data!Q:Q)),#N/A)","v":{"$error":"#N/A"}},{"$f":"IF(I$6,IF(SUMIF(Data!$I:$I,$A312,Data!R:R)=0,#N/A,SUMIF(Data!$I:$I,$A312,Data!R:R)),#N/A)","v":{"$error":"#N/A"}},{"$f":"IF(J$6,IF(SUMIF(Data!$I:$I,$A312,Data!S:S)=0,#N/A,SUMIF(Data!$I:$I,$A312,Data!S:S)),#N/A)","v":{"$error":"#N/A"}},{"$f":"IF(K$6,IF(SUMIF(Data!$I:$I,$A312,Data!T:T)=0,#N/A,SUMIF(Data!$I:$I,$A312,Data!T:T)),#N/A)","v":{"$error":"#N/A"}}]
[{"$error":"#N/A"},{"$f":"IF(B$6,IF(SUMIF(Data!$I:$I,$A313,Data!K:K)=0,#N/A,SUMIF(Data!$I:$I,$A313,Data!K:K)),#N/A)","v":{"$error":"#N/A"}},{"$f":"IF(C$6,IF(SUMIF(Data!$I:$I,$A313,Data!L:L)=0,#N/A,SUMIF(Data!$I:$I,$A313,Data!L:L)),#N/A)","v":{"$error":"#N/A"}},{"$f":"IF(D$6,IF(SUMIF(Data!$I:$I,$A313,Data!M:M)=0,#N/A,SUMIF(Data!$I:$I,$A313,Data!M:M)),#N/A)","v":{"$error":"#N/A"}},{"$f":"IF(E$6,IF(SUMIF(Data!$I:$I,$A313,Data!N:N)=0,#N/A,SUMIF(Data!$I:$I,$A313,Data!N:N)),#N/A)","v":{"$error":"#N/A"}},{"$f":"IF(F$6,IF(SUMIF(Data!$I:$I,$A313,Data!O:O)=0,#N/A,SUMIF(Data!$I:$I,$A313,Data!O:O)),#N/A)","v":{"$error":"#N/A"}},{"$f":"IF(G$6,IF(SUMIF(Data!$I:$I,$A313,Data!P:P)=0,#N/A,SUMIF(Data!$I:$I,$A313,Data!P:P)),#N/A)","v":{"$error":"#N/A"}},{"$f":"IF(H$6,IF(SUMIF(Data!$I:$I,$A313,Data!Q:Q)=0,#N/A,SUMIF(Data!$I:$I,$A313,Data!Q:Q)),#N/A)","v":{"$error":"#N/A"}},{"$f":"IF(I$6,IF(SUMIF(Data!$I:$I,$A313,Data!R:R)=0,#N/A,SUMIF(Data!$I:$I,$A313,Data!R:R)),#N/A)","v":{"$error":"#N/A"}},{"$f":"IF(J$6,IF(SUMIF(Data!$I:$I,$A313,Data!S:S)=0,#N/A,SUMIF(Data!$I:$I,$A313,Data!S:S)),#N/A)","v":{"$error":"#N/A"}},{"$f":"IF(K$6,IF(SUMIF(Data!$I:$I,$A313,Data!T:T)=0,#N/A,SUMIF(Data!$I:$I,$A313,Data!T:T)),#N/A)","v":{"$error":"#N/A"}}]
[{"$error":"#N/A"},{"$f":"IF(B$6,IF(SUMIF(Data!$I:$I,$A314,Data!K:K)=0,#N/A,SUMIF(Data!$I:$I,$A314,Data!K:K)),#N/A)","v":{"$error":"#N/A"}},{"$f":"IF(C$6,IF(SUMIF(Data!$I:$I,$A314,Data!L:L)=0,#N/A,SUMIF(Data!$I:$I,$A314,Data!L:L)),#N/A)","v":{"$error":"#N/A"}},{"$f":"IF(D$6,IF(SUMIF(Data!$I:$I,$A314,Data!M:M)=0,#N/A,SUMIF(Data!$I:$I,$A314,Data!M:M)),#N/A)","v":{"$error":"#N/A"}},{"$f":"IF(E$6,IF(SUMIF(Data!$I:$I,$A314,Data!N:N)=0,#N/A,SUMIF(Data!$I:$I,$A314,Data!N:N)),#N/A)","v":{"$error":"#N/A"}},{"$f":"IF(F$6,IF(SUMIF(Data!$I:$I,$A314,Data!O:O)=0,#N/A,SUMIF(Data!$I:$I,$A314,Data!O:O)),#N/A)","v":{"$error":"#N/A"}},{"$f":"IF(G$6,IF(SUMIF(Data!$I:$I,$A314,Data!P:P)=0,#N/A,SUMIF(Data!$I:$I,$A314,Data!P:P)),#N/A)","v":{"$error":"#N/A"}},{"$f":"IF(H$6,IF(SUMIF(Data!$I:$I,$A314,Data!Q:Q)=0,#N/A,SUMIF(Data!$I:$I,$A314,Data!Q:Q)),#N/A)","v":{"$error":"#N/A"}},{"$f":"IF(I$6,IF(SUMIF(Data!$I:$I,$A314,Data!R:R)=0,#N/A,SUMIF(Data!$I:$I,$A314,Data!R:R)),#N/A)","v":{"$error":"#N/A"}},{"$f":"IF(J$6,IF(SUMIF(Data!$I:$I,$A314,Data!S:S)=0,#N/A,SUMIF(Data!$I:$I,$A314,Data!S:S)),#N/A)","v":{"$error":"#N/A"}},{"$f":"IF(K$6,IF(SUMIF(Data!$I:$I,$A314,Data!T:T)=0,#N/A,SUMIF(Data!$I:$I,$A314,Data!T:T)),#N/A)","v":{"$error":"#N/A"}}]
[{"$error":"#N/A"},{"$f":"IF(B$6,IF(SUMIF(Data!$I:$I,$A315,Data!K:K)=0,#N/A,SUMIF(Data!$I:$I,$A315,Data!K:K)),#N/A)","v":{"$error":"#N/A"}},{"$f":"IF(C$6,IF(SUMIF(Data!$I:$I,$A315,Data!L:L)=0,#N/A,SUMIF(Data!$I:$I,$A315,Data!L:L)),#N/A)","v":{"$error":"#N/A"}},{"$f":"IF(D$6,IF(SUMIF(Data!$I:$I,$A315,Data!M:M)=0,#N/A,SUMIF(Data!$I:$I,$A315,Data!M:M)),#N/A)","v":{"$error":"#N/A"}},{"$f":"IF(E$6,IF(SUMIF(Data!$I:$I,$A315,Data!N:N)=0,#N/A,SUMIF(Data!$I:$I,$A315,Data!N:N)),#N/A)","v":{"$error":"#N/A"}},{"$f":"IF(F$6,IF(SUMIF(Data!$I:$I,$A315,Data!O:O)=0,#N/A,SUMIF(Data!$I:$I,$A315,Data!O:O)),#N/A)","v":{"$error":"#N/A"}},{"$f":"IF(G$6,IF(SUMIF(Data!$I:$I,$A315,Data!P:P)=0,#N/A,SUMIF(Data!$I:$I,$A315,Data!P:P)),#N/A)","v":{"$error":"#N/A"}},{"$f":"IF(H$6,IF(SUMIF(Data!$I:$I,$A315,Data!Q:Q)=0,#N/A,SUMIF(Data!$I:$I,$A315,Data!Q:Q)),#N/A)","v":{"$error":"#N/A"}},{"$f":"IF(I$6,IF(SUMIF(Data!$I:$I,$A315,Data!R:R)=0,#N/A,SUMIF(Data!$I:$I,$A315,Data!R:R)),#N/A)","v":{"$error":"#N/A"}},{"$f":"IF(J$6,IF(SUMIF(Data!$I:$I,$A315,Data!S:S)=0,#N/A,SUMIF(Data!$I:$I,$A315,Data!S:S)),#N/A)","v":{"$error":"#N/A"}},{"$f":"IF(K$6,IF(SUMIF(Data!$I:$I,$A315,Data!T:T)=0,#N/A,SUMIF(Data!$I:$I,$A315,Data!T:T)),#N/A)","v":{"$error":"#N/A"}}]
[{"$error":"#N/A"},{"$f":"IF(B$6,IF(SUMIF(Data!$I:$I,$A316,Data!K:K)=0,#N/A,SUMIF(Data!$I:$I,$A316,Data!K:K)),#N/A)","v":{"$error":"#N/A"}},{"$f":"IF(C$6,IF(SUMIF(Data!$I:$I,$A316,Data!L:L)=0,#N/A,SUMIF(Data!$I:$I,$A316,Data!L:L)),#N/A)","v":{"$error":"#N/A"}},{"$f":"IF(D$6,IF(SUMIF(Data!$I:$I,$A316,Data!M:M)=0,#N/A,SUMIF(Data!$I:$I,$A316,Data!M:M)),#N/A)","v":{"$error":"#N/A"}},{"$f":"IF(E$6,IF(SUMIF(Data!$I:$I,$A316,Data!N:N)=0,#N/A,SUMIF(Data!$I:$I,$A316,Data!N:N)),#N/A)","v":{"$error":"#N/A"}},{"$f":"IF(F$6,IF(SUMIF(Data!$I:$I,$A316,Data!O:O)=0,#N/A,SUMIF(Data!$I:$I,$A316,Data!O:O)),#N/A)","v":{"$error":"#N/A"}},{"$f":"IF(G$6,IF(SUMIF(Data!$I:$I,$A316,Data!P:P)=0,#N/A,SUMIF(Data!$I:$I,$A316,Data!P:P)),#N/A)","v":{"$error":"#N/A"}},{"$f":"IF(H$6,IF(SUMIF(Data!$I:$I,$A316,Data!Q:Q)=0,#N/A,SUMIF(Data!$I:$I,$A316,Data!Q:Q)),#N/A)","v":{"$error":"#N/A"}},{"$f":"IF(I$6,IF(SUMIF(Data!$I:$I,$A316,Data!R:R)=0,#N/A,SUMIF(Data!$I:$I,$A316,Data!R:R)),#N/A)","v":{"$error":"#N/A"}},{"$f":"IF(J$6,IF(SUMIF(Data!$I:$I,$A316,Data!S:S)=0,#N/A,SUMIF(Data!$I:$I,$A316,Data!S:S)),#N/A)","v":{"$error":"#N/A"}},{"$f":"IF(K$6,IF(SUMIF(Data!$I:$I,$A316,Data!T:T)=0,#N/A,SUMIF(Data!$I:$I,$A316,Data!T:T)),#N/A)","v":{"$error":"#N/A"}}]
[{"$error":"#N/A"},{"$f":"IF(B$6,IF(SUMIF(Data!$I:$I,$A317,Data!K:K)=0,#N/A,SUMIF(Data!$I:$I,$A317,Data!K:K)),#N/A)","v":{"$error":"#N/A"}},{"$f":"IF(C$6,IF(SUMIF(Data!$I:$I,$A317,Data!L:L)=0,#N/A,SUMIF(Data!$I:$I,$A317,Data!L:L)),#N/A)","v":{"$error":"#N/A"}},{"$f":"IF(D$6,IF(SUMIF(Data!$I:$I,$A317,Data!M:M)=0,#N/A,SUMIF(Data!$I:$I,$A317,Data!M:M)),#N/A)","v":{"$error":"#N/A"}},{"$f":"IF(E$6,IF(SUMIF(Data!$I:$I,$A317,Data!N:N)=0,#N/A,SUMIF(Data!$I:$I,$A317,Data!N:N)),#N/A)","v":{"$error":"#N/A"}},{"$f":"IF(F$6,IF(SUMIF(Data!$I:$I,$A317,Data!O:O)=0,#N/A,SUMIF(Data!$I:$I,$A317,Data!O:O)),#N/A)","v":{"$error":"#N/A"}},{"$f":"IF(G$6,IF(SUMIF(Data!$I:$I,$A317,Data!P:P)=0,#N/A,SUMIF(Data!$I:$I,$A317,Data!P:P)),#N/A)","v":{"$error":"#N/A"}},{"$f":"IF(H$6,IF(SUMIF(Data!$I:$I,$A317,Data!Q:Q)=0,#N/A,SUMIF(Data!$I:$I,$A317,Data!Q:Q)),#N/A)","v":{"$error":"#N/A"}},{"$f":"IF(I$6,IF(SUMIF(Data!$I:$I,$A317,Data!R:R)=0,#N/A,SUMIF(Data!$I:$I,$A317,Data!R:R)),#N/A)","v":{"$error":"#N/A"}},{"$f":"IF(J$6,IF(SUMIF(Data!$I:$I,$A317,Data!S:S)=0,#N/A,SUMIF(Data!$I:$I,$A317,Data!S:S)),#N/A)","v":{"$error":"#N/A"}},{"$f":"IF(K$6,IF(SUMIF(Data!$I:$I,$A317,Data!T:T)=0,#N/A,SUMIF(Data!$I:$I,$A317,Data!T:T)),#N/A)","v":{"$error":"#N/A"}}]
[{"$error":"#N/A"},{"$f":"IF(B$6,IF(SUMIF(Data!$I:$I,$A318,Data!K:K)=0,#N/A,SUMIF(Data!$I:$I,$A318,Data!K:K)),#N/A)","v":{"$error":"#N/A"}},{"$f":"IF(C$6,IF(SUMIF(Data!$I:$I,$A318,Data!L:L)=0,#N/A,SUMIF(Data!$I:$I,$A318,Data!L:L)),#N/A)","v":{"$error":"#N/A"}},{"$f":"IF(D$6,IF(SUMIF(Data!$I:$I,$A318,Data!M:M)=0,#N/A,SUMIF(Data!$I:$I,$A318,Data!M:M)),#N/A)","v":{"$error":"#N/A"}},{"$f":"IF(E$6,IF(SUMIF(Data!$I:$I,$A318,Data!N:N)=0,#N/A,SUMIF(Data!$I:$I,$A318,Data!N:N)),#N/A)","v":{"$error":"#N/A"}},{"$f":"IF(F$6,IF(SUMIF(Data!$I:$I,$A318,Data!O:O)=0,#N/A,SUMIF(Data!$I:$I,$A318,Data!O:O)),#N/A)","v":{"$error":"#N/A"}},{"$f":"IF(G$6,IF(SUMIF(Data!$I:$I,$A318,Data!P:P)=0,#N/A,SUMIF(Data!$I:$I,$A318,Data!P:P)),#N/A)","v":{"$error":"#N/A"}},{"$f":"IF(H$6,IF(SUMIF(Data!$I:$I,$A318,Data!Q:Q)=0,#N/A,SUMIF(Data!$I:$I,$A318,Data!Q:Q)),#N/A)","v":{"$error":"#N/A"}},{"$f":"IF(I$6,IF(SUMIF(Data!$I:$I,$A318,Data!R:R)=0,#N/A,SUMIF(Data!$I:$I,$A318,Data!R:R)),#N/A)","v":{"$error":"#N/A"}},{"$f":"IF(J$6,IF(SUMIF(Data!$I:$I,$A318,Data!S:S)=0,#N/A,SUMIF(Data!$I:$I,$A318,Data!S:S)),#N/A)","v":{"$error":"#N/A"}},{"$f":"IF(K$6,IF(SUMIF(Data!$I:$I,$A318,Data!T:T)=0,#N/A,SUMIF(Data!$I:$I,$A318,Data!T:T)),#N/A)","v":{"$error":"#N/A"}}]
[{"$error":"#N/A"},{"$f":"IF(B$6,IF(SUMIF(Data!$I:$I,$A319,Data!K:K)=0,#N/A,SUMIF(Data!$I:$I,$A319,Data!K:K)),#N/A)","v":{"$error":"#N/A"}},{"$f":"IF(C$6,IF(SUMIF(Data!$I:$I,$A319,Data!L:L)=0,#N/A,SUMIF(Data!$I:$I,$A319,Data!L:L)),#N/A)","v":{"$error":"#N/A"}},{"$f":"IF(D$6,IF(SUMIF(Data!$I:$I,$A319,Data!M:M)=0,#N/A,SUMIF(Data!$I:$I,$A319,Data!M:M)),#N/A)","v":{"$error":"#N/A"}},{"$f":"IF(E$6,IF(SUMIF(Data!$I:$I,$A319,Data!N:N)=0,#N/A,SUMIF(Data!$I:$I,$A319,Data!N:N)),#N/A)","v":{"$error":"#N/A"}},{"$f":"IF(F$6,IF(SUMIF(Data!$I:$I,$A319,Data!O:O)=0,#N/A,SUMIF(Data!$I:$I,$A319,Data!O:O)),#N/A)","v":{"$error":"#N/A"}},{"$f":"IF(G$6,IF(SUMIF(Data!$I:$I,$A319,Data!P:P)=0,#N/A,SUMIF(Data!$I:$I,$A319,Data!P:P)),#N/A)","v":{"$error":"#N/A"}},{"$f":"IF(H$6,IF(SUMIF(Data!$I:$I,$A319,Data!Q:Q)=0,#N/A,SUMIF(Data!$I:$I,$A319,Data!Q:Q)),#N/A)","v":{"$error":"#N/A"}},{"$f":"IF(I$6,IF(SUMIF(Data!$I:$I,$A319,Data!R:R)=0,#N/A,SUMIF(Data!$I:$I,$A319,Data!R:R)),#N/A)","v":{"$error":"#N/A"}},{"$f":"IF(J$6,IF(SUMIF(Data!$I:$I,$A319,Data!S:S)=0,#N/A,SUMIF(Data!$I:$I,$A319,Data!S:S)),#N/A)","v":{"$error":"#N/A"}},{"$f":"IF(K$6,IF(SUMIF(Data!$I:$I,$A319,Data!T:T)=0,#N/A,SUMIF(Data!$I:$I,$A319,Data!T:T)),#N/A)","v":{"$error":"#N/A"}}]
[{"$error":"#N/A"},{"$f":"IF(B$6,IF(SUMIF(Data!$I:$I,$A320,Data!K:K)=0,#N/A,SUMIF(Data!$I:$I,$A320,Data!K:K)),#N/A)","v":{"$error":"#N/A"}},{"$f":"IF(C$6,IF(SUMIF(Data!$I:$I,$A320,Data!L:L)=0,#N/A,SUMIF(Data!$I:$I,$A320,Data!L:L)),#N/A)","v":{"$error":"#N/A"}},{"$f":"IF(D$6,IF(SUMIF(Data!$I:$I,$A320,Data!M:M)=0,#N/A,SUMIF(Data!$I:$I,$A320,Data!M:M)),#N/A)","v":{"$error":"#N/A"}},{"$f":"IF(E$6,IF(SUMIF(Data!$I:$I,$A320,Data!N:N)=0,#N/A,SUMIF(Data!$I:$I,$A320,Data!N:N)),#N/A)","v":{"$error":"#N/A"}},{"$f":"IF(F$6,IF(SUMIF(Data!$I:$I,$A320,Data!O:O)=0,#N/A,SUMIF(Data!$I:$I,$A320,Data!O:O)),#N/A)","v":{"$error":"#N/A"}},{"$f":"IF(G$6,IF(SUMIF(Data!$I:$I,$A320,Data!P:P)=0,#N/A,SUMIF(Data!$I:$I,$A320,Data!P:P)),#N/A)","v":{"$error":"#N/A"}},{"$f":"IF(H$6,IF(SUMIF(Data!$I:$I,$A320,Data!Q:Q)=0,#N/A,SUMIF(Data!$I:$I,$A320,Data!Q:Q)),#N/A)","v":{"$error":"#N/A"}},{"$f":"IF(I$6,IF(SUMIF(Data!$I:$I,$A320,Data!R:R)=0,#N/A,SUMIF(Data!$I:$I,$A320,Data!R:R)),#N/A)","v":{"$error":"#N/A"}},{"$f":"IF(J$6,IF(SUMIF(Data!$I:$I,$A320,Data!S:S)=0,#N/A,SUMIF(Data!$I:$I,$A320,Data!S:S)),#N/A)","v":{"$error":"#N/A"}},{"$f":"IF(K$6,IF(SUMIF(Data!$I:$I,$A320,Data!T:T)=0,#N/A,SUMIF(Data!$I:$I,$A320,Data!T:T)),#N/A)","v":{"$error":"#N/A"}}]
[{"$error":"#N/A"},{"$f":"IF(B$6,IF(SUMIF(Data!$I:$I,$A321,Data!K:K)=0,#N/A,SUMIF(Data!$I:$I,$A321,Data!K:K)),#N/A)","v":{"$error":"#N/A"}},{"$f":"IF(C$6,IF(SUMIF(Data!$I:$I,$A321,Data!L:L)=0,#N/A,SUMIF(Data!$I:$I,$A321,Data!L:L)),#N/A)","v":{"$error":"#N/A"}},{"$f":"IF(D$6,IF(SUMIF(Data!$I:$I,$A321,Data!M:M)=0,#N/A,SUMIF(Data!$I:$I,$A321,Data!M:M)),#N/A)","v":{"$error":"#N/A"}},{"$f":"IF(E$6,IF(SUMIF(Data!$I:$I,$A321,Data!N:N)=0,#N/A,SUMIF(Data!$I:$I,$A321,Data!N:N)),#N/A)","v":{"$error":"#N/A"}},{"$f":"IF(F$6,IF(SUMIF(Data!$I:$I,$A321,Data!O:O)=0,#N/A,SUMIF(Data!$I:$I,$A321,Data!O:O)),#N/A)","v":{"$error":"#N/A"}},{"$f":"IF(G$6,IF(SUMIF(Data!$I:$I,$A321,Data!P:P)=0,#N/A,SUMIF(Data!$I:$I,$A321,Data!P:P)),#N/A)","v":{"$error":"#N/A"}},{"$f":"IF(H$6,IF(SUMIF(Data!$I:$I,$A321,Data!Q:Q)=0,#N/A,SUMIF(Data!$I:$I,$A321,Data!Q:Q)),#N/A)","v":{"$error":"#N/A"}},{"$f":"IF(I$6,IF(SUMIF(Data!$I:$I,$A321,Data!R:R)=0,#N/A,SUMIF(Data!$I:$I,$A321,Data!R:R)),#N/A)","v":{"$error":"#N/A"}},{"$f":"IF(J$6,IF(SUMIF(Data!$I:$I,$A321,Data!S:S)=0,#N/A,SUMIF(Data!$I:$I,$A321,Data!S:S)),#N/A)","v":{"$error":"#N/A"}},{"$f":"IF(K$6,IF(SUMIF(Data!$I:$I,$A321,Data!T:T)=0,#N/A,SUMIF(Data!$I:$I,$A321,Data!T:T)),#N/A)","v":{"$error":"#N/A"}}]
[{"$error":"#N/A"},{"$f":"IF(B$6,IF(SUMIF(Data!$I:$I,$A322,Data!K:K)=0,#N/A,SUMIF(Data!$I:$I,$A322,Data!K:K)),#N/A)","v":{"$error":"#N/A"}},{"$f":"IF(C$6,IF(SUMIF(Data!$I:$I,$A322,Data!L:L)=0,#N/A,SUMIF(Data!$I:$I,$A322,Data!L:L)),#N/A)","v":{"$error":"#N/A"}},{"$f":"IF(D$6,IF(SUMIF(Data!$I:$I,$A322,Data!M:M)=0,#N/A,SUMIF(Data!$I:$I,$A322,Data!M:M)),#N/A)","v":{"$error":"#N/A"}},{"$f":"IF(E$6,IF(SUMIF(Data!$I:$I,$A322,Data!N:N)=0,#N/A,SUMIF(Data!$I:$I,$A322,Data!N:N)),#N/A)","v":{"$error":"#N/A"}},{"$f":"IF(F$6,IF(SUMIF(Data!$I:$I,$A322,Data!O:O)=0,#N/A,SUMIF(Data!$I:$I,$A322,Data!O:O)),#N/A)","v":{"$error":"#N/A"}},{"$f":"IF(G$6,IF(SUMIF(Data!$I:$I,$A322,Data!P:P)=0,#N/A,SUMIF(Data!$I:$I,$A322,Data!P:P)),#N/A)","v":{"$error":"#N/A"}},{"$f":"IF(H$6,IF(SUMIF(Data!$I:$I,$A322,Data!Q:Q)=0,#N/A,SUMIF(Data!$I:$I,$A322,Data!Q:Q)),#N/A)","v":{"$error":"#N/A"}},{"$f":"IF(I$6,IF(SUMIF(Data!$I:$I,$A322,Data!R:R)=0,#N/A,SUMIF(Data!$I:$I,$A322,Data!R:R)),#N/A)","v":{"$error":"#N/A"}},{"$f":"IF(J$6,IF(SUMIF(Data!$I:$I,$A322,Data!S:S)=0,#N/A,SUMIF(Data!$I:$I,$A322,Data!S:S)),#N/A)","v":{"$error":"#N/A"}},{"$f":"IF(K$6,IF(SUMIF(Data!$I:$I,$A322,Data!T:T)=0,#N/A,SUMIF(Data!$I:$I,$A322,Data!T:T)),#N/A)","v":{"$error":"#N/A"}}]
[{"$error":"#N/A"},{"$f":"IF(B$6,IF(SUMIF(Data!$I:$I,$A323,Data!K:K)=0,#N/A,SUMIF(Data!$I:$I,$A323,Data!K:K)),#N/A)","v":{"$error":"#N/A"}},{"$f":"IF(C$6,IF(SUMIF(Data!$I:$I,$A323,Data!L:L)=0,#N/A,SUMIF(Data!$I:$I,$A323,Data!L:L)),#N/A)","v":{"$error":"#N/A"}},{"$f":"IF(D$6,IF(SUMIF(Data!$I:$I,$A323,Data!M:M)=0,#N/A,SUMIF(Data!$I:$I,$A323,Data!M:M)),#N/A)","v":{"$error":"#N/A"}},{"$f":"IF(E$6,IF(SUMIF(Data!$I:$I,$A323,Data!N:N)=0,#N/A,SUMIF(Data!$I:$I,$A323,Data!N:N)),#N/A)","v":{"$error":"#N/A"}},{"$f":"IF(F$6,IF(SUMIF(Data!$I:$I,$A323,Data!O:O)=0,#N/A,SUMIF(Data!$I:$I,$A323,Data!O:O)),#N/A)","v":{"$error":"#N/A"}},{"$f":"IF(G$6,IF(SUMIF(Data!$I:$I,$A323,Data!P:P)=0,#N/A,SUMIF(Data!$I:$I,$A323,Data!P:P)),#N/A)","v":{"$error":"#N/A"}},{"$f":"IF(H$6,IF(SUMIF(Data!$I:$I,$A323,Data!Q:Q)=0,#N/A,SUMIF(Data!$I:$I,$A323,Data!Q:Q)),#N/A)","v":{"$error":"#N/A"}},{"$f":"IF(I$6,IF(SUMIF(Data!$I:$I,$A323,Data!R:R)=0,#N/A,SUMIF(Data!$I:$I,$A323,Data!R:R)),#N/A)","v":{"$error":"#N/A"}},{"$f":"IF(J$6,IF(SUMIF(Data!$I:$I,$A323,Data!S:S)=0,#N/A,SUMIF(Data!$I:$I,$A323,Data!S:S)),#N/A)","v":{"$error":"#N/A"}},{"$f":"IF(K$6,IF(SUMIF(Data!$I:$I,$A323,Data!T:T)=0,#N/A,SUMIF(Data!$I:$I,$A323,Data!T:T)),#N/A)","v":{"$error":"#N/A"}}]
[{"$error":"#N/A"},{"$f":"IF(B$6,IF(SUMIF(Data!$I:$I,$A324,Data!K:K)=0,#N/A,SUMIF(Data!$I:$I,$A324,Data!K:K)),#N/A)","v":{"$error":"#N/A"}},{"$f":"IF(C$6,IF(SUMIF(Data!$I:$I,$A324,Data!L:L)=0,#N/A,SUMIF(Data!$I:$I,$A324,Data!L:L)),#N/A)","v":{"$error":"#N/A"}},{"$f":"IF(D$6,IF(SUMIF(Data!$I:$I,$A324,Data!M:M)=0,#N/A,SUMIF(Data!$I:$I,$A324,Data!M:M)),#N/A)","v":{"$error":"#N/A"}},{"$f":"IF(E$6,IF(SUMIF(Data!$I:$I,$A324,Data!N:N)=0,#N/A,SUMIF(Data!$I:$I,$A324,Data!N:N)),#N/A)","v":{"$error":"#N/A"}},{"$f":"IF(F$6,IF(SUMIF(Data!$I:$I,$A324,Data!O:O)=0,#N/A,SUMIF(Data!$I:$I,$A324,Data!O:O)),#N/A)","v":{"$error":"#N/A"}},{"$f":"IF(G$6,IF(SUMIF(Data!$I:$I,$A324,Data!P:P)=0,#N/A,SUMIF(Data!$I:$I,$A324,Data!P:P)),#N/A)","v":{"$error":"#N/A"}},{"$f":"IF(H$6,IF(SUMIF(Data!$I:$I,$A324,Data!Q:Q)=0,#N/A,SUMIF(Data!$I:$I,$A324,Data!Q:Q)),#N/A)","v":{"$error":"#N/A"}},{"$f":"IF(I$6,IF(SUMIF(Data!$I:$I,$A324,Data!R:R)=0,#N/A,SUMIF(Data!$I:$I,$A324,Data!R:R)),#N/A)","v":{"$error":"#N/A"}},{"$f":"IF(J$6,IF(SUMIF(Data!$I:$I,$A324,Data!S:S)=0,#N/A,SUMIF(Data!$I:$I,$A324,Data!S:S)),#N/A)","v":{"$error":"#N/A"}},{"$f":"IF(K$6,IF(SUMIF(Data!$I:$I,$A324,Data!T:T)=0,#N/A,SUMIF(Data!$I:$I,$A324,Data!T:T)),#N/A)","v":{"$error":"#N/A"}}]
[{"$error":"#N/A"},{"$f":"IF(B$6,IF(SUMIF(Data!$I:$I,$A325,Data!K:K)=0,#N/A,SUMIF(Data!$I:$I,$A325,Data!K:K)),#N/A)","v":{"$error":"#N/A"}},{"$f":"IF(C$6,IF(SUMIF(Data!$I:$I,$A325,Data!L:L)=0,#N/A,SUMIF(Data!$I:$I,$A325,Data!L:L)),#N/A)","v":{"$error":"#N/A"}},{"$f":"IF(D$6,IF(SUMIF(Data!$I:$I,$A325,Data!M:M)=0,#N/A,SUMIF(Data!$I:$I,$A325,Data!M:M)),#N/A)","v":{"$error":"#N/A"}},{"$f":"IF(E$6,IF(SUMIF(Data!$I:$I,$A325,Data!N:N)=0,#N/A,SUMIF(Data!$I:$I,$A325,Data!N:N)),#N/A)","v":{"$error":"#N/A"}},{"$f":"IF(F$6,IF(SUMIF(Data!$I:$I,$A325,Data!O:O)=0,#N/A,SUMIF(Data!$I:$I,$A325,Data!O:O)),#N/A)","v":{"$error":"#N/A"}},{"$f":"IF(G$6,IF(SUMIF(Data!$I:$I,$A325,Data!P:P)=0,#N/A,SUMIF(Data!$I:$I,$A325,Data!P:P)),#N/A)","v":{"$error":"#N/A"}},{"$f":"IF(H$6,IF(SUMIF(Data!$I:$I,$A325,Data!Q:Q)=0,#N/A,SUMIF(Data!$I:$I,$A325,Data!Q:Q)),#N/A)","v":{"$error":"#N/A"}},{"$f":"IF(I$6,IF(SUMIF(Data!$I:$I,$A325,Data!R:R)=0,#N/A,SUMIF(Data!$I:$I,$A325,Data!R:R)),#N/A)","v":{"$error":"#N/A"}},{"$f":"IF(J$6,IF(SUMIF(Data!$I:$I,$A325,Data!S:S)=0,#N/A,SUMIF(Data!$I:$I,$A325,Data!S:S)),#N/A)","v":{"$error":"#N/A"}},{"$f":"IF(K$6,IF(SUMIF(Data!$I:$I,$A325,Data!T:T)=0,#N/A,SUMIF(Data!$I:$I,$A325,Data!T:T)),#N/A)","v":{"$error":"#N/A"}}]
[{"$error":"#N/A"},{"$f":"IF(B$6,IF(SUMIF(Data!$I:$I,$A326,Data!K:K)=0,#N/A,SUMIF(Data!$I:$I,$A326,Data!K:K)),#N/A)","v":{"$error":"#N/A"}},{"$f":"IF(C$6,IF(SUMIF(Data!$I:$I,$A326,Data!L:L)=0,#N/A,SUMIF(Data!$I:$I,$A326,Data!L:L)),#N/A)","v":{"$error":"#N/A"}},{"$f":"IF(D$6,IF(SUMIF(Data!$I:$I,$A326,Data!M:M)=0,#N/A,SUMIF(Data!$I:$I,$A326,Data!M:M)),#N/A)","v":{"$error":"#N/A"}},{"$f":"IF(E$6,IF(SUMIF(Data!$I:$I,$A326,Data!N:N)=0,#N/A,SUMIF(Data!$I:$I,$A326,Data!N:N)),#N/A)","v":{"$error":"#N/A"}},{"$f":"IF(F$6,IF(SUMIF(Data!$I:$I,$A326,Data!O:O)=0,#N/A,SUMIF(Data!$I:$I,$A326,Data!O:O)),#N/A)","v":{"$error":"#N/A"}},{"$f":"IF(G$6,IF(SUMIF(Data!$I:$I,$A326,Data!P:P)=0,#N/A,SUMIF(Data!$I:$I,$A326,Data!P:P)),#N/A)","v":{"$error":"#N/A"}},{"$f":"IF(H$6,IF(SUMIF(Data!$I:$I,$A326,Data!Q:Q)=0,#N/A,SUMIF(Data!$I:$I,$A326,Data!Q:Q)),#N/A)","v":{"$error":"#N/A"}},{"$f":"IF(I$6,IF(SUMIF(Data!$I:$I,$A326,Data!R:R)=0,#N/A,SUMIF(Data!$I:$I,$A326,Data!R:R)),#N/A)","v":{"$error":"#N/A"}},{"$f":"IF(J$6,IF(SUMIF(Data!$I:$I,$A326,Data!S:S)=0,#N/A,SUMIF(Data!$I:$I,$A326,Data!S:S)),#N/A)","v":{"$error":"#N/A"}},{"$f":"IF(K$6,IF(SUMIF(Data!$I:$I,$A326,Data!T:T)=0,#N/A,SUMIF(Data!$I:$I,$A326,Data!T:T)),#N/A)","v":{"$error":"#N/A"}}]
[{"$error":"#N/A"},{"$f":"IF(B$6,IF(SUMIF(Data!$I:$I,$A327,Data!K:K)=0,#N/A,SUMIF(Data!$I:$I,$A327,Data!K:K)),#N/A)","v":{"$error":"#N/A"}},{"$f":"IF(C$6,IF(SUMIF(Data!$I:$I,$A327,Data!L:L)=0,#N/A,SUMIF(Data!$I:$I,$A327,Data!L:L)),#N/A)","v":{"$error":"#N/A"}},{"$f":"IF(D$6,IF(SUMIF(Data!$I:$I,$A327,Data!M:M)=0,#N/A,SUMIF(Data!$I:$I,$A327,Data!M:M)),#N/A)","v":{"$error":"#N/A"}},{"$f":"IF(E$6,IF(SUMIF(Data!$I:$I,$A327,Data!N:N)=0,#N/A,SUMIF(Data!$I:$I,$A327,Data!N:N)),#N/A)","v":{"$error":"#N/A"}},{"$f":"IF(F$6,IF(SUMIF(Data!$I:$I,$A327,Data!O:O)=0,#N/A,SUMIF(Data!$I:$I,$A327,Data!O:O)),#N/A)","v":{"$error":"#N/A"}},{"$f":"IF(G$6,IF(SUMIF(Data!$I:$I,$A327,Data!P:P)=0,#N/A,SUMIF(Data!$I:$I,$A327,Data!P:P)),#N/A)","v":{"$error":"#N/A"}},{"$f":"IF(H$6,IF(SUMIF(Data!$I:$I,$A327,Data!Q:Q)=0,#N/A,SUMIF(Data!$I:$I,$A327,Data!Q:Q)),#N/A)","v":{"$error":"#N/A"}},{"$f":"IF(I$6,IF(SUMIF(Data!$I:$I,$A327,Data!R:R)=0,#N/A,SUMIF(Data!$I:$I,$A327,Data!R:R)),#N/A)","v":{"$error":"#N/A"}},{"$f":"IF(J$6,IF(SUMIF(Data!$I:$I,$A327,Data!S:S)=0,#N/A,SUMIF(Data!$I:$I,$A327,Data!S:S)),#N/A)","v":{"$error":"#N/A"}},{"$f":"IF(K$6,IF(SUMIF(Data!$I:$I,$A327,Data!T:T)=0,#N/A,SUMIF(Data!$I:$I,$A327,Data!T:T)),#N/A)","v":{"$error":"#N/A"}}]
[{"$error":"#N/A"},{"$f":"IF(B$6,IF(SUMIF(Data!$I:$I,$A328,Data!K:K)=0,#N/A,SUMIF(Data!$I:$I,$A328,Data!K:K)),#N/A)","v":{"$error":"#N/A"}},{"$f":"IF(C$6,IF(SUMIF(Data!$I:$I,$A328,Data!L:L)=0,#N/A,SUMIF(Data!$I:$I,$A328,Data!L:L)),#N/A)","v":{"$error":"#N/A"}},{"$f":"IF(D$6,IF(SUMIF(Data!$I:$I,$A328,Data!M:M)=0,#N/A,SUMIF(Data!$I:$I,$A328,Data!M:M)),#N/A)","v":{"$error":"#N/A"}},{"$f":"IF(E$6,IF(SUMIF(Data!$I:$I,$A328,Data!N:N)=0,#N/A,SUMIF(Data!$I:$I,$A328,Data!N:N)),#N/A)","v":{"$error":"#N/A"}},{"$f":"IF(F$6,IF(SUMIF(Data!$I:$I,$A328,Data!O:O)=0,#N/A,SUMIF(Data!$I:$I,$A328,Data!O:O)),#N/A)","v":{"$error":"#N/A"}},{"$f":"IF(G$6,IF(SUMIF(Data!$I:$I,$A328,Data!P:P)=0,#N/A,SUMIF(Data!$I:$I,$A328,Data!P:P)),#N/A)","v":{"$error":"#N/A"}},{"$f":"IF(H$6,IF(SUMIF(Data!$I:$I,$A328,Data!Q:Q)=0,#N/A,SUMIF(Data!$I:$I,$A328,Data!Q:Q)),#N/A)","v":{"$error":"#N/A"}},{"$f":"IF(I$6,IF(SUMIF(Data!$I:$I,$A328,Data!R:R)=0,#N/A,SUMIF(Data!$I:$I,$A328,Data!R:R)),#N/A)","v":{"$error":"#N/A"}},{"$f":"IF(J$6,IF(SUMIF(Data!$I:$I,$A328,Data!S:S)=0,#N/A,SUMIF(Data!$I:$I,$A328,Data!S:S)),#N/A)","v":{"$error":"#N/A"}},{"$f":"IF(K$6,IF(SUMIF(Data!$I:$I,$A328,Data!T:T)=0,#N/A,SUMIF(Data!$I:$I,$A328,Data!T:T)),#N/A)","v":{"$error":"#N/A"}}]
[{"$error":"#N/A"},{"$f":"IF(B$6,IF(SUMIF(Data!$I:$I,$A329,Data!K:K)=0,#N/A,SUMIF(Data!$I:$I,$A329,Data!K:K)),#N/A)","v":{"$error":"#N/A"}},{"$f":"IF(C$6,IF(SUMIF(Data!$I:$I,$A329,Data!L:L)=0,#N/A,SUMIF(Data!$I:$I,$A329,Data!L:L)),#N/A)","v":{"$error":"#N/A"}},{"$f":"IF(D$6,IF(SUMIF(Data!$I:$I,$A329,Data!M:M)=0,#N/A,SUMIF(Data!$I:$I,$A329,Data!M:M)),#N/A)","v":{"$error":"#N/A"}},{"$f":"IF(E$6,IF(SUMIF(Data!$I:$I,$A329,Data!N:N)=0,#N/A,SUMIF(Data!$I:$I,$A329,Data!N:N)),#N/A)","v":{"$error":"#N/A"}},{"$f":"IF(F$6,IF(SUMIF(Data!$I:$I,$A329,Data!O:O)=0,#N/A,SUMIF(Data!$I:$I,$A329,Data!O:O)),#N/A)","v":{"$error":"#N/A"}},{"$f":"IF(G$6,IF(SUMIF(Data!$I:$I,$A329,Data!P:P)=0,#N/A,SUMIF(Data!$I:$I,$A329,Data!P:P)),#N/A)","v":{"$error":"#N/A"}},{"$f":"IF(H$6,IF(SUMIF(Data!$I:$I,$A329,Data!Q:Q)=0,#N/A,SUMIF(Data!$I:$I,$A329,Data!Q:Q)),#N/A)","v":{"$error":"#N/A"}},{"$f":"IF(I$6,IF(SUMIF(Data!$I:$I,$A329,Data!R:R)=0,#N/A,SUMIF(Data!$I:$I,$A329,Data!R:R)),#N/A)","v":{"$error":"#N/A"}},{"$f":"IF(J$6,IF(SUMIF(Data!$I:$I,$A329,Data!S:S)=0,#N/A,SUMIF(Data!$I:$I,$A329,Data!S:S)),#N/A)","v":{"$error":"#N/A"}},{"$f":"IF(K$6,IF(SUMIF(Data!$I:$I,$A329,Data!T:T)=0,#N/A,SUMIF(Data!$I:$I,$A329,Data!T:T)),#N/A)","v":{"$error":"#N/A"}}]
[{"$error":"#N/A"},{"$f":"IF(B$6,IF(SUMIF(Data!$I:$I,$A330,Data!K:K)=0,#N/A,SUMIF(Data!$I:$I,$A330,Data!K:K)),#N/A)","v":{"$error":"#N/A"}},{"$f":"IF(C$6,IF(SUMIF(Data!$I:$I,$A330,Data!L:L)=0,#N/A,SUMIF(Data!$I:$I,$A330,Data!L:L)),#N/A)","v":{"$error":"#N/A"}},{"$f":"IF(D$6,IF(SUMIF(Data!$I:$I,$A330,Data!M:M)=0,#N/A,SUMIF(Data!$I:$I,$A330,Data!M:M)),#N/A)","v":{"$error":"#N/A"}},{"$f":"IF(E$6,IF(SUMIF(Data!$I:$I,$A330,Data!N:N)=0,#N/A,SUMIF(Data!$I:$I,$A330,Data!N:N)),#N/A)","v":{"$error":"#N/A"}},{"$f":"IF(F$6,IF(SUMIF(Data!$I:$I,$A330,Data!O:O)=0,#N/A,SUMIF(Data!$I:$I,$A330,Data!O:O)),#N/A)","v":{"$error":"#N/A"}},{"$f":"IF(G$6,IF(SUMIF(Data!$I:$I,$A330,Data!P:P)=0,#N/A,SUMIF(Data!$I:$I,$A330,Data!P:P)),#N/A)","v":{"$error":"#N/A"}},{"$f":"IF(H$6,IF(SUMIF(Data!$I:$I,$A330,Data!Q:Q)=0,#N/A,SUMIF(Data!$I:$I,$A330,Data!Q:Q)),#N/A)","v":{"$error":"#N/A"}},{"$f":"IF(I$6,IF(SUMIF(Data!$I:$I,$A330,Data!R:R)=0,#N/A,SUMIF(Data!$I:$I,$A330,Data!R:R)),#N/A)","v":{"$error":"#N/A"}},{"$f":"IF(J$6,IF(SUMIF(Data!$I:$I,$A330,Data!S:S)=0,#N/A,SUMIF(Data!$I:$I,$A330,Data!S:S)),#N/A)","v":{"$error":"#N/A"}},{"$f":"IF(K$6,IF(SUMIF(Data!$I:$I,$A330,Data!T:T)=0,#N/A,SUMIF(Data!$I:$I,$A330,Data!T:T)),#N/A)","v":{"$error":"#N/A"}}]
[{"$f":"IF(A330+1<$B$3,A330+1,#N/A)","v":{"$error":"#N/A"}},{"$f":"IF(B$6,IF(SUMIF(Data!$I:$I,$A331,Data!K:K)=0,#N/A,SUMIF(Data!$I:$I,$A331,Data!K:K)),#N/A)","v":{"$error":"#N/A"}},{"$f":"IF(C$6,IF(SUMIF(Data!$I:$I,$A331,Data!L:L)=0,#N/A,SUMIF(Data!$I:$I,$A331,Data!L:L)),#N/A)","v":{"$error":"#N/A"}},{"$f":"IF(D$6,IF(SUMIF(Data!$I:$I,$A331,Data!M:M)=0,#N/A,SUMIF(Data!$I:$I,$A331,Data!M:M)),#N/A)","v":{"$error":"#N/A"}},{"$f":"IF(E$6,IF(SUMIF(Data!$I:$I,$A331,Data!N:N)=0,#N/A,SUMIF(Data!$I:$I,$A331,Data!N:N)),#N/A)","v":{"$error":"#N/A"}},{"$f":"IF(F$6,IF(SUMIF(Data!$I:$I,$A331,Data!O:O)=0,#N/A,SUMIF(Data!$I:$I,$A331,Data!O:O)),#N/A)","v":{"$error":"#N/A"}},{"$f":"IF(G$6,IF(SUMIF(Data!$I:$I,$A331,Data!P:P)=0,#N/A,SUMIF(Data!$I:$I,$A331,Data!P:P)),#N/A)","v":{"$error":"#N/A"}},{"$f":"IF(H$6,IF(SUMIF(Data!$I:$I,$A331,Data!Q:Q)=0,#N/A,SUMIF(Data!$I:$I,$A331,Data!Q:Q)),#N/A)","v":{"$error":"#N/A"}},{"$f":"IF(I$6,IF(SUMIF(Data!$I:$I,$A331,Data!R:R)=0,#N/A,SUMIF(Data!$I:$I,$A331,Data!R:R)),#N/A)","v":{"$error":"#N/A"}},{"$f":"IF(J$6,IF(SUMIF(Data!$I:$I,$A331,Data!S:S)=0,#N/A,SUMIF(Data!$I:$I,$A331,Data!S:S)),#N/A)","v":{"$error":"#N/A"}},{"$f":"IF(K$6,IF(SUMIF(Data!$I:$I,$A331,Data!T:T)=0,#N/A,SUMIF(Data!$I:$I,$A331,Data!T:T)),#N/A)","v":{"$error":"#N/A"}}]
[{"$error":"#N/A"},{"$f":"IF(B$6,IF(SUMIF(Data!$I:$I,$A332,Data!K:K)=0,#N/A,SUMIF(Data!$I:$I,$A332,Data!K:K)),#N/A)","v":{"$error":"#N/A"}},{"$f":"IF(C$6,IF(SUMIF(Data!$I:$I,$A332,Data!L:L)=0,#N/A,SUMIF(Data!$I:$I,$A332,Data!L:L)),#N/A)","v":{"$error":"#N/A"}},{"$f":"IF(D$6,IF(SUMIF(Data!$I:$I,$A332,Data!M:M)=0,#N/A,SUMIF(Data!$I:$I,$A332,Data!M:M)),#N/A)","v":{"$error":"#N/A"}},{"$f":"IF(E$6,IF(SUMIF(Data!$I:$I,$A332,Data!N:N)=0,#N/A,SUMIF(Data!$I:$I,$A332,Data!N:N)),#N/A)","v":{"$error":"#N/A"}},{"$f":"IF(F$6,IF(SUMIF(Data!$I:$I,$A332,Data!O:O)=0,#N/A,SUMIF(Data!$I:$I,$A332,Data!O:O)),#N/A)","v":{"$error":"#N/A"}},{"$f":"IF(G$6,IF(SUMIF(Data!$I:$I,$A332,Data!P:P)=0,#N/A,SUMIF(Data!$I:$I,$A332,Data!P:P)),#N/A)","v":{"$error":"#N/A"}},{"$f":"IF(H$6,IF(SUMIF(Data!$I:$I,$A332,Data!Q:Q)=0,#N/A,SUMIF(Data!$I:$I,$A332,Data!Q:Q)),#N/A)","v":{"$error":"#N/A"}},{"$f":"IF(I$6,IF(SUMIF(Data!$I:$I,$A332,Data!R:R)=0,#N/A,SUMIF(Data!$I:$I,$A332,Data!R:R)),#N/A)","v":{"$error":"#N/A"}},{"$f":"IF(J$6,IF(SUMIF(Data!$I:$I,$A332,Data!S:S)=0,#N/A,SUMIF(Data!$I:$I,$A332,Data!S:S)),#N/A)","v":{"$error":"#N/A"}},{"$f":"IF(K$6,IF(SUMIF(Data!$I:$I,$A332,Data!T:T)=0,#N/A,SUMIF(Data!$I:$I,$A332,Data!T:T)),#N/A)","v":{"$error":"#N/A"}}]
[{"$error":"#N/A"},{"$f":"IF(B$6,IF(SUMIF(Data!$I:$I,$A333,Data!K:K)=0,#N/A,SUMIF(Data!$I:$I,$A333,Data!K:K)),#N/A)","v":{"$error":"#N/A"}},{"$f":"IF(C$6,IF(SUMIF(Data!$I:$I,$A333,Data!L:L)=0,#N/A,SUMIF(Data!$I:$I,$A333,Data!L:L)),#N/A)","v":{"$error":"#N/A"}},{"$f":"IF(D$6,IF(SUMIF(Data!$I:$I,$A333,Data!M:M)=0,#N/A,SUMIF(Data!$I:$I,$A333,Data!M:M)),#N/A)","v":{"$error":"#N/A"}},{"$f":"IF(E$6,IF(SUMIF(Data!$I:$I,$A333,Data!N:N)=0,#N/A,SUMIF(Data!$I:$I,$A333,Data!N:N)),#N/A)","v":{"$error":"#N/A"}},{"$f":"IF(F$6,IF(SUMIF(Data!$I:$I,$A333,Data!O:O)=0,#N/A,SUMIF(Data!$I:$I,$A333,Data!O:O)),#N/A)","v":{"$error":"#N/A"}},{"$f":"IF(G$6,IF(SUMIF(Data!$I:$I,$A333,Data!P:P)=0,#N/A,SUMIF(Data!$I:$I,$A333,Data!P:P)),#N/A)","v":{"$error":"#N/A"}},{"$f":"IF(H$6,IF(SUMIF(Data!$I:$I,$A333,Data!Q:Q)=0,#N/A,SUMIF(Data!$I:$I,$A333,Data!Q:Q)),#N/A)","v":{"$error":"#N/A"}},{"$f":"IF(I$6,IF(SUMIF(Data!$I:$I,$A333,Data!R:R)=0,#N/A,SUMIF(Data!$I:$I,$A333,Data!R:R)),#N/A)","v":{"$error":"#N/A"}},{"$f":"IF(J$6,IF(SUMIF(Data!$I:$I,$A333,Data!S:S)=0,#N/A,SUMIF(Data!$I:$I,$A333,Data!S:S)),#N/A)","v":{"$error":"#N/A"}},{"$f":"IF(K$6,IF(SUMIF(Data!$I:$I,$A333,Data!T:T)=0,#N/A,SUMIF(Data!$I:$I,$A333,Data!T:T)),#N/A)","v":{"$error":"#N/A"}}]
[{"$error":"#N/A"},{"$f":"IF(B$6,IF(SUMIF(Data!$I:$I,$A334,Data!K:K)=0,#N/A,SUMIF(Data!$I:$I,$A334,Data!K:K)),#N/A)","v":{"$error":"#N/A"}},{"$f":"IF(C$6,IF(SUMIF(Data!$I:$I,$A334,Data!L:L)=0,#N/A,SUMIF(Data!$I:$I,$A334,Data!L:L)),#N/A)","v":{"$error":"#N/A"}},{"$f":"IF(D$6,IF(SUMIF(Data!$I:$I,$A334,Data!M:M)=0,#N/A,SUMIF(Data!$I:$I,$A334,Data!M:M)),#N/A)","v":{"$error":"#N/A"}},{"$f":"IF(E$6,IF(SUMIF(Data!$I:$I,$A334,Data!N:N)=0,#N/A,SUMIF(Data!$I:$I,$A334,Data!N:N)),#N/A)","v":{"$error":"#N/A"}},{"$f":"IF(F$6,IF(SUMIF(Data!$I:$I,$A334,Data!O:O)=0,#N/A,SUMIF(Data!$I:$I,$A334,Data!O:O)),#N/A)","v":{"$error":"#N/A"}},{"$f":"IF(G$6,IF(SUMIF(Data!$I:$I,$A334,Data!P:P)=0,#N/A,SUMIF(Data!$I:$I,$A334,Data!P:P)),#N/A)","v":{"$error":"#N/A"}},{"$f":"IF(H$6,IF(SUMIF(Data!$I:$I,$A334,Data!Q:Q)=0,#N/A,SUMIF(Data!$I:$I,$A334,Data!Q:Q)),#N/A)","v":{"$error":"#N/A"}},{"$f":"IF(I$6,IF(SUMIF(Data!$I:$I,$A334,Data!R:R)=0,#N/A,SUMIF(Data!$I:$I,$A334,Data!R:R)),#N/A)","v":{"$error":"#N/A"}},{"$f":"IF(J$6,IF(SUMIF(Data!$I:$I,$A334,Data!S:S)=0,#N/A,SUMIF(Data!$I:$I,$A334,Data!S:S)),#N/A)","v":{"$error":"#N/A"}},{"$f":"IF(K$6,IF(SUMIF(Data!$I:$I,$A334,Data!T:T)=0,#N/A,SUMIF(Data!$I:$I,$A334,Data!T:T)),#N/A)","v":{"$error":"#N/A"}}]
[{"$error":"#N/A"},{"$f":"IF(B$6,IF(SUMIF(Data!$I:$I,$A335,Data!K:K)=0,#N/A,SUMIF(Data!$I:$I,$A335,Data!K:K)),#N/A)","v":{"$error":"#N/A"}},{"$f":"IF(C$6,IF(SUMIF(Data!$I:$I,$A335,Data!L:L)=0,#N/A,SUMIF(Data!$I:$I,$A335,Data!L:L)),#N/A)","v":{"$error":"#N/A"}},{"$f":"IF(D$6,IF(SUMIF(Data!$I:$I,$A335,Data!M:M)=0,#N/A,SUMIF(Data!$I:$I,$A335,Data!M:M)),#N/A)","v":{"$error":"#N/A"}},{"$f":"IF(E$6,IF(SUMIF(Data!$I:$I,$A335,Data!N:N)=0,#N/A,SUMIF(Data!$I:$I,$A335,Data!N:N)),#N/A)","v":{"$error":"#N/A"}},{"$f":"IF(F$6,IF(SUMIF(Data!$I:$I,$A335,Data!O:O)=0,#N/A,SUMIF(Data!$I:$I,$A335,Data!O:O)),#N/A)","v":{"$error":"#N/A"}},{"$f":"IF(G$6,IF(SUMIF(Data!$I:$I,$A335,Data!P:P)=0,#N/A,SUMIF(Data!$I:$I,$A335,Data!P:P)),#N/A)","v":{"$error":"#N/A"}},{"$f":"IF(H$6,IF(SUMIF(Data!$I:$I,$A335,Data!Q:Q)=0,#N/A,SUMIF(Data!$I:$I,$A335,Data!Q:Q)),#N/A)","v":{"$error":"#N/A"}},{"$f":"IF(I$6,IF(SUMIF(Data!$I:$I,$A335,Data!R:R)=0,#N/A,SUMIF(Data!$I:$I,$A335,Data!R:R)),#N/A)","v":{"$error":"#N/A"}},{"$f":"IF(J$6,IF(SUMIF(Data!$I:$I,$A335,Data!S:S)=0,#N/A,SUMIF(Data!$I:$I,$A335,Data!S:S)),#N/A)","v":{"$error":"#N/A"}},{"$f":"IF(K$6,IF(SUMIF(Data!$I:$I,$A335,Data!T:T)=0,#N/A,SUMIF(Data!$I:$I,$A335,Data!T:T)),#N/A)","v":{"$error":"#N/A"}}]
[{"$error":"#N/A"},{"$f":"IF(B$6,IF(SUMIF(Data!$I:$I,$A336,Data!K:K)=0,#N/A,SUMIF(Data!$I:$I,$A336,Data!K:K)),#N/A)","v":{"$error":"#N/A"}},{"$f":"IF(C$6,IF(SUMIF(Data!$I:$I,$A336,Data!L:L)=0,#N/A,SUMIF(Data!$I:$I,$A336,Data!L:L)),#N/A)","v":{"$error":"#N/A"}},{"$f":"IF(D$6,IF(SUMIF(Data!$I:$I,$A336,Data!M:M)=0,#N/A,SUMIF(Data!$I:$I,$A336,Data!M:M)),#N/A)","v":{"$error":"#N/A"}},{"$f":"IF(E$6,IF(SUMIF(Data!$I:$I,$A336,Data!N:N)=0,#N/A,SUMIF(Data!$I:$I,$A336,Data!N:N)),#N/A)","v":{"$error":"#N/A"}},{"$f":"IF(F$6,IF(SUMIF(Data!$I:$I,$A336,Data!O:O)=0,#N/A,SUMIF(Data!$I:$I,$A336,Data!O:O)),#N/A)","v":{"$error":"#N/A"}},{"$f":"IF(G$6,IF(SUMIF(Data!$I:$I,$A336,Data!P:P)=0,#N/A,SUMIF(Data!$I:$I,$A336,Data!P:P)),#N/A)","v":{"$error":"#N/A"}},{"$f":"IF(H$6,IF(SUMIF(Data!$I:$I,$A336,Data!Q:Q)=0,#N/A,SUMIF(Data!$I:$I,$A336,Data!Q:Q)),#N/A)","v":{"$error":"#N/A"}},{"$f":"IF(I$6,IF(SUMIF(Data!$I:$I,$A336,Data!R:R)=0,#N/A,SUMIF(Data!$I:$I,$A336,Data!R:R)),#N/A)","v":{"$error":"#N/A"}},{"$f":"IF(J$6,IF(SUMIF(Data!$I:$I,$A336,Data!S:S)=0,#N/A,SUMIF(Data!$I:$I,$A336,Data!S:S)),#N/A)","v":{"$error":"#N/A"}},{"$f":"IF(K$6,IF(SUMIF(Data!$I:$I,$A336,Data!T:T)=0,#N/A,SUMIF(Data!$I:$I,$A336,Data!T:T)),#N/A)","v":{"$error":"#N/A"}}]
[{"$error":"#N/A"},{"$f":"IF(B$6,IF(SUMIF(Data!$I:$I,$A337,Data!K:K)=0,#N/A,SUMIF(Data!$I:$I,$A337,Data!K:K)),#N/A)","v":{"$error":"#N/A"}},{"$f":"IF(C$6,IF(SUMIF(Data!$I:$I,$A337,Data!L:L)=0,#N/A,SUMIF(Data!$I:$I,$A337,Data!L:L)),#N/A)","v":{"$error":"#N/A"}},{"$f":"IF(D$6,IF(SUMIF(Data!$I:$I,$A337,Data!M:M)=0,#N/A,SUMIF(Data!$I:$I,$A337,Data!M:M)),#N/A)","v":{"$error":"#N/A"}},{"$f":"IF(E$6,IF(SUMIF(Data!$I:$I,$A337,Data!N:N)=0,#N/A,SUMIF(Data!$I:$I,$A337,Data!N:N)),#N/A)","v":{"$error":"#N/A"}},{"$f":"IF(F$6,IF(SUMIF(Data!$I:$I,$A337,Data!O:O)=0,#N/A,SUMIF(Data!$I:$I,$A337,Data!O:O)),#N/A)","v":{"$error":"#N/A"}},{"$f":"IF(G$6,IF(SUMIF(Data!$I:$I,$A337,Data!P:P)=0,#N/A,SUMIF(Data!$I:$I,$A337,Data!P:P)),#N/A)","v":{"$error":"#N/A"}},{"$f":"IF(H$6,IF(SUMIF(Data!$I:$I,$A337,Data!Q:Q)=0,#N/A,SUMIF(Data!$I:$I,$A337,Data!Q:Q)),#N/A)","v":{"$error":"#N/A"}},{"$f":"IF(I$6,IF(SUMIF(Data!$I:$I,$A337,Data!R:R)=0,#N/A,SUMIF(Data!$I:$I,$A337,Data!R:R)),#N/A)","v":{"$error":"#N/A"}},{"$f":"IF(J$6,IF(SUMIF(Data!$I:$I,$A337,Data!S:S)=0,#N/A,SUMIF(Data!$I:$I,$A337,Data!S:S)),#N/A)","v":{"$error":"#N/A"}},{"$f":"IF(K$6,IF(SUMIF(Data!$I:$I,$A337,Data!T:T)=0,#N/A,SUMIF(Data!$I:$I,$A337,Data!T:T)),#N/A)","v":{"$error":"#N/A"}}]
[{"$error":"#N/A"},{"$f":"IF(B$6,IF(SUMIF(Data!$I:$I,$A338,Data!K:K)=0,#N/A,SUMIF(Data!$I:$I,$A338,Data!K:K)),#N/A)","v":{"$error":"#N/A"}},{"$f":"IF(C$6,IF(SUMIF(Data!$I:$I,$A338,Data!L:L)=0,#N/A,SUMIF(Data!$I:$I,$A338,Data!L:L)),#N/A)","v":{"$error":"#N/A"}},{"$f":"IF(D$6,IF(SUMIF(Data!$I:$I,$A338,Data!M:M)=0,#N/A,SUMIF(Data!$I:$I,$A338,Data!M:M)),#N/A)","v":{"$error":"#N/A"}},{"$f":"IF(E$6,IF(SUMIF(Data!$I:$I,$A338,Data!N:N)=0,#N/A,SUMIF(Data!$I:$I,$A338,Data!N:N)),#N/A)","v":{"$error":"#N/A"}},{"$f":"IF(F$6,IF(SUMIF(Data!$I:$I,$A338,Data!O:O)=0,#N/A,SUMIF(Data!$I:$I,$A338,Data!O:O)),#N/A)","v":{"$error":"#N/A"}},{"$f":"IF(G$6,IF(SUMIF(Data!$I:$I,$A338,Data!P:P)=0,#N/A,SUMIF(Data!$I:$I,$A338,Data!P:P)),#N/A)","v":{"$error":"#N/A"}},{"$f":"IF(H$6,IF(SUMIF(Data!$I:$I,$A338,Data!Q:Q)=0,#N/A,SUMIF(Data!$I:$I,$A338,Data!Q:Q)),#N/A)","v":{"$error":"#N/A"}},{"$f":"IF(I$6,IF(SUMIF(Data!$I:$I,$A338,Data!R:R)=0,#N/A,SUMIF(Data!$I:$I,$A338,Data!R:R)),#N/A)","v":{"$error":"#N/A"}},{"$f":"IF(J$6,IF(SUMIF(Data!$I:$I,$A338,Data!S:S)=0,#N/A,SUMIF(Data!$I:$I,$A338,Data!S:S)),#N/A)","v":{"$error":"#N/A"}},{"$f":"IF(K$6,IF(SUMIF(Data!$I:$I,$A338,Data!T:T)=0,#N/A,SUMIF(Data!$I:$I,$A338,Data!T:T)),#N/A)","v":{"$error":"#N/A"}}]
[{"$error":"#N/A"},{"$f":"IF(B$6,IF(SUMIF(Data!$I:$I,$A339,Data!K:K)=0,#N/A,SUMIF(Data!$I:$I,$A339,Data!K:K)),#N/A)","v":{"$error":"#N/A"}},{"$f":"IF(C$6,IF(SUMIF(Data!$I:$I,$A339,Data!L:L)=0,#N/A,SUMIF(Data!$I:$I,$A339,Data!L:L)),#N/A)","v":{"$error":"#N/A"}},{"$f":"IF(D$6,IF(SUMIF(Data!$I:$I,$A339,Data!M:M)=0,#N/A,SUMIF(Data!$I:$I,$A339,Data!M:M)),#N/A)","v":{"$error":"#N/A"}},{"$f":"IF(E$6,IF(SUMIF(Data!$I:$I,$A339,Data!N:N)=0,#N/A,SUMIF(Data!$I:$I,$A339,Data!N:N)),#N/A)","v":{"$error":"#N/A"}},{"$f":"IF(F$6,IF(SUMIF(Data!$I:$I,$A339,Data!O:O)=0,#N/A,SUMIF(Data!$I:$I,$A339,Data!O:O)),#N/A)","v":{"$error":"#N/A"}},{"$f":"IF(G$6,IF(SUMIF(Data!$I:$I,$A339,Data!P:P)=0,#N/A,SUMIF(Data!$I:$I,$A339,Data!P:P)),#N/A)","v":{"$error":"#N/A"}},{"$f":"IF(H$6,IF(SUMIF(Data!$I:$I,$A339,Data!Q:Q)=0,#N/A,SUMIF(Data!$I:$I,$A339,Data!Q:Q)),#N/A)","v":{"$error":"#N/A"}},{"$f":"IF(I$6,IF(SUMIF(Data!$I:$I,$A339,Data!R:R)=0,#N/A,SUMIF(Data!$I:$I,$A339,Data!R:R)),#N/A)","v":{"$error":"#N/A"}},{"$f":"IF(J$6,IF(SUMIF(Data!$I:$I,$A339,Data!S:S)=0,#N/A,SUMIF(Data!$I:$I,$A339,Data!S:S)),#N/A)","v":{"$error":"#N/A"}},{"$f":"IF(K$6,IF(SUMIF(Data!$I:$I,$A339,Data!T:T)=0,#N/A,SUMIF(Data!$I:$I,$A339,Data!T:T)),#N/A)","v":{"$error":"#N/A"}}]
[{"$error":"#N/A"},{"$f":"IF(B$6,IF(SUMIF(Data!$I:$I,$A340,Data!K:K)=0,#N/A,SUMIF(Data!$I:$I,$A340,Data!K:K)),#N/A)","v":{"$error":"#N/A"}},{"$f":"IF(C$6,IF(SUMIF(Data!$I:$I,$A340,Data!L:L)=0,#N/A,SUMIF(Data!$I:$I,$A340,Data!L:L)),#N/A)","v":{"$error":"#N/A"}},{"$f":"IF(D$6,IF(SUMIF(Data!$I:$I,$A340,Data!M:M)=0,#N/A,SUMIF(Data!$I:$I,$A340,Data!M:M)),#N/A)","v":{"$error":"#N/A"}},{"$f":"IF(E$6,IF(SUMIF(Data!$I:$I,$A340,Data!N:N)=0,#N/A,SUMIF(Data!$I:$I,$A340,Data!N:N)),#N/A)","v":{"$error":"#N/A"}},{"$f":"IF(F$6,IF(SUMIF(Data!$I:$I,$A340,Data!O:O)=0,#N/A,SUMIF(Data!$I:$I,$A340,Data!O:O)),#N/A)","v":{"$error":"#N/A"}},{"$f":"IF(G$6,IF(SUMIF(Data!$I:$I,$A340,Data!P:P)=0,#N/A,SUMIF(Data!$I:$I,$A340,Data!P:P)),#N/A)","v":{"$error":"#N/A"}},{"$f":"IF(H$6,IF(SUMIF(Data!$I:$I,$A340,Data!Q:Q)=0,#N/A,SUMIF(Data!$I:$I,$A340,Data!Q:Q)),#N/A)","v":{"$error":"#N/A"}},{"$f":"IF(I$6,IF(SUMIF(Data!$I:$I,$A340,Data!R:R)=0,#N/A,SUMIF(Data!$I:$I,$A340,Data!R:R)),#N/A)","v":{"$error":"#N/A"}},{"$f":"IF(J$6,IF(SUMIF(Data!$I:$I,$A340,Data!S:S)=0,#N/A,SUMIF(Data!$I:$I,$A340,Data!S:S)),#N/A)","v":{"$error":"#N/A"}},{"$f":"IF(K$6,IF(SUMIF(Data!$I:$I,$A340,Data!T:T)=0,#N/A,SUMIF(Data!$I:$I,$A340,Data!T:T)),#N/A)","v":{"$error":"#N/A"}}]
[{"$error":"#N/A"},{"$f":"IF(B$6,IF(SUMIF(Data!$I:$I,$A341,Data!K:K)=0,#N/A,SUMIF(Data!$I:$I,$A341,Data!K:K)),#N/A)","v":{"$error":"#N/A"}},{"$f":"IF(C$6,IF(SUMIF(Data!$I:$I,$A341,Data!L:L)=0,#N/A,SUMIF(Data!$I:$I,$A341,Data!L:L)),#N/A)","v":{"$error":"#N/A"}},{"$f":"IF(D$6,IF(SUMIF(Data!$I:$I,$A341,Data!M:M)=0,#N/A,SUMIF(Data!$I:$I,$A341,Data!M:M)),#N/A)","v":{"$error":"#N/A"}},{"$f":"IF(E$6,IF(SUMIF(Data!$I:$I,$A341,Data!N:N)=0,#N/A,SUMIF(Data!$I:$I,$A341,Data!N:N)),#N/A)","v":{"$error":"#N/A"}},{"$f":"IF(F$6,IF(SUMIF(Data!$I:$I,$A341,Data!O:O)=0,#N/A,SUMIF(Data!$I:$I,$A341,Data!O:O)),#N/A)","v":{"$error":"#N/A"}},{"$f":"IF(G$6,IF(SUMIF(Data!$I:$I,$A341,Data!P:P)=0,#N/A,SUMIF(Data!$I:$I,$A341,Data!P:P)),#N/A)","v":{"$error":"#N/A"}},{"$f":"IF(H$6,IF(SUMIF(Data!$I:$I,$A341,Data!Q:Q)=0,#N/A,SUMIF(Data!$I:$I,$A341,Data!Q:Q)),#N/A)","v":{"$error":"#N/A"}},{"$f":"IF(I$6,IF(SUMIF(Data!$I:$I,$A341,Data!R:R)=0,#N/A,SUMIF(Data!$I:$I,$A341,Data!R:R)),#N/A)","v":{"$error":"#N/A"}},{"$f":"IF(J$6,IF(SUMIF(Data!$I:$I,$A341,Data!S:S)=0,#N/A,SUMIF(Data!$I:$I,$A341,Data!S:S)),#N/A)","v":{"$error":"#N/A"}},{"$f":"IF(K$6,IF(SUMIF(Data!$I:$I,$A341,Data!T:T)=0,#N/A,SUMIF(Data!$I:$I,$A341,Data!T:T)),#N/A)","v":{"$error":"#N/A"}}]
[{"$error":"#N/A"},{"$f":"IF(B$6,IF(SUMIF(Data!$I:$I,$A342,Data!K:K)=0,#N/A,SUMIF(Data!$I:$I,$A342,Data!K:K)),#N/A)","v":{"$error":"#N/A"}},{"$f":"IF(C$6,IF(SUMIF(Data!$I:$I,$A342,Data!L:L)=0,#N/A,SUMIF(Data!$I:$I,$A342,Data!L:L)),#N/A)","v":{"$error":"#N/A"}},{"$f":"IF(D$6,IF(SUMIF(Data!$I:$I,$A342,Data!M:M)=0,#N/A,SUMIF(Data!$I:$I,$A342,Data!M:M)),#N/A)","v":{"$error":"#N/A"}},{"$f":"IF(E$6,IF(SUMIF(Data!$I:$I,$A342,Data!N:N)=0,#N/A,SUMIF(Data!$I:$I,$A342,Data!N:N)),#N/A)","v":{"$error":"#N/A"}},{"$f":"IF(F$6,IF(SUMIF(Data!$I:$I,$A342,Data!O:O)=0,#N/A,SUMIF(Data!$I:$I,$A342,Data!O:O)),#N/A)","v":{"$error":"#N/A"}},{"$f":"IF(G$6,IF(SUMIF(Data!$I:$I,$A342,Data!P:P)=0,#N/A,SUMIF(Data!$I:$I,$A342,Data!P:P)),#N/A)","v":{"$error":"#N/A"}},{"$f":"IF(H$6,IF(SUMIF(Data!$I:$I,$A342,Data!Q:Q)=0,#N/A,SUMIF(Data!$I:$I,$A342,Data!Q:Q)),#N/A)","v":{"$error":"#N/A"}},{"$f":"IF(I$6,IF(SUMIF(Data!$I:$I,$A342,Data!R:R)=0,#N/A,SUMIF(Data!$I:$I,$A342,Data!R:R)),#N/A)","v":{"$error":"#N/A"}},{"$f":"IF(J$6,IF(SUMIF(Data!$I:$I,$A342,Data!S:S)=0,#N/A,SUMIF(Data!$I:$I,$A342,Data!S:S)),#N/A)","v":{"$error":"#N/A"}},{"$f":"IF(K$6,IF(SUMIF(Data!$I:$I,$A342,Data!T:T)=0,#N/A,SUMIF(Data!$I:$I,$A342,Data!T:T)),#N/A)","v":{"$error":"#N/A"}}]
[{"$error":"#N/A"},{"$f":"IF(B$6,IF(SUMIF(Data!$I:$I,$A343,Data!K:K)=0,#N/A,SUMIF(Data!$I:$I,$A343,Data!K:K)),#N/A)","v":{"$error":"#N/A"}},{"$f":"IF(C$6,IF(SUMIF(Data!$I:$I,$A343,Data!L:L)=0,#N/A,SUMIF(Data!$I:$I,$A343,Data!L:L)),#N/A)","v":{"$error":"#N/A"}},{"$f":"IF(D$6,IF(SUMIF(Data!$I:$I,$A343,Data!M:M)=0,#N/A,SUMIF(Data!$I:$I,$A343,Data!M:M)),#N/A)","v":{"$error":"#N/A"}},{"$f":"IF(E$6,IF(SUMIF(Data!$I:$I,$A343,Data!N:N)=0,#N/A,SUMIF(Data!$I:$I,$A343,Data!N:N)),#N/A)","v":{"$error":"#N/A"}},{"$f":"IF(F$6,IF(SUMIF(Data!$I:$I,$A343,Data!O:O)=0,#N/A,SUMIF(Data!$I:$I,$A343,Data!O:O)),#N/A)","v":{"$error":"#N/A"}},{"$f":"IF(G$6,IF(SUMIF(Data!$I:$I,$A343,Data!P:P)=0,#N/A,SUMIF(Data!$I:$I,$A343,Data!P:P)),#N/A)","v":{"$error":"#N/A"}},{"$f":"IF(H$6,IF(SUMIF(Data!$I:$I,$A343,Data!Q:Q)=0,#N/A,SUMIF(Data!$I:$I,$A343,Data!Q:Q)),#N/A)","v":{"$error":"#N/A"}},{"$f":"IF(I$6,IF(SUMIF(Data!$I:$I,$A343,Data!R:R)=0,#N/A,SUMIF(Data!$I:$I,$A343,Data!R:R)),#N/A)","v":{"$error":"#N/A"}},{"$f":"IF(J$6,IF(SUMIF(Data!$I:$I,$A343,Data!S:S)=0,#N/A,SUMIF(Data!$I:$I,$A343,Data!S:S)),#N/A)","v":{"$error":"#N/A"}},{"$f":"IF(K$6,IF(SUMIF(Data!$I:$I,$A343,Data!T:T)=0,#N/A,SUMIF(Data!$I:$I,$A343,Data!T:T)),#N/A)","v":{"$error":"#N/A"}}]
[{"$error":"#N/A"},{"$f":"IF(B$6,IF(SUMIF(Data!$I:$I,$A344,Data!K:K)=0,#N/A,SUMIF(Data!$I:$I,$A344,Data!K:K)),#N/A)","v":{"$error":"#N/A"}},{"$f":"IF(C$6,IF(SUMIF(Data!$I:$I,$A344,Data!L:L)=0,#N/A,SUMIF(Data!$I:$I,$A344,Data!L:L)),#N/A)","v":{"$error":"#N/A"}},{"$f":"IF(D$6,IF(SUMIF(Data!$I:$I,$A344,Data!M:M)=0,#N/A,SUMIF(Data!$I:$I,$A344,Data!M:M)),#N/A)","v":{"$error":"#N/A"}},{"$f":"IF(E$6,IF(SUMIF(Data!$I:$I,$A344,Data!N:N)=0,#N/A,SUMIF(Data!$I:$I,$A344,Data!N:N)),#N/A)","v":{"$error":"#N/A"}},{"$f":"IF(F$6,IF(SUMIF(Data!$I:$I,$A344,Data!O:O)=0,#N/A,SUMIF(Data!$I:$I,$A344,Data!O:O)),#N/A)","v":{"$error":"#N/A"}},{"$f":"IF(G$6,IF(SUMIF(Data!$I:$I,$A344,Data!P:P)=0,#N/A,SUMIF(Data!$I:$I,$A344,Data!P:P)),#N/A)","v":{"$error":"#N/A"}},{"$f":"IF(H$6,IF(SUMIF(Data!$I:$I,$A344,Data!Q:Q)=0,#N/A,SUMIF(Data!$I:$I,$A344,Data!Q:Q)),#N/A)","v":{"$error":"#N/A"}},{"$f":"IF(I$6,IF(SUMIF(Data!$I:$I,$A344,Data!R:R)=0,#N/A,SUMIF(Data!$I:$I,$A344,Data!R:R)),#N/A)","v":{"$error":"#N/A"}},{"$f":"IF(J$6,IF(SUMIF(Data!$I:$I,$A344,Data!S:S)=0,#N/A,SUMIF(Data!$I:$I,$A344,Data!S:S)),#N/A)","v":{"$error":"#N/A"}},{"$f":"IF(K$6,IF(SUMIF(Data!$I:$I,$A344,Data!T:T)=0,#N/A,SUMIF(Data!$I:$I,$A344,Data!T:T)),#N/A)","v":{"$error":"#N/A"}}]
[{"$error":"#N/A"},{"$f":"IF(B$6,IF(SUMIF(Data!$I:$I,$A345,Data!K:K)=0,#N/A,SUMIF(Data!$I:$I,$A345,Data!K:K)),#N/A)","v":{"$error":"#N/A"}},{"$f":"IF(C$6,IF(SUMIF(Data!$I:$I,$A345,Data!L:L)=0,#N/A,SUMIF(Data!$I:$I,$A345,Data!L:L)),#N/A)","v":{"$error":"#N/A"}},{"$f":"IF(D$6,IF(SUMIF(Data!$I:$I,$A345,Data!M:M)=0,#N/A,SUMIF(Data!$I:$I,$A345,Data!M:M)),#N/A)","v":{"$error":"#N/A"}},{"$f":"IF(E$6,IF(SUMIF(Data!$I:$I,$A345,Data!N:N)=0,#N/A,SUMIF(Data!$I:$I,$A345,Data!N:N)),#N/A)","v":{"$error":"#N/A"}},{"$f":"IF(F$6,IF(SUMIF(Data!$I:$I,$A345,Data!O:O)=0,#N/A,SUMIF(Data!$I:$I,$A345,Data!O:O)),#N/A)","v":{"$error":"#N/A"}},{"$f":"IF(G$6,IF(SUMIF(Data!$I:$I,$A345,Data!P:P)=0,#N/A,SUMIF(Data!$I:$I,$A345,Data!P:P)),#N/A)","v":{"$error":"#N/A"}},{"$f":"IF(H$6,IF(SUMIF(Data!$I:$I,$A345,Data!Q:Q)=0,#N/A,SUMIF(Data!$I:$I,$A345,Data!Q:Q)),#N/A)","v":{"$error":"#N/A"}},{"$f":"IF(I$6,IF(SUMIF(Data!$I:$I,$A345,Data!R:R)=0,#N/A,SUMIF(Data!$I:$I,$A345,Data!R:R)),#N/A)","v":{"$error":"#N/A"}},{"$f":"IF(J$6,IF(SUMIF(Data!$I:$I,$A345,Data!S:S)=0,#N/A,SUMIF(Data!$I:$I,$A345,Data!S:S)),#N/A)","v":{"$error":"#N/A"}},{"$f":"IF(K$6,IF(SUMIF(Data!$I:$I,$A345,Data!T:T)=0,#N/A,SUMIF(Data!$I:$I,$A345,Data!T:T)),#N/A)","v":{"$error":"#N/A"}}]
[{"$error":"#N/A"},{"$f":"IF(B$6,IF(SUMIF(Data!$I:$I,$A346,Data!K:K)=0,#N/A,SUMIF(Data!$I:$I,$A346,Data!K:K)),#N/A)","v":{"$error":"#N/A"}},{"$f":"IF(C$6,IF(SUMIF(Data!$I:$I,$A346,Data!L:L)=0,#N/A,SUMIF(Data!$I:$I,$A346,Data!L:L)),#N/A)","v":{"$error":"#N/A"}},{"$f":"IF(D$6,IF(SUMIF(Data!$I:$I,$A346,Data!M:M)=0,#N/A,SUMIF(Data!$I:$I,$A346,Data!M:M)),#N/A)","v":{"$error":"#N/A"}},{"$f":"IF(E$6,IF(SUMIF(Data!$I:$I,$A346,Data!N:N)=0,#N/A,SUMIF(Data!$I:$I,$A346,Data!N:N)),#N/A)","v":{"$error":"#N/A"}},{"$f":"IF(F$6,IF(SUMIF(Data!$I:$I,$A346,Data!O:O)=0,#N/A,SUMIF(Data!$I:$I,$A346,Data!O:O)),#N/A)","v":{"$error":"#N/A"}},{"$f":"IF(G$6,IF(SUMIF(Data!$I:$I,$A346,Data!P:P)=0,#N/A,SUMIF(Data!$I:$I,$A346,Data!P:P)),#N/A)","v":{"$error":"#N/A"}},{"$f":"IF(H$6,IF(SUMIF(Data!$I:$I,$A346,Data!Q:Q)=0,#N/A,SUMIF(Data!$I:$I,$A346,Data!Q:Q)),#N/A)","v":{"$error":"#N/A"}},{"$f":"IF(I$6,IF(SUMIF(Data!$I:$I,$A346,Data!R:R)=0,#N/A,SUMIF(Data!$I:$I,$A346,Data!R:R)),#N/A)","v":{"$error":"#N/A"}},{"$f":"IF(J$6,IF(SUMIF(Data!$I:$I,$A346,Data!S:S)=0,#N/A,SUMIF(Data!$I:$I,$A346,Data!S:S)),#N/A)","v":{"$error":"#N/A"}},{"$f":"IF(K$6,IF(SUMIF(Data!$I:$I,$A346,Data!T:T)=0,#N/A,SUMIF(Data!$I:$I,$A346,Data!T:T)),#N/A)","v":{"$error":"#N/A"}}]
[{"$error":"#N/A"},{"$f":"IF(B$6,IF(SUMIF(Data!$I:$I,$A347,Data!K:K)=0,#N/A,SUMIF(Data!$I:$I,$A347,Data!K:K)),#N/A)","v":{"$error":"#N/A"}},{"$f":"IF(C$6,IF(SUMIF(Data!$I:$I,$A347,Data!L:L)=0,#N/A,SUMIF(Data!$I:$I,$A347,Data!L:L)),#N/A)","v":{"$error":"#N/A"}},{"$f":"IF(D$6,IF(SUMIF(Data!$I:$I,$A347,Data!M:M)=0,#N/A,SUMIF(Data!$I:$I,$A347,Data!M:M)),#N/A)","v":{"$error":"#N/A"}},{"$f":"IF(E$6,IF(SUMIF(Data!$I:$I,$A347,Data!N:N)=0,#N/A,SUMIF(Data!$I:$I,$A347,Data!N:N)),#N/A)","v":{"$error":"#N/A"}},{"$f":"IF(F$6,IF(SUMIF(Data!$I:$I,$A347,Data!O:O)=0,#N/A,SUMIF(Data!$I:$I,$A347,Data!O:O)),#N/A)","v":{"$error":"#N/A"}},{"$f":"IF(G$6,IF(SUMIF(Data!$I:$I,$A347,Data!P:P)=0,#N/A,SUMIF(Data!$I:$I,$A347,Data!P:P)),#N/A)","v":{"$error":"#N/A"}},{"$f":"IF(H$6,IF(SUMIF(Data!$I:$I,$A347,Data!Q:Q)=0,#N/A,SUMIF(Data!$I:$I,$A347,Data!Q:Q)),#N/A)","v":{"$error":"#N/A"}},{"$f":"IF(I$6,IF(SUMIF(Data!$I:$I,$A347,Data!R:R)=0,#N/A,SUMIF(Data!$I:$I,$A347,Data!R:R)),#N/A)","v":{"$error":"#N/A"}},{"$f":"IF(J$6,IF(SUMIF(Data!$I:$I,$A347,Data!S:S)=0,#N/A,SUMIF(Data!$I:$I,$A347,Data!S:S)),#N/A)","v":{"$error":"#N/A"}},{"$f":"IF(K$6,IF(SUMIF(Data!$I:$I,$A347,Data!T:T)=0,#N/A,SUMIF(Data!$I:$I,$A347,Data!T:T)),#N/A)","v":{"$error":"#N/A"}}]
[{"$error":"#N/A"},{"$f":"IF(B$6,IF(SUMIF(Data!$I:$I,$A348,Data!K:K)=0,#N/A,SUMIF(Data!$I:$I,$A348,Data!K:K)),#N/A)","v":{"$error":"#N/A"}},{"$f":"IF(C$6,IF(SUMIF(Data!$I:$I,$A348,Data!L:L)=0,#N/A,SUMIF(Data!$I:$I,$A348,Data!L:L)),#N/A)","v":{"$error":"#N/A"}},{"$f":"IF(D$6,IF(SUMIF(Data!$I:$I,$A348,Data!M:M)=0,#N/A,SUMIF(Data!$I:$I,$A348,Data!M:M)),#N/A)","v":{"$error":"#N/A"}},{"$f":"IF(E$6,IF(SUMIF(Data!$I:$I,$A348,Data!N:N)=0,#N/A,SUMIF(Data!$I:$I,$A348,Data!N:N)),#N/A)","v":{"$error":"#N/A"}},{"$f":"IF(F$6,IF(SUMIF(Data!$I:$I,$A348,Data!O:O)=0,#N/A,SUMIF(Data!$I:$I,$A348,Data!O:O)),#N/A)","v":{"$error":"#N/A"}},{"$f":"IF(G$6,IF(SUMIF(Data!$I:$I,$A348,Data!P:P)=0,#N/A,SUMIF(Data!$I:$I,$A348,Data!P:P)),#N/A)","v":{"$error":"#N/A"}},{"$f":"IF(H$6,IF(SUMIF(Data!$I:$I,$A348,Data!Q:Q)=0,#N/A,SUMIF(Data!$I:$I,$A348,Data!Q:Q)),#N/A)","v":{"$error":"#N/A"}},{"$f":"IF(I$6,IF(SUMIF(Data!$I:$I,$A348,Data!R:R)=0,#N/A,SUMIF(Data!$I:$I,$A348,Data!R:R)),#N/A)","v":{"$error":"#N/A"}},{"$f":"IF(J$6,IF(SUMIF(Data!$I:$I,$A348,Data!S:S)=0,#N/A,SUMIF(Data!$I:$I,$A348,Data!S:S)),#N/A)","v":{"$error":"#N/A"}},{"$f":"IF(K$6,IF(SUMIF(Data!$I:$I,$A348,Data!T:T)=0,#N/A,SUMIF(Data!$I:$I,$A348,Data!T:T)),#N/A)","v":{"$error":"#N/A"}}]
[{"$error":"#N/A"},{"$f":"IF(B$6,IF(SUMIF(Data!$I:$I,$A349,Data!K:K)=0,#N/A,SUMIF(Data!$I:$I,$A349,Data!K:K)),#N/A)","v":{"$error":"#N/A"}},{"$f":"IF(C$6,IF(SUMIF(Data!$I:$I,$A349,Data!L:L)=0,#N/A,SUMIF(Data!$I:$I,$A349,Data!L:L)),#N/A)","v":{"$error":"#N/A"}},{"$f":"IF(D$6,IF(SUMIF(Data!$I:$I,$A349,Data!M:M)=0,#N/A,SUMIF(Data!$I:$I,$A349,Data!M:M)),#N/A)","v":{"$error":"#N/A"}},{"$f":"IF(E$6,IF(SUMIF(Data!$I:$I,$A349,Data!N:N)=0,#N/A,SUMIF(Data!$I:$I,$A349,Data!N:N)),#N/A)","v":{"$error":"#N/A"}},{"$f":"IF(F$6,IF(SUMIF(Data!$I:$I,$A349,Data!O:O)=0,#N/A,SUMIF(Data!$I:$I,$A349,Data!O:O)),#N/A)","v":{"$error":"#N/A"}},{"$f":"IF(G$6,IF(SUMIF(Data!$I:$I,$A349,Data!P:P)=0,#N/A,SUMIF(Data!$I:$I,$A349,Data!P:P)),#N/A)","v":{"$error":"#N/A"}},{"$f":"IF(H$6,IF(SUMIF(Data!$I:$I,$A349,Data!Q:Q)=0,#N/A,SUMIF(Data!$I:$I,$A349,Data!Q:Q)),#N/A)","v":{"$error":"#N/A"}},{"$f":"IF(I$6,IF(SUMIF(Data!$I:$I,$A349,Data!R:R)=0,#N/A,SUMIF(Data!$I:$I,$A349,Data!R:R)),#N/A)","v":{"$error":"#N/A"}},{"$f":"IF(J$6,IF(SUMIF(Data!$I:$I,$A349,Data!S:S)=0,#N/A,SUMIF(Data!$I:$I,$A349,Data!S:S)),#N/A)","v":{"$error":"#N/A"}},{"$f":"IF(K$6,IF(SUMIF(Data!$I:$I,$A349,Data!T:T)=0,#N/A,SUMIF(Data!$I:$I,$A349,Data!T:T)),#N/A)","v":{"$error":"#N/A"}}]
[{"$error":"#N/A"},{"$f":"IF(B$6,IF(SUMIF(Data!$I:$I,$A350,Data!K:K)=0,#N/A,SUMIF(Data!$I:$I,$A350,Data!K:K)),#N/A)","v":{"$error":"#N/A"}},{"$f":"IF(C$6,IF(SUMIF(Data!$I:$I,$A350,Data!L:L)=0,#N/A,SUMIF(Data!$I:$I,$A350,Data!L:L)),#N/A)","v":{"$error":"#N/A"}},{"$f":"IF(D$6,IF(SUMIF(Data!$I:$I,$A350,Data!M:M)=0,#N/A,SUMIF(Data!$I:$I,$A350,Data!M:M)),#N/A)","v":{"$error":"#N/A"}},{"$f":"IF(E$6,IF(SUMIF(Data!$I:$I,$A350,Data!N:N)=0,#N/A,SUMIF(Data!$I:$I,$A350,Data!N:N)),#N/A)","v":{"$error":"#N/A"}},{"$f":"IF(F$6,IF(SUMIF(Data!$I:$I,$A350,Data!O:O)=0,#N/A,SUMIF(Data!$I:$I,$A350,Data!O:O)),#N/A)","v":{"$error":"#N/A"}},{"$f":"IF(G$6,IF(SUMIF(Data!$I:$I,$A350,Data!P:P)=0,#N/A,SUMIF(Data!$I:$I,$A350,Data!P:P)),#N/A)","v":{"$error":"#N/A"}},{"$f":"IF(H$6,IF(SUMIF(Data!$I:$I,$A350,Data!Q:Q)=0,#N/A,SUMIF(Data!$I:$I,$A350,Data!Q:Q)),#N/A)","v":{"$error":"#N/A"}},{"$f":"IF(I$6,IF(SUMIF(Data!$I:$I,$A350,Data!R:R)=0,#N/A,SUMIF(Data!$I:$I,$A350,Data!R:R)),#N/A)","v":{"$error":"#N/A"}},{"$f":"IF(J$6,IF(SUMIF(Data!$I:$I,$A350,Data!S:S)=0,#N/A,SUMIF(Data!$I:$I,$A350,Data!S:S)),#N/A)","v":{"$error":"#N/A"}},{"$f":"IF(K$6,IF(SUMIF(Data!$I:$I,$A350,Data!T:T)=0,#N/A,SUMIF(Data!$I:$I,$A350,Data!T:T)),#N/A)","v":{"$error":"#N/A"}}]
[{"$error":"#N/A"},{"$f":"IF(B$6,IF(SUMIF(Data!$I:$I,$A351,Data!K:K)=0,#N/A,SUMIF(Data!$I:$I,$A351,Data!K:K)),#N/A)","v":{"$error":"#N/A"}},{"$f":"IF(C$6,IF(SUMIF(Data!$I:$I,$A351,Data!L:L)=0,#N/A,SUMIF(Data!$I:$I,$A351,Data!L:L)),#N/A)","v":{"$error":"#N/A"}},{"$f":"IF(D$6,IF(SUMIF(Data!$I:$I,$A351,Data!M:M)=0,#N/A,SUMIF(Data!$I:$I,$A351,Data!M:M)),#N/A)","v":{"$error":"#N/A"}},{"$f":"IF(E$6,IF(SUMIF(Data!$I:$I,$A351,Data!N:N)=0,#N/A,SUMIF(Data!$I:$I,$A351,Data!N:N)),#N/A)","v":{"$error":"#N/A"}},{"$f":"IF(F$6,IF(SUMIF(Data!$I:$I,$A351,Data!O:O)=0,#N/A,SUMIF(Data!$I:$I,$A351,Data!O:O)),#N/A)","v":{"$error":"#N/A"}},{"$f":"IF(G$6,IF(SUMIF(Data!$I:$I,$A351,Data!P:P)=0,#N/A,SUMIF(Data!$I:$I,$A351,Data!P:P)),#N/A)","v":{"$error":"#N/A"}},{"$f":"IF(H$6,IF(SUMIF(Data!$I:$I,$A351,Data!Q:Q)=0,#N/A,SUMIF(Data!$I:$I,$A351,Data!Q:Q)),#N/A)","v":{"$error":"#N/A"}},{"$f":"IF(I$6,IF(SUMIF(Data!$I:$I,$A351,Data!R:R)=0,#N/A,SUMIF(Data!$I:$I,$A351,Data!R:R)),#N/A)","v":{"$error":"#N/A"}},{"$f":"IF(J$6,IF(SUMIF(Data!$I:$I,$A351,Data!S:S)=0,#N/A,SUMIF(Data!$I:$I,$A351,Data!S:S)),#N/A)","v":{"$error":"#N/A"}},{"$f":"IF(K$6,IF(SUMIF(Data!$I:$I,$A351,Data!T:T)=0,#N/A,SUMIF(Data!$I:$I,$A351,Data!T:T)),#N/A)","v":{"$error":"#N/A"}}]
[{"$error":"#N/A"},{"$f":"IF(B$6,IF(SUMIF(Data!$I:$I,$A352,Data!K:K)=0,#N/A,SUMIF(Data!$I:$I,$A352,Data!K:K)),#N/A)","v":{"$error":"#N/A"}},{"$f":"IF(C$6,IF(SUMIF(Data!$I:$I,$A352,Data!L:L)=0,#N/A,SUMIF(Data!$I:$I,$A352,Data!L:L)),#N/A)","v":{"$error":"#N/A"}},{"$f":"IF(D$6,IF(SUMIF(Data!$I:$I,$A352,Data!M:M)=0,#N/A,SUMIF(Data!$I:$I,$A352,Data!M:M)),#N/A)","v":{"$error":"#N/A"}},{"$f":"IF(E$6,IF(SUMIF(Data!$I:$I,$A352,Data!N:N)=0,#N/A,SUMIF(Data!$I:$I,$A352,Data!N:N)),#N/A)","v":{"$error":"#N/A"}},{"$f":"IF(F$6,IF(SUMIF(Data!$I:$I,$A352,Data!O:O)=0,#N/A,SUMIF(Data!$I:$I,$A352,Data!O:O)),#N/A)","v":{"$error":"#N/A"}},{"$f":"IF(G$6,IF(SUMIF(Data!$I:$I,$A352,Data!P:P)=0,#N/A,SUMIF(Data!$I:$I,$A352,Data!P:P)),#N/A)","v":{"$error":"#N/A"}},{"$f":"IF(H$6,IF(SUMIF(Data!$I:$I,$A352,Data!Q:Q)=0,#N/A,SUMIF(Data!$I:$I,$A352,Data!Q:Q)),#N/A)","v":{"$error":"#N/A"}},{"$f":"IF(I$6,IF(SUMIF(Data!$I:$I,$A352,Data!R:R)=0,#N/A,SUMIF(Data!$I:$I,$A352,Data!R:R)),#N/A)","v":{"$error":"#N/A"}},{"$f":"IF(J$6,IF(SUMIF(Data!$I:$I,$A352,Data!S:S)=0,#N/A,SUMIF(Data!$I:$I,$A352,Data!S:S)),#N/A)","v":{"$error":"#N/A"}},{"$f":"IF(K$6,IF(SUMIF(Data!$I:$I,$A352,Data!T:T)=0,#N/A,SUMIF(Data!$I:$I,$A352,Data!T:T)),#N/A)","v":{"$error":"#N/A"}}]
[{"$error":"#N/A"},{"$f":"IF(B$6,IF(SUMIF(Data!$I:$I,$A353,Data!K:K)=0,#N/A,SUMIF(Data!$I:$I,$A353,Data!K:K)),#N/A)","v":{"$error":"#N/A"}},{"$f":"IF(C$6,IF(SUMIF(Data!$I:$I,$A353,Data!L:L)=0,#N/A,SUMIF(Data!$I:$I,$A353,Data!L:L)),#N/A)","v":{"$error":"#N/A"}},{"$f":"IF(D$6,IF(SUMIF(Data!$I:$I,$A353,Data!M:M)=0,#N/A,SUMIF(Data!$I:$I,$A353,Data!M:M)),#N/A)","v":{"$error":"#N/A"}},{"$f":"IF(E$6,IF(SUMIF(Data!$I:$I,$A353,Data!N:N)=0,#N/A,SUMIF(Data!$I:$I,$A353,Data!N:N)),#N/A)","v":{"$error":"#N/A"}},{"$f":"IF(F$6,IF(SUMIF(Data!$I:$I,$A353,Data!O:O)=0,#N/A,SUMIF(Data!$I:$I,$A353,Data!O:O)),#N/A)","v":{"$error":"#N/A"}},{"$f":"IF(G$6,IF(SUMIF(Data!$I:$I,$A353,Data!P:P)=0,#N/A,SUMIF(Data!$I:$I,$A353,Data!P:P)),#N/A)","v":{"$error":"#N/A"}},{"$f":"IF(H$6,IF(SUMIF(Data!$I:$I,$A353,Data!Q:Q)=0,#N/A,SUMIF(Data!$I:$I,$A353,Data!Q:Q)),#N/A)","v":{"$error":"#N/A"}},{"$f":"IF(I$6,IF(SUMIF(Data!$I:$I,$A353,Data!R:R)=0,#N/A,SUMIF(Data!$I:$I,$A353,Data!R:R)),#N/A)","v":{"$error":"#N/A"}},{"$f":"IF(J$6,IF(SUMIF(Data!$I:$I,$A353,Data!S:S)=0,#N/A,SUMIF(Data!$I:$I,$A353,Data!S:S)),#N/A)","v":{"$error":"#N/A"}},{"$f":"IF(K$6,IF(SUMIF(Data!$I:$I,$A353,Data!T:T)=0,#N/A,SUMIF(Data!$I:$I,$A353,Data!T:T)),#N/A)","v":{"$error":"#N/A"}}]
[{"$error":"#N/A"},{"$f":"IF(B$6,IF(SUMIF(Data!$I:$I,$A354,Data!K:K)=0,#N/A,SUMIF(Data!$I:$I,$A354,Data!K:K)),#N/A)","v":{"$error":"#N/A"}},{"$f":"IF(C$6,IF(SUMIF(Data!$I:$I,$A354,Data!L:L)=0,#N/A,SUMIF(Data!$I:$I,$A354,Data!L:L)),#N/A)","v":{"$error":"#N/A"}},{"$f":"IF(D$6,IF(SUMIF(Data!$I:$I,$A354,Data!M:M)=0,#N/A,SUMIF(Data!$I:$I,$A354,Data!M:M)),#N/A)","v":{"$error":"#N/A"}},{"$f":"IF(E$6,IF(SUMIF(Data!$I:$I,$A354,Data!N:N)=0,#N/A,SUMIF(Data!$I:$I,$A354,Data!N:N)),#N/A)","v":{"$error":"#N/A"}},{"$f":"IF(F$6,IF(SUMIF(Data!$I:$I,$A354,Data!O:O)=0,#N/A,SUMIF(Data!$I:$I,$A354,Data!O:O)),#N/A)","v":{"$error":"#N/A"}},{"$f":"IF(G$6,IF(SUMIF(Data!$I:$I,$A354,Data!P:P)=0,#N/A,SUMIF(Data!$I:$I,$A354,Data!P:P)),#N/A)","v":{"$error":"#N/A"}},{"$f":"IF(H$6,IF(SUMIF(Data!$I:$I,$A354,Data!Q:Q)=0,#N/A,SUMIF(Data!$I:$I,$A354,Data!Q:Q)),#N/A)","v":{"$error":"#N/A"}},{"$f":"IF(I$6,IF(SUMIF(Data!$I:$I,$A354,Data!R:R)=0,#N/A,SUMIF(Data!$I:$I,$A354,Data!R:R)),#N/A)","v":{"$error":"#N/A"}},{"$f":"IF(J$6,IF(SUMIF(Data!$I:$I,$A354,Data!S:S)=0,#N/A,SUMIF(Data!$I:$I,$A354,Data!S:S)),#N/A)","v":{"$error":"#N/A"}},{"$f":"IF(K$6,IF(SUMIF(Data!$I:$I,$A354,Data!T:T)=0,#N/A,SUMIF(Data!$I:$I,$A354,Data!T:T)),#N/A)","v":{"$error":"#N/A"}}]
[{"$error":"#N/A"},{"$f":"IF(B$6,IF(SUMIF(Data!$I:$I,$A355,Data!K:K)=0,#N/A,SUMIF(Data!$I:$I,$A355,Data!K:K)),#N/A)","v":{"$error":"#N/A"}},{"$f":"IF(C$6,IF(SUMIF(Data!$I:$I,$A355,Data!L:L)=0,#N/A,SUMIF(Data!$I:$I,$A355,Data!L:L)),#N/A)","v":{"$error":"#N/A"}},{"$f":"IF(D$6,IF(SUMIF(Data!$I:$I,$A355,Data!M:M)=0,#N/A,SUMIF(Data!$I:$I,$A355,Data!M:M)),#N/A)","v":{"$error":"#N/A"}},{"$f":"IF(E$6,IF(SUMIF(Data!$I:$I,$A355,Data!N:N)=0,#N/A,SUMIF(Data!$I:$I,$A355,Data!N:N)),#N/A)","v":{"$error":"#N/A"}},{"$f":"IF(F$6,IF(SUMIF(Data!$I:$I,$A355,Data!O:O)=0,#N/A,SUMIF(Data!$I:$I,$A355,Data!O:O)),#N/A)","v":{"$error":"#N/A"}},{"$f":"IF(G$6,IF(SUMIF(Data!$I:$I,$A355,Data!P:P)=0,#N/A,SUMIF(Data!$I:$I,$A355,Data!P:P)),#N/A)","v":{"$error":"#N/A"}},{"$f":"IF(H$6,IF(SUMIF(Data!$I:$I,$A355,Data!Q:Q)=0,#N/A,SUMIF(Data!$I:$I,$A355,Data!Q:Q)),#N/A)","v":{"$error":"#N/A"}},{"$f":"IF(I$6,IF(SUMIF(Data!$I:$I,$A355,Data!R:R)=0,#N/A,SUMIF(Data!$I:$I,$A355,Data!R:R)),#N/A)","v":{"$error":"#N/A"}},{"$f":"IF(J$6,IF(SUMIF(Data!$I:$I,$A355,Data!S:S)=0,#N/A,SUMIF(Data!$I:$I,$A355,Data!S:S)),#N/A)","v":{"$error":"#N/A"}},{"$f":"IF(K$6,IF(SUMIF(Data!$I:$I,$A355,Data!T:T)=0,#N/A,SUMIF(Data!$I:$I,$A355,Data!T:T)),#N/A)","v":{"$error":"#N/A"}}]
[{"$error":"#N/A"},{"$f":"IF(B$6,IF(SUMIF(Data!$I:$I,$A356,Data!K:K)=0,#N/A,SUMIF(Data!$I:$I,$A356,Data!K:K)),#N/A)","v":{"$error":"#N/A"}},{"$f":"IF(C$6,IF(SUMIF(Data!$I:$I,$A356,Data!L:L)=0,#N/A,SUMIF(Data!$I:$I,$A356,Data!L:L)),#N/A)","v":{"$error":"#N/A"}},{"$f":"IF(D$6,IF(SUMIF(Data!$I:$I,$A356,Data!M:M)=0,#N/A,SUMIF(Data!$I:$I,$A356,Data!M:M)),#N/A)","v":{"$error":"#N/A"}},{"$f":"IF(E$6,IF(SUMIF(Data!$I:$I,$A356,Data!N:N)=0,#N/A,SUMIF(Data!$I:$I,$A356,Data!N:N)),#N/A)","v":{"$error":"#N/A"}},{"$f":"IF(F$6,IF(SUMIF(Data!$I:$I,$A356,Data!O:O)=0,#N/A,SUMIF(Data!$I:$I,$A356,Data!O:O)),#N/A)","v":{"$error":"#N/A"}},{"$f":"IF(G$6,IF(SUMIF(Data!$I:$I,$A356,Data!P:P)=0,#N/A,SUMIF(Data!$I:$I,$A356,Data!P:P)),#N/A)","v":{"$error":"#N/A"}},{"$f":"IF(H$6,IF(SUMIF(Data!$I:$I,$A356,Data!Q:Q)=0,#N/A,SUMIF(Data!$I:$I,$A356,Data!Q:Q)),#N/A)","v":{"$error":"#N/A"}},{"$f":"IF(I$6,IF(SUMIF(Data!$I:$I,$A356,Data!R:R)=0,#N/A,SUMIF(Data!$I:$I,$A356,Data!R:R)),#N/A)","v":{"$error":"#N/A"}},{"$f":"IF(J$6,IF(SUMIF(Data!$I:$I,$A356,Data!S:S)=0,#N/A,SUMIF(Data!$I:$I,$A356,Data!S:S)),#N/A)","v":{"$error":"#N/A"}},{"$f":"IF(K$6,IF(SUMIF(Data!$I:$I,$A356,Data!T:T)=0,#N/A,SUMIF(Data!$I:$I,$A356,Data!T:T)),#N/A)","v":{"$error":"#N/A"}}]
[{"$error":"#N/A"},{"$f":"IF(B$6,IF(SUMIF(Data!$I:$I,$A357,Data!K:K)=0,#N/A,SUMIF(Data!$I:$I,$A357,Data!K:K)),#N/A)","v":{"$error":"#N/A"}},{"$f":"IF(C$6,IF(SUMIF(Data!$I:$I,$A357,Data!L:L)=0,#N/A,SUMIF(Data!$I:$I,$A357,Data!L:L)),#N/A)","v":{"$error":"#N/A"}},{"$f":"IF(D$6,IF(SUMIF(Data!$I:$I,$A357,Data!M:M)=0,#N/A,SUMIF(Data!$I:$I,$A357,Data!M:M)),#N/A)","v":{"$error":"#N/A"}},{"$f":"IF(E$6,IF(SUMIF(Data!$I:$I,$A357,Data!N:N)=0,#N/A,SUMIF(Data!$I:$I,$A357,Data!N:N)),#N/A)","v":{"$error":"#N/A"}},{"$f":"IF(F$6,IF(SUMIF(Data!$I:$I,$A357,Data!O:O)=0,#N/A,SUMIF(Data!$I:$I,$A357,Data!O:O)),#N/A)","v":{"$error":"#N/A"}},{"$f":"IF(G$6,IF(SUMIF(Data!$I:$I,$A357,Data!P:P)=0,#N/A,SUMIF(Data!$I:$I,$A357,Data!P:P)),#N/A)","v":{"$error":"#N/A"}},{"$f":"IF(H$6,IF(SUMIF(Data!$I:$I,$A357,Data!Q:Q)=0,#N/A,SUMIF(Data!$I:$I,$A357,Data!Q:Q)),#N/A)","v":{"$error":"#N/A"}},{"$f":"IF(I$6,IF(SUMIF(Data!$I:$I,$A357,Data!R:R)=0,#N/A,SUMIF(Data!$I:$I,$A357,Data!R:R)),#N/A)","v":{"$error":"#N/A"}},{"$f":"IF(J$6,IF(SUMIF(Data!$I:$I,$A357,Data!S:S)=0,#N/A,SUMIF(Data!$I:$I,$A357,Data!S:S)),#N/A)","v":{"$error":"#N/A"}},{"$f":"IF(K$6,IF(SUMIF(Data!$I:$I,$A357,Data!T:T)=0,#N/A,SUMIF(Data!$I:$I,$A357,Data!T:T)),#N/A)","v":{"$error":"#N/A"}}]
[{"$error":"#N/A"},{"$f":"IF(B$6,IF(SUMIF(Data!$I:$I,$A358,Data!K:K)=0,#N/A,SUMIF(Data!$I:$I,$A358,Data!K:K)),#N/A)","v":{"$error":"#N/A"}},{"$f":"IF(C$6,IF(SUMIF(Data!$I:$I,$A358,Data!L:L)=0,#N/A,SUMIF(Data!$I:$I,$A358,Data!L:L)),#N/A)","v":{"$error":"#N/A"}},{"$f":"IF(D$6,IF(SUMIF(Data!$I:$I,$A358,Data!M:M)=0,#N/A,SUMIF(Data!$I:$I,$A358,Data!M:M)),#N/A)","v":{"$error":"#N/A"}},{"$f":"IF(E$6,IF(SUMIF(Data!$I:$I,$A358,Data!N:N)=0,#N/A,SUMIF(Data!$I:$I,$A358,Data!N:N)),#N/A)","v":{"$error":"#N/A"}},{"$f":"IF(F$6,IF(SUMIF(Data!$I:$I,$A358,Data!O:O)=0,#N/A,SUMIF(Data!$I:$I,$A358,Data!O:O)),#N/A)","v":{"$error":"#N/A"}},{"$f":"IF(G$6,IF(SUMIF(Data!$I:$I,$A358,Data!P:P)=0,#N/A,SUMIF(Data!$I:$I,$A358,Data!P:P)),#N/A)","v":{"$error":"#N/A"}},{"$f":"IF(H$6,IF(SUMIF(Data!$I:$I,$A358,Data!Q:Q)=0,#N/A,SUMIF(Data!$I:$I,$A358,Data!Q:Q)),#N/A)","v":{"$error":"#N/A"}},{"$f":"IF(I$6,IF(SUMIF(Data!$I:$I,$A358,Data!R:R)=0,#N/A,SUMIF(Data!$I:$I,$A358,Data!R:R)),#N/A)","v":{"$error":"#N/A"}},{"$f":"IF(J$6,IF(SUMIF(Data!$I:$I,$A358,Data!S:S)=0,#N/A,SUMIF(Data!$I:$I,$A358,Data!S:S)),#N/A)","v":{"$error":"#N/A"}},{"$f":"IF(K$6,IF(SUMIF(Data!$I:$I,$A358,Data!T:T)=0,#N/A,SUMIF(Data!$I:$I,$A358,Data!T:T)),#N/A)","v":{"$error":"#N/A"}}]
[{"$error":"#N/A"},{"$f":"IF(B$6,IF(SUMIF(Data!$I:$I,$A359,Data!K:K)=0,#N/A,SUMIF(Data!$I:$I,$A359,Data!K:K)),#N/A)","v":{"$error":"#N/A"}},{"$f":"IF(C$6,IF(SUMIF(Data!$I:$I,$A359,Data!L:L)=0,#N/A,SUMIF(Data!$I:$I,$A359,Data!L:L)),#N/A)","v":{"$error":"#N/A"}},{"$f":"IF(D$6,IF(SUMIF(Data!$I:$I,$A359,Data!M:M)=0,#N/A,SUMIF(Data!$I:$I,$A359,Data!M:M)),#N/A)","v":{"$error":"#N/A"}},{"$f":"IF(E$6,IF(SUMIF(Data!$I:$I,$A359,Data!N:N)=0,#N/A,SUMIF(Data!$I:$I,$A359,Data!N:N)),#N/A)","v":{"$error":"#N/A"}},{"$f":"IF(F$6,IF(SUMIF(Data!$I:$I,$A359,Data!O:O)=0,#N/A,SUMIF(Data!$I:$I,$A359,Data!O:O)),#N/A)","v":{"$error":"#N/A"}},{"$f":"IF(G$6,IF(SUMIF(Data!$I:$I,$A359,Data!P:P)=0,#N/A,SUMIF(Data!$I:$I,$A359,Data!P:P)),#N/A)","v":{"$error":"#N/A"}},{"$f":"IF(H$6,IF(SUMIF(Data!$I:$I,$A359,Data!Q:Q)=0,#N/A,SUMIF(Data!$I:$I,$A359,Data!Q:Q)),#N/A)","v":{"$error":"#N/A"}},{"$f":"IF(I$6,IF(SUMIF(Data!$I:$I,$A359,Data!R:R)=0,#N/A,SUMIF(Data!$I:$I,$A359,Data!R:R)),#N/A)","v":{"$error":"#N/A"}},{"$f":"IF(J$6,IF(SUMIF(Data!$I:$I,$A359,Data!S:S)=0,#N/A,SUMIF(Data!$I:$I,$A359,Data!S:S)),#N/A)","v":{"$error":"#N/A"}},{"$f":"IF(K$6,IF(SUMIF(Data!$I:$I,$A359,Data!T:T)=0,#N/A,SUMIF(Data!$I:$I,$A359,Data!T:T)),#N/A)","v":{"$error":"#N/A"}}]

{"sheet":"System Data","index":8,"n_rows":2,"n_cols":1,"rows_kept":2,"cut":false,"hidden":true,"merged":[]}
["Version"]
[1]

{"sheet":"Discouting","index":9,"n_rows":61,"n_cols":3,"rows_kept":61,"cut":false,"hidden":true,"merged":[]}
["Year","Discount_Factor","Discount Rate"]
[1,1,3.5]
[2,{"$f":"B2*(1+(C3/100))","v":1.0349999999999999},3.5]
[3,{"$f":"B3*(1+(C4/100))","v":1.0712249999999999},3.5]
[4,1.1087178749999997,3.5]
[5,1.1475230006249997,3.5]
[6,1.1876863056468745,3.5]
[7,1.229255326344515,3.5]
[8,1.2722792627665729,3.5]
[9,1.3168090369634029,3.5]
[10,1.3628973532571218,3.5]
[11,1.410598760621121,3.5]
[12,1.4599697172428601,3.5]
[13,1.5110686573463601,3.5]
[14,1.5639560603534826,3.5]
[15,1.6186945224658542,3.5]
[16,1.6753488307521589,3.5]
[17,1.7339860398284843,3.5]
[18,1.7946755512224812,3.5]
[19,1.8574891955152679,3.5]
[20,1.9225013173583021,3.5]
[21,1.9897888634658425,3.5]
[22,2.0594314736871469,3.5]
[23,2.1315115752661966,3.5]
[24,2.2061144804005135,3.5]
[25,2.2833284872145314,3.5]
[26,2.3632449842670398,3.5]
[27,2.4459585587163861,3.5]
[28,2.5315671082714593,3.5]
[29,2.6201719570609603,3.5]
[30,2.7118779755580937,3.5]
[31,2.7932343148248364,3]
[32,2.8770313442695814,3]
[33,2.9633422845976689,3]
[34,3.0522425531355992,3]
[35,3.1438098297296673,3]
[36,3.2381241246215575,3]
[37,3.3352678483602043,3]
[38,3.4353258838110103,3]
[39,3.5383856603253405,3]
[40,3.6445372301351009,3]
[41,3.7538733470391539,3]
[42,3.8664895474503287,3]
[43,3.9824842338738389,3]
[44,4.1019587608900538,3]
[45,4.2250175237167555,3]
[46,4.3517680494282587,3]
[47,4.4823210909111069,3]
[48,4.6167907236384398,3]
[49,4.7552944453475927,3]
[50,4.8979532787080204,3]
[51,5.0448918770692615,3]
[52,5.1962386333813395,3]
[53,5.3521257923827799,3]
[54,5.512689566154263,3]
[55,5.6780702531388911,3]
[56,5.8484123607330583,3]
[57,6.02386473155505,3]
[58,6.2045806735017015,3]
[59,6.3907180937067531,3]
[60,6.5824396365179556,3]