{"text_format":"1","workbook":"xlsx","n_sheets":10,"sheets":["Viewer","Statistics","Quantitative","Qualitative","Data","Graph","Error Report","GraphData","System Data","Discouting"],"not_rendered":{"charts":1,"images":0,"macros":1,"external_links":1,"defined_names":10,"comments":0,"pivot_tables":0},"unopened":[],"bounds":{"document_bytes":16777216,"sheet_cells":100000,"rows_first":2000,"rows_last":500,"rows_between":2000,"halvings":0,"cell_chars":16384,"cell_head_chars":4096},"cells_cut":0,"cells_raw":0,"read":"whole","date_system":"1900"}

{"sheet":"Viewer","index":0,"n_rows":19,"n_cols":6,"rows_kept":19,"cut":false,"hidden":false,"merged":[[18,5,18,9],[1,2,3,10],[14,5,14,9],[15,5,15,9],[16,5,16,9],[17,5,17,9]]}
[]
[null,null,"Multiple Scenarios Reviewer"]
[]
[]
[]
[]
[]
[]
[]
[]
[]
[]
[]
[]
[null,null,null,"Version","Date","Description"]
{"$rows_left_out":5}
{"sheet":"Statistics","index":1,"n_rows":3,"n_cols":12,"rows_kept":3,"cut":false,"hidden":false,"merged":[[2,11,3,11],[2,6,3,6],[2,7,3,7],[2,8,3,8],[2,9,3,9],[2,10,3,10],[2,1,3,1],[2,2,3,2],[2,3,3,3],[2,4,3,4],[2,5,3,5]]}
[]
[]
[null,"Check","Workbook Number","Workbook Name","Start Year","Analysis Period","Number of Condition Bands","Number of Asset Groups","Number of Treatment Types","Number of Stategies","Number of Budgets","Number of Targets"]

{"sheet":"Quantitative","index":2,"n_rows":61,"n_cols":32,"rows_kept":61,"cut":false,"hidden":false,"merged":[[22,1,22,29],[23,1,23,29],[27,1,27,29],[31,1,31,29],[54,1,54,31],[34,1,34,29],[39,1,39,29],[38,1,38,29],[49,1,49,31],[43,1,43,29],[44,1,44,29],[46,1,46,29],[13,1,13,29],[6,1,6,29],[3,1,5,1],[3,2,4,2],[3,5,4,5],[3,8,4,8],[3,11,4,11],[3,14,4,14],[3,17,4,17],[3,20,4,20],[3,23,4,23],[3,26,4,26],[3,29,4,29]]}
[null,null,null,null,null,null,null,null,"Discounted",null,null,"Undiscounted"]
[null,null,"Cost Basis:",null,null,"Discounted",null,null,"Undiscounted"]
[]
[null,null,"Scenario",null,null,"Scenario",null,null,"Scenario",null,null,"Scenario",null,null,"Scenario",null,null,"Scenario",null,null,"Scenario",null,null,"Scenario",null,null,"Scenario",null,null,"Scenario"]
[null,null,null,"Disc","Undisc",null,"Disc","Undisc",null,"Disc","Undisc",null,"Disc","Undisc",null,"Disc","Undisc",null,"Disc","Undisc",null,"Disc","Undisc",null,"Disc","Undisc",null,"Disc","Undisc",null,"Disc","Undisc"]
[null,null,"#1. Scenario",{"$f":"IF(SUM(D8:D11,D15:D20,D25:D27,D29:D31,D33:D34,D36:D37,D41:D42)>0, 1, 0)","v":0},{"$f":"IF(SUM(E8:E11,E15:E20,E25:E27,E29:E31,E33:E34,E36:E37,E41:E42)>0, 1, 0)","v":0},"#2. Scenario",{"$f":"IF(SUM(G8:G11,G15:G20,G25:G27,G29:G31,G33:G34,G36:G37,G41:G42)>0, 1, 0)","v":0},{"$f":"IF(SUM(H8:H11,H15:H20,H25:H27,H29:H31,H33:H34,H36:H37,H41:H42)>0, 1, 0)","v":0},"#3. Scenario",{"$f":"IF(SUM(J8:J11,J15:J20,J25:J27,J29:J31,J33:J34,J36:J37,J41:J42)>0, 1, 0)","v":0},{"$f":"IF(SUM(K8:K11,K15:K20,K25:K27,K29:K31,K33:K34,K36:K37,K41:K42)>0, 1, 0)","v":0},"#4. Scenario",{"$f":"IF(SUM(M8:M11,M15:M20,M25:M27,M29:M31,M33:M34,M36:M37,M41:M42)>0, 1, 0)","v":0},{"$f":"IF(SUM(N8:N11,N15:N20,N25:N27,N29:N31,N33:N34,N36:N37,N41:N42)>0, 1, 0)","v":0},"#5. Scenario",{"$f":"IF(SUM(P8:P11,P15:P20,P25:P27,P29:P31,P33:P34,P36:P37,P41:P42)>0, 1, 0)","v":0},{"$f":"IF(SUM(Q8:Q11,Q15:Q20,Q25:Q27,Q29:Q31,Q33:Q34,Q36:Q37,Q41:Q42)>0, 1, 0)","v":0},"#6. Scenario",{"$f":"IF(SUM(S8:S11,S15:S20,S25:S27,S29:S31,S33:S34,S36:S37,S41:S42)>0, 1, 0)","v":0},{"$f":"IF(SUM(T8:T11,T15:T20,T25:T27,T29:T31,T33:T34,T36:T37,T41:T42)>0, 1, 0)","v":0},"#7. Scenario",{"$f":"IF(SUM(V8:V11,V15:V20,V25:V27,V29:V31,V33:V34,V36:V37,V41:V42)>0, 1, 0)","v":0},{"$f":"IF(SUM(W8:W11,W15:W20,W25:W27,W29:W31,W33:W34,W36:W37,W41:W42)>0, 1, 0)","v":0},"#8. Scenario",{"$f":"IF(SUM(Y8:Y11,Y15:Y20,Y25:Y27,Y29:Y31,Y33:Y34,Y36:Y37,Y41:Y42)>0, 1, 0)","v":0},{"$f":"IF(SUM(Z8:Z11,Z15:Z20,Z25:Z27,Z29:Z31,Z33:Z34,Z36:Z37,Z41:Z42)>0, 1, 0)","v":0},"#9. Scenario",{"$f":"IF(SUM(AB8:AB11,AB15:AB20,AB25:AB27,AB29:AB31,AB33:AB34,AB36:AB37,AB41:AB42)>0, 1, 0)","v":0},{"$f":"IF(SUM(AC8:AC11,AC15:AC20,AC25:AC27,AC29:AC31,AC33:AC34,AC36:AC37,AC41:AC42)>0, 1, 0)","v":0},"#10. Scenario",{"$f":"IF(SUM(AE8:AE11,AE15:AE20,AE25:AE27,AE29:AE31,AE33:AE34,AE36:AE37,AE41:AE42)>0, 1, 0)","v":0},{"$f":"IF(SUM(AF8:AF11,AF15:AF20,AF25:AF27,AF29:AF31,AF33:AF34,AF36:AF37,AF41:AF42)>0, 1, 0)","v":0}]
[null,"Direct Costs (Outturn)"]
[null,"Carriageway Output (£k)"]
[null,"Skid (£k)"]
[null,"Lighting (£k)"]
[null,"Other (£k)"]
[null,"Total (Outturn) Direct Costs (£k)"]
[]
[null,"Direct Costs (Allocated) categorised by maintenance drivers"]
[null,"Safety (£k)"]
{"$rows_left_out":47}
{"sheet":"Qualitative","index":3,"n_rows":35,"n_cols":5,"rows_kept":35,"cut":false,"hidden":false,"merged":[[41,2,41,3],[10,1,10,2],[11,1,14,1],[6,1,6,2],[8,1,8,2],[36,2,36,3],[37,2,37,3],[38,2,38,3],[39,2,39,3],[40,2,40,3],[1,1,1,2],[35,0,35,5],[0,5,34,5],[0,0,34,0],[15,1,22,1],[23,1,32,1],[33,1,34,1]]}
[]
[null,"Contact:"]
[null,"Name:"]
[null,"Organisation:"]
[null,"Role:"]
[null,"Date:"]
[null,"Name of base scenario:"]
[null,"ID:","Current Budget 60yrs"]
[null,"Description of scenarios:",null,"This commentary provides qualitative discussion around Scenario 1 ('current budget'), Scenario 3 (10% increase years 1 to 10, same total spend) and Scenario 4 (20% increase years 1 to 10, same total spend). N.B. These are example comments as setup requires further refinement and calibration before conclusions can be drawn."]
[]
[null,"Impacts",null,"Summary of key impacts","Advice Notes"]
[null,"Economy","Business users & transport providers","Scenario 4 has lowest costs for value of time and condition impacts, which are borne as costs by business users and transport providers.  ","Use value of time changes to inform impact."]
[null,null,"Reliability impact on Business users","Scenario 4 causes most disruption due to road works (shown in road works impact time values) but this small compared with the value of time savings generated by improved road conditions.  Also, the increased investment overall (as reflected by the increased allocation in particular for relaibility, accessibility and customer service drivers) will result in increased investment in activities such as bridge maintenance or drainage (effects not quantified) and therefore reduce the risk of disruption due to extreme weather of unforseen structural failures.","If there is a reduction in the value of time it can be used as a proxy for an improvement in the reliability of the route."]
[null,null,"Regeneration","Regeneration is not considered applicable in terms of variation under these budget scenarios.","Only considered if within one or more regenration areas. More applicable for localised analyses rather than national."]
[null,null,"Wider Impacts","(Statements as exampled above could be made for each qualitative criteria once an analyst is satisfied the results are ready for reporting).","Use comparison of total indirect costs to inform impact."]
{"$rows_left_out":21}
{"sheet":"Data","index":4,"n_rows":2,"n_cols":20,"rows_kept":2,"cut":false,"hidden":true,"merged":[]}
["Workbook #","Workbook Name","Module","Scheme Name","type","value title","value","units","year","(undiscounted value)",1,2,3,4,5,6,7,8,9,10]
[null,null,null,null,null,null,null,null,null,null,{"$f":"IF(AND($A2=GraphData!B$7,$C2=GraphData!$O$6,$F2=GraphData!$O$7,Quantitative!$F$2=\"Undiscounted\",LEFT($H2,1)<>\"£\"),$G2,IF(AND($A2=GraphData!B$7,$C2=GraphData!$O$6,$F2=GraphData!$O$7,Quantitative!$F$2=\"Discounted\"),$G2,IF(AND($A2=GraphData!B$7,$C2=GraphData!$O$6,$F2=GraphData!$O$7,Quantitative!$F$2=\"Undiscounted\",LEFT($H2,1)=\"£\"),$J2,0)))","v":0},{"$f":"IF(AND($A2=GraphData!C$7,$C2=GraphData!$O$6,$F2=GraphData!$O$7,Quantitative!$F$2=\"Undiscounted\",LEFT($H2,1)<>\"£\"),$G2,IF(AND($A2=GraphData!C$7,$C2=GraphData!$O$6,$F2=GraphData!$O$7,Quantitative!$F$2=\"Discounted\"),$G2,IF(AND($A2=GraphData!C$7,$C2=GraphData!$O$6,$F2=GraphData!$O$7,Quantitative!$F$2=\"Undiscounted\",LEFT($H2,1)=\"£\"),$J2,0)))","v":0},{"$f":"IF(AND($A2=GraphData!D$7,$C2=GraphData!$O$6,$F2=GraphData!$O$7,Quantitative!$F$2=\"Undiscounted\",LEFT($H2,1)<>\"£\"),$G2,IF(AND($A2=GraphData!D$7,$C2=GraphData!$O$6,$F2=GraphData!$O$7,Quantitative!$F$2=\"Discounted\"),$G2,IF(AND($A2=GraphData!D$7,$C2=GraphData!$O$6,$F2=GraphData!$O$7,Quantitative!$F$2=\"Undiscounted\",LEFT($H2,1)=\"£\"),$J2,0)))","v":0},{"$f":"IF(AND($A2=GraphData!E$7,$C2=GraphData!$O$6,$F2=GraphData!$O$7,Quantitative!$F$2=\"Undiscounted\",LEFT($H2,1)<>\"£\"),$G2,IF(AND($A2=GraphData!E$7,$C2=GraphData!$O$6,$F2=GraphData!$O$7,Quantitative!$F$2=\"Discounted\"),$G2,IF(AND($A2=GraphData!E$7,$C2=GraphData!$O$6,$F2=GraphData!$O$7,Quantitative!$F$2=\"Undiscounted\",LEFT($H2,1)=\"£\"),$J2,0)))","v":0},{"$f":"IF(AND($A2=GraphData!F$7,$C2=GraphData!$O$6,$F2=GraphData!$O$7,Quantitative!$F$2=\"Undiscounted\",LEFT($H2,1)<>\"£\"),$G2,IF(AND($A2=GraphData!F$7,$C2=GraphData!$O$6,$F2=GraphData!$O$7,Quantitative!$F$2=\"Discounted\"),$G2,IF(AND($A2=GraphData!F$7,$C2=GraphData!$O$6,$F2=GraphData!$O$7,Quantitative!$F$2=\"Undiscounted\",LEFT($H2,1)=\"£\"),$J2,0)))","v":0},{"$f":"IF(AND($A2=GraphData!G$7,$C2=GraphData!$O$6,$F2=GraphData!$O$7,Quantitative!$F$2=\"Undiscounted\",LEFT($H2,1)<>\"£\"),$G2,IF(AND($A2=GraphData!G$7,$C2=GraphData!$O$6,$F2=GraphData!$O$7,Quantitative!$F$2=\"Discounted\"),$G2,IF(AND($A2=GraphData!G$7,$C2=GraphData!$O$6,$F2=GraphData!$O$7,Quantitative!$F$2=\"Undiscounted\",LEFT($H2,1)=\"£\"),$J2,0)))","v":0},{"$f":"IF(AND($A2=GraphData!H$7,$C2=GraphData!$O$6,$F2=GraphData!$O$7,Quantitative!$F$2=\"Undiscounted\",LEFT($H2,1)<>\"£\"),$G2,IF(AND($A2=GraphData!H$7,$C2=GraphData!$O$6,$F2=GraphData!$O$7,Quantitative!$F$2=\"Discounted\"),$G2,IF(AND($A2=GraphData!H$7,$C2=GraphData!$O$6,$F2=GraphData!$O$7,Quantitative!$F$2=\"Undiscounted\",LEFT($H2,1)=\"£\"),$J2,0)))","v":0},{"$f":"IF(AND($A2=GraphData!I$7,$C2=GraphData!$O$6,$F2=GraphData!$O$7,Quantitative!$F$2=\"Undiscounted\",LEFT($H2,1)<>\"£\"),$G2,IF(AND($A2=GraphData!I$7,$C2=GraphData!$O$6,$F2=GraphData!$O$7,Quantitative!$F$2=\"Discounted\"),$G2,IF(AND($A2=GraphData!I$7,$C2=GraphData!$O$6,$F2=GraphData!$O$7,Quantitative!$F$2=\"Undiscounted\",LEFT($H2,1)=\"£\"),$J2,0)))","v":0},{"$f":"IF(AND($A2=GraphData!J$7,$C2=GraphData!$O$6,$F2=GraphData!$O$7,Quantitative!$F$2=\"Undiscounted\",LEFT($H2,1)<>\"£\"),$G2,IF(AND($A2=GraphData!J$7,$C2=GraphData!$O$6,$F2=GraphData!$O$7,Quantitative!$F$2=\"Discounted\"),$G2,IF(AND($A2=GraphData!J$7,$C2=GraphData!$O$6,$F2=GraphData!$O$7,Quantitative!$F$2=\"Undiscounted\",LEFT($H2,1)=\"£\"),$J2,0)))","v":0},{"$f":"IF(AND($A2=GraphData!K$7,$C2=GraphData!$O$6,$F2=GraphData!$O$7,Quantitative!$F$2=\"Undiscounted\",LEFT($H2,1)<>\"£\"),$G2,IF(AND($A2=GraphData!K$7,$C2=GraphData!$O$6,$F2=GraphData!$O$7,Quantitative!$F$2=\"Discounted\"),$G2,IF(AND($A2=GraphData!K$7,$C2=GraphData!$O$6,$F2=GraphData!$O$7,Quantitative!$F$2=\"Undiscounted\",LEFT($H2,1)=\"£\"),$J2,0)))","v":0}]

{"sheet":"Graph","index":5,"n_rows":17,"n_cols":14,"rows_kept":17,"cut":false,"hidden":false,"merged":[]}
[]
[null,null,null,null,null,null,null,null,null,null,null,null,null,"Cost Basis: Discounted"]
[]
[]
[]
[]
[]
[null,null,null,null,null,null,null,null,null,null,null,null,null,{"$f":"GraphData!B8","v":" 1."}]
[null,null,null,null,null,null,null,null,null,null,null,null,null,{"$f":"GraphData!C8","v":" 2."}]
[null,null,null,null,null,null,null,null,null,null,null,null,null,{"$f":"GraphData!D8","v":" 3."}]
[null,null,null,null,null,null,null,null,null,null,null,null,null,{"$f":"GraphData!E8","v":" 4."}]
[null,null,null,null,null,null,null,null,null,null,null,null,null,{"$f":"GraphData!F8","v":" 5."}]
[null,null,null,null,null,null,null,null,null,null,null,null,null,{"$f":"GraphData!G8","v":" 6."}]
[null,null,null,null,null,null,null,null,null,null,null,null,null,{"$f":"GraphData!H8","v":" 7."}]
[null,null,null,null,null,null,null,null,null,null,null,null,null,{"$f":"GraphData!I8","v":" 8."}]
{"$rows_left_out":3}
{"sheet":"Error Report","index":6,"n_rows":1,"n_cols":6,"rows_kept":1,"cut":false,"hidden":false,"merged":[]}
["Workbook","Module","Location","Scheme","Error","Reason"]

{"sheet":"GraphData","index":7,"n_rows":359,"n_cols":27,"rows_kept":359,"cut":false,"hidden":true,"merged":[[16,20,16,27]]}
[null,null,null,null,null,null,null,null,null,null,null,null,null,"1st Selection",6,"Count","Yaxis count"]
["Min",{"$f":"MIN(Data!I:I)","v":0},null,null,null,null,null,null,null,null,null,null,null,"2nd Selection",1,{"$f":"COUNTA(O11:O18)-COUNTIF(O11:O18,\"\")","v":3},{"$f":"COUNTA(P11:P18)-COUNTIF(P11:P18,\"\")","v":3}]
["Max",{"$f":"MAX(Data!I:I)","v":0},null,null,null,null,null,null,null,null,null,null,null,"1st title",{"$f":"INDEX(N11:N18,O1)","v":"Budgets"}]
[null,{"$f":"SUMIFS(Data!$G:$G,Data!$A:$A,B$7,Data!$C:$C,$O$6,Data!$F:$F,$O$7,Data!$I:$I,$A10)","v":0},null,null,null,null,null,null,null,null,null,null,null,"2nd Title",{"$f":"INDEX(O11:O18,O2)","v":"Carriageway output "}]
[null,{"$f":"SUMPRODUCT((Data!$A:$A=B$7)*(Data!$C:$C=$O$6)*(Data!$F:$F=$O$7)*(Data!$I:$I=$A10)*(Data!$G:$G))","v":{"$error":"#VALUE!"}},{"$f":"SUM(IF(Data!$A:$A=B$7,IF(Data!$C:$C=$O$6,IF(Data!$F:$F=$O$7,IF(Data!$I:$I=$A10,Data!$G:$G,0)))))","v":0},null,null,null,null,null,null,null,null,null,null,"Selection in lookup table",{"$f":"INDEX(T35:V64,MATCH(1,(U35:U64=O3)*(V35:V64=O4),0),1)","v":20},"<- array formula"]
[null,true,true,true,true,true,true,true,true,true,true,null,null,"Module",{"$f":"INDEX(W35:W64,O5)","v":"Expenditure by Treatment"}]
[null,1,2,3,4,5,6,7,8,9,10,null,null,"value title",{"$f":"INDEX(X35:X64,O5)","v":"Treatment Costs"},null,null,null,null,null,"Job Impacts","Accident Analysis","Road Works","Road condition","Carbon","Budgets","Drivers"]
[null,{"$f":"IF(B7<10,\" \",\"\") & B7 & \".\" & IFERROR(VLOOKUP(B7,Data!$A:$I,4,FALSE),\"\")","v":" 1."},{"$f":"IF(C7<10,\" \",\"\") & C7 & \".\" & IFERROR(VLOOKUP(C7,Data!$A:$I,4,FALSE),\"\")","v":" 2."},{"$f":"IF(D7<10,\" \",\"\") & D7 & \".\" & IFERROR(VLOOKUP(D7,Data!$A:$I,4,FALSE),\"\")","v":" 3."},{"$f":"IF(E7<10,\" \",\"\") & E7 & \".\" & IFERROR(VLOOKUP(E7,Data!$A:$I,4,FALSE),\"\")","v":" 4."},{"$f":"IF(F7<10,\" \",\"\") & F7 & \".\" & IFERROR(VLOOKUP(F7,Data!$A:$I,4,FALSE),\"\")","v":" 5."},{"$f":"IF(G7<10,\" \",\"\") & G7 & \".\" & IFERROR(VLOOKUP(G7,Data!$A:$I,4,FALSE),\"\")","v":" 6."},{"$f":"IF(H7<10,\" \",\"\") & H7 & \".\" & IFERROR(VLOOKUP(H7,Data!$A:$I,4,FALSE),\"\")","v":" 7."},{"$f":"IF(I7<10,\" \",\"\") & I7 & \".\" & IFERROR(VLOOKUP(I7,Data!$A:$I,4,FALSE),\"\")","v":" 8."},{"$f":"IF(J7<10,\" \",\"\") & J7 & \".\" & IFERROR(VLOOKUP(J7,Data!$A:$I,4,FALSE),\"\")","v":" 9."},{"$f":"IF(K7<10,\" \",\"\") & K7 & \".\" & IFERROR(VLOOKUP(K7,Data!$A:$I,4,FALSE),\"\")","v":"10."},null,null,"Yaxis",{"$f":"INDEX(P11:P18,O2)","v":"£"},null,null,null,null,null,"Jobs","Accident Count","Accidents","VOC","Quantity","Carriageway output ","Safety"]
["Year",null,null,null,null,null,null,null,null,null,null,null,null,null,null,null,null,null,null,null,"GVA","Total Accident costs","Time","Value of Time","Cost","Lighting","Accessibility"]
[{"$f":"MIN(Data!I:I)","v":0},{"$f":"IF(B$6,IF(SUMIF(Data!$I:$I,$A10,Data!K:K)=0,#N/A,SUMIF(Data!$I:$I,$A10,Data!K:K)),#N/A)","v":{"$error":"#N/A"}},{"$f":"IF(C$6,IF(SUMIF(Data!$I:$I,$A10,Data!L:L)=0,#N/A,SUMIF(Data!$I:$I,$A10,Data!L:L)),#N/A)","v":{"$error":"#N/A"}},{"$f":"IF(D$6,IF(SUMIF(Data!$I:$I,$A10,Data!M:M)=0,#N/A,SUMIF(Data!$I:$I,$A10,Data!M:M)),#N/A)","v":{"$error":"#N/A"}},{"$f":"IF(E$6,IF(SUMIF(Data!$I:$I,$A10,Data!N:N)=0,#N/A,SUMIF(Data!$I:$I,$A10,Data!N:N)),#N/A)","v":{"$error":"#N/A"}},{"$f":"IF(F$6,IF(SUMIF(Data!$I:$I,$A10,Data!O:O)=0,#N/A,SUMIF(Data!$I:$I,$A10,Data!O:O)),#N/A)","v":{"$error":"#N/A"}},{"$f":"IF(G$6,IF(SUMIF(Data!$I:$I,$A10,Data!P:P)=0,#N/A,SUMIF(Data!$I:$I,$A10,Data!P:P)),#N/A)","v":{"$error":"#N/A"}},{"$f":"IF(H$6,IF(SUMIF(Data!$I:$I,$A10,Data!Q:Q)=0,#N/A,SUMIF(Data!$I:$I,$A10,Data!Q:Q)),#N/A)","v":{"$error":"#N/A"}},{"$f":"IF(I$6,IF(SUMIF(Data!$I:$I,$A10,Data!R:R)=0,#N/A,SUMIF(Data!$I:$I,$A10,Data!R:R)),#N/A)","v":{"$error":"#N/A"}},{"$f":"IF(J$6,IF(SUMIF(Data!$I:$I,$A10,Data!S:S)=0,#N/A,SUMIF(Data!$I:$I,$A10,Data!S:S)),#N/A)","v":{"$error":"#N/A"}},{"$f":"IF(K$6,IF(SUMIF(Data!$I:$I,$A10,Data!T:T)=0,#N/A,SUMIF(Data!$I:$I,$A10,Data!T:T)),#N/A)","v":{"$error":"#N/A"}},null,null,"1st Selection","2nd Selection","Yaxis","Module","Value title",null,null,null,null,"Carbon (from fuel)","Carbon (from fuel)",null,"Skid","Condition"]
[{"$f":"IF(A10+1<$B$3,A10+1,#N/A)","v":{"$error":"#N/A"}},{"$f":"IF(B$6,IF(SUMIF(Data!$I:$I,$A11,Data!K:K)=0,#N/A,SUMIF(Data!$I:$I,$A11,Data!K:K)),#N/A)","v":{"$error":"#N/A"}},{"$f":"IF(C$6,IF(SUMIF(Data!$I:$I,$A11,Data!L:L)=0,#N/A,SUMIF(Data!$I:$I,$A11,Data!L:L)),#N/A)","v":{"$error":"#N/A"}},{"$f":"IF(D$6,IF(SUMIF(Data!$I:$I,$A11,Data!M:M)=0,#N/A,SUMIF(Data!$I:$I,$A11,Data!M:M)),#N/A)","v":{"$error":"#N/A"}},{"$f":"IF(E$6,IF(SUMIF(Data!$I:$I,$A11,Data!N:N)=0,#N/A,SUMIF(Data!$I:$I,$A11,Data!N:N)),#N/A)","v":{"$error":"#N/A"}},{"$f":"IF(F$6,IF(SUMIF(Data!$I:$I,$A11,Data!O:O)=0,#N/A,SUMIF(Data!$I:$I,$A11,Data!O:O)),#N/A)","v":{"$error":"#N/A"}},{"$f":"IF(G$6,IF(SUMIF(Data!$I:$I,$A11,Data!P:P)=0,#N/A,SUMIF(Data!$I:$I,$A11,Data!P:P)),#N/A)","v":{"$error":"#N/A"}},{"$f":"IF(H$6,IF(SUMIF(Data!$I:$I,$A11,Data!Q:Q)=0,#N/A,SUMIF(Data!$I:$I,$A11,Data!Q:Q)),#N/A)","v":{"$error":"#N/A"}},{"$f":"IF(I$6,IF(SUMIF(Data!$I:$I,$A11,Data!R:R)=0,#N/A,SUMIF(Data!$I:$I,$A11,Data!R:R)),#N/A)","v":{"$error":"#N/A"}},{"$f":"IF(J$6,IF(SUMIF(Data!$I:$I,$A11,Data!S:S)=0,#N/A,SUMIF(Data!$I:$I,$A11,Data!S:S)),#N/A)","v":{"$error":"#N/A"}},{"$f":"IF(K$6,IF(SUMIF(Data!$I:$I,$A11,Data!T:T)=0,#N/A,SUMIF(Data!$I:$I,$A11,Data!T:T)),#N/A)","v":{"$error":"#N/A"}},null,1,"Job Impacts",{"$f":"IF(AND($O$2>$Q$2,M11>$Q$2,M11<=$O$2),\"Please reselect\",IF(OFFSET(T8,0,$O$1)=\"\",\"\",OFFSET(T8,0,$O$1)))","v":"Carriageway output "},{"$f":"IF(OFFSET(T19,0,$O$1)=\"\",\"\",OFFSET(T19,0,$O$1))","v":"£"},"Job Impacts Module",null,null,null,null,null,null,null,null,null,"Reliability"]
[{"$error":"#N/A"},{"$f":"IF(B$6,IF(SUMIF(Data!$I:$I,$A12,Data!K:K)=0,#N/A,SUMIF(Data!$I:$I,$A12,Data!K:K)),#N/A)","v":{"$error":"#N/A"}},{"$f":"IF(C$6,IF(SUMIF(Data!$I:$I,$A12,Data!L:L)=0,#N/A,SUMIF(Data!$I:$I,$A12,Data!L:L)),#N/A)","v":{"$error":"#N/A"}},{"$f":"IF(D$6,IF(SUMIF(Data!$I:$I,$A12,Data!M:M)=0,#N/A,SUMIF(Data!$I:$I,$A12,Data!M:M)),#N/A)","v":{"$error":"#N/A"}},{"$f":"IF(E$6,IF(SUMIF(Data!$I:$I,$A12,Data!N:N)=0,#N/A,SUMIF(Data!$I:$I,$A12,Data!N:N)),#N/A)","v":{"$error":"#N/A"}},{"$f":"IF(F$6,IF(SUMIF(Data!$I:$I,$A12,Data!O:O)=0,#N/A,SUMIF(Data!$I:$I,$A12,Data!O:O)),#N/A)","v":{"$error":"#N/A"}},{"$f":"IF(G$6,IF(SUMIF(Data!$I:$I,$A12,Data!P:P)=0,#N/A,SUMIF(Data!$I:$I,$A12,Data!P:P)),#N/A)","v":{"$error":"#N/A"}},{"$f":"IF(H$6,IF(SUMIF(Data!$I:$I,$A12,Data!Q:Q)=0,#N/A,SUMIF(Data!$I:$I,$A12,Data!Q:Q)),#N/A)","v":{"$error":"#N/A"}},{"$f":"IF(I$6,IF(SUMIF(Data!$I:$I,$A12,Data!R:R)=0,#N/A,SUMIF(Data!$I:$I,$A12,Data!R:R)),#N/A)","v":{"$error":"#N/A"}},{"$f":"IF(J$6,IF(SUMIF(Data!$I:$I,$A12,Data!S:S)=0,#N/A,SUMIF(Data!$I:$I,$A12,Data!S:S)),#N/A)","v":{"$error":"#N/A"}},{"$f":"IF(K$6,IF(SUMIF(Data!$I:$I,$A12,Data!T:T)=0,#N/A,SUMIF(Data!$I:$I,$A12,Data!T:T)),#N/A)","v":{"$error":"#N/A"}},null,2,"Accident Analysis",{"$f":"IF(AND($O$2>$Q$2,M12>$Q$2,M12<=$O$2),\"Please reselect\",IF(OFFSET(T9,0,$O$1)=\"\",\"\",OFFSET(T9,0,$O$1)))","v":"Lighting"},{"$f":"IF(OFFSET(T20,0,$O$1)=\"\",\"\",OFFSET(T20,0,$O$1))","v":"£k"},"Accident Analysis Module",null,null,null,null,null,null,null,null,null,"Customer Service"]
[{"$error":"#N/A"},{"$f":"IF(B$6,IF(SUMIF(Data!$I:$I,$A13,Data!K:K)=0,#N/A,SUMIF(Data!$I:$I,$A13,Data!K:K)),#N/A)","v":{"$error":"#N/A"}},{"$f":"IF(C$6,IF(SUMIF(Data!$I:$I,$A13,Data!L:L)=0,#N/A,SUMIF(Data!$I:$I,$A13,Data!L:L)),#N/A)","v":{"$error":"#N/A"}},{"$f":"IF(D$6,IF(SUMIF(Data!$I:$I,$A13,Data!M:M)=0,#N/A,SUMIF(Data!$I:$I,$A13,Data!M:M)),#N/A)","v":{"$error":"#N/A"}},{"$f":"IF(E$6,IF(SUMIF(Data!$I:$I,$A13,Data!N:N)=0,#N/A,SUMIF(Data!$I:$I,$A13,Data!N:N)),#N/A)","v":{"$error":"#N/A"}},{"$f":"IF(F$6,IF(SUMIF(Data!$I:$I,$A13,Data!O:O)=0,#N/A,SUMIF(Data!$I:$I,$A13,Data!O:O)),#N/A)","v":{"$error":"#N/A"}},{"$f":"IF(G$6,IF(SUMIF(Data!$I:$I,$A13,Data!P:P)=0,#N/A,SUMIF(Data!$I:$I,$A13,Data!P:P)),#N/A)","v":{"$error":"#N/A"}},{"$f":"IF(H$6,IF(SUMIF(Data!$I:$I,$A13,Data!Q:Q)=0,#N/A,SUMIF(Data!$I:$I,$A13,Data!Q:Q)),#N/A)","v":{"$error":"#N/A"}},{"$f":"IF(I$6,IF(SUMIF(Data!$I:$I,$A13,Data!R:R)=0,#N/A,SUMIF(Data!$I:$I,$A13,Data!R:R)),#N/A)","v":{"$error":"#N/A"}},{"$f":"IF(J$6,IF(SUMIF(Data!$I:$I,$A13,Data!S:S)=0,#N/A,SUMIF(Data!$I:$I,$A13,Data!S:S)),#N/A)","v":{"$error":"#N/A"}},{"$f":"IF(K$6,IF(SUMIF(Data!$I:$I,$A13,Data!T:T)=0,#N/A,SUMIF(Data!$I:$I,$A13,Data!T:T)),#N/A)","v":{"$error":"#N/A"}},null,3,"Road Works",{"$f":"IF(AND($O$2>$Q$2,M13>$Q$2,M13<=$O$2),\"Please reselect\",IF(OFFSET(T10,0,$O$1)=\"\",\"\",OFFSET(T10,0,$O$1)))","v":"Skid"},"£k","Road Works Impacts Accidents",null,null,null,null,null,null,null,null,null,"Environment"]
[{"$error":"#N/A"},{"$f":"IF(B$6,IF(SUMIF(Data!$I:$I,$A14,Data!K:K)=0,#N/A,SUMIF(Data!$I:$I,$A14,Data!K:K)),#N/A)","v":{"$error":"#N/A"}},{"$f":"IF(C$6,IF(SUMIF(Data!$I:$I,$A14,Data!L:L)=0,#N/A,SUMIF(Data!$I:$I,$A14,Data!L:L)),#N/A)","v":{"$error":"#N/A"}},{"$f":"IF(D$6,IF(SUMIF(Data!$I:$I,$A14,Data!M:M)=0,#N/A,SUMIF(Data!$I:$I,$A14,Data!M:M)),#N/A)","v":{"$error":"#N/A"}},{"$f":"IF(E$6,IF(SUMIF(Data!$I:$I,$A14,Data!N:N)=0,#N/A,SUMIF(Data!$I:$I,$A14,Data!N:N)),#N/A)","v":{"$error":"#N/A"}},{"$f":"IF(F$6,IF(SUMIF(Data!$I:$I,$A14,Data!O:O)=0,#N/A,SUMIF(Data!$I:$I,$A14,Data!O:O)),#N/A)","v":{"$error":"#N/A"}},{"$f":"IF(G$6,IF(SUMIF(Data!$I:$I,$A14,Data!P:P)=0,#N/A,SUMIF(Data!$I:$I,$A14,Data!P:P)),#N/A)","v":{"$error":"#N/A"}},{"$f":"IF(H$6,IF(SUMIF(Data!$I:$I,$A14,Data!Q:Q)=0,#N/A,SUMIF(Data!$I:$I,$A14,Data!Q:Q)),#N/A)","v":{"$error":"#N/A"}},{"$f":"IF(I$6,IF(SUMIF(Data!$I:$I,$A14,Data!R:R)=0,#N/A,SUMIF(Data!$I:$I,$A14,Data!R:R)),#N/A)","v":{"$error":"#N/A"}},{"$f":"IF(J$6,IF(SUMIF(Data!$I:$I,$A14,Data!S:S)=0,#N/A,SUMIF(Data!$I:$I,$A14,Data!S:S)),#N/A)","v":{"$error":"#N/A"}},{"$f":"IF(K$6,IF(SUMIF(Data!$I:$I,$A14,Data!T:T)=0,#N/A,SUMIF(Data!$I:$I,$A14,Data!T:T)),#N/A)","v":{"$error":"#N/A"}},null,4,"Road condition",{"$f":"IF(AND($O$2>$Q$2,M14>$Q$2,M14<=$O$2),\"Please reselect\",IF(OFFSET(T11,0,$O$1)=\"\",\"\",OFFSET(T11,0,$O$1)))","v":""},"","Road Works Impacts Time"]
[{"$error":"#N/A"},{"$f":"IF(B$6,IF(SUMIF(Data!$I:$I,$A15,Data!K:K)=0,#N/A,SUMIF(Data!$I:$I,$A15,Data!K:K)),#N/A)","v":{"$error":"#N/A"}},{"$f":"IF(C$6,IF(SUMIF(Data!$I:$I,$A15,Data!L:L)=0,#N/A,SUMIF(Data!$I:$I,$A15,Data!L:L)),#N/A)","v":{"$error":"#N/A"}},{"$f":"IF(D$6,IF(SUMIF(Data!$I:$I,$A15,Data!M:M)=0,#N/A,SUMIF(Data!$I:$I,$A15,Data!M:M)),#N/A)","v":{"$error":"#N/A"}},{"$f":"IF(E$6,IF(SUMIF(Data!$I:$I,$A15,Data!N:N)=0,#N/A,SUMIF(Data!$I:$I,$A15,Data!N:N)),#N/A)","v":{"$error":"#N/A"}},{"$f":"IF(F$6,IF(SUMIF(Data!$I:$I,$A15,Data!O:O)=0,#N/A,SUMIF(Data!$I:$I,$A15,Data!O:O)),#N/A)","v":{"$error":"#N/A"}},{"$f":"IF(G$6,IF(SUMIF(Data!$I:$I,$A15,Data!P:P)=0,#N/A,SUMIF(Data!$I:$I,$A15,Data!P:P)),#N/A)","v":{"$error":"#N/A"}},{"$f":"IF(H$6,IF(SUMIF(Data!$I:$I,$A15,Data!Q:Q)=0,#N/A,SUMIF(Data!$I:$I,$A15,Data!Q:Q)),#N/A)","v":{"$error":"#N/A"}},{"$f":"IF(I$6,IF(SUMIF(Data!$I:$I,$A15,Data!R:R)=0,#N/A,SUMIF(Data!$I:$I,$A15,Data!R:R)),#N/A)","v":{"$error":"#N/A"}},{"$f":"IF(J$6,IF(SUMIF(Data!$I:$I,$A15,Data!S:S)=0,#N/A,SUMIF(Data!$I:$I,$A15,Data!S:S)),#N/A)","v":{"$error":"#N/A"}},{"$f":"IF(K$6,IF(SUMIF(Data!$I:$I,$A15,Data!T:T)=0,#N/A,SUMIF(Data!$I:$I,$A15,Data!T:T)),#N/A)","v":{"$error":"#N/A"}},null,5,"Carbon",{"$f":"IF(AND($O$2>$Q$2,M15>$Q$2,M15<=$O$2),\"Please reselect\",IF(OFFSET(T12,0,$O$1)=\"\",\"\",OFFSET(T12,0,$O$1)))","v":""},"","Carbon Quantity"]
{"$rows_left_out":345}
{"sheet":"System Data","index":8,"n_rows":2,"n_cols":1,"rows_kept":2,"cut":false,"hidden":true,"merged":[]}
["Version"]
[1]

{"sheet":"Discouting","index":9,"n_rows":61,"n_cols":3,"rows_kept":61,"cut":false,"hidden":true,"merged":[]}
["Year","Discount_Factor","Discount Rate"]
[1,1,3.5]
[2,{"$f":"B2*(1+(C3/100))","v":1.0349999999999999},3.5]
[3,{"$f":"B3*(1+(C4/100))","v":1.0712249999999999},3.5]
[4,1.1087178749999997,3.5]
[5,1.1475230006249997,3.5]
[6,1.1876863056468745,3.5]
[7,1.229255326344515,3.5]
[8,1.2722792627665729,3.5]
[9,1.3168090369634029,3.5]
[10,1.3628973532571218,3.5]
[11,1.410598760621121,3.5]
[12,1.4599697172428601,3.5]
[13,1.5110686573463601,3.5]
[14,1.5639560603534826,3.5]
{"$rows_left_out":46}