{"text_format":"1","workbook":"xlsx","n_sheets":7,"sheets":["Front page","Intro","data dictionary","data entry","calculations","output against PN standards","lists"],"not_rendered":{"charts":0,"images":2,"macros":0,"external_links":0,"defined_names":10,"comments":0,"pivot_tables":0},"unopened":[],"bounds":{"document_bytes":16777216,"sheet_cells":100000,"rows_first":2000,"rows_last":500,"rows_between":2000,"halvings":0,"cell_chars":16384,"cell_head_chars":4096},"cells_cut":0,"cells_raw":0,"read":"whole","date_system":"1900"}

{"sheet":"Front page","index":0,"n_rows":17,"n_cols":2,"rows_kept":17,"cut":false,"hidden":false,"merged":[[12,1,12,11],[26,0,26,9]]}
[]
[]
[]
[]
[]
[]
{"$rows_left_out":12}
{"sheet":"Intro","index":1,"n_rows":40,"n_cols":1,"rows_kept":40,"cut":false,"hidden":false,"merged":[[12,0,12,12],[13,0,13,12],[15,0,15,12],[18,0,18,12],[20,0,20,12],[37,0,37,12],[33,0,33,12],[28,0,28,8],[29,0,29,8],[30,0,30,8],[31,0,31,8],[32,0,32,8],[36,0,36,8],[35,0,35,8],[26,0,26,8],[23,0,23,8],[24,0,24,8],[16,0,16,12],[22,0,22,12],[25,0,25,8]]}
[]
[]
[]
[]
[]
[]
{"$rows_left_out":35}
{"sheet":"data dictionary","index":2,"n_rows":27,"n_cols":3,"rows_kept":27,"cut":false,"hidden":false,"merged":[[15,0,21,0],[15,2,21,2]]}
["Data item","Explanatory notes"]
["Name of commissioning authority","Please enter name of the main commissioning local authority. If you have more than one commissioning authority, you may wish to complete an audit tool for each one as part of potential contract requirements to undertake audits. This will only need to be completed once, not for every patient. Please use data for 40 patients found to be positive from a specific date, going back in time until 40 records have been found.","return to data entry"]
["Name of service provider","Please enter name of the clinic or organisation that provides the services. This will only need to be entered once, not for every patient","return to data entry"]
["Type of service provider","Please select from drop down list.","return to data entry"]
["Period","Can be any period and probably depends on the size of the service, usually best to choose from one month, one week or a quarter. Data entry tab can also be used to keep adding throughout the year for example.","return to data entry"]
["index patient","Please enter a number, no commas or full stops for positive patients only. This should not be the same as any id numbers used in your service. You may keep the 'key' locally if you wish to keep an audit trail.","return to data entry"]
{"$rows_left_out":22}
{"sheet":"data entry","index":3,"n_rows":45,"n_cols":31,"rows_kept":45,"cut":false,"hidden":false,"merged":[]}
["Commissioning local authority","Name of service provider","Type of service provider","positive patient number (index)","date of test","gender","age","testing service type","date of result notification","date of treatment","treatment service type","offered PN?","date of PN discussion","if no PN offered, reason?","total no of contacts","total  number of contactable contacts","date of patient/HCW reported attendance for testing and treating contact 1","date of patient/HCW reported attendance for testing and treating contact 2","date of patient/HCW reported attendance for testing and treating contact 3","date of patient/HCW reported attendance for testing and treating contact 4","date of patient/HCW reported attendance for testing and treating contact 5","date of healthcare worker verified attendance for testing and treating contact 1","date of healthcare worker verified attendance for testing and treating contact 2","date of healthcare worker verified attendance for testing and treating contact 3","date of healthcare worker verified attendance for testing and treating contact 4","date of healthcare worker verified attendance for testing and treating contact 5","PN outcome for contact no 1","PN outcome for contact no 2","PN outcome for contact no 3","PN outcome for contact no 4","PN outcome for contact no 5"]
[null,null,null,1]
[{"$f":"$A$2","v":0},{"$f":"$B$2","v":0},{"$f":"$C$2","v":0},2]
[{"$f":"$A$2","v":0},{"$f":"$B$2","v":0},{"$f":"$C$2","v":0},3]
[0,0,{"$f":"$C$2","v":0},4]
[0,0,0,5]
{"$rows_left_out":40}
{"sheet":"calculations","index":4,"n_rows":50,"n_cols":50,"rows_kept":50,"cut":false,"hidden":false,"merged":[]}
["positive patient (index)","If PN offered, 1, otherwise 'not offered' or 'not completed'","Date of test of index patient","Date of PN discussion","date of patient reported attendance for testing and treating contact 1","date of patient reported attendance for testing and treating contact 2","date of patient reported attendance for testing and treating contact 3","date of patient reported attendance for testing and treating contact 4","date of patient reported attendance for testing and treating contact 5","days between PN discussion and date of patient reported attendance contact 1","days between PN discussion and date of patient reported attendance contact 2","days between PN discussion and date of patient reported attendance contact 3","days between PN discussion and date of patient reported attendance contact 4","days between PN discussion and date of patient reported attendance contact 5","meeting standard (between 0 and 21 working days - four working weeks after date of PN discussion) contact 1","meeting standard (between 0 and 21 working days - four working weeks after date of PN discussion) contact 2","meeting standard (between 0 and 21 working days - four working weeks after date of PN discussion) contact 3","meeting standard (between 0 and 21 working days - four working weeks after date of PN discussion) contact 4","meeting standard (between 0 and 21 working days - four working weeks after date of PN discussion) contact 5","number where patient/\nhcw reported standard has been met","Number of contacts with an attendance date ","total number of contacts",null,"date of healthcare worker verified attendance for testing and treating contact 1","date of healthcare worker verified attendance for testing and treating contact 2","date of healthcare worker verified attendance for testing and treating contact 3","date of healthcare worker verified attendance for testing and treating contact 4","date of healthcare worker verified attendance for testing and treating contact 5",null,"days between PN discussion and date of healthcare worker verified attendance contact 2","days between PN discussion and date of healthcare worker verified attendance contact 3","days between PN discussion and date of healthcare worker verified attendance contact 4","days between PN discussion and date of healthcare worker verified attendance contact 5","meeting standard within four weeks contact 1","meeting standard within four weeks contact 2","meeting standard within four weeks contact 3","meeting standard within four weeks contact 4","meeting standard within four weeks contact 5","number where healthcare worker verified standard has been met","Number of contacts with an attendance date ","total number of contacts","PN outcome: contact already known to have chlamydia infection","PN outcome: contact had a negative test in your service","PN outcome: contact had a negative test in another service","PN outcome: contact had a positive test in your service","PN outcome: contact had a positive test in another service","PN outcome: contact had a chlamydia test, but result not known","PN outcome: record made that contact informed of risk of chlamydia infection, but not known to have had a chlamydia test","PN outcome: contact not known to have been informed of risk of chlamydia infection","Other"]
[{"$f":"'data entry'!D2","v":1},{"$f":"IF('data entry'!M2=0,\"not completed\",IF('data entry'!M2=0,\"not offered\",1))","v":"not completed"},{"$f":"IF('data entry'!$E2>0,'data entry'!$E2, \"not completed\")","v":"not completed"},{"$f":"IF('data entry'!M2>0,'data entry'!M2,\"0\")","v":"0"},{"$f":"IF(AND('data entry'!Q2>0,$B2=1),'data entry'!Q2,\"NA\")","v":"NA"},{"$f":"IF(AND('data entry'!R2>0,$B2=1),'data entry'!R2,\"NA\")","v":"NA"},{"$f":"IF(AND('data entry'!S2>0,$B2=1),'data entry'!S2,\"NA\")","v":"NA"},{"$f":"IF(AND('data entry'!T2>0,$B2=1),'data entry'!T2,\"NA\")","v":"NA"},{"$f":"IF(AND('data entry'!U2>0,$B2=1),'data entry'!U2,\"NA\")","v":"NA"},{"$f":"IF(E2=\"na\",\"NA\",NETWORKDAYS(D2,E2))","v":"NA"},{"$f":"IF(F2=\"NA\",\"NA\",NETWORKDAYS(D2,F2))","v":"NA"},{"$f":"IF($G2=\"NA\",\"NA\",NETWORKDAYS(D2,G2))","v":"NA"},{"$f":"IF($H2=\"NA\",\"NA\",NETWORKDAYS(D2,H2))","v":"NA"},{"$f":"IF($I2=\"NA\",\"NA\",NETWORKDAYS(D2,I2))","v":"NA"},{"$f":"IF(AND($J2<21,$J2>=0),1,0)","v":0},{"$f":"IF(AND($K2<21,$K2>=0),1,0)","v":0},{"$f":"IF(AND($L2<21,$L2>=0),1,0)","v":0},{"$f":"IF(AND($M2<21,$M2>=0),1,0)","v":0},{"$f":"IF(AND($N2<21,$N2>=0),1,0)","v":0},{"$f":"SUM(O2:S2)","v":0},{"$f":"COUNT(E2:I2)","v":0},{"$f":"'data entry'!O2","v":0},null,{"$f":"IF(AND('data entry'!V2>0,$B2=1),'data entry'!V2,\"NA\")","v":"NA"},{"$f":"IF(AND('data entry'!W2>0,$B2=1),'data entry'!W2,\"NA\")","v":"NA"},{"$f":"IF(AND('data entry'!X2>0,$B2=1),'data entry'!X2,\"NA\")","v":"NA"},{"$f":"IF(AND('data entry'!Y2>0,$B2=1),'data entry'!Y2,\"NA\")","v":"NA"},{"$f":"IF(AND('data entry'!Z2>0,$B2=1),'data entry'!Z2,\"NA\")","v":"NA"},{"$f":"IF(X2=\"na\",\"NA\",NETWORKDAYS(D2,X2))","v":"NA"},{"$f":"IF(Y2=\"NA\",\"NA\",NETWORKDAYS(D2,Y2))","v":"NA"},{"$f":"IF($Z2=\"NA\",\"NA\",NETWORKDAYS(D2,Z2))","v":"NA"},{"$f":"IF($AA2=\"NA\",\"NA\",NETWORKDAYS(D2,AA2))","v":"NA"},{"$f":"IF($AB2=\"NA\",\"NA\",NETWORKDAYS(D2,AB2))","v":"NA"},{"$f":"IF(AND($AC2<21,$AC2>=0),1,0)","v":0},{"$f":"IF(AND($AD2<21,$AD2>=0),1,0)","v":0},{"$f":"IF(AND($AE2<21,$AE2>=0),1,0)","v":0},{"$f":"IF(AND($AF2<21,$AF2>=0),1,0)","v":0},{"$f":"IF(AND($AG2<21,$AG2>=0),1,0)","v":0},{"$f":"SUM(AH2:AL2)","v":0},{"$f":"COUNT(X2:AB2)","v":0},{"$f":"'data entry'!$O2","v":0},{"$f":"COUNTIF('data entry'!$AA$2:$AE$2,\"contact already known to have chlamydia infection\")","v":0},{"$f":"COUNTIF('data entry'!$AA2:$AE2,\"contact had a negative test in your service\")","v":0},{"$f":"COUNTIF('data entry'!$AA2:$AE2,\"contact had a negative test in another service\")","v":0},{"$f":"COUNTIF('data entry'!$AA2:$AE2,\"contact had a positive test in your service\")","v":0},{"$f":"COUNTIF('data entry'!$AA2:$AE2,\"contact had a positive test in another service\")","v":0},{"$f":"COUNTIF('data entry'!$AA2:$AE2,\"contact had a chlamydia test, but result not known\")","v":0},{"$f":"COUNTIF('data entry'!$AA2:$AE2,\"record made that contact informed of risk of chlamydia infection, but not known to have had a chlamydia test\")","v":0},{"$f":"COUNTIF('data entry'!$AA2:$AE2,\"contact not known to have been informed of risk of chlamydia infection\")","v":0},{"$f":"COUNTIF('data entry'!$AA2:$AE2,\"other\")","v":0}]
[{"$f":"'data entry'!D3","v":2},{"$f":"IF('data entry'!M3=0,\"not completed\",IF('data entry'!M3=0,\"not offered\",1))","v":"not completed"},{"$f":"IF('data entry'!$E3>0,'data entry'!$E3, \"not completed\")","v":"not completed"},{"$f":"IF('data entry'!M3>0,'data entry'!M3,\"0\")","v":"0"},{"$f":"IF(AND('data entry'!Q3>0,$B3=1),'data entry'!Q3,\"NA\")","v":"NA"},{"$f":"IF(AND('data entry'!R3>0,$B3=1),'data entry'!R3,\"NA\")","v":"NA"},{"$f":"IF(AND('data entry'!S3>0,$B3=1),'data entry'!S3,\"NA\")","v":"NA"},{"$f":"IF(AND('data entry'!T3>0,$B3=1),'data entry'!T3,\"NA\")","v":"NA"},{"$f":"IF(AND('data entry'!U3>0,$B3=1),'data entry'!U3,\"NA\")","v":"NA"},{"$f":"IF(E3=\"na\",\"NA\",NETWORKDAYS(D3,E3))","v":"NA"},{"$f":"IF(F3=\"NA\",\"NA\",NETWORKDAYS(D3,F3))","v":"NA"},{"$f":"IF($G3=\"NA\",\"NA\",NETWORKDAYS(D3,G3))","v":"NA"},{"$f":"IF($H3=\"NA\",\"NA\",NETWORKDAYS(D3,H3))","v":"NA"},{"$f":"IF($I3=\"NA\",\"NA\",NETWORKDAYS(D3,I3))","v":"NA"},{"$f":"IF(AND($J3<21,$J3>=0),1,0)","v":0},{"$f":"IF(AND($K3<21,$K3>=0),1,0)","v":0},{"$f":"IF(AND($L3<21,$L3>=0),1,0)","v":0},{"$f":"IF(AND($M3<21,$M3>=0),1,0)","v":0},{"$f":"IF(AND($N3<21,$N3>=0),1,0)","v":0},{"$f":"SUM(O3:S3)","v":0},0,{"$f":"'data entry'!O3","v":0},null,{"$f":"IF(AND('data entry'!V3>0,$B3=1),'data entry'!V3,\"NA\")","v":"NA"},{"$f":"IF(AND('data entry'!W3>0,$B3=1),'data entry'!W3,\"NA\")","v":"NA"},{"$f":"IF(AND('data entry'!X3>0,$B3=1),'data entry'!X3,\"NA\")","v":"NA"},{"$f":"IF(AND('data entry'!Y3>0,$B3=1),'data entry'!Y3,\"NA\")","v":"NA"},{"$f":"IF(AND('data entry'!Z3>0,$B3=1),'data entry'!Z3,\"NA\")","v":"NA"},{"$f":"IF(X3=\"na\",\"NA\",NETWORKDAYS(D3,X3))","v":"NA"},{"$f":"IF(Y3=\"NA\",\"NA\",NETWORKDAYS(D3,Y3))","v":"NA"},{"$f":"IF($Z3=\"NA\",\"NA\",NETWORKDAYS(D3,Z3))","v":"NA"},{"$f":"IF($AA3=\"NA\",\"NA\",NETWORKDAYS(D3,AA3))","v":"NA"},{"$f":"IF($AB3=\"NA\",\"NA\",NETWORKDAYS(D3,AB3))","v":"NA"},{"$f":"IF(AND($AC3<21,$AC3>=0),1,0)","v":0},{"$f":"IF(AND($AD3<21,$AD3>=0),1,0)","v":0},{"$f":"IF(AND($AE3<21,$AE3>=0),1,0)","v":0},{"$f":"IF(AND($AF3<21,$AF3>=0),1,0)","v":0},{"$f":"IF(AND($AG3<21,$AG3>=0),1,0)","v":0},{"$f":"SUM(AH3:AL3)","v":0},0,{"$f":"'data entry'!$O3","v":0},{"$f":"COUNTIF('data entry'!$AA3:$AE3,\"contact already known to have chlamydia infection\")","v":0},{"$f":"COUNTIF('data entry'!$AA3:$AE3,\"contact had a negative test in your service\")","v":0},{"$f":"COUNTIF('data entry'!$AA3:$AE3,\"contact had a negative test in another service\")","v":0},{"$f":"COUNTIF('data entry'!$AA3:$AE3,\"contact had a positive test in your service\")","v":0},{"$f":"COUNTIF('data entry'!$AA3:$AE3,\"contact had a positive test in another service\")","v":0},{"$f":"COUNTIF('data entry'!$AA3:$AE3,\"contact had a chlamydia test, but result not known\")","v":0},{"$f":"COUNTIF('data entry'!$AA3:$AE3,\"record made that contact informed of risk of chlamydia infection, but not known to have had a chlamydia test\")","v":0},{"$f":"COUNTIF('data entry'!$AA3:$AE3,\"contact not known to have been informed of risk of chlamydia infection\")","v":0},{"$f":"COUNTIF('data entry'!$AA3:$AE3,\"other\")","v":0}]
[{"$f":"'data entry'!D4","v":3},{"$f":"IF('data entry'!M4=0,\"not completed\",IF('data entry'!M4=0,\"not offered\",1))","v":"not completed"},{"$f":"IF('data entry'!$E4>0,'data entry'!$E4, \"not completed\")","v":"not completed"},{"$f":"IF('data entry'!M4>0,'data entry'!M4,\"0\")","v":"0"},{"$f":"IF(AND('data entry'!Q4>0,$B4=1),'data entry'!Q4,\"NA\")","v":"NA"},{"$f":"IF(AND('data entry'!R4>0,$B4=1),'data entry'!R4,\"NA\")","v":"NA"},{"$f":"IF(AND('data entry'!S4>0,$B4=1),'data entry'!S4,\"NA\")","v":"NA"},{"$f":"IF(AND('data entry'!T4>0,$B4=1),'data entry'!T4,\"NA\")","v":"NA"},{"$f":"IF(AND('data entry'!U4>0,$B4=1),'data entry'!U4,\"NA\")","v":"NA"},{"$f":"IF(E4=\"na\",\"NA\",NETWORKDAYS(D4,E4))","v":"NA"},{"$f":"IF(F4=\"NA\",\"NA\",NETWORKDAYS(D4,F4))","v":"NA"},{"$f":"IF($G4=\"NA\",\"NA\",NETWORKDAYS(D4,G4))","v":"NA"},{"$f":"IF($H4=\"NA\",\"NA\",NETWORKDAYS(D4,H4))","v":"NA"},{"$f":"IF($I4=\"NA\",\"NA\",NETWORKDAYS(D4,I4))","v":"NA"},0,0,0,0,0,0,0,{"$f":"'data entry'!O4","v":0},null,{"$f":"IF(AND('data entry'!V4>0,$B4=1),'data entry'!V4,\"NA\")","v":"NA"},{"$f":"IF(AND('data entry'!W4>0,$B4=1),'data entry'!W4,\"NA\")","v":"NA"},{"$f":"IF(AND('data entry'!X4>0,$B4=1),'data entry'!X4,\"NA\")","v":"NA"},{"$f":"IF(AND('data entry'!Y4>0,$B4=1),'data entry'!Y4,\"NA\")","v":"NA"},{"$f":"IF(AND('data entry'!Z4>0,$B4=1),'data entry'!Z4,\"NA\")","v":"NA"},"NA","NA","NA","NA","NA",0,0,0,0,0,0,0,{"$f":"'data entry'!$O4","v":0},{"$f":"COUNTIF('data entry'!$AA4:$AE4,\"contact already known to have chlamydia infection\")","v":0},{"$f":"COUNTIF('data entry'!$AA4:$AE4,\"contact had a negative test in your service\")","v":0},{"$f":"COUNTIF('data entry'!$AA4:$AE4,\"contact had a negative test in another service\")","v":0},{"$f":"COUNTIF('data entry'!$AA4:$AE4,\"contact had a positive test in your service\")","v":0},{"$f":"COUNTIF('data entry'!$AA4:$AE4,\"contact had a positive test in another service\")","v":0},{"$f":"COUNTIF('data entry'!$AA4:$AE4,\"contact had a chlamydia test, but result not known\")","v":0},{"$f":"COUNTIF('data entry'!$AA4:$AE4,\"record made that contact informed of risk of chlamydia infection, but not known to have had a chlamydia test\")","v":0},{"$f":"COUNTIF('data entry'!$AA4:$AE4,\"contact not known to have been informed of risk of chlamydia infection\")","v":0},{"$f":"COUNTIF('data entry'!$AA4:$AE4,\"other\")","v":0}]
[{"$f":"'data entry'!D5","v":4},{"$f":"IF('data entry'!M5=0,\"not completed\",IF('data entry'!M5=0,\"not offered\",1))","v":"not completed"},{"$f":"IF('data entry'!$E5>0,'data entry'!$E5, \"not completed\")","v":"not completed"},{"$f":"IF('data entry'!M5>0,'data entry'!M5,\"0\")","v":"0"},{"$f":"IF(AND('data entry'!Q5>0,$B5=1),'data entry'!Q5,\"NA\")","v":"NA"},{"$f":"IF(AND('data entry'!R5>0,$B5=1),'data entry'!R5,\"NA\")","v":"NA"},{"$f":"IF(AND('data entry'!S5>0,$B5=1),'data entry'!S5,\"NA\")","v":"NA"},{"$f":"IF(AND('data entry'!T5>0,$B5=1),'data entry'!T5,\"NA\")","v":"NA"},{"$f":"IF(AND('data entry'!U5>0,$B5=1),'data entry'!U5,\"NA\")","v":"NA"},"NA","NA","NA","NA","NA",0,0,0,0,0,0,0,{"$f":"'data entry'!O5","v":0},null,{"$f":"IF(AND('data entry'!V5>0,$B5=1),'data entry'!V5,\"NA\")","v":"NA"},{"$f":"IF(AND('data entry'!W5>0,$B5=1),'data entry'!W5,\"NA\")","v":"NA"},{"$f":"IF(AND('data entry'!X5>0,$B5=1),'data entry'!X5,\"NA\")","v":"NA"},{"$f":"IF(AND('data entry'!Y5>0,$B5=1),'data entry'!Y5,\"NA\")","v":"NA"},{"$f":"IF(AND('data entry'!Z5>0,$B5=1),'data entry'!Z5,\"NA\")","v":"NA"},"NA","NA","NA","NA","NA",0,0,0,0,0,0,0,{"$f":"'data entry'!$O5","v":0},{"$f":"COUNTIF('data entry'!$AA5:$AE5,\"contact already known to have chlamydia infection\")","v":0},{"$f":"COUNTIF('data entry'!$AA5:$AE5,\"contact had a negative test in your service\")","v":0},{"$f":"COUNTIF('data entry'!$AA5:$AE5,\"contact had a negative test in another service\")","v":0},{"$f":"COUNTIF('data entry'!$AA5:$AE5,\"contact had a positive test in your service\")","v":0},{"$f":"COUNTIF('data entry'!$AA5:$AE5,\"contact had a positive test in another service\")","v":0},{"$f":"COUNTIF('data entry'!$AA5:$AE5,\"contact had a chlamydia test, but result not known\")","v":0},{"$f":"COUNTIF('data entry'!$AA5:$AE5,\"record made that contact informed of risk of chlamydia infection, but not known to have had a chlamydia test\")","v":0},{"$f":"COUNTIF('data entry'!$AA5:$AE5,\"contact not known to have been informed of risk of chlamydia infection\")","v":0},{"$f":"COUNTIF('data entry'!$AA5:$AE5,\"other\")","v":0}]
[{"$f":"'data entry'!D6","v":5},{"$f":"IF('data entry'!M6=0,\"not completed\",IF('data entry'!M6=0,\"not offered\",1))","v":"not completed"},{"$f":"IF('data entry'!$E6>0,'data entry'!$E6, \"not completed\")","v":"not completed"},{"$f":"IF('data entry'!M6>0,'data entry'!M6,\"0\")","v":"0"},{"$f":"IF(AND('data entry'!Q6>0,$B6=1),'data entry'!Q6,\"NA\")","v":"NA"},{"$f":"IF(AND('data entry'!R6>0,$B6=1),'data entry'!R6,\"NA\")","v":"NA"},{"$f":"IF(AND('data entry'!S6>0,$B6=1),'data entry'!S6,\"NA\")","v":"NA"},{"$f":"IF(AND('data entry'!T6>0,$B6=1),'data entry'!T6,\"NA\")","v":"NA"},{"$f":"IF(AND('data entry'!U6>0,$B6=1),'data entry'!U6,\"NA\")","v":"NA"},"NA","NA","NA","NA","NA",0,0,0,0,0,0,0,{"$f":"'data entry'!O6","v":0},null,{"$f":"IF(AND('data entry'!V6>0,$B6=1),'data entry'!V6,\"NA\")","v":"NA"},{"$f":"IF(AND('data entry'!W6>0,$B6=1),'data entry'!W6,\"NA\")","v":"NA"},{"$f":"IF(AND('data entry'!X6>0,$B6=1),'data entry'!X6,\"NA\")","v":"NA"},{"$f":"IF(AND('data entry'!Y6>0,$B6=1),'data entry'!Y6,\"NA\")","v":"NA"},{"$f":"IF(AND('data entry'!Z6>0,$B6=1),'data entry'!Z6,\"NA\")","v":"NA"},"NA","NA","NA","NA","NA",0,0,0,0,0,0,0,{"$f":"'data entry'!$O6","v":0},{"$f":"COUNTIF('data entry'!$AA6:$AE6,\"contact already known to have chlamydia infection\")","v":0},{"$f":"COUNTIF('data entry'!$AA6:$AE6,\"contact had a negative test in your service\")","v":0},{"$f":"COUNTIF('data entry'!$AA6:$AE6,\"contact had a negative test in another service\")","v":0},{"$f":"COUNTIF('data entry'!$AA6:$AE6,\"contact had a positive test in your service\")","v":0},{"$f":"COUNTIF('data entry'!$AA6:$AE6,\"contact had a positive test in another service\")","v":0},{"$f":"COUNTIF('data entry'!$AA6:$AE6,\"contact had a chlamydia test, but result not known\")","v":0},{"$f":"COUNTIF('data entry'!$AA6:$AE6,\"record made that contact informed of risk of chlamydia infection, but not known to have had a chlamydia test\")","v":0},{"$f":"COUNTIF('data entry'!$AA6:$AE6,\"contact not known to have been informed of risk of chlamydia infection\")","v":0},{"$f":"COUNTIF('data entry'!$AA6:$AE6,\"other\")","v":0}]
{"$rows_left_out":45}
{"sheet":"output against PN standards","index":5,"n_rows":63,"n_cols":8,"rows_kept":63,"cut":false,"hidden":false,"merged":[[12,0,12,4],[1,0,1,4],[4,0,4,4],[5,0,5,4],[7,0,7,4],[10,0,10,4],[2,0,2,4],[11,0,11,4]]}
["Period covered: 40 consecutive patients found to be positive from  <enter date>",null,null,null,null,"Patient/HCW reported","Healthcare worker verified"]
["Number of contacts where standard has been achieved of contact's attendance 28 days (20 working days) after date of PN discussion with index patient(a)",null,null,null,null,{"$f":"SUMIF(calculations!$T$2:'calculations'!$T$2001,\">0\")","v":0},{"$f":"SUMIF(calculations!AM2:'calculations'!AM2001,\">0\")","v":0}]
["Number of contacts where attendance has not met the standard of attending a service within 28 days (20 working days) after date of PN discussion with index patient (b)",null,null,null,null,{"$f":"SUM(calculations!U2:U2001)-SUM(calculations!T2:T2001)","v":0},{"$f":"SUM(calculations!AN2:AN2001)-SUM(calculations!AM2:AM2001)","v":0}]
["Number of index cases not offered PN",null,null,null,null,{"$f":"COUNTIF(calculations!$B$2:$B$2001,\"not offered\")","v":0},{"$f":"COUNTIF(calculations!$B$2:$B$2001,\"not offered\")","v":0}]
["Total number of index cases (c)",null,null,null,null,{"$f":"B19","v":0},{"$f":"B19","v":0}]
["Proportion of contacts of index cases that met the standard (contacts that meet the standard/index cases: =a/c)",null,null,null,null,{"$f":"F2/F5","v":{"$error":"#DIV/0!"}},{"$f":"G2/G5","v":{"$error":"#DIV/0!"}}]
{"$rows_left_out":58}
{"sheet":"lists","index":6,"n_rows":10,"n_cols":7,"rows_kept":10,"cut":false,"hidden":true,"merged":[]}
["Testing service type","Gender","PN offer","No PN reasons","number of partners","number of contactable partners","PN outcome"]
["GUM clinic","Male","Yes","no documented evidence of PN",1,0,"contact already known to have chlamydia infection"]
["SRH/CASH clinic","Female","No","patient routinely seen for SH care elsewhere",2,1,"contact had a negative test in your service"]
["GP","Unknown","Unknown","patient transferred care",3,2,"contact had a negative test in another service"]
["Community Pharmacy",null,null,"documented that PN performed elsewhere",4,3,"contact had a positive test in your service"]
["Remote testing",null,null,"lost to follow up before PN initiated",5,4,"contact had a positive test in another service"]
{"$rows_left_out":4}