{"text_format":"1","workbook":"xlsx","n_sheets":59,"sheets":["Control","Introduction","Guide","Model steps","Example","Disclaimer","Intervention","Intervention (2)","Population","Population (3)","Population (2)","Programme costs","Programme costs (2)","Resources","MENU1B5","MENU1B6","MENU1B7","MENU1B8","Resources (2)","Results tables","Results charts","MENU2B3","MENU2B4","MENU2B5","MENU2B6","MENU2B7","MENU2B8","MENU3B4","MENU3B5","MENU3B6","MENU3B7","MENU3B8","MENU4B1","MENU4B2","MENU4B3","MENU4B4","MENU4B5","MENU4B6","MENU4B7","MENU4B8","MENU5B1","MENU5B2","MENU5B3","MENU5B4","MENU5B5","MENU5B6","MENU5B7","MENU5B8","MENU6B1","MENU6B2","MENU6B3","MENU6B4","MENU6B5","MENU6B6","MENU6B7","MENU6B8","PDF","Calcs","Study data"],"not_rendered":{"charts":3,"images":3,"macros":1,"external_links":0,"defined_names":1,"comments":4,"pivot_tables":0},"unopened":[],"bounds":{"document_bytes":16777216,"sheet_cells":100000,"rows_first":2000,"rows_last":500,"rows_between":2000,"halvings":0,"cell_chars":16384,"cell_head_chars":4096},"cells_cut":0,"cells_raw":0,"read":"whole","date_system":"1900"}

{"sheet":"Control","index":0,"n_rows":32,"n_cols":9,"rows_kept":32,"cut":false,"hidden":true,"merged":[[0,1,0,8]]}
["Menu Text","Button Text/Sheet Names"]
["Inputs","Intervention","Population","Programme costs","Resources",".",".",".","."]
["Results","Results tables","Results charts",".",".",".",".",".","."]
["Intro","Background","Guide","Model steps",".",".",".",".","."]
[".","MENU4B1","MENU4B2","MENU4B3","MENU4B4","MENU4B5","MENU4B6","MENU4B7","MENU4B8"]
[".","MENU5B1","MENU5B2","MENU5B3","MENU5B4","MENU5B5","MENU5B6","MENU5B7","MENU5B8"]
[".","MENU6B1","MENU6B2","MENU6B3","MENU6B4","MENU6B5","MENU6B6","MENU6B7","MENU6B8"]
[]
[]
[]
{"$rows_left_out":23}
{"sheet":"Introduction","index":1,"n_rows":2,"n_cols":4,"rows_kept":2,"cut":false,"hidden":false,"merged":[[1,3,4,11]]}
[]
[null,null,null,"Public Health England - Return on Investment of Oral Health Interventions"]

{"sheet":"Guide","index":2,"n_rows":36,"n_cols":6,"rows_kept":36,"cut":false,"hidden":false,"merged":[[19,5,20,12]]}
[]
[]
[]
[]
[]
[]
[]
[]
[]
[null,null,null,"How to use the tool"]
{"$rows_left_out":27}
{"sheet":"Model steps","index":3,"n_rows":16,"n_cols":11,"rows_kept":16,"cut":false,"hidden":false,"merged":[[10,10,12,13],[15,10,38,13]]}
[]
[]
[]
[]
[]
[]
[]
[]
[]
[null,null,null,"Model calculation steps"]
{"$rows_left_out":7}
{"sheet":"Example","index":4,"n_rows":0,"n_cols":0,"rows_kept":0,"cut":false,"hidden":false,"merged":[[1,3,2,11]]}

{"sheet":"Disclaimer","index":5,"n_rows":0,"n_cols":0,"rows_kept":0,"cut":false,"hidden":false,"merged":[[1,3,2,11]]}

{"sheet":"Intervention","index":6,"n_rows":46,"n_cols":11,"rows_kept":46,"cut":false,"hidden":false,"merged":[[15,10,15,12],[20,10,20,12],[17,10,17,12],[18,10,18,12],[24,4,24,10],[29,4,29,10],[28,4,28,10],[25,4,25,10],[41,4,41,10],[44,4,44,10],[45,4,45,10],[32,4,32,10],[33,4,33,10],[36,4,36,10],[37,4,37,10],[40,4,40,10]]}
[]
[]
[]
[]
[]
[]
[]
[]
[]
[]
{"$rows_left_out":37}
{"sheet":"Intervention (2)","index":7,"n_rows":11,"n_cols":8,"rows_kept":11,"cut":false,"hidden":false,"merged":[]}
[]
[]
[]
[]
[]
[]
[]
[]
[]
[]
{"$rows_left_out":2}
{"sheet":"Population","index":8,"n_rows":54,"n_cols":11,"rows_kept":54,"cut":false,"hidden":false,"merged":[[27,7,27,9]]}
[]
[]
[]
[]
[]
[]
[]
[]
[]
[]
{"$rows_left_out":45}
{"sheet":"Population (3)","index":9,"n_rows":11,"n_cols":8,"rows_kept":11,"cut":false,"hidden":false,"merged":[]}
[]
[]
[]
[]
[]
[]
[]
[]
[]
[]
{"$rows_left_out":2}
{"sheet":"Population (2)","index":10,"n_rows":170,"n_cols":10,"rows_kept":170,"cut":false,"hidden":true,"merged":[]}
[]
[]
[]
[]
[]
[]
[]
[]
[]
[null,null,1,"Select an area","5-year-old population\n(mid 2014)","Examined","% of sample examined","Mean\nd3mft"]
{"$rows_left_out":161}
{"sheet":"Programme costs","index":11,"n_rows":97,"n_cols":10,"rows_kept":97,"cut":false,"hidden":false,"merged":[[57,4,57,10],[61,4,61,10],[58,4,58,10],[95,4,95,10],[84,4,84,10],[91,4,91,10],[68,4,68,10],[66,4,66,10],[96,4,96,10],[65,4,65,10],[72,4,72,10],[81,4,81,10],[85,4,85,10],[92,4,92,10],[67,4,67,10],[70,4,70,10],[93,4,93,10],[76,4,76,10],[78,4,78,10],[82,4,82,10],[25,4,25,10],[59,4,59,10],[94,4,94,10],[89,4,89,10],[90,4,90,10],[35,4,35,10],[83,4,83,10],[80,4,80,10],[79,4,79,10],[77,4,77,10],[47,4,47,10],[45,4,45,10],[69,4,69,10],[71,4,71,10],[38,4,38,10],[60,4,60,10],[32,4,32,10],[40,4,40,10],[44,4,44,10],[50,4,50,10],[56,4,56,10],[34,4,34,10],[36,4,36,10],[46,4,46,10],[48,4,48,10],[52,4,52,10],[51,4,51,10],[33,4,33,10],[49,4,49,10],[37,4,37,10],[39,4,39,10]]}
[]
[]
[]
[]
[]
[]
[]
[]
[]
[]
{"$rows_left_out":88}
{"sheet":"Programme costs (2)","index":12,"n_rows":11,"n_cols":9,"rows_kept":11,"cut":false,"hidden":false,"merged":[]}
[]
[]
[]
[]
[]
[]
[]
[]
[]
[]
{"$rows_left_out":2}
{"sheet":"Resources","index":13,"n_rows":31,"n_cols":12,"rows_kept":31,"cut":false,"hidden":false,"merged":[[30,3,30,4],[29,11,30,11],[29,8,30,10],[27,8,28,10],[27,11,28,11],[20,8,20,9],[27,3,27,4],[17,3,17,4],[20,3,20,4],[26,3,26,4],[19,3,19,4]]}
[]
[]
[]
[]
[]
[]
[]
[]
[]
[]
{"$rows_left_out":22}
{"sheet":"MENU1B5","index":14,"n_rows":0,"n_cols":0,"rows_kept":0,"cut":false,"hidden":true,"merged":[]}

{"sheet":"MENU1B6","index":15,"n_rows":0,"n_cols":0,"rows_kept":0,"cut":false,"hidden":true,"merged":[]}

{"sheet":"MENU1B7","index":16,"n_rows":0,"n_cols":0,"rows_kept":0,"cut":false,"hidden":true,"merged":[]}

{"sheet":"MENU1B8","index":17,"n_rows":0,"n_cols":0,"rows_kept":0,"cut":false,"hidden":true,"merged":[]}

{"sheet":"Resources (2)","index":18,"n_rows":11,"n_cols":9,"rows_kept":11,"cut":false,"hidden":false,"merged":[]}
[]
[]
[]
[]
[]
[]
[]
[]
[]
[]
{"$rows_left_out":2}
{"sheet":"Results tables","index":19,"n_rows":52,"n_cols":10,"rows_kept":52,"cut":false,"hidden":false,"merged":[[39,3,39,9],[41,3,41,9],[51,3,51,9],[47,3,47,9],[45,3,45,9],[43,3,43,9],[49,3,49,9],[10,3,10,9],[11,3,11,9],[12,3,12,9],[32,7,33,9],[35,3,36,5],[13,3,13,9]]}
[]
[]
[]
[]
[]
[]
[]
[]
[]
[]
{"$rows_left_out":43}
{"sheet":"Results charts","index":20,"n_rows":0,"n_cols":0,"rows_kept":0,"cut":false,"hidden":false,"merged":[]}

{"sheet":"MENU2B3","index":21,"n_rows":0,"n_cols":0,"rows_kept":0,"cut":false,"hidden":true,"merged":[]}

{"sheet":"MENU2B4","index":22,"n_rows":0,"n_cols":0,"rows_kept":0,"cut":false,"hidden":true,"merged":[]}

{"sheet":"MENU2B5","index":23,"n_rows":0,"n_cols":0,"rows_kept":0,"cut":false,"hidden":true,"merged":[]}

{"sheet":"MENU2B6","index":24,"n_rows":0,"n_cols":0,"rows_kept":0,"cut":false,"hidden":true,"merged":[]}

{"sheet":"MENU2B7","index":25,"n_rows":0,"n_cols":0,"rows_kept":0,"cut":false,"hidden":true,"merged":[]}

{"sheet":"MENU2B8","index":26,"n_rows":0,"n_cols":0,"rows_kept":0,"cut":false,"hidden":true,"merged":[]}

{"sheet":"MENU3B4","index":27,"n_rows":0,"n_cols":0,"rows_kept":0,"cut":false,"hidden":true,"merged":[]}

{"sheet":"MENU3B5","index":28,"n_rows":0,"n_cols":0,"rows_kept":0,"cut":false,"hidden":true,"merged":[]}

{"sheet":"MENU3B6","index":29,"n_rows":0,"n_cols":0,"rows_kept":0,"cut":false,"hidden":true,"merged":[]}

{"sheet":"MENU3B7","index":30,"n_rows":0,"n_cols":0,"rows_kept":0,"cut":false,"hidden":true,"merged":[]}

{"sheet":"MENU3B8","index":31,"n_rows":0,"n_cols":0,"rows_kept":0,"cut":false,"hidden":true,"merged":[]}

{"sheet":"MENU4B1","index":32,"n_rows":0,"n_cols":0,"rows_kept":0,"cut":false,"hidden":true,"merged":[]}

{"sheet":"MENU4B2","index":33,"n_rows":0,"n_cols":0,"rows_kept":0,"cut":false,"hidden":true,"merged":[]}

{"sheet":"MENU4B3","index":34,"n_rows":0,"n_cols":0,"rows_kept":0,"cut":false,"hidden":true,"merged":[]}

{"sheet":"MENU4B4","index":35,"n_rows":0,"n_cols":0,"rows_kept":0,"cut":false,"hidden":true,"merged":[]}

{"sheet":"MENU4B5","index":36,"n_rows":0,"n_cols":0,"rows_kept":0,"cut":false,"hidden":true,"merged":[]}

{"sheet":"MENU4B6","index":37,"n_rows":0,"n_cols":0,"rows_kept":0,"cut":false,"hidden":true,"merged":[]}

{"sheet":"MENU4B7","index":38,"n_rows":0,"n_cols":0,"rows_kept":0,"cut":false,"hidden":true,"merged":[]}

{"sheet":"MENU4B8","index":39,"n_rows":0,"n_cols":0,"rows_kept":0,"cut":false,"hidden":true,"merged":[]}

{"sheet":"MENU5B1","index":40,"n_rows":0,"n_cols":0,"rows_kept":0,"cut":false,"hidden":true,"merged":[]}

{"sheet":"MENU5B2","index":41,"n_rows":0,"n_cols":0,"rows_kept":0,"cut":false,"hidden":true,"merged":[]}

{"sheet":"MENU5B3","index":42,"n_rows":0,"n_cols":0,"rows_kept":0,"cut":false,"hidden":true,"merged":[]}

{"sheet":"MENU5B4","index":43,"n_rows":0,"n_cols":0,"rows_kept":0,"cut":false,"hidden":true,"merged":[]}

{"sheet":"MENU5B5","index":44,"n_rows":0,"n_cols":0,"rows_kept":0,"cut":false,"hidden":true,"merged":[]}

{"sheet":"MENU5B6","index":45,"n_rows":0,"n_cols":0,"rows_kept":0,"cut":false,"hidden":true,"merged":[]}

{"sheet":"MENU5B7","index":46,"n_rows":0,"n_cols":0,"rows_kept":0,"cut":false,"hidden":true,"merged":[]}

{"sheet":"MENU5B8","index":47,"n_rows":0,"n_cols":0,"rows_kept":0,"cut":false,"hidden":true,"merged":[]}

{"sheet":"MENU6B1","index":48,"n_rows":0,"n_cols":0,"rows_kept":0,"cut":false,"hidden":true,"merged":[]}

{"sheet":"MENU6B2","index":49,"n_rows":0,"n_cols":0,"rows_kept":0,"cut":false,"hidden":true,"merged":[]}

{"sheet":"MENU6B3","index":50,"n_rows":0,"n_cols":0,"rows_kept":0,"cut":false,"hidden":true,"merged":[]}

{"sheet":"MENU6B4","index":51,"n_rows":0,"n_cols":0,"rows_kept":0,"cut":false,"hidden":true,"merged":[]}

{"sheet":"MENU6B5","index":52,"n_rows":0,"n_cols":0,"rows_kept":0,"cut":false,"hidden":true,"merged":[]}

{"sheet":"MENU6B6","index":53,"n_rows":0,"n_cols":0,"rows_kept":0,"cut":false,"hidden":true,"merged":[]}

{"sheet":"MENU6B7","index":54,"n_rows":0,"n_cols":0,"rows_kept":0,"cut":false,"hidden":true,"merged":[]}

{"sheet":"MENU6B8","index":55,"n_rows":0,"n_cols":0,"rows_kept":0,"cut":false,"hidden":true,"merged":[]}

{"sheet":"PDF","index":56,"n_rows":51,"n_cols":8,"rows_kept":51,"cut":false,"hidden":false,"merged":[[2,1,3,9],[12,1,12,9],[6,1,6,9],[36,1,37,9],[14,1,14,9],[34,1,34,9],[32,1,32,9]]}
[]
[]
[null,"Return on Investment of Oral Health Interventions"]
[]
[]
[]
[null,"The analysis focuses on programmes aimed at improving the oral health of young children and reducing the decay levels in 5 year olds. The programmes included in the tool are those that have the best available evidence of effectiveness in reducing tooth decay in pre-school children (CBOH)."]
[]
[]
[]
{"$rows_left_out":42}
{"sheet":"Calcs","index":57,"n_rows":150,"n_cols":28,"rows_kept":150,"cut":false,"hidden":false,"merged":[[39,28,41,28],[30,10,31,10],[30,4,30,5],[30,9,31,9],[30,7,31,7],[30,8,31,8]]}
[]
[null,"Programme",1,{"$f":"CHOOSE(C2,Intervention!D16,Intervention!D17,Intervention!D18,Intervention!D19,Intervention!D20,Intervention!D21)","v":"Supervised toothbrushing"},null,null,null,"dmft option",1]
[null,"Prog length",{"$f":"CHOOSE(C2,'Study data'!D6,'Study data'!D10,'Study data'!D14,'Study data'!D18,'Study data'!D22,'Study data'!D26)","v":2},null,null,null,null,"Option 3 dmft",{"$f":"IF(SUM(Population!G41:K41)=1,SUMPRODUCT(Population!G41:K41,Population!G42:K42),\"\")","v":""}]
[null,"Calc info for diagram",8,null,null,null,null,"Option 4 dmft",{"$f":"IF(SUM(Population!G47:K47)<1,\"\",SUMPRODUCT(Population!G47:K47,Population!G48:K48))","v":""}]
[null,null,null,"Quintile",1,2,3,4,5]
[null,null,null,"National weighting",26119,23792,21122,20487,19980]
[null,null,null,"Baseline dmft",{"$f":"CHOOSE(I2,'Population (2)'!J13,IF(ISBLANK(Population!$G$37),\"\",Population!$G$37),I3,I4)","v":""}]
[]
[]
[]
{"$rows_left_out":141}
{"sheet":"Study data","index":58,"n_rows":44,"n_cols":15,"rows_kept":44,"cut":false,"hidden":false,"merged":[]}
[null,"Note: This sheet will be hidden from the user in the final version"]
[]
[null,"Supervised toothbrushing"]
[null,"Targeted supervised tooth brushing in schools or nurseries is recommended as an effective intervention by NICE PH55 and CBOH. This model has used the preventive fraction reported by the Childsmile programme.\n\nThe Childsmile programme, which has been run throughout Scotland over the last decade, involves daily supervised tooth brushing in nurseries of 3 and 4 year old children and distribution by nurseries of fluoride toothpaste (at least 1000ppm) for use at home on 6 occasions. The Childsmile programme has also reported overall cost savings in Scotland (Anopa et al., 2015), with the largest reduction in estimated cost in the most deprived cohort of children.\n\nWhether this programme could have an impact on inequalities depends on a number of factors, including appropriate targeting of high-risk populations, as well as high rates of consent, compliance and retention.\n","Source study","Programme length","Age at start of programme","Post-programme dmft (5 year olds)","Pre-programme dmft (5 year olds)","Preventive fraction (derived from study data)",null,null,null,"Time point for PF (after programme start)","Age for PF",null,"Recommendations\nNICE PH55 sets out the following recommendations for the implementation of a supervised toothbrushing programme: a designated lead is required at all establishments where they are run; access to advice from a dental professional if needed; and free toothbrush and fluoride toothpaste packs (one set to use on the premises and one set to take home). Commissioning Better Oral Health recommends that staff will require ongoing support in terms of training, cross infection control and consent issues. The programme requires teacher supervision which can be time-consuming; a potential alternative is using older peers or parent supervisors.\n\nStaffing and consumables\nThe cost of an age-appropriate toothbrush, 100ml of toothpaste and an educational leaflet (purchasing a pack of 50 units via NHS Supply Chain) is currently between £27.20 and £33.60.\n\nThe cost of staffing such a scheme may depend on how it is structured and delivered. For example the designated lead may be a current member of staff, such as a teacher or teaching assistant working within core hours. If this is the case, it is likely that no additional staff costs will be incurred.\n\nTraining\nIt is anticipated that the support and training required for people delivering the scheme (including the designated leads) will be the main cost incurred. This training may be provided by members of an existing community oral health team, or by an external supplier. There are a wide range of potential suppliers of local or online courses on oral health.\n\nTraining may be needed for other frontline staff who work with groups at high risk of poor oral health. This is to ensure they can give advice on the importance of oral health and promote good practice. In one example provided in NICE Costing template for PH55, a 3.5 hour course for 20 delegates cost £15 per delegate. This included raising awareness of a range of oral health issues and equipping them to provide advice on good practice.\n\nExample programme\nStoke on Trent has developed a local supervised toothbrushing programme, targeting a number of special schools and playgroups (16 sites). Children are involved in the programme for the two years they attend nursery. Annual non-pay costs ranged from £9.12 per child in day nurseries (based on 355 children), and £12.59 per child (based on 75 children) in the special schools. The largest component of the non-pay costs were the toothbrushes, tooth paste, toiletry bags, gloves and parent packs. Project support was provided by a Band 5 worker, allocating approximately 10% of their working hours to the implementation of this programme. The project worker trained staff at the nurseries (approximately two hours), with a further visit to support implementation. Audits were carried out twice a year to observe the supervised brushing.\n\nThe cost of delivering the Childsmile programme on a national level in Scotland is also described in Anopa 2015. The largest cost component was staff salary, ranging from 49.1% to 90.4% of the total cost. Total annual costs ranged from £19,881 (under 600 children aged 3 to 4), to £399,650 (over 12,000 children aged 3 to 4).\n"]
[null,"Reference: Macpherson LM, Anopa Y, Conway DI et al. National supervised toothbrushing program and dental decay in Scotland.  J Dent Res.  2013;92(2):109-13.","Macpherson (2013)","2 years (at nursery)","3-4 years (nursery-aged children)",2.0699999999999998,3.06,{"$f":"1-F5/G5","v":0.32352941176470595},null,null,null,2,5]
[null,null,null,2,3]
[null,"Fluoride varnish"]
[null,"Targeted community fluoride varnish programmes are recommended by NICE PH55 and CBOH. Programmes centred on the applications of fluoride varnish in targeted community settings have strong evidence of effectiveness in preventing tooth decay. The model has used the preventive fraction based on the most recent systematic review (Marinho et al., 2013). This review updated the evidence from the first systematic review in 2002.\n\nThe systematic review and meta-analysis included evidence from ten clinical trials combined to estimate the overall impact of fluoride varnish. The majority of trials included were of two year duration, had a biannual application frequency, and were in both community and dental settings. Some of the studies were carried out in populations which may not be representative of the UK population and there was considerable variation in outcomes across the studies. The review suggests a substantial caries inhibiting effect of fluoride varnish in both permanent and primary teeth, however the quality of the evidence was assessed as moderate.\n\nEffectiveness and whether this programme could have an impact on inequalities depends on a number of factors, including appropriate targeting of high-risk populations, providing oral health improvement advice within the programme, as well as high rates of consent, compliance and retention over a two year period.","Source study","Programme length","Age at start of programme","Mean increment in intervention group","Mean increment in control group","Risk ratio for developing one or more new caries","Preventive fraction (reported in study)",null,null,"Time point for PF (after programme start)","Age for PF",null,"Recommendations\nNICE PH55 sets out a number of recommendations for the implementation of a fluoride varnish programme. Programmes should involve at least 2 applications of fluoride varnish per year, over a two year programme. This service could be provided by dental hygienists or specially trained dental nurses commissioned by the local authority. There may be a high cost due to need for clinical personnel. Commissioning Better Oral Health recommends that the use of skill mix may help to reduce costs (e.g. using dental nurses rather than dentists).\n\nStaffing and consumables\nA dental nurse on band 6 would have a salary midpoint of £30,357 (NHS Agenda for Change, 2016/17). Additional overheads, including management, facilities and transport costs should be assessed locally.\n\nThe cost of the materials required for fluoride varnishing should be checked with the provider, but is expected to account for a relatively small proportion of the programme costs.\n\nTraining\nTraining is needed for these staff to perform fluoride varnishing in schools. The associated costs depend on the provider and can vary widely. One example provided in NICE Costing template for PH55, is that training in how to deliver fluoride varnishing would cost £150 per delegate for a group of 15 delegates. The costs were primarily for the student workbooks, the venue and external speakers. \n\nTraining may be needed for other frontline staff who work with groups at high risk of poor oral health. This is to ensure they can give advice on the importance of oral health and promote good practice. In one example provided in NICE Costing template for PH55, a 3.5 hour course for 20 delegates cost £15 per delegate. This included raising awareness of a range of oral health issues and equipping them to provide advice on good practice.\n\nExample programme\nTees Valley has implemented a fluoride varnish programme, treating 50 pupils in a session. The staff requirements are dental nurses applying the varnish, and a dentist. For each session, two nurses delivered varnish over three hours – with an hourly cost of £10 per nurse, this is approximately £60 per session for nurse time. It was estimated that per year, the dentist cost per 200 pupils was £275. Materials required for the programme are fluoride varnish, and toothbrush and paste. The varnish cost is approximately £1.40 per head, per session, and provision of toothbrush and paste is £1.00 per head, per session. The annual administration cost was estimated to be £1.33 per head, and management fee is an additional 20% extra on the total running cost.\n\nThe NICE Costing template for PH55 provides an example of the costs for one local authority delivering twice-yearly fluoride varnish to children aged between 3 and 10. The programme treated around 6,000 children in this age range a year. Fluoride, disposables and other clinical equipment accounted for around 8% of the total cost. The total programme cost was £169,000, and the costs per child were approximately £28 per child per year (see cost breakdown on NICE website)."]
[null,"Reference: Marinho VCC, Worthing HV, Walsh T, Clarkson JE. Fluoride varnishes for preventing dental caries in children and adolescents. Cochrane Database of Systematic Reviews 2013, Issue 7. Art. No,: CD002279.","Marinho (2013)","Majority trials were of 2 years","N/A",1.04,1.65,0.81,0.37,null,null,2,5]
[null,null,null,2,3]
{"$rows_left_out":34}