{"text_format":"1","workbook":"xlsx","n_sheets":26,"sheets":["Contents","Table 1a","Table 1b","Table 1c","Table 1dsupp","Table 1d","List of A and AS level subjects","Table 2","Table 2m","Table 2f","Table 3","Table 3m","Table 3f","Table 4","Table 4m","Table 4f","Table 5","Table 6","Table 7","Table 8","Table 9","Table 10","Table 11a","Table 11b","Table 11c","Table 11d"],"not_rendered":{"charts":0,"images":2,"macros":1,"external_links":6,"defined_names":123,"comments":0,"pivot_tables":0},"unopened":[],"bounds":{"document_bytes":16777216,"sheet_cells":100000,"rows_first":2000,"rows_last":500,"rows_between":2000,"halvings":0,"cell_chars":16384,"cell_head_chars":4096},"cells_cut":0,"cells_raw":0,"read":"whole","date_system":"1900"}

{"sheet":"Contents","index":0,"n_rows":55,"n_cols":3,"rows_kept":55,"cut":false,"hidden":false,"merged":[[22,1,22,2]]}
[]
[]
[]
[]
[]
[]
[null,"A level and other level 3 results (revised): 2013/14"]
[null,"Coverage: England"]
[]
[null,"The full statistical first release is available at  GOV.UK"]
{"$rows_left_out":46}
{"sheet":"Table 1a","index":1,"n_rows":56,"n_cols":36,"rows_kept":56,"cut":false,"hidden":false,"merged":[[41,0,42,7],[48,0,49,7],[6,5,6,7],[6,9,6,11],[36,0,38,5],[4,1,4,15],[4,17,4,35],[5,1,6,3],[5,5,5,11],[5,13,6,15],[5,17,6,19],[5,21,6,23],[5,25,6,27],[5,29,6,31],[5,33,6,35]]}
["Table 1a: A level and level 3 results1,2 3 by institution type and gender"]
["Year: 2013/14 (revised)"]
["Coverage: England"]
[]
[null,"All level 3 qualifications",null,null,null,null,null,null,null,null,null,null,null,null,null,null,null,"A level"]
[null,"Students entered for at least one substantial level 3 qualification4",null,null,null,"Average point score",null,null,null,null,null,null,null,"Percentage of students achieving at least 2 substantial level 3 qualifications ",null,null,null,"Students entered for at least one A level or applied single/double award A level5",null,null,null,"Percentage of students achieving 3 A*-A grades or better at A level or applied single/double award A level6",null,null,null,"Percentage of students achieving grades AAB or better at A level or applied single/double award A level6",null,null,null,"Percentage of students achieving grades AAB or better at A level, of which at least two are in facilitating subjects7",null,null,null,"Percentage of students achieving grades AAB or better at A level, all of which are in facilitating subjects7"]
["Institution type",null,null,null,null,"Per Student",null,null,null,"Per Entry"]
[null,"Males","Females","Total",null,"Males","Females","Total",null,"Males","Females","Total",null,"Males","Females","Total",null,"Males","Females","Total",null,"Males","Females","Total",null,"Males","Females","Total",null,"Males","Females","Total",null,"Males","Females","Total"]
[]
["All state-funded schools8",81262,92692,173954,null,757.1,791.3,775.3,null,211.2,218,214.8,null,97.6,98.3,98,null,68686,82901,151587,null,10.9,9.8000000000000007,10.3,null,17.3,17.5,17.399999999999999,null,14.7,12.4,13.5,null,10.5,7.2,8.6999999999999993]
{"$rows_left_out":47}
{"sheet":"Table 1b","index":2,"n_rows":44,"n_cols":24,"rows_kept":44,"cut":false,"hidden":false,"merged":[[35,0,37,19],[4,17,4,23],[1,3,1,4],[4,1,4,15],[5,1,6,3],[5,5,5,11],[5,13,6,15],[5,17,6,19],[5,21,6,23],[6,5,6,7],[6,9,6,11],[30,0,32,20]]}
["Table 1b: Time series of A level and level 31,2 results by gender"]
["Years: 2005/06 to 2013/14"]
["Coverage: England"]
[]
[null,"All level 3 qualifications",null,null,null,null,null,null,null,null,null,null,null,null,null,null,null,"A level"]
[null,"Students entered for at least one substantial level 3 qualification3",null,null,null,"Average point score",null,null,null,null,null,null,null,"Percentage of students achieving at least 2 substantial level 3 qualifications ",null,null,null,"Students entered for at least one A level or applied single/double award A level4",null,null,null,"Percentage of students achieving 3 A*-A grades or better at A level or applied single/double award A level5"]
[null,null,null,null,null,"Per Student",null,null,null,"Per Entry"]
[null,"Males","Females","Total",null,"Males","Females","Total",null,"Males","Females","Total",null,"Males","Females","Total",null,"Males","Females","Total",null,"Males","Females","Total"]
[]
["2005/06",144229,167258,311487,null,700.9,739.3,721.5,null,201.5,210.2,206.2,null,94,96.1,95.1,null,118593,139692,258285,null,10.5,10.9,10.7]
{"$rows_left_out":35}
{"sheet":"Table 1c","index":3,"n_rows":47,"n_cols":36,"rows_kept":47,"cut":false,"hidden":false,"merged":[[4,1,4,15],[5,1,6,3],[5,5,5,11],[5,13,6,15],[5,17,6,19],[4,17,4,35],[24,0,25,14],[36,0,37,13],[5,33,6,35],[6,5,6,7],[6,9,6,11],[30,0,31,17],[28,0,29,13],[5,21,6,23],[5,25,6,27],[5,29,6,31]]}
["Table 1c: A level and level 3 results1 of state-funded school students2,3 by admissions basis and gender"]
["Year: 2013/14 (revised)"]
["Coverage: England"]
[]
[null,"All Level 3 qualifications",null,null,null,null,null,null,null,null,null,null,null,null,null,null,null,"A level"]
[null,"Students entered for at least one substantial Level 3 qualification4",null,null,null,"Average point score",null,null,null,null,null,null,null,"Percentage of students achieving at least 2 substantial Level 3 qualifications ",null,null,null,"Students entered for at least one A level or Applied single/double award A level5",null,null,null,"Percentage of students achieving 3 A*-A grades or better at A level or Applied single/double award A level 5,6",null,null,null,"Percentage of students achieving grades AAB or better at A level or Applied single/double award A level 5,6",null,null,null,"Percentage of students achieving grades AAB or better at A level, of which at least two are in facilitating subjects7",null,null,null,"Percentage of students achieving grades AAB or better at A level, all of which are in facilitating subjects7"]
["Admissions basis",null,null,null,null,"Per Student",null,null,null,"Per Entry"]
[null,"Males","Females","Total",null,"Males","Females","Total",null,"Males","Females","Total",null,"Males","Females","Total",null,"Males","Females","Total",null,"Males","Females","Total",null,"Males","Females","Total",null,"Males","Females","Total",null,"Males","Females","Total"]
[]
["All state-funded schools, state-funded special",81262,92692,173954,null,757.1,791.3,775.3,null,211.2,218,214.8,null,97.6,98.3,98,null,68686,82901,151587,null,10.9,9.8000000000000007,10.3,null,17.3,17.5,17.399999999999999,null,14.7,12.4,13.5,null,10.5,7.2,8.6999999999999993]
{"$rows_left_out":38}
{"sheet":"Table 1dsupp","index":4,"n_rows":52,"n_cols":60,"rows_kept":52,"cut":false,"hidden":true,"merged":[[41,0,42,7],[4,1,4,15],[4,21,4,35],[4,41,4,55],[5,1,6,3],[5,5,6,7],[5,9,5,15],[5,17,6,19],[5,21,6,23],[5,25,6,27],[5,29,5,35],[5,57,6,59],[6,0,7,0],[6,9,6,11],[6,13,6,15],[6,29,6,31],[6,33,6,35],[6,49,6,51],[6,53,6,55],[5,37,6,39],[5,41,6,43],[5,45,6,47],[5,49,5,55]]}
["Table 1d: Average Point Score and percentage achievements of students aged 16 to 191 by institution type, cohort and gender "]
["Year: 2012/13 (revised)"]
["Coverage: England"]
[]
[null,"A level cohort2",null,null,null,null,null,null,null,null,null,null,null,null,null,null,null,null,null,null,null,"Academic cohort3",null,null,null,null,null,null,null,null,null,null,null,null,null,null,null,null,null,null,null,"Vocational cohort4"]
[null,"Number of students",null,null,null,"Number of Full-Time Equivalents",null,null,null,"Average Point Score ",null,null,null,null,null,null,null,"Percentage of students achieving at least 2 A level qualifications",null,null,null,"Number of students",null,null,null,"Number of Full-Time Equivalents",null,null,null,"Average Point Score ",null,null,null,null,null,null,null,"Percentage of students achieving at least 2 substantial level 3 academic qualifications",null,null,null,"Number of students",null,null,null,"Number of Full-Time Equivalents",null,null,null,"Average Point Score ",null,null,null,null,null,null,null,"Percentage of students achieving at least 2 substantial level 3 vocational qualifications"]
["Institution type",null,null,null,null,null,null,null,null,"Per Entry",null,null,null,"Per Full-Time Equivalent",null,null,null,null,null,null,null,null,null,null,null,null,null,null,null,"Per Entry",null,null,null,"Per Full-Time Equivalent",null,null,null,null,null,null,null,null,null,null,null,null,null,null,null,"Per Entry",null,null,null,"Per Full-Time Equivalent"]
[null,"Males","Females","Total",null,"Males","Females","Total",null,"Males","Females","Total",null,"Males","Females","Total",null,"Males","Females","Total",null,"Males","Females","Total",null,"Males","Females","Total",null,"Males","Females","Total",null,"Males","Females","Total",null,"Males","Females","Total",null,"Males","Females","Total",null,"Males","Females","Total",null,"Males","Females","Total",null,"Males","Females","Total",null,"Males","Females","Total"]
[]
["All state-funded schools5",68686,82901,151587,null,62592.800000000003,76360.100000000006,138952.9,null,210,216.1,213.3,null,767.6,791.1,780.5,null,90.1,92.7,91.5,null,69282,83654,152936,null,63882.6,78083.600000000006,141966.20000000001,null,209.9,216.1,213.3,null,771.3,795.6,784.7,null,90.2,92.7,91.6,null,24148,21889,46037,null,17379.400000000001,14608.4,31987.8,null,223.7,235.1,229,null,668.6,721,692.5,null,66.7,61.6,64.3]
{"$rows_left_out":43}
{"sheet":"Table 1d","index":5,"n_rows":52,"n_cols":20,"rows_kept":52,"cut":false,"hidden":false,"merged":[[5,17,6,19],[4,1,4,19],[41,0,42,7],[5,1,6,3],[5,5,6,7],[5,9,5,15],[6,9,6,11],[6,13,6,15]]}
["Table 1d: Level 3 results1,2,3 by cohort, institution type and gender "]
["Year: 2013/14 (revised)",null,null,null,null,null,1,"1. A level cohort"]
["Coverage: England",null,null,{"$f":"IF(Selectcohort=\"1. A level cohort\",1,IF(Selectcohort=\"2. Academic cohort\",2,IF(Selectcohort=\"3. Vocational cohort\",3)))","v":1},null,null,2,"2. Academic cohort",null,null,{"$f":"VLOOKUP(K4,G2:H4,2,FALSE)","v":"1. A level cohort"}]
[null,null,null,null,null,null,3,"3. Vocational cohort",null,null,1]
[null,{"$f":"K3","v":"1. A level cohort"}]
["                                                        Select Cohort:","Number of students",null,null,null,"Number of Full-Time Equivalents",null,null,null,"Average point score ",null,null,null,null,null,null,null,{"$f":"IF(Selectcohort=\"1. A level cohort\",\"Percentage of students achieving at least 2 A level qualifications\",IF(Selectcohort=\"2. Academic cohort\",\"Percentage of students achieving at least 2 substantial level 3 academic qualifications\",\"Percentage of students achieving at least 2 substantial level 3 vocational qualifications\"))","v":"Percentage of students achieving at least 2 A level qualifications"}]
["Institution type",null,null,null,null,null,null,null,null,"Per entry",null,null,null,"Per Full-Time Equivalent"]
[null,"Males","Females","Total",null,"Males","Females","Total",null,"Males","Females","Total",null,"Males","Females","Total",null,"Males","Females","Total"]
[]
["All state-funded schools4",{"$f":"IF($D$3=1,'Table 1dsupp'!B10,IF($D$3=2,'Table 1dsupp'!V10,IF($D$3=3,'Table 1dsupp'!AP10)))","v":68686},{"$f":"IF($D$3=1,'Table 1dsupp'!C10,IF($D$3=2,'Table 1dsupp'!W10,IF($D$3=3,'Table 1dsupp'!AQ10)))","v":82901},{"$f":"IF($D$3=1,'Table 1dsupp'!D10,IF($D$3=2,'Table 1dsupp'!X10,IF($D$3=3,'Table 1dsupp'!AR10)))","v":151587},null,{"$f":"IF($D$3=1,'Table 1dsupp'!F10,IF($D$3=2,'Table 1dsupp'!Z10,IF($D$3=3,'Table 1dsupp'!AT10)))","v":62592.800000000003},{"$f":"IF($D$3=1,'Table 1dsupp'!G10,IF($D$3=2,'Table 1dsupp'!AA10,IF($D$3=3,'Table 1dsupp'!AU10)))","v":76360.100000000006},{"$f":"IF($D$3=1,'Table 1dsupp'!H10,IF($D$3=2,'Table 1dsupp'!AB10,IF($D$3=3,'Table 1dsupp'!AV10)))","v":138952.9},null,{"$f":"IF($D$3=1,'Table 1dsupp'!J10,IF($D$3=2,'Table 1dsupp'!AD10,IF($D$3=3,'Table 1dsupp'!AX10)))","v":210},{"$f":"IF($D$3=1,'Table 1dsupp'!K10,IF($D$3=2,'Table 1dsupp'!AE10,IF($D$3=3,'Table 1dsupp'!AY10)))","v":216.1},{"$f":"IF($D$3=1,'Table 1dsupp'!L10,IF($D$3=2,'Table 1dsupp'!AF10,IF($D$3=3,'Table 1dsupp'!AZ10)))","v":213.3},null,{"$f":"IF($D$3=1,'Table 1dsupp'!N10,IF($D$3=2,'Table 1dsupp'!AH10,IF($D$3=3,'Table 1dsupp'!BB10)))","v":767.6},{"$f":"IF($D$3=1,'Table 1dsupp'!O10,IF($D$3=2,'Table 1dsupp'!AI10,IF($D$3=3,'Table 1dsupp'!BC10)))","v":791.1},{"$f":"IF($D$3=1,'Table 1dsupp'!P10,IF($D$3=2,'Table 1dsupp'!AJ10,IF($D$3=3,'Table 1dsupp'!BD10)))","v":780.5},null,{"$f":"IF($D$3=1,'Table 1dsupp'!R10,IF($D$3=2,'Table 1dsupp'!AL10,IF($D$3=3,'Table 1dsupp'!BF10)))","v":90.1},{"$f":"IF($D$3=1,'Table 1dsupp'!S10,IF($D$3=2,'Table 1dsupp'!AM10,IF($D$3=3,'Table 1dsupp'!BG10)))","v":92.7},{"$f":"IF($D$3=1,'Table 1dsupp'!T10,IF($D$3=2,'Table 1dsupp'!AN10,IF($D$3=3,'Table 1dsupp'!BH10)))","v":91.5}]
{"$rows_left_out":43}
{"sheet":"List of A and AS level subjects","index":6,"n_rows":119,"n_cols":3,"rows_kept":119,"cut":false,"hidden":false,"merged":[]}
[null,"A level and AS level subjects"]
[null,"This table provides information on the subject groups shown in tables 2 to 4"]
[]
[null,"Subject group","Subjects included"]
[null,"Biological Sciences","Biology"]
[null,null,"Human Biology "]
[null,"Chemistry","Chemistry"]
[null,"Physics","Physics"]
[null,"Other Science","Electronics"]
[null,null,"Environmental Science"]
{"$rows_left_out":110}
{"sheet":"Table 2","index":7,"n_rows":76,"n_cols":11,"rows_kept":76,"cut":false,"hidden":false,"merged":[[4,1,4,9],[5,1,5,9],[5,10,6,10]]}
["Table 2: A level results1 of all students2 by subject and grade"]
["Year: 2013/14 (revised)"]
["Coverage: England"]
[]
[null,"Males and Females"]
["Subject","Percentage achieving grade",null,null,null,null,null,null,null,null,"Number of entries"]
[null,"A*","A","B","C","D","E","Other3","A*-A ","A*-E "]
[]
["Biological Sciences",10.1,18.2,23.4,20.9,16.3,9.4,1.6,28.4,98.4,55847]
["Chemistry",9.4,24,26.3,19,12.6,7.2,1.5,33.5,98.5,47144]
{"$rows_left_out":67}
{"sheet":"Table 2m","index":8,"n_rows":76,"n_cols":11,"rows_kept":76,"cut":false,"hidden":false,"merged":[[4,1,4,9],[5,1,5,9],[5,10,6,10]]}
["Table 2m: A level results1 of male students2 by subject and grade"]
["Year: 2013/14 (revised)"]
["Coverage: England"]
[]
[null,"Males"]
["Subject","Percentage achieving grade",null,null,null,null,null,null,null,null,"Number of entries"]
[null,"A*","A","B","C","D","E","Other3","A*-A ","A*-E "]
[]
["Biological Sciences",10,17.5,23,21,16.7,9.8000000000000007,2,27.5,98,22808]
["Chemistry",10.3,23.5,25.5,18.600000000000001,12.7,7.6,1.8,33.799999999999997,98.2,24321]
{"$rows_left_out":67}
{"sheet":"Table 2f","index":9,"n_rows":76,"n_cols":11,"rows_kept":76,"cut":false,"hidden":false,"merged":[[4,1,4,9],[5,1,5,9],[5,10,6,10]]}
["Table 2f: A level results1 of female students2 by subject and grade"]
["Year: 2013/14 (revised)"]
["Coverage: England"]
[]
[null,"Females"]
["Subject","Percentage achieving grade",null,null,null,null,null,null,null,null,"Number of entries"]
[null,"A*","A","B","C","D","E","Other3","A*-A ","A*-E "]
[]
["Biological Sciences",10.3,18.7,23.7,20.8,15.9,9.1999999999999993,1.4,29,98.6,33039]
["Chemistry",8.6,24.6,27,19.5,12.4,6.7,1.2,33.200000000000003,98.8,22823]
{"$rows_left_out":67}
{"sheet":"Table 3","index":10,"n_rows":77,"n_cols":9,"rows_kept":77,"cut":false,"hidden":false,"merged":[[2,0,2,2],[4,1,4,7],[5,1,5,7],[5,8,6,8],[74,0,75,8]]}
["Table 3:  AS level results1 of all students2 by subject and grade"]
["Year: 2013/14 (revised)"]
["Coverage: England"]
[]
[null,"Males and Females"]
["Subject","Percentage achieving grade",null,null,null,null,null,null,"Number of entries"]
[null,"A","B","C","D","E","Other3","A-E "]
[]
["Biological Sciences",17.100000000000001,16.8,18.399999999999999,16.8,13.8,17,83,82247]
["Chemistry",18.399999999999999,18.5,18.2,15.6,12.6,16.7,83.3,69586]
{"$rows_left_out":68}
{"sheet":"Table 3m","index":11,"n_rows":77,"n_cols":9,"rows_kept":77,"cut":false,"hidden":false,"merged":[[4,1,4,7],[5,1,5,7],[5,8,6,8],[74,0,75,8]]}
["Table 3m: AS level results1 of male students2 by subject and grade"]
["Year: 2013/14 (revised)"]
["Coverage: England"]
[]
[null,"Males"]
["Subject","Percentage achieving grade",null,null,null,null,null,null,"Number of entries"]
[null,"A","B","C","D","E","Other3","A-E "]
[]
["Biological Sciences",15.9,16.2,18.7,16.899999999999999,14.3,18,82,33505]
["Chemistry",19.600000000000001,18.399999999999999,17.7,14.9,12.6,16.8,83.2,35581]
{"$rows_left_out":68}
{"sheet":"Table 3f","index":12,"n_rows":77,"n_cols":9,"rows_kept":77,"cut":false,"hidden":false,"merged":[[4,1,4,7],[5,1,5,7],[5,8,6,8],[74,0,75,8]]}
["Table 3f: AS level results1 of female students2 by subject and grade"]
["Year: 2013/14 (revised)"]
["Coverage: England"]
[]
[null,"Females"]
["Subject","Percentage achieving grade",null,null,null,null,null,null,"Number of entries"]
[null,"A","B","C","D","E","Other3","A-E "]
[]
["Biological Sciences",18,17.3,18.3,16.7,13.4,16.3,83.7,48742]
["Chemistry",17.100000000000001,18.7,18.7,16.3,12.7,16.600000000000001,83.4,34005]
{"$rows_left_out":68}
{"sheet":"Table 4","index":13,"n_rows":75,"n_cols":9,"rows_kept":75,"cut":false,"hidden":false,"merged":[[4,1,4,7],[5,1,5,7],[5,8,6,8],[74,0,74,8]]}
["Table 4: 2013 AS level results1 of all current Year 13 students2 by subject and grade"]
["Year: 2013/14 (revised)"]
["Coverage: England"]
[]
[null,"Males and Females"]
["Subject","Percentage achieving grade",null,null,null,null,null,null,"Number of entries"]
[null,"A","B","C","D","E","Other3","A-E "]
[]
["Biological Sciences",25.3,33.700000000000003,26.4,12.3,1.4,0.8,99.2,12699]
["Chemistry",35,35.299999999999997,20.8,7.8,0.6,0.5,99.5,11090]
{"$rows_left_out":66}
{"sheet":"Table 4m","index":14,"n_rows":75,"n_cols":9,"rows_kept":75,"cut":false,"hidden":false,"merged":[[74,0,74,8],[4,1,4,7],[5,1,5,7],[5,8,6,8]]}
["Table 4m: 2013 AS level results1 of current Year 13 male students2 by subject and grade"]
["Year: 2013/14 (revised)"]
["Coverage: England"]
[]
[null,"Males"]
["Subject","Percentage achieving grade",null,null,null,null,null,null,"Number of entries"]
[null,"A","B","C","D","E","Other3","A-E "]
[]
["Biological Sciences",24.4,32.799999999999997,27.3,12.9,1.8,0.8,99.2,5364]
["Chemistry",33.6,34.9,21.7,8.6,0.7,0.4,99.6,5565]
{"$rows_left_out":66}
{"sheet":"Table 4f","index":15,"n_rows":75,"n_cols":9,"rows_kept":75,"cut":false,"hidden":false,"merged":[[4,1,4,7],[5,1,5,7],[5,8,6,8],[74,0,74,8]]}
["Table 4f: 2013 AS level results1 of current Year 13 female students2 by subject and grade"]
["Year: 2013/14 (revised)"]
["Coverage: England"]
[]
[null,"Females"]
["Subject","Percentage achieving grade",null,null,null,null,null,null,"Number of entries"]
[null,"A","B","C","D","E","Other3","A-E "]
[]
["Biological Sciences",26,34.4,25.8,11.9,1.1000000000000001,0.8,99.2,7335]
["Chemistry",36.299999999999997,35.700000000000003,19.8,7.1,0.5,0.6,99.4,5525]
{"$rows_left_out":66}
{"sheet":"Table 5","index":16,"n_rows":58,"n_cols":11,"rows_kept":58,"cut":false,"hidden":false,"merged":[[4,0,5,0],[4,1,4,9],[4,10,5,10],[55,0,56,8]]}
["Table 5: Applied single A level results1,2 by gender, subject and grade"]
["Year: 2013/14 (revised)"]
["Coverage: England"]
[]
["Gender/Subject","Percentage achieving grade",null,null,null,null,null,null,null,null,"Number of entries"]
[null,"A*","A","B","C","D","E","Other3","A*-A","A*-E"]
[]
["Males and Females"]
["Applied Art & Design",6.9,19.2,28.1,24.6,16.2,3.8,1.2,26.2,98.8,260]
["Applied Business",3.7,11.4,27.7,29.9,18.5,7.6,1.2,15.1,98.8,5673]
{"$rows_left_out":49}
{"sheet":"Table 6","index":17,"n_rows":58,"n_cols":9,"rows_kept":58,"cut":false,"hidden":false,"merged":[[4,0,5,0],[4,1,4,7],[4,8,5,8],[55,0,56,8]]}
["Table 6: Applied single AS level results1,2 by gender, subject and grade"]
["Year: 2013/14 (revised)"]
["Coverage: England"]
[]
["Gender/Subject","Percentage achieving grade",null,null,null,null,null,null,"Number of entries"]
[null,"A","B","C","D","E","Other3","A-E"]
[]
["Males and Females"]
["Applied Art & Design",21.8,26.8,24.1,11.7,11.7,3.9,96.1,257]
["Applied Business",7.4,19.7,27.4,24.4,13.6,7.5,92.5,8327]
{"$rows_left_out":49}
{"sheet":"Table 7","index":18,"n_rows":45,"n_cols":16,"rows_kept":45,"cut":false,"hidden":false,"merged":[[4,0,5,0],[4,1,4,14],[4,15,5,15]]}
["Table 7: Applied double A level results1,2 by gender, subject and grade"]
["Year: 2013/14 (revised)"]
["Coverage: England"]
[]
["Gender/Subject","Percentage achieving grade",null,null,null,null,null,null,null,null,null,null,null,null,null,"Number of entries"]
[null,"A*A*","A*A","AA","AB","BB","BC","CC","CD","DD","DE","EE","Other3","A*A*-AA","A*A*-EE"]
[]
["Males and Females"]
["Applied Art & Design",6.5,7.3,9.6999999999999993,13,19.399999999999999,13.4,12.6,7.3,8.5,"x","x",0,23.5,100,247]
["Applied Business",1.1000000000000001,5.3,2.7,10.9,12.5,15.7,17,12,12.6,4.8,4.2,1.2,9.1,98.8,967]
{"$rows_left_out":36}
{"sheet":"Table 8","index":19,"n_rows":45,"n_cols":13,"rows_kept":45,"cut":false,"hidden":false,"merged":[[4,0,5,0],[4,1,4,11],[4,12,5,12]]}
["Table 8: Applied double AS level results1,2 by gender, subject and grade"]
["Year: 2013/14 (revised)"]
["Coverage: England"]
[]
["Gender/Subject","Percentage achieving grade",null,null,null,null,null,null,null,null,null,null,"Number of entries"]
[null,"AA","AB","BB","BC","CC","CD","DD","DE","EE","Other3","AA-EE"]
[]
["Males and Females"]
["Applied Art & Design",18.7,9.6,14.1,10.6,13.6,10.1,11.1,"x","x",4,96,198]
["Applied Business",5.2,7.2,11,13.5,14.8,14.6,13.1,9.1,5.0999999999999996,6.4,93.6,1025]
{"$rows_left_out":36}
{"sheet":"Table 9","index":20,"n_rows":48,"n_cols":33,"rows_kept":48,"cut":false,"hidden":false,"merged":[[40,0,41,6],[4,1,4,10],[4,12,4,21],[4,23,4,32],[5,0,6,0],[5,1,5,9],[5,10,6,10],[5,12,5,20],[5,21,6,21],[5,23,5,31],[5,32,6,32]]}
["Table 9: A level results1 of students2 by institution type, gender and grade"]
["Year: 2013/14 (revised)"]
["Coverage: England"]
[]
[null,"Males and Females",null,null,null,null,null,null,null,null,null,null,"Males",null,null,null,null,null,null,null,null,null,null,"Females"]
["Institution type","Percentage achieving grade",null,null,null,null,null,null,null,null,"Number of entries",null,"Percentage achieving grade",null,null,null,null,null,null,null,null,"Number of entries",null,"Percentage achieving grade",null,null,null,null,null,null,null,null,"Number of entries"]
[null,"A*","A","B","C","D","E","Other3","A*-A","A*-E",null,null,"A*","A","B","C","D","E","Other3","A*-A","A*-E",null,null,"A*","A","B","C","D","E","Other3","A*-A","A*-E"]
[]
["All state-funded schools4",7.5,16.899999999999999,26.6,25.3,15.7,6.7,1.3,24.4,98.7,427993,null,7.9,16.2,24.6,24.6,17,8,1.7,24.1,98.3,195530,null,7.2,17.399999999999999,28.3,25.8,14.7,5.6,1,24.6,99,232463]
["of which:"]
{"$rows_left_out":39}
{"sheet":"Table 10","index":21,"n_rows":63,"n_cols":11,"rows_kept":63,"cut":false,"hidden":false,"merged":[[56,0,57,10],[4,0,5,0],[4,1,4,9],[4,10,5,10],[49,0,49,4],[50,0,52,7]]}
["Table 10: A level results1 of state-funded school students2 by admissions basis, gender and grade"]
["Year: 2013/14 (revised)"]
["Coverage: England"]
[]
["Admissions basis / Gender","Percentage achieving grade",null,null,null,null,null,null,null,null,"Number of entries"]
[null,"A*","A","B","C","D","E","Other3","A*-A","A*-E"]
[]
["Males and Females"]
[]
["    All state-funded schools, state-funded special",7.5,16.899999999999999,26.6,25.3,15.7,6.7,1.3,24.4,98.7,427993]
{"$rows_left_out":54}
{"sheet":"Table 11a","index":22,"n_rows":78,"n_cols":11,"rows_kept":78,"cut":false,"hidden":false,"merged":[[70,0,70,4],[5,10,6,10],[4,1,4,9],[5,1,5,9],[67,0,68,9]]}
["Table 11a: A level results1 of state-funded school2 students3 by subject and grade"]
["Year: 2013/14 (revised)"]
["Coverage: England"]
[]
[null,"Males and Females"]
["Subject","Percentage achieving grade",null,null,null,null,null,null,null,null,"Number of entries"]
[null,"A*","A","B","C","D","E","Other4","A*-A ","A*-E "]
[]
["Biological Sciences",8.6,16.8,23.8,21.9,17.3,10,1.6,25.5,98.4,33993]
["Chemistry",8.3000000000000007,22.3,27,20.3,13.3,7.4,1.4,30.6,98.6,27777]
{"$rows_left_out":69}
{"sheet":"Table 11b","index":23,"n_rows":77,"n_cols":11,"rows_kept":77,"cut":false,"hidden":false,"merged":[[4,1,4,9],[5,1,5,9],[5,10,6,10]]}
["Table 11b: A level results1 of independent school2 students3 by subject and grade"]
["Year: 2013/14 (revised)"]
["Coverage: England"]
[]
[null,"Males and Females"]
["Subject","Percentage achieving grade",null,null,null,null,null,null,null,null,"Number of entries"]
[null,"A*","A","B","C","D","E","Other4","A*-A ","A*-E "]
[]
["Biological Sciences",20.100000000000001,27.9,23.6,14.8,8.6,3.8,1.1000000000000001,48.1,98.9,8523]
["Chemistry",17.5,35.700000000000003,25,11.8,6.5,2.8,0.6,53.2,99.4,8328]
{"$rows_left_out":68}
{"sheet":"Table 11c","index":24,"n_rows":78,"n_cols":11,"rows_kept":78,"cut":false,"hidden":false,"merged":[[4,1,4,9],[5,1,5,9],[5,10,6,10]]}
["Table 11c: A level results1 of all further education sector college2 students3 by subject and grade"]
["Year: 2013/14 (revised)"]
["Coverage: England"]
[]
[null,"Males and Females"]
["Subject","Percentage achieving grade",null,null,null,null,null,null,null,null,"Number of entries"]
[null,"A*","A","B","C","D","E","Other4","A*-A ","A*-E "]
[]
["Biological Sciences",7.6,15.7,22.4,22.1,18.600000000000001,11.5,2.1,23.3,97.9,13331]
["Chemistry",6.3,19.600000000000001,25.4,21.3,15.1,9.8000000000000007,2.5,25.9,97.5,11039]
{"$rows_left_out":69}
{"sheet":"Table 11d","index":25,"n_rows":78,"n_cols":11,"rows_kept":78,"cut":false,"hidden":false,"merged":[[4,1,4,9],[5,1,5,9],[5,10,6,10]]}
["Table 11d: A level results1 of sixth form college2 students3 by subject and grade"]
["Year: 2013/14 (revised)"]
["Coverage: England"]
[]
[null,"Males and Females"]
["Subject","Percentage achieving grade",null,null,null,null,null,null,null,null,"Number of entries"]
[null,"A*","A","B","C","D","E","Other4","A*-A ","A*-E "]
[]
["Biological Sciences",8.6,17.3,23.4,21.2,17.3,10.5,1.9,25.8,98.1,9624]
["Chemistry",7,21.6,26.3,20.6,13.8,8.6,2.1,28.5,97.9,8292]
{"$rows_left_out":68}