{"text_format":"1","workbook":"xlsx","n_sheets":6,"sheets":["Cover","Contents and Guidance","Glossary and Methodology","Chart 1","Table 1","Data"],"not_rendered":{"charts":1,"images":2,"macros":1,"external_links":2,"defined_names":11,"comments":0,"pivot_tables":0},"unopened":[],"bounds":{"document_bytes":16777216,"sheet_cells":100000,"rows_first":2000,"rows_last":500,"rows_between":2000,"halvings":0,"cell_chars":16384,"cell_head_chars":4096},"cells_cut":0,"cells_raw":0,"read":"whole","date_system":"1900"}

{"sheet":"Cover","index":0,"n_rows":27,"n_cols":3,"rows_kept":27,"cut":false,"hidden":false,"merged":[[5,1,5,2]]}
[]
[]
[]
[]
[]
[null,"Management information"]
[null,"Policy area:","Independent schools and maintained schools and academies."]
[null,"Theme:","Education, children's services and skills"]
[null,"Published on:","2015-11-20"]
[null,"Coverage:","England"]
{"$rows_left_out":18}
{"sheet":"Contents and Guidance","index":1,"n_rows":40,"n_cols":2,"rows_kept":40,"cut":false,"hidden":false,"merged":[]}
[]
[null,"Management Information: Parent View 2014/15"]
[null,"Contents and Guidance"]
[]
[null,"What data does this release cover?"]
[]
[null,"This data release covers the submissions received to Parent View in the 2014/15 academic year (1 September 2014 – 31 August 2015) for:"]
[null,"√ maintained schools and academies who were open throughout the academic year"]
[null,"√ independent schools who were open and eligible for inspection by Ofsted throughout the academic year"]
[]
{"$rows_left_out":31}
{"sheet":"Glossary and Methodology","index":2,"n_rows":37,"n_cols":2,"rows_kept":37,"cut":false,"hidden":false,"merged":[]}
[]
[null,"Methodology"]
[]
[null,"What data was used to produce this management information?"]
[null,"▪ Data regarding opening/closing dates and school capacity was taken from Edubase on 03/11/2015."]
[null,"▪ For independent schools, additional information regarding inspectorate changes was taken from Edubase on 16/11/2015."]
[null,"▪ Data regarding total pupil numbers was taken from Edubase, according to the 15/01/2015 census."]
[null,"▪ The data extract from Parent View contains submissions received between 01/09/2014 and 31/08/2015."]
[]
[null,"How are response rates calculated?"]
{"$rows_left_out":28}
{"sheet":"Chart 1","index":3,"n_rows":48,"n_cols":17,"rows_kept":48,"cut":false,"hidden":false,"merged":[[19,5,19,6],[1,1,1,6],[5,1,6,1],[5,2,5,6],[2,2,2,4]]}
[]
[null,{"$f":"\"Chart 1: Parent View responses received for \" &  LOWER(C3) & \" in England between 1 September 2014 and 31 August 2015\"","v":"Chart 1: Parent View responses received for maintained schools and academies in England between 1 September 2014 and 31 August 2015"}]
[null,"Select chart1,2:","Maintained schools and academies",null,null,null,null,null,null,null,null,"Independent schools"]
[null,null,null,null,null,null,null,null,null,null,null,"Maintained schools and academies"]
[null,"This table shows the number of submissions received per response."]
[null,"Parent View question:",{"$f":"\"Parents' responses (based on \" & TEXT(L8,\"0,000\") & \" submissions)\"","v":"Parents' responses (based on 285,424 submissions)"}]
[null,null,"Strongly agree","Agree","Disagree","Strongly disagree","Don't know"]
[null,"Q1. My child is happy at this school",{"$f":"$L$8*(M12/100)","v":182574.99999999991},{"$f":"$L$8*(N12/100)","v":81129.000000000029},{"$f":"$L$8*(O12/100)","v":12450.000000000024},{"$f":"$L$8*(P12/100)","v":7958.9999999999718},{"$f":"$L$8*(Q12/100)","v":1311.0000000000455},null,null,null,null,{"$f":"VLOOKUP(C3,Data!$A:$BH,MATCH(\"Number of Submissions\",Data!$1:$1,0),FALSE)","v":285424}]
[null,"Q2. My child feels safe at this school",183617.99999999994,83297.000000000116,9922.0000000000382,6267.9999999998599,{"$f":"$L$8*(Q13/100)","v":2319.0000000000459}]
[null,"Q3. My child makes good progress at this school",145371.00000000006,103550.00000000012,21616.999999999967,9938.0000000000018,4948.0000000001392]
{"$rows_left_out":39}
{"sheet":"Table 1","index":4,"n_rows":47,"n_cols":27,"rows_kept":47,"cut":false,"hidden":false,"merged":[[3,10,3,17],[1,1,1,17],[4,1,4,4]]}
[null,null,null,null,null,null,null,null,null,null,null,null,null,null,null,null,null,null,null,null,null,null,null,null,null,null,"Q1. My child is happy at this school (%)"]
[null,"Table 1: Submissions made to Parent View, between 1 September 2014 and 31 August 2015, for schools in England, broken down by type of school, phase, region and question1,2,3",null,null,null,null,null,null,null,null,null,null,null,null,null,null,null,null,null,null,null,null,null,null,null,null,"Q2. My child feels safe at this school (%)"]
[null,null,null,null,null,null,null,null,null,null,null,null,null,null,null,null,null,null,null,null,null,null,null,null,null,null,"Q3. My child makes good progress at this school (%)"]
[null,null,null,null,null,null,null,null,null,null,"Q1. My child is happy at this school (%)",null,null,null,null,null,null,null,null,null,null,null,null,null,null,null,"Q4. My child is well looked after at this school (%)"]
[null,"For more information about Parent View visit: \nhttp://parentview.ofsted.gov.uk",null,null,null,"Number of submissions",null,"Response rate (%)",null,null,{"$f":"IF(K4=AA12,\"\", \"Strongly agree\")","v":"Strongly agree"},{"$f":"IF(K4=AA12, \"Yes\", \"Agree\")","v":"Agree"},{"$f":"IF(K4=AA12, \"\", \"Disagree\")","v":"Disagree"},{"$f":"IF(K4=AA12, \"No\", \"Strongly disagree\")","v":"Strongly disagree"},{"$f":"IF(K4=AA12, \"\", \"Don't know\")","v":"Don't know"},null,"Positive","Negative",null,null,null,null,null,null,null,null,"Q5. My child is taught well at this school (%)"]
[null,null,null,null,null,null,null,null,null,null,null,null,null,null,null,null,null,null,null,null,null,null,null,null,null,null,"Q6. My child receives appropriate homework for their age (%)"]
[null,"Parent View benchmarks for schools in England",null,null,null,null,null,null,null,null,null,null,null,null,null,null,null,null,null,null,null,null,null,null,null,null,"Q7. This school makes sure its pupils are well behaved (%)"]
[null,null,null,null,null,null,null,null,null,null,null,null,null,null,null,null,null,null,null,null,null,null,null,null,null,null,"Q8. This school deals effectively with bullying (%)"]
[null,"Independent schools",null,null,null,{"$f":"VLOOKUP($B$9,Data!$A:$BH,MATCH($F$5,Data!$1:$1,0),FALSE)","v":3528},null,{"$f":"VLOOKUP($B$9,Data!$A:$BH,MATCH($H$5,Data!$1:$1,0),FALSE)","v":3.9952890016307001},null,null,{"$f":"IF($K$5=\"\",\"\",VLOOKUP($B$9,Data!$A:$BH,MATCH(CONCATENATE($K$5,LEFT($K$4,3)),Data!$1:$1,0),FALSE))","v":77.210884353741505},{"$f":"IF($L$5=\"\",\"\",VLOOKUP($B$9,Data!$A:$BH,MATCH(CONCATENATE($L$5,LEFT($K$4,3)),Data!$1:$1,0),FALSE))","v":17.233560090702898},{"$f":"IF($M$5=\"\",\"\",VLOOKUP($B$9,Data!$A:$BH,MATCH(CONCATENATE($M$5,LEFT($K$4,3)),Data!$1:$1,0),FALSE))","v":3.0895691609977001},{"$f":"IF($N$5=\"\",\"\",VLOOKUP($B$9,Data!$A:$BH,MATCH(CONCATENATE($N$5,LEFT($K$4,3)),Data!$1:$1,0),FALSE))","v":1.7573696145125},{"$f":"IF($O$5=\"\",\"\",VLOOKUP($B$9,Data!$A:$BH,MATCH(CONCATENATE($O$5,LEFT($K$4,3)),Data!$1:$1,0),FALSE))","v":0.70861678004539996},null,{"$f":"SUM($K$9:$L$9)","v":94.4444444444444},{"$f":"SUM($M$9:$N$9)","v":4.8469387755101998},null,null,null,null,null,null,null,null,"Q9. This school is well led and managed (%)"]
[null,"Average number of submissions per independent school",null,null,null,{"$f":"VLOOKUP($B$10,Data!$A:$BH,MATCH($F$5,Data!$1:$1,0),FALSE)","v":4},null,null,null,null,null,null,null,null,null,null,null,null,null,null,null,null,null,null,null,null,"Q10. This school responds well to any concerns I raise (%)"]
{"$rows_left_out":38}
{"sheet":"Data","index":5,"n_rows":18,"n_cols":60,"rows_kept":18,"cut":false,"hidden":true,"merged":[]}
["Group Description","Number of Submissions","Response Rate (%)","Strongly AgreeQ1.","AgreeQ1.","DisagreeQ1.","Strongly DisagreeQ1.","Don't KnowQ1.","Strongly AgreeQ2.","AgreeQ2.","DisagreeQ2.","Strongly DisagreeQ2.","Don't KnowQ2.","Strongly AgreeQ3.","AgreeQ3.","DisagreeQ3.","Strongly DisagreeQ3.","Don't KnowQ3.","Strongly AgreeQ4.","AgreeQ4.","DisagreeQ4.","Strongly DisagreeQ4.","Don't KnowQ4.","Strongly AgreeQ5.","AgreeQ5.","DisagreeQ5.","Strongly DisagreeQ5.","Don't KnowQ5.","Strongly AgreeQ6.","AgreeQ6.","DisagreeQ6.","Strongly DisagreeQ6.","Don't KnowQ6.","Strongly AgreeQ7.","AgreeQ7.","DisagreeQ7.","Strongly DisagreeQ7.","Don't KnowQ7.","Strongly AgreeQ8.","AgreeQ8.","DisagreeQ8.","Strongly DisagreeQ8.","Don't KnowQ8.","Strongly AgreeQ9.","AgreeQ9.","DisagreeQ9.","Strongly DisagreeQ9.","Don't KnowQ9.","Strongly AgreeQ10","AgreeQ10","DisagreeQ10","Strongly DisagreeQ10","Don't KnowQ10","Strongly AgreeQ11","AgreeQ11","DisagreeQ11","Strongly DisagreeQ11","Don't KnowQ11","YesQ12","NoQ12"]
["Average number of submissions per independent school",4,0,0,0,0,0,0,0,0,0,0,0,0,0,0,0,0,0,0,0,0,0,0,0,0,0,0,0,0,0,0,0,0,0,0,0,0,0,0,0,0,0,0,0,0,0,0,0,0,0,0,0,0,0,0,0,0,0,0]
["Average number of submissions per maintained school",13,0,0,0,0,0,0,0,0,0,0,0,0,0,0,0,0,0,0,0,0,0,0,0,0,0,0,0,0,0,0,0,0,0,0,0,0,0,0,0,0,0,0,0,0,0,0,0,0,0,0,0,0,0,0,0,0,0,0]
["East Midlands",24935,3.8154097567992,62.117505514337303,29.889713254461601,4.7002205734910998,2.8794866653299001,0.41307399238019998,62.526569079607,30.872267896531,3.6775616603168002,2.2257870463203999,0.69781431722480003,49.969921796671301,36.944054541808697,7.7722077401243004,3.4529777421294998,1.8608381792661,56.170042109484697,33.860036093844002,5.9474634048526003,2.6709444555844999,1.3515139362341999,48.425907359133703,37.870463204331301,7.6438740725886998,3.2524563866051999,2.8072989773410999,37.4092640866252,44.098656506917997,11.1570082213756,4.2510527371164999,3.0840184479646999,47.367154601965098,37.653900140364897,7.7280930419090001,4.2590735913374997,2.9917786244235001,36.719470623621397,30.639663124122698,6.5289753358732998,5.8271505915380004,20.284740324844599,50.086224182875497,31.0166432725085,7.4273110086224001,6.7736113896130004,4.6962101463805999,47.202727090435097,31.5219570884299,9.1718468016843993,6.6532985762983996,5.4501704431522002,44.126729496691397,38.427912572689003,11.2291959093643,4.6761580108281997,1.5400040104271,85.582514537798303,14.4174854622017]
["East of England",41271,4.8548052207771999,62.157447117830898,30.081655399675299,4.6109859223183003,2.6895398706112998,0.46037168956410002,62.4385161493543,31.0338978944053,3.5787841341378002,2.1128637542100002,0.83593806789269998,47.8883477502362,38.1551210292942,8.1800780208863006,3.7483947566087998,2.0280584429744999,55.053185045189103,34.997940442441397,5.764338155121,2.7331540306752999,1.4513823265731001,46.6986503840469,38.906253785951399,7.9765452739212002,3.6732814809429999,2.7452690751375002,36.073756390686,45.021928230476597,11.589251532553099,4.5504107000073004,2.7646531462769999,46.977296406677802,38.283540500593602,7.5888638511303004,4.2354195439896998,2.9148796976084999,34.656296188607001,31.021782849943101,7.0339948147609999,5.5608054081558,21.727120738533099,49.603838046085599,31.201085507983802,8.0201594339850999,7.1599912771680003,4.0149257347773997,45.5792202757384,32.497395265440602,9.4860798139128999,6.7601948099150002,5.6771098349931002,42.5359211068305,39.083133435099697,11.8606285285067,4.9259770783359,1.5943398512272999,85.311720094012699,14.688279905987301]
["Independent schools",3528,3.9952890016307001,77.210884353741505,17.233560090702898,3.0895691609977001,1.7573696145125,0.70861678004539996,78.7414965986395,16.581632653061199,2.2108843537415002,1.6156462585033999,0.85034013605439995,66.865079365079396,25.255102040816301,4.0249433106575996,2.4659863945578002,1.3888888888888999,75.396825396825406,18.5090702947846,3.4863945578230999,1.8707482993197,0.73696145124720003,67.431972789115605,24.376417233560101,4.3367346938775997,2.2675736961450998,1.5873015873016001,56.0374149659864,29.138321995464899,6.2641723356009003,2.8344671201814,5.7256235827664002,71.116780045351504,21.7687074829932,3.4580498866212999,2.1258503401361,1.530612244898,57.8514739229025,22.8741496598639,3.4580498866212999,3.2312925170067999,12.5850340136054,62.840136054421798,25.566893424036301,4.8185941043084002,5.1303854875282999,1.6439909297052,62.443310657596399,24.092970521542,5.5272108843536998,4.9886621315193,2.9478458049887002,61.0827664399093,29.024943310657601,6.1507936507937,2.5793650793651,1.1621315192743999,91.496598639455797,8.5034013605441992]
["London",35223,2.8816489285547999,66.746160179428202,26.837577719104001,3.3955086165289998,2.4784941657439998,0.54225931919479997,66.144280725662199,27.984555546092,2.8986741617692999,2.0952218720721998,0.87726769440420005,53.215228685801897,35.950941146410003,6.1834596712375003,2.9781676745308001,1.6722028220197001,58.725832552593502,32.586662124180201,4.6645657666864997,2.6687107855662,1.3542287709734999,52.607671123981497,36.382477358544101,5.8143826477017999,2.7822729466542002,2.4131959231183999,41.316753257814497,41.725577037731,9.9622405814382997,3.9207336115606002,3.0746955114555998,54.717088266189698,34.278738324390297,5.3005138687789,3.2308434829514998,2.4728160576896001,39.871674757970602,30.3040626863129,5.2692842744797002,4.3834994179939004,20.1714788632428,54.992476506827899,30.446015387672801,5.8910371064360998,5.1954688697725997,3.4750021292905,48.119126706981199,33.265196036680599,7.8641796553388001,5.3885245436220996,5.3629730573772996,47.815347926070999,37.191607756295603,9.6073588280384996,3.9377679357237998,1.4479175538711,88.5841637566363,11.4158362433637]
["Maintained schools and academies",285424,3.7332516758789001,63.966239699534697,28.424028813274301,4.3619317226302003,2.7884830988284,0.45931666573239999,64.331660967543002,29.183600538146798,3.4762318515612001,2.1960311676663,0.81247547508270002,50.931596502046098,36.279359829586902,7.5736448231402997,3.4818375469477001,1.7335612982791,57.689963002410501,32.7186921912663,5.5005885980156002,2.7453893155446001,1.345366892763,49.950950165367999,36.963254666741399,7.2611273053421996,3.2509529682156999,2.5737148943325998,38.7763467683166,43.172963731150901,10.8126856886597,4.3542238914737004,2.8837799203991001,49.562755759852003,36.503587645047403,7.0418044733449001,4.0865519367678003,2.8053001849879,37.328675934749697,30.243777678120999,6.5218762262459,5.4788665283927998,20.4268036324906,51.941672739503304,30.2231066763832,7.2211867257132996,6.6357419137843996,3.9782919446156999,48.146616962834202,31.321822972139699,8.9382812937944998,6.4122148102471996,5.1810639609843996,45.457985313078098,37.3854336005381,11.055482370088001,4.6839088513930003,1.4171898649026999,86.035161724311905,13.9648382756881]
["North East, Yorkshire and Humber",36957,3.2019192101285001,63.157182671753702,28.0894011959845,4.9949941824281998,3.2903103606894,0.4681115891441,63.2112996184755,29.431501474686801,3.9775955840571,2.5813783586330001,0.79822496414749999,52.249912059961602,34.797196742159798,7.481667884298,3.8666558432773002,1.6045674703032999,57.7968990989528,31.690884000324701,6.0150986281353997,3.2145466352788001,1.2825716373081999,51.018751522039103,35.487187812863603,7.3734339908541999,3.6123061936846002,2.5083204805585,39.5432529696674,42.2031009010472,10.650215114863199,4.6784100441053003,2.9250209703169001,48.559136293530301,35.971534486024296,7.5926076250778003,4.7298211434911002,3.1469004518764998,37.843980842600899,29.1122114890278,6.8890873176934999,6.2288605676867999,19.925859782991001,50.244879183916403,30.113375003382298,7.7766052439321003,7.3409638228210996,4.524176745948,48.854073653164498,29.577617230835799,9.3243499201775002,7.1813188299916,5.0626403658305996,46.481045539410701,35.7577725464729,11.2996184755256,5.1275807018968003,1.333982736694,84.509024000865907,15.490975999134101]
["North West",33935,3.2639191459851999,64.629438632680106,27.260940032414901,4.5263002799469998,3.0175335199646001,0.56578753499339995,65.304258140562794,27.814940327095901,3.6157359658170001,2.4605864152054999,0.80447915131869996,53.428613525858303,33.835273316634698,7.3964932960071001,3.7424487991749,1.5971710623249999,59.861499926329799,30.443494916752599,5.3956092529835997,2.9821717990276002,1.3172241049064,52.450272579932196,34.233092677176998,7.4082805363194,3.4949167526153002,2.4134374539560999,41.676734934433497,40.306468248121398,10.3933991454251,4.9447473110358002,2.6786503609842001,52.314719316340103,33.514071018122898,6.9780462649182002,4.5852364815088,2.6079269191101,40.554000294681003,27.608663621629599,6.5153970826579997,6.0085457492265002,19.3133932518049,53.481656107263902,28.156770296154399,7.2668336525711004,7.2020038308530996,3.8927361131575,50.620303521437997,28.277589509356101,8.9052600559894,6.9338441137468996,5.2630027994696,48.937674966848398,34.159422425224697,10.4611757772212,5.1392367761897999,1.3024900545160001,85.177545307204994,14.8224546927951]
{"$rows_left_out":8}