{"text_format":"1","workbook":"xlsx","n_sheets":6,"sheets":["Cover","Contents and Guidance","Glossary and Methodology","Chart 1","Table 1","Data"],"not_rendered":{"charts":1,"images":2,"macros":1,"external_links":2,"defined_names":11,"comments":0,"pivot_tables":0},"unopened":[],"bounds":{"document_bytes":16777216,"sheet_cells":100000,"rows_first":2000,"rows_last":500,"rows_between":2000,"halvings":0,"cell_chars":16384,"cell_head_chars":4096},"cells_cut":0,"cells_raw":0,"read":"whole","date_system":"1900"}

{"sheet":"Cover","index":0,"n_rows":27,"n_cols":3,"rows_kept":27,"cut":false,"hidden":false,"merged":[[5,1,5,2]]}
[]
[]
[]
[]
[]
[null,"Management information"]
[null,"Policy area:","Independent schools and maintained schools and academies."]
[null,"Theme:","Education, children's services and skills"]
[null,"Published on:","2015-11-20"]
[null,"Coverage:","England"]
[null,"Period covered:","Parent View submissions received between 1 September 2014 and 31 August 2015."]
[null,"Status:","Management Information"]
[null,"Statistician:","Paul Moore"]
[null,"Public enquiries:","enquiries@ofsted.gov.uk"]
[null,"Press enquiries:","pressenquiries@ofsted.gov.uk"]
[null,"Link to official statistics release web page:","https://www.gov.uk/government/collections/maintained-schools-and-academies-inspections-and-outcomes-official-statistics"]
[]
[]
[null,"© Crown copyright 2015"]
[]
[null,"You may use and re-use this information (not including logos) free of charge in any format or medium, "]
[null,"under the terms of the Open Government Licence. "]
[null,"To view this licence, visit:"]
[null,"http://www.nationalarchives.gov.uk/doc/open-government-licence/"]
[null,"Or write to the Information Policy Team, The National Archives, Kew, London, TW9 4DU"]
[null,"Or email:"]
[null,"psi@nationalarchives.gsi.gov.uk"]

{"sheet":"Contents and Guidance","index":1,"n_rows":40,"n_cols":2,"rows_kept":40,"cut":false,"hidden":false,"merged":[]}
[]
[null,"Management Information: Parent View 2014/15"]
[null,"Contents and Guidance"]
[]
[null,"What data does this release cover?"]
[]
[null,"This data release covers the submissions received to Parent View in the 2014/15 academic year (1 September 2014 – 31 August 2015) for:"]
[null,"√ maintained schools and academies who were open throughout the academic year"]
[null,"√ independent schools who were open and eligible for inspection by Ofsted throughout the academic year"]
[]
[null,"It does not include submissions received for:"]
[null,"x schools who opened or closed between 1 September 2014 and 31 August 2015"]
[null,"x maintained schools which converted to academy status during this period"]
[null,"x independent schools who changed inspectorate during this period"]
[]
[null,"What data is contained in this spreadsheet?"]
[]
[null,"Chart 1: Parent View responses received for independent schools/maintained schools and academies in England between 1 September 2014 and 31 August 2015"]
[]
[null,"This sheet details the number of submissions received for each question by response (Strongly agree, Agree, Disagree, Strongly disagree, Don't know) along with a chart which demonstrates the proportion of responses received per question."]
[]
[null,"� The dropdown box below the title, highlighted in blue, can be used to filter the charts to show the results for either independent schools or maintained schools and academies in \n    England."]
[null,"Table 1: Submissions made to Parent View, between 1 September 2014 and 31 August 2015, for schools in England, broken down by type of school, phase, region and question"]
[]
[null,"Table 1 provides an overview of the Parent View results for independent schools and maintained schools and academies within England. The results are broken down by each question and additional information provided includes:"]
[null,"▪ the total number of submissions received and the response rate for each category,"]
[null,"▪ the percentage of positive and negative responses received for each question,"]
[null,"▪ and for maintained schools and academies, a further break down by phase (Nursery, Primary, Secondary, Special and Pupil referral unit) and region."]
[]
[null,"� You can select the question you want to look at by clicking on the blue drop down box in the top right hand corner. The data will update to reflect your choice."]
[]
[null,"How can I use this data?"]
[null,"This data can be used to compare the performance of individual schools against the performance of those in England or those of the same phase or region. For example:"]
[null,"▪ Parents and guardians can see how their child’s school compares to others, and consider the performance of potential schools their child may attend. "]
[null,"▪ Teachers, leaders and governors can see how their own school performs against other schools."]
[]
[null,"What are its limitations?"]
[null,"▪ The data is representative of the views of parents and guardians who filled in the questionnaire, but response rates are low so any conclusions should be made with caution."]
[null,"▪ The data for independent schools covers those inspected by Ofsted, and not by other inspectorates."]
[null,"▪ Response rates are estimates based upon pupil numbers because no data is available on the number of parents and guardians whose children attend any given school. More detail \n  about this can be found on the Glossary and Methodology tab."]

{"sheet":"Glossary and Methodology","index":2,"n_rows":37,"n_cols":2,"rows_kept":37,"cut":false,"hidden":false,"merged":[]}
[]
[null,"Methodology"]
[]
[null,"What data was used to produce this management information?"]
[null,"▪ Data regarding opening/closing dates and school capacity was taken from Edubase on 03/11/2015."]
[null,"▪ For independent schools, additional information regarding inspectorate changes was taken from Edubase on 16/11/2015."]
[null,"▪ Data regarding total pupil numbers was taken from Edubase, according to the 15/01/2015 census."]
[null,"▪ The data extract from Parent View contains submissions received between 01/09/2014 and 31/08/2015."]
[]
[null,"How are response rates calculated?"]
[null,"▪ Response rates are calculated by dividing the total number of submissions received for each category by the total number of pupils recorded as attending the schools within that \n  category. Where pupil numbers of 1 or 2 have been suppressed for a school, 2 has been used as their total within this calculation."]
[null,"▪ School capacity has been used when there is a true value of zero or if no information is available regarding the total number of pupils."]
[null,"▪ In the small number of cases where neither pieces of information are available, the schools submissions are removed from the calculation. However, their submissions are still included  \n  in the total number of submissions received and within the breakdown of responses by question."]
[]
[null,"What other important points are there to note?"]
[null,"▪ Data in the tables and charts are rounded so may not add to 100%."]
[null,"▪ As there is only a small number of independent schools, the Parent View results have not been broken down any further from the overall figure for England."]
[null,"▪ Parents and guardians can update their views on schools throughout the year. This data set contains each individuals' most recent entry in that period."]
[]
[null,"Glossary1"]
[]
[null,"Academy Converter"]
[null,"All schools that have chosen through Governing Body Resolution and application to the Secretary of State to become an Academy under the Academies Act 2010."]
[]
[null,"Independent School"]
[null,"An Independent School is any school which provides full time education for 5 or more pupils of compulsory school age, which is not maintained by a local authority or a non-maintained special school."]
[]
[null,"Phase"]
[null,"Schools have been grouped according to Ofsted’s phase of education. All-through schools have been categorised as secondary. As a majority of their funding comes from local authorities, non-maintained special schools have been categorised as special and not as an independent school. "]
[]
[null,"Pupil Referral Unit"]
[null,"A Pupil Referral Unit (PRU) is established and maintained by a local authority which is specially organised to provide education for children who are excluded, sick or otherwise unable to attend mainstream school and is not a special or other type of school."]
[]
[null,"Region"]
[null,"Schools have been grouped according to Ofsted region. This is similar to the government office region, however the North East and Yorkshire and Humber regions are combined.  "]
[]
[null,"1. Definitions regarding school types were taken from Edubase."]

{"sheet":"Chart 1","index":3,"n_rows":48,"n_cols":17,"rows_kept":48,"cut":false,"hidden":false,"merged":[[19,5,19,6],[1,1,1,6],[5,1,6,1],[5,2,5,6],[2,2,2,4]]}
[]
[null,{"$f":"\"Chart 1: Parent View responses received for \" &  LOWER(C3) & \" in England between 1 September 2014 and 31 August 2015\"","v":"Chart 1: Parent View responses received for maintained schools and academies in England between 1 September 2014 and 31 August 2015"}]
[null,"Select chart1,2:","Maintained schools and academies",null,null,null,null,null,null,null,null,"Independent schools"]
[null,null,null,null,null,null,null,null,null,null,null,"Maintained schools and academies"]
[null,"This table shows the number of submissions received per response."]
[null,"Parent View question:",{"$f":"\"Parents' responses (based on \" & TEXT(L8,\"0,000\") & \" submissions)\"","v":"Parents' responses (based on 285,424 submissions)"}]
[null,null,"Strongly agree","Agree","Disagree","Strongly disagree","Don't know"]
[null,"Q1. My child is happy at this school",{"$f":"$L$8*(M12/100)","v":182574.99999999991},{"$f":"$L$8*(N12/100)","v":81129.000000000029},{"$f":"$L$8*(O12/100)","v":12450.000000000024},{"$f":"$L$8*(P12/100)","v":7958.9999999999718},{"$f":"$L$8*(Q12/100)","v":1311.0000000000455},null,null,null,null,{"$f":"VLOOKUP(C3,Data!$A:$BH,MATCH(\"Number of Submissions\",Data!$1:$1,0),FALSE)","v":285424}]
[null,"Q2. My child feels safe at this school",183617.99999999994,83297.000000000116,9922.0000000000382,6267.9999999998599,{"$f":"$L$8*(Q13/100)","v":2319.0000000000459}]
[null,"Q3. My child makes good progress at this school",145371.00000000006,103550.00000000012,21616.999999999967,9938.0000000000018,4948.0000000001392]
[null,"Q4. My child is well looked after at this school",164661.00000000015,93386.999999999927,15700.000000000047,7836.0000000000191,3839.9999999998654,null,null,null,null,null,"Strongly agree","Agree","Disagree","Strongly disagree","Don't know"]
[null,"Q5. My child is taught well at this school",142571.99999999994,105501.99999999996,20724.99999999992,9278.99999999998,7345.9999999998799,null,null,null,null,"Q1. My child is happy at this school",{"$f":"VLOOKUP($C$3,Data!$A:$BH,MATCH(CONCATENATE('Chart 1'!M$11,LEFT('Chart 1'!$L12,3)),Data!$1:$1,0),FALSE)","v":63.966239699534697},{"$f":"VLOOKUP($C$3,Data!$A:$BH,MATCH(CONCATENATE('Chart 1'!N$11,LEFT('Chart 1'!$L12,3)),Data!$1:$1,0),FALSE)","v":28.424028813274301},{"$f":"VLOOKUP($C$3,Data!$A:$BH,MATCH(CONCATENATE('Chart 1'!O$11,LEFT('Chart 1'!$L12,3)),Data!$1:$1,0),FALSE)","v":4.3619317226302003},{"$f":"VLOOKUP($C$3,Data!$A:$BH,MATCH(CONCATENATE('Chart 1'!P$11,LEFT('Chart 1'!$L12,3)),Data!$1:$1,0),FALSE)","v":2.7884830988284},{"$f":"VLOOKUP($C$3,Data!$A:$BH,MATCH(CONCATENATE('Chart 1'!Q$11,LEFT('Chart 1'!$L12,3)),Data!$1:$1,0),FALSE)","v":0.45931666573239999}]
[null,"Q6. My child receives appropriate homework for their age",110676.99999999997,123226.00000000015,30862.000000000062,12427.999999999894,8230.9999999999272,null,null,null,null,"Q2. My child feels safe at this school",{"$f":"VLOOKUP($C$3,Data!$A:$BH,MATCH(CONCATENATE('Chart 1'!M$11,LEFT('Chart 1'!$L13,3)),Data!$1:$1,0),FALSE)","v":64.331660967543002},{"$f":"VLOOKUP($C$3,Data!$A:$BH,MATCH(CONCATENATE('Chart 1'!N$11,LEFT('Chart 1'!$L13,3)),Data!$1:$1,0),FALSE)","v":29.183600538146798},{"$f":"VLOOKUP($C$3,Data!$A:$BH,MATCH(CONCATENATE('Chart 1'!O$11,LEFT('Chart 1'!$L13,3)),Data!$1:$1,0),FALSE)","v":3.4762318515612001},{"$f":"VLOOKUP($C$3,Data!$A:$BH,MATCH(CONCATENATE('Chart 1'!P$11,LEFT('Chart 1'!$L13,3)),Data!$1:$1,0),FALSE)","v":2.1960311676663},{"$f":"VLOOKUP($C$3,Data!$A:$BH,MATCH(CONCATENATE('Chart 1'!Q$11,LEFT('Chart 1'!$L13,3)),Data!$1:$1,0),FALSE)","v":0.81247547508270002}]
[null,"Q7. This school makes sure its pupils are well behaved",141463.99999999997,104190.0000000001,20098.999999999945,11664.000000000126,8006.9999999998645,null,null,null,null,"Q3. My child makes good progress at this school",{"$f":"VLOOKUP($C$3,Data!$A:$BH,MATCH(CONCATENATE('Chart 1'!M$11,LEFT('Chart 1'!$L14,3)),Data!$1:$1,0),FALSE)","v":50.931596502046098},{"$f":"VLOOKUP($C$3,Data!$A:$BH,MATCH(CONCATENATE('Chart 1'!N$11,LEFT('Chart 1'!$L14,3)),Data!$1:$1,0),FALSE)","v":36.279359829586902},{"$f":"VLOOKUP($C$3,Data!$A:$BH,MATCH(CONCATENATE('Chart 1'!O$11,LEFT('Chart 1'!$L14,3)),Data!$1:$1,0),FALSE)","v":7.5736448231402997},{"$f":"VLOOKUP($C$3,Data!$A:$BH,MATCH(CONCATENATE('Chart 1'!P$11,LEFT('Chart 1'!$L14,3)),Data!$1:$1,0),FALSE)","v":3.4818375469477001},{"$f":"VLOOKUP($C$3,Data!$A:$BH,MATCH(CONCATENATE('Chart 1'!Q$11,LEFT('Chart 1'!$L14,3)),Data!$1:$1,0),FALSE)","v":1.7335612982791}]
[null,"Q8. This school deals effectively with bullying",106544.99999999997,86323.000000000073,18615.000000000098,15637.999999999865,58302.999999999971,null,null,null,null,"Q4. My child is well looked after at this school",{"$f":"VLOOKUP($C$3,Data!$A:$BH,MATCH(CONCATENATE('Chart 1'!M$11,LEFT('Chart 1'!$L15,3)),Data!$1:$1,0),FALSE)","v":57.689963002410501},{"$f":"VLOOKUP($C$3,Data!$A:$BH,MATCH(CONCATENATE('Chart 1'!N$11,LEFT('Chart 1'!$L15,3)),Data!$1:$1,0),FALSE)","v":32.7186921912663},{"$f":"VLOOKUP($C$3,Data!$A:$BH,MATCH(CONCATENATE('Chart 1'!O$11,LEFT('Chart 1'!$L15,3)),Data!$1:$1,0),FALSE)","v":5.5005885980156002},{"$f":"VLOOKUP($C$3,Data!$A:$BH,MATCH(CONCATENATE('Chart 1'!P$11,LEFT('Chart 1'!$L15,3)),Data!$1:$1,0),FALSE)","v":2.7453893155446001},{"$f":"VLOOKUP($C$3,Data!$A:$BH,MATCH(CONCATENATE('Chart 1'!Q$11,LEFT('Chart 1'!$L15,3)),Data!$1:$1,0),FALSE)","v":1.345366892763}]
[null,"Q9. This school is well led and managed",148253.99999999991,86263.999999999985,20610.999999999927,18939.999999999985,11354.999999999916,null,null,null,null,"Q5. My child is taught well at this school",{"$f":"VLOOKUP($C$3,Data!$A:$BH,MATCH(CONCATENATE('Chart 1'!M$11,LEFT('Chart 1'!$L16,3)),Data!$1:$1,0),FALSE)","v":49.950950165367999},{"$f":"VLOOKUP($C$3,Data!$A:$BH,MATCH(CONCATENATE('Chart 1'!N$11,LEFT('Chart 1'!$L16,3)),Data!$1:$1,0),FALSE)","v":36.963254666741399},{"$f":"VLOOKUP($C$3,Data!$A:$BH,MATCH(CONCATENATE('Chart 1'!O$11,LEFT('Chart 1'!$L16,3)),Data!$1:$1,0),FALSE)","v":7.2611273053421996},{"$f":"VLOOKUP($C$3,Data!$A:$BH,MATCH(CONCATENATE('Chart 1'!P$11,LEFT('Chart 1'!$L16,3)),Data!$1:$1,0),FALSE)","v":3.2509529682156999},{"$f":"VLOOKUP($C$3,Data!$A:$BH,MATCH(CONCATENATE('Chart 1'!Q$11,LEFT('Chart 1'!$L16,3)),Data!$1:$1,0),FALSE)","v":2.5737148943325998}]
[null,"Q10. This school responds well to any concerns I raise",137421.99999999988,89400.000000000015,25512.000000000011,18301.999999999967,14788.000000000113,null,null,null,null,"Q6. My child receives appropriate homework for their age",{"$f":"VLOOKUP($C$3,Data!$A:$BH,MATCH(CONCATENATE('Chart 1'!M$11,LEFT('Chart 1'!$L17,3)),Data!$1:$1,0),FALSE)","v":38.7763467683166},{"$f":"VLOOKUP($C$3,Data!$A:$BH,MATCH(CONCATENATE('Chart 1'!N$11,LEFT('Chart 1'!$L17,3)),Data!$1:$1,0),FALSE)","v":43.172963731150901},{"$f":"VLOOKUP($C$3,Data!$A:$BH,MATCH(CONCATENATE('Chart 1'!O$11,LEFT('Chart 1'!$L17,3)),Data!$1:$1,0),FALSE)","v":10.8126856886597},{"$f":"VLOOKUP($C$3,Data!$A:$BH,MATCH(CONCATENATE('Chart 1'!P$11,LEFT('Chart 1'!$L17,3)),Data!$1:$1,0),FALSE)","v":4.3542238914737004},{"$f":"VLOOKUP($C$3,Data!$A:$BH,MATCH(CONCATENATE('Chart 1'!Q$11,LEFT('Chart 1'!$L17,3)),Data!$1:$1,0),FALSE)","v":2.8837799203991001}]
[null,"Q11. I receive valuable information from the school about my child's progress",129748.00000000003,106706.99999999985,31554.999999999975,13368.999999999958,4044.9999999998822,null,null,null,null,"Q7. This school makes sure its pupils are well behaved",{"$f":"VLOOKUP($C$3,Data!$A:$BH,MATCH(CONCATENATE('Chart 1'!M$11,LEFT('Chart 1'!$L18,3)),Data!$1:$1,0),FALSE)","v":49.562755759852003},{"$f":"VLOOKUP($C$3,Data!$A:$BH,MATCH(CONCATENATE('Chart 1'!N$11,LEFT('Chart 1'!$L18,3)),Data!$1:$1,0),FALSE)","v":36.503587645047403},{"$f":"VLOOKUP($C$3,Data!$A:$BH,MATCH(CONCATENATE('Chart 1'!O$11,LEFT('Chart 1'!$L18,3)),Data!$1:$1,0),FALSE)","v":7.0418044733449001},{"$f":"VLOOKUP($C$3,Data!$A:$BH,MATCH(CONCATENATE('Chart 1'!P$11,LEFT('Chart 1'!$L18,3)),Data!$1:$1,0),FALSE)","v":4.0865519367678003},{"$f":"VLOOKUP($C$3,Data!$A:$BH,MATCH(CONCATENATE('Chart 1'!Q$11,LEFT('Chart 1'!$L18,3)),Data!$1:$1,0),FALSE)","v":2.8053001849879}]
[null,"Q12. Would you recommend this school to another parent?",{"$f":"$L$8*(M23/100)","v":245565},null,null,{"$f":"$L$8*(P23/100)","v":39859},null,null,null,null,null,"Q8. This school deals effectively with bullying",{"$f":"VLOOKUP($C$3,Data!$A:$BH,MATCH(CONCATENATE('Chart 1'!M$11,LEFT('Chart 1'!$L19,3)),Data!$1:$1,0),FALSE)","v":37.328675934749697},{"$f":"VLOOKUP($C$3,Data!$A:$BH,MATCH(CONCATENATE('Chart 1'!N$11,LEFT('Chart 1'!$L19,3)),Data!$1:$1,0),FALSE)","v":30.243777678120999},{"$f":"VLOOKUP($C$3,Data!$A:$BH,MATCH(CONCATENATE('Chart 1'!O$11,LEFT('Chart 1'!$L19,3)),Data!$1:$1,0),FALSE)","v":6.5218762262459},{"$f":"VLOOKUP($C$3,Data!$A:$BH,MATCH(CONCATENATE('Chart 1'!P$11,LEFT('Chart 1'!$L19,3)),Data!$1:$1,0),FALSE)","v":5.4788665283927998},{"$f":"VLOOKUP($C$3,Data!$A:$BH,MATCH(CONCATENATE('Chart 1'!Q$11,LEFT('Chart 1'!$L19,3)),Data!$1:$1,0),FALSE)","v":20.4268036324906}]
[null,null,null,null,null,"Source: Parent View",null,null,null,null,null,"Q9. This school is well led and managed",{"$f":"VLOOKUP($C$3,Data!$A:$BH,MATCH(CONCATENATE('Chart 1'!M$11,LEFT('Chart 1'!$L20,3)),Data!$1:$1,0),FALSE)","v":51.941672739503304},{"$f":"VLOOKUP($C$3,Data!$A:$BH,MATCH(CONCATENATE('Chart 1'!N$11,LEFT('Chart 1'!$L20,3)),Data!$1:$1,0),FALSE)","v":30.2231066763832},{"$f":"VLOOKUP($C$3,Data!$A:$BH,MATCH(CONCATENATE('Chart 1'!O$11,LEFT('Chart 1'!$L20,3)),Data!$1:$1,0),FALSE)","v":7.2211867257132996},{"$f":"VLOOKUP($C$3,Data!$A:$BH,MATCH(CONCATENATE('Chart 1'!P$11,LEFT('Chart 1'!$L20,3)),Data!$1:$1,0),FALSE)","v":6.6357419137843996},{"$f":"VLOOKUP($C$3,Data!$A:$BH,MATCH(CONCATENATE('Chart 1'!Q$11,LEFT('Chart 1'!$L20,3)),Data!$1:$1,0),FALSE)","v":3.9782919446156999}]
[null,null,null,null,null,null,null,null,null,null,null,"Q10. This school responds well to any concerns I raise",{"$f":"VLOOKUP($C$3,Data!$A:$BH,MATCH(CONCATENATE('Chart 1'!M$11,LEFT('Chart 1'!$L21,3)),Data!$1:$1,0),FALSE)","v":48.146616962834202},{"$f":"VLOOKUP($C$3,Data!$A:$BH,MATCH(CONCATENATE('Chart 1'!N$11,LEFT('Chart 1'!$L21,3)),Data!$1:$1,0),FALSE)","v":31.321822972139699},{"$f":"VLOOKUP($C$3,Data!$A:$BH,MATCH(CONCATENATE('Chart 1'!O$11,LEFT('Chart 1'!$L21,3)),Data!$1:$1,0),FALSE)","v":8.9382812937944998},{"$f":"VLOOKUP($C$3,Data!$A:$BH,MATCH(CONCATENATE('Chart 1'!P$11,LEFT('Chart 1'!$L21,3)),Data!$1:$1,0),FALSE)","v":6.4122148102471996},{"$f":"VLOOKUP($C$3,Data!$A:$BH,MATCH(CONCATENATE('Chart 1'!Q$11,LEFT('Chart 1'!$L21,3)),Data!$1:$1,0),FALSE)","v":5.1810639609843996}]
[null,null,null,null,null,null,null,null,null,null,null,"Q11. I receive valuable information from the school about my child's progress",{"$f":"VLOOKUP($C$3,Data!$A:$BH,MATCH(CONCATENATE('Chart 1'!M$11,LEFT('Chart 1'!$L22,3)),Data!$1:$1,0),FALSE)","v":45.457985313078098},{"$f":"VLOOKUP($C$3,Data!$A:$BH,MATCH(CONCATENATE('Chart 1'!N$11,LEFT('Chart 1'!$L22,3)),Data!$1:$1,0),FALSE)","v":37.3854336005381},{"$f":"VLOOKUP($C$3,Data!$A:$BH,MATCH(CONCATENATE('Chart 1'!O$11,LEFT('Chart 1'!$L22,3)),Data!$1:$1,0),FALSE)","v":11.055482370088001},{"$f":"VLOOKUP($C$3,Data!$A:$BH,MATCH(CONCATENATE('Chart 1'!P$11,LEFT('Chart 1'!$L22,3)),Data!$1:$1,0),FALSE)","v":4.6839088513930003},{"$f":"VLOOKUP($C$3,Data!$A:$BH,MATCH(CONCATENATE('Chart 1'!Q$11,LEFT('Chart 1'!$L22,3)),Data!$1:$1,0),FALSE)","v":1.4171898649026999}]
[null,null,null,null,null,null,null,null,null,null,null,"Q12. Would you recommend this school to another parent?",{"$f":"VLOOKUP($C$3,Data!$A:$BH,MATCH(\"YesQ12\",Data!$1:$1,0),FALSE)","v":86.035161724311905},null,null,{"$f":"VLOOKUP($C$3,Data!$A:$BH,MATCH(\"NoQ12\",Data!$1:$1,0),FALSE)","v":13.9648382756881}]
[]
[]
[]
[]
[]
[]
[]
[]
[]
[]
[]
[]
[]
[]
[]
[]
[]
[]
[]
[]
[]
[null,null,null,null,null,"Percentage of submissions per response"]
[]
[null,"1 The percentages shown in the chart have been rounded and may not add up to 100."]
[null,"2 The data is representative of the views of parents and guardians who filled in the questionnaire, but response rates are low so any conclusions should be made with caution."]

{"sheet":"Table 1","index":4,"n_rows":47,"n_cols":27,"rows_kept":47,"cut":false,"hidden":false,"merged":[[3,10,3,17],[1,1,1,17],[4,1,4,4]]}
[null,null,null,null,null,null,null,null,null,null,null,null,null,null,null,null,null,null,null,null,null,null,null,null,null,null,"Q1. My child is happy at this school (%)"]
[null,"Table 1: Submissions made to Parent View, between 1 September 2014 and 31 August 2015, for schools in England, broken down by type of school, phase, region and question1,2,3",null,null,null,null,null,null,null,null,null,null,null,null,null,null,null,null,null,null,null,null,null,null,null,null,"Q2. My child feels safe at this school (%)"]
[null,null,null,null,null,null,null,null,null,null,null,null,null,null,null,null,null,null,null,null,null,null,null,null,null,null,"Q3. My child makes good progress at this school (%)"]
[null,null,null,null,null,null,null,null,null,null,"Q1. My child is happy at this school (%)",null,null,null,null,null,null,null,null,null,null,null,null,null,null,null,"Q4. My child is well looked after at this school (%)"]
[null,"For more information about Parent View visit: \nhttp://parentview.ofsted.gov.uk",null,null,null,"Number of submissions",null,"Response rate (%)",null,null,{"$f":"IF(K4=AA12,\"\", \"Strongly agree\")","v":"Strongly agree"},{"$f":"IF(K4=AA12, \"Yes\", \"Agree\")","v":"Agree"},{"$f":"IF(K4=AA12, \"\", \"Disagree\")","v":"Disagree"},{"$f":"IF(K4=AA12, \"No\", \"Strongly disagree\")","v":"Strongly disagree"},{"$f":"IF(K4=AA12, \"\", \"Don't know\")","v":"Don't know"},null,"Positive","Negative",null,null,null,null,null,null,null,null,"Q5. My child is taught well at this school (%)"]
[null,null,null,null,null,null,null,null,null,null,null,null,null,null,null,null,null,null,null,null,null,null,null,null,null,null,"Q6. My child receives appropriate homework for their age (%)"]
[null,"Parent View benchmarks for schools in England",null,null,null,null,null,null,null,null,null,null,null,null,null,null,null,null,null,null,null,null,null,null,null,null,"Q7. This school makes sure its pupils are well behaved (%)"]
[null,null,null,null,null,null,null,null,null,null,null,null,null,null,null,null,null,null,null,null,null,null,null,null,null,null,"Q8. This school deals effectively with bullying (%)"]
[null,"Independent schools",null,null,null,{"$f":"VLOOKUP($B$9,Data!$A:$BH,MATCH($F$5,Data!$1:$1,0),FALSE)","v":3528},null,{"$f":"VLOOKUP($B$9,Data!$A:$BH,MATCH($H$5,Data!$1:$1,0),FALSE)","v":3.9952890016307001},null,null,{"$f":"IF($K$5=\"\",\"\",VLOOKUP($B$9,Data!$A:$BH,MATCH(CONCATENATE($K$5,LEFT($K$4,3)),Data!$1:$1,0),FALSE))","v":77.210884353741505},{"$f":"IF($L$5=\"\",\"\",VLOOKUP($B$9,Data!$A:$BH,MATCH(CONCATENATE($L$5,LEFT($K$4,3)),Data!$1:$1,0),FALSE))","v":17.233560090702898},{"$f":"IF($M$5=\"\",\"\",VLOOKUP($B$9,Data!$A:$BH,MATCH(CONCATENATE($M$5,LEFT($K$4,3)),Data!$1:$1,0),FALSE))","v":3.0895691609977001},{"$f":"IF($N$5=\"\",\"\",VLOOKUP($B$9,Data!$A:$BH,MATCH(CONCATENATE($N$5,LEFT($K$4,3)),Data!$1:$1,0),FALSE))","v":1.7573696145125},{"$f":"IF($O$5=\"\",\"\",VLOOKUP($B$9,Data!$A:$BH,MATCH(CONCATENATE($O$5,LEFT($K$4,3)),Data!$1:$1,0),FALSE))","v":0.70861678004539996},null,{"$f":"SUM($K$9:$L$9)","v":94.4444444444444},{"$f":"SUM($M$9:$N$9)","v":4.8469387755101998},null,null,null,null,null,null,null,null,"Q9. This school is well led and managed (%)"]
[null,"Average number of submissions per independent school",null,null,null,{"$f":"VLOOKUP($B$10,Data!$A:$BH,MATCH($F$5,Data!$1:$1,0),FALSE)","v":4},null,null,null,null,null,null,null,null,null,null,null,null,null,null,null,null,null,null,null,null,"Q10. This school responds well to any concerns I raise (%)"]
[null,null,null,null,null,null,null,null,null,null,null,null,null,null,null,null,null,null,null,null,null,null,null,null,null,null,"Q11. I receive valuable information from the school about my child's progress (%)"]
[null,"Maintained schools and academies",null,null,null,{"$f":"VLOOKUP($B$12,Data!$A:$BH,MATCH($F$5,Data!$1:$1,0),FALSE)","v":285424},null,{"$f":"VLOOKUP($B$12,Data!$A:$BH,MATCH($H$5,Data!$1:$1,0),FALSE)","v":3.7332516758789001},null,null,{"$f":"IF($K$5=\"\",\"\",VLOOKUP($B$12,Data!$A:$BH,MATCH(CONCATENATE($K$5,LEFT($K$4,3)),Data!$1:$1,0),FALSE))","v":63.966239699534697},{"$f":"IF($L$5=\"\",\"\",VLOOKUP($B$12,Data!$A:$BH,MATCH(CONCATENATE($L$5,LEFT($K$4,3)),Data!$1:$1,0),FALSE))","v":28.424028813274301},{"$f":"IF($M$5=\"\",\"\",VLOOKUP($B$12,Data!$A:$BH,MATCH(CONCATENATE($M$5,LEFT($K$4,3)),Data!$1:$1,0),FALSE))","v":4.3619317226302003},{"$f":"IF($N$5=\"\",\"\",VLOOKUP($B$12,Data!$A:$BH,MATCH(CONCATENATE($N$5,LEFT($K$4,3)),Data!$1:$1,0),FALSE))","v":2.7884830988284},{"$f":"IF($O$5=\"\",\"\",VLOOKUP($B$12,Data!$A:$BH,MATCH(CONCATENATE($O$5,LEFT($K$4,3)),Data!$1:$1,0),FALSE))","v":0.45931666573239999},null,{"$f":"SUM($K$12:$L$12)","v":92.390268512809001},{"$f":"SUM($M$12:$N$12)","v":7.1504148214586003},null,null,null,null,null,null,null,null,"Q12. Would you recommend this school to another parent? (%)"]
[null,"Average number of submissions per maintained school",null,null,null,{"$f":"VLOOKUP($B$13,Data!$A:$BH,MATCH($F$5,Data!$1:$1,0),FALSE)","v":13}]
[]
[null,"All data below refers to maintained schools and academies only"]
[]
[]
[null,"Phase"]
[]
[null,"Nursery",null,null,null,{"$f":"VLOOKUP($B$20,Data!$A:$BH,MATCH($F$5,Data!$1:$1,0),FALSE)","v":2343},null,{"$f":"VLOOKUP($B$20,Data!$A:$BH,MATCH($H$5,Data!$1:$1,0),FALSE)","v":5.6658525379054003},null,null,{"$f":"IF($K$5=\"\",\"\",VLOOKUP($B$20,Data!$A:$BH,MATCH(CONCATENATE($K$5,LEFT($K$4,3)),Data!$1:$1,0),FALSE))","v":85.616730687153193},{"$f":"IF($L$5=\"\",\"\",VLOOKUP($B$20,Data!$A:$BH,MATCH(CONCATENATE($L$5,LEFT($K$4,3)),Data!$1:$1,0),FALSE))","v":13.1455399061033},{"$f":"IF($M$5=\"\",\"\",VLOOKUP($B$20,Data!$A:$BH,MATCH(CONCATENATE($M$5,LEFT($K$4,3)),Data!$1:$1,0),FALSE))","v":0.64020486555699996},{"$f":"IF($N$5=\"\",\"\",VLOOKUP($B$20,Data!$A:$BH,MATCH(CONCATENATE($N$5,LEFT($K$4,3)),Data!$1:$1,0),FALSE))","v":0.25608194622280001},{"$f":"IF($O$5=\"\",\"\",VLOOKUP($B$20,Data!$A:$BH,MATCH(CONCATENATE($O$5,LEFT($K$4,3)),Data!$1:$1,0),FALSE))","v":0.3414425949637},null,{"$f":"SUM($K$20:$L$20)","v":98.762270593256488},{"$f":"SUM($M$20:$N$20)","v":0.89628681177979996}]
[null,"Primary",null,null,null,{"$f":"VLOOKUP($B$21,Data!$A:$BH,MATCH($F$5,Data!$1:$1,0),FALSE)","v":196616},null,{"$f":"VLOOKUP($B$21,Data!$A:$BH,MATCH($H$5,Data!$1:$1,0),FALSE)","v":4.4885992920188},null,null,{"$f":"IF($K$5=\"\",\"\",VLOOKUP($B$21,Data!$A:$BH,MATCH(CONCATENATE($K$5,LEFT($K$4,3)),Data!$1:$1,0),FALSE))","v":68.281319933271007},{"$f":"IF($L$5=\"\",\"\",VLOOKUP($B$21,Data!$A:$BH,MATCH(CONCATENATE($L$5,LEFT($K$4,3)),Data!$1:$1,0),FALSE))","v":25.548785449810801},{"$f":"IF($M$5=\"\",\"\",VLOOKUP($B$21,Data!$A:$BH,MATCH(CONCATENATE($M$5,LEFT($K$4,3)),Data!$1:$1,0),FALSE))","v":3.5521015583676001},{"$f":"IF($N$5=\"\",\"\",VLOOKUP($B$21,Data!$A:$BH,MATCH(CONCATENATE($N$5,LEFT($K$4,3)),Data!$1:$1,0),FALSE))","v":2.2200634739797001},{"$f":"IF($O$5=\"\",\"\",VLOOKUP($B$21,Data!$A:$BH,MATCH(CONCATENATE($O$5,LEFT($K$4,3)),Data!$1:$1,0),FALSE))","v":0.39772958457090002},null,{"$f":"SUM($K$21:$L$21)","v":93.830105383081815},{"$f":"SUM($M$21:$N$21)","v":5.7721650323473002}]
[null,"Secondary",null,null,null,{"$f":"VLOOKUP($B$22,Data!$A:$BH,MATCH($F$5,Data!$1:$1,0),FALSE)","v":80879},null,{"$f":"VLOOKUP($B$22,Data!$A:$BH,MATCH($H$5,Data!$1:$1,0),FALSE)","v":2.6025121889689},null,null,{"$f":"IF($K$5=\"\",\"\",VLOOKUP($B$22,Data!$A:$BH,MATCH(CONCATENATE($K$5,LEFT($K$4,3)),Data!$1:$1,0),FALSE))","v":52.310241224545301},{"$f":"IF($L$5=\"\",\"\",VLOOKUP($B$22,Data!$A:$BH,MATCH(CONCATENATE($L$5,LEFT($K$4,3)),Data!$1:$1,0),FALSE))","v":36.381508178884502},{"$f":"IF($M$5=\"\",\"\",VLOOKUP($B$22,Data!$A:$BH,MATCH(CONCATENATE($M$5,LEFT($K$4,3)),Data!$1:$1,0),FALSE))","v":6.5097244031206998},{"$f":"IF($N$5=\"\",\"\",VLOOKUP($B$22,Data!$A:$BH,MATCH(CONCATENATE($N$5,LEFT($K$4,3)),Data!$1:$1,0),FALSE))","v":4.2384302476539002},{"$f":"IF($O$5=\"\",\"\",VLOOKUP($B$22,Data!$A:$BH,MATCH(CONCATENATE($O$5,LEFT($K$4,3)),Data!$1:$1,0),FALSE))","v":0.56009594579559996},null,{"$f":"SUM($K$22:$L$22)","v":88.69174940342981},{"$f":"SUM($M$22:$N$22)","v":10.7481546507746}]
[null,"Special",null,null,null,{"$f":"VLOOKUP($B$23,Data!$A:$BH,MATCH($F$5,Data!$1:$1,0),FALSE)","v":5219},null,{"$f":"VLOOKUP($B$23,Data!$A:$BH,MATCH($H$5,Data!$1:$1,0),FALSE)","v":5.1156134521323997},null,null,{"$f":"IF($K$5=\"\",\"\",VLOOKUP($B$23,Data!$A:$BH,MATCH(CONCATENATE($K$5,LEFT($K$4,3)),Data!$1:$1,0),FALSE))","v":72.983330139873502},{"$f":"IF($L$5=\"\",\"\",VLOOKUP($B$23,Data!$A:$BH,MATCH(CONCATENATE($L$5,LEFT($K$4,3)),Data!$1:$1,0),FALSE))","v":20.2529220157118},{"$f":"IF($M$5=\"\",\"\",VLOOKUP($B$23,Data!$A:$BH,MATCH(CONCATENATE($M$5,LEFT($K$4,3)),Data!$1:$1,0),FALSE))","v":3.0848821613336002},{"$f":"IF($N$5=\"\",\"\",VLOOKUP($B$23,Data!$A:$BH,MATCH(CONCATENATE($N$5,LEFT($K$4,3)),Data!$1:$1,0),FALSE))","v":2.5483809158842998},{"$f":"IF($O$5=\"\",\"\",VLOOKUP($B$23,Data!$A:$BH,MATCH(CONCATENATE($O$5,LEFT($K$4,3)),Data!$1:$1,0),FALSE))","v":1.1304847671967999},null,{"$f":"SUM($K$23:$L$23)","v":93.236252155585305},{"$f":"SUM($M$23:$N$23)","v":5.6332630772179}]
[null,"Pupil referral unit",null,null,null,{"$f":"VLOOKUP($B$24,Data!$A:$BH,MATCH($F$5,Data!$1:$1,0),FALSE)","v":367},null,{"$f":"VLOOKUP($B$24,Data!$A:$BH,MATCH($H$5,Data!$1:$1,0),FALSE)","v":2.5777777777778002},null,null,{"$f":"IF($K$5=\"\",\"\",VLOOKUP($B$24,Data!$A:$BH,MATCH(CONCATENATE($K$5,LEFT($K$4,3)),Data!$1:$1,0),FALSE))","v":54.495912806539501},{"$f":"IF($L$5=\"\",\"\",VLOOKUP($B$24,Data!$A:$BH,MATCH(CONCATENATE($L$5,LEFT($K$4,3)),Data!$1:$1,0),FALSE))","v":28.882833787465898},{"$f":"IF($M$5=\"\",\"\",VLOOKUP($B$24,Data!$A:$BH,MATCH(CONCATENATE($M$5,LEFT($K$4,3)),Data!$1:$1,0),FALSE))","v":6.8119891008174003},{"$f":"IF($N$5=\"\",\"\",VLOOKUP($B$24,Data!$A:$BH,MATCH(CONCATENATE($N$5,LEFT($K$4,3)),Data!$1:$1,0),FALSE))","v":7.3569482288827999},{"$f":"IF($O$5=\"\",\"\",VLOOKUP($B$24,Data!$A:$BH,MATCH(CONCATENATE($O$5,LEFT($K$4,3)),Data!$1:$1,0),FALSE))","v":2.4523160762942999},null,{"$f":"SUM($K$24:$L$24)","v":83.378746594005406},{"$f":"SUM($M$24:$N$24)","v":14.168937329700199}]
[]
[null,"Ofsted Region"]
[]
[null,"East Midlands",null,null,null,{"$f":"VLOOKUP($B$28,Data!$A:$BH,MATCH($F$5,Data!$1:$1,0),FALSE)","v":24935},null,{"$f":"VLOOKUP($B$28,Data!$A:$BH,MATCH($H$5,Data!$1:$1,0),FALSE)","v":3.8154097567992},null,null,{"$f":"IF($K$5=\"\",\"\",VLOOKUP($B$28,Data!$A:$BH,MATCH(CONCATENATE($K$5,LEFT($K$4,3)),Data!$1:$1,0),FALSE))","v":62.117505514337303},{"$f":"IF($L$5=\"\",\"\",VLOOKUP($B$28,Data!$A:$BH,MATCH(CONCATENATE($L$5,LEFT($K$4,3)),Data!$1:$1,0),FALSE))","v":29.889713254461601},{"$f":"IF($M$5=\"\",\"\",VLOOKUP($B$28,Data!$A:$BH,MATCH(CONCATENATE($M$5,LEFT($K$4,3)),Data!$1:$1,0),FALSE))","v":4.7002205734910998},{"$f":"IF($N$5=\"\",\"\",VLOOKUP($B$28,Data!$A:$BH,MATCH(CONCATENATE($N$5,LEFT($K$4,3)),Data!$1:$1,0),FALSE))","v":2.8794866653299001},{"$f":"IF($O$5=\"\",\"\",VLOOKUP($B$28,Data!$A:$BH,MATCH(CONCATENATE($O$5,LEFT($K$4,3)),Data!$1:$1,0),FALSE))","v":0.41307399238019998},null,{"$f":"SUM($K$28:$L$28)","v":92.007218768798907},{"$f":"SUM($M$28:$N$28)","v":7.5797072388209994}]
[]
[null,"East of England",null,null,null,{"$f":"VLOOKUP($B$30,Data!$A:$BH,MATCH($F$5,Data!$1:$1,0),FALSE)","v":41271},null,{"$f":"VLOOKUP($B$30,Data!$A:$BH,MATCH($H$5,Data!$1:$1,0),FALSE)","v":4.8548052207771999},null,null,{"$f":"IF($K$5=\"\",\"\",VLOOKUP($B$30,Data!$A:$BH,MATCH(CONCATENATE($K$5,LEFT($K$4,3)),Data!$1:$1,0),FALSE))","v":62.157447117830898},{"$f":"IF($L$5=\"\",\"\",VLOOKUP($B$30,Data!$A:$BH,MATCH(CONCATENATE($L$5,LEFT($K$4,3)),Data!$1:$1,0),FALSE))","v":30.081655399675299},{"$f":"IF($M$5=\"\",\"\",VLOOKUP($B$30,Data!$A:$BH,MATCH(CONCATENATE($M$5,LEFT($K$4,3)),Data!$1:$1,0),FALSE))","v":4.6109859223183003},{"$f":"IF($N$5=\"\",\"\",VLOOKUP($B$30,Data!$A:$BH,MATCH(CONCATENATE($N$5,LEFT($K$4,3)),Data!$1:$1,0),FALSE))","v":2.6895398706112998},{"$f":"IF($O$5=\"\",\"\",VLOOKUP($B$30,Data!$A:$BH,MATCH(CONCATENATE($O$5,LEFT($K$4,3)),Data!$1:$1,0),FALSE))","v":0.46037168956410002},null,{"$f":"SUM($K$30:$L$30)","v":92.239102517506197},{"$f":"SUM($M$30:$N$30)","v":7.3005257929295997}]
[]
[null,"London",null,null,null,{"$f":"VLOOKUP($B$32,Data!$A:$BH,MATCH($F$5,Data!$1:$1,0),FALSE)","v":35223},null,{"$f":"VLOOKUP($B$32,Data!$A:$BH,MATCH($H$5,Data!$1:$1,0),FALSE)","v":2.8816489285547999},null,null,{"$f":"IF($K$5=\"\",\"\",VLOOKUP($B$32,Data!$A:$BH,MATCH(CONCATENATE($K$5,LEFT($K$4,3)),Data!$1:$1,0),FALSE))","v":66.746160179428202},{"$f":"IF($L$5=\"\",\"\",VLOOKUP($B$32,Data!$A:$BH,MATCH(CONCATENATE($L$5,LEFT($K$4,3)),Data!$1:$1,0),FALSE))","v":26.837577719104001},{"$f":"IF($M$5=\"\",\"\",VLOOKUP($B$32,Data!$A:$BH,MATCH(CONCATENATE($M$5,LEFT($K$4,3)),Data!$1:$1,0),FALSE))","v":3.3955086165289998},{"$f":"IF($N$5=\"\",\"\",VLOOKUP($B$32,Data!$A:$BH,MATCH(CONCATENATE($N$5,LEFT($K$4,3)),Data!$1:$1,0),FALSE))","v":2.4784941657439998},{"$f":"IF($O$5=\"\",\"\",VLOOKUP($B$32,Data!$A:$BH,MATCH(CONCATENATE($O$5,LEFT($K$4,3)),Data!$1:$1,0),FALSE))","v":0.54225931919479997},null,{"$f":"SUM($K$32:$L$32)","v":93.583737898532206},{"$f":"SUM($M$32:$N$32)","v":5.8740027822729992}]
[]
[null,"North East, Yorkshire and Humber",null,null,null,{"$f":"VLOOKUP($B$34,Data!$A:$BH,MATCH($F$5,Data!$1:$1,0),FALSE)","v":36957},null,{"$f":"VLOOKUP($B$34,Data!$A:$BH,MATCH($H$5,Data!$1:$1,0),FALSE)","v":3.2019192101285001},null,null,{"$f":"IF($K$5=\"\",\"\",VLOOKUP($B$34,Data!$A:$BH,MATCH(CONCATENATE($K$5,LEFT($K$4,3)),Data!$1:$1,0),FALSE))","v":63.157182671753702},{"$f":"IF($L$5=\"\",\"\",VLOOKUP($B$34,Data!$A:$BH,MATCH(CONCATENATE($L$5,LEFT($K$4,3)),Data!$1:$1,0),FALSE))","v":28.0894011959845},{"$f":"IF($M$5=\"\",\"\",VLOOKUP($B$34,Data!$A:$BH,MATCH(CONCATENATE($M$5,LEFT($K$4,3)),Data!$1:$1,0),FALSE))","v":4.9949941824281998},{"$f":"IF($N$5=\"\",\"\",VLOOKUP($B$34,Data!$A:$BH,MATCH(CONCATENATE($N$5,LEFT($K$4,3)),Data!$1:$1,0),FALSE))","v":3.2903103606894},{"$f":"IF($O$5=\"\",\"\",VLOOKUP($B$34,Data!$A:$BH,MATCH(CONCATENATE($O$5,LEFT($K$4,3)),Data!$1:$1,0),FALSE))","v":0.4681115891441},null,{"$f":"SUM($K$34:$L$34)","v":91.246583867738195},{"$f":"SUM($M$34:$N$34)","v":8.2853045431176007}]
[]
[null,"North West",null,null,null,{"$f":"VLOOKUP($B$36,Data!$A:$BH,MATCH($F$5,Data!$1:$1,0),FALSE)","v":33935},null,{"$f":"VLOOKUP($B$36,Data!$A:$BH,MATCH($H$5,Data!$1:$1,0),FALSE)","v":3.2639191459851999},null,null,{"$f":"IF($K$5=\"\",\"\",VLOOKUP($B$36,Data!$A:$BH,MATCH(CONCATENATE($K$5,LEFT($K$4,3)),Data!$1:$1,0),FALSE))","v":64.629438632680106},{"$f":"IF($L$5=\"\",\"\",VLOOKUP($B$36,Data!$A:$BH,MATCH(CONCATENATE($L$5,LEFT($K$4,3)),Data!$1:$1,0),FALSE))","v":27.260940032414901},{"$f":"IF($M$5=\"\",\"\",VLOOKUP($B$36,Data!$A:$BH,MATCH(CONCATENATE($M$5,LEFT($K$4,3)),Data!$1:$1,0),FALSE))","v":4.5263002799469998},{"$f":"IF($N$5=\"\",\"\",VLOOKUP($B$36,Data!$A:$BH,MATCH(CONCATENATE($N$5,LEFT($K$4,3)),Data!$1:$1,0),FALSE))","v":3.0175335199646001},{"$f":"IF($O$5=\"\",\"\",VLOOKUP($B$36,Data!$A:$BH,MATCH(CONCATENATE($O$5,LEFT($K$4,3)),Data!$1:$1,0),FALSE))","v":0.56578753499339995},null,{"$f":"SUM($K$36:$L$36)","v":91.890378665095},{"$f":"SUM($M$36:$N$36)","v":7.5438337999115994}]
[]
[null,"South East",null,null,null,{"$f":"VLOOKUP($B$38,Data!$A:$BH,MATCH($F$5,Data!$1:$1,0),FALSE)","v":56105},null,{"$f":"VLOOKUP($B$38,Data!$A:$BH,MATCH($H$5,Data!$1:$1,0),FALSE)","v":4.7250407621511998},null,null,{"$f":"IF($K$5=\"\",\"\",VLOOKUP($B$38,Data!$A:$BH,MATCH(CONCATENATE($K$5,LEFT($K$4,3)),Data!$1:$1,0),FALSE))","v":65.092237768469801},{"$f":"IF($L$5=\"\",\"\",VLOOKUP($B$38,Data!$A:$BH,MATCH(CONCATENATE($L$5,LEFT($K$4,3)),Data!$1:$1,0),FALSE))","v":28.181089029498299},{"$f":"IF($M$5=\"\",\"\",VLOOKUP($B$38,Data!$A:$BH,MATCH(CONCATENATE($M$5,LEFT($K$4,3)),Data!$1:$1,0),FALSE))","v":3.9925140361821998},{"$f":"IF($N$5=\"\",\"\",VLOOKUP($B$38,Data!$A:$BH,MATCH(CONCATENATE($N$5,LEFT($K$4,3)),Data!$1:$1,0),FALSE))","v":2.3063898048302001},{"$f":"IF($O$5=\"\",\"\",VLOOKUP($B$38,Data!$A:$BH,MATCH(CONCATENATE($O$5,LEFT($K$4,3)),Data!$1:$1,0),FALSE))","v":0.42776936101950003},null,{"$f":"SUM($K$38:$L$38)","v":93.273326797968096},{"$f":"SUM($M$38:$N$38)","v":6.2989038410124003}]
[]
[null,"South West",null,null,null,{"$f":"VLOOKUP($B$40,Data!$A:$BH,MATCH($F$5,Data!$1:$1,0),FALSE)","v":31287},null,{"$f":"VLOOKUP($B$40,Data!$A:$BH,MATCH($H$5,Data!$1:$1,0),FALSE)","v":4.4959433476938004},null,null,{"$f":"IF($K$5=\"\",\"\",VLOOKUP($B$40,Data!$A:$BH,MATCH(CONCATENATE($K$5,LEFT($K$4,3)),Data!$1:$1,0),FALSE))","v":63.796464985457199},{"$f":"IF($L$5=\"\",\"\",VLOOKUP($B$40,Data!$A:$BH,MATCH(CONCATENATE($L$5,LEFT($K$4,3)),Data!$1:$1,0),FALSE))","v":28.139482852302901},{"$f":"IF($M$5=\"\",\"\",VLOOKUP($B$40,Data!$A:$BH,MATCH(CONCATENATE($M$5,LEFT($K$4,3)),Data!$1:$1,0),FALSE))","v":4.6281203055582001},{"$f":"IF($N$5=\"\",\"\",VLOOKUP($B$40,Data!$A:$BH,MATCH(CONCATENATE($N$5,LEFT($K$4,3)),Data!$1:$1,0),FALSE))","v":3.0172276025186},{"$f":"IF($O$5=\"\",\"\",VLOOKUP($B$40,Data!$A:$BH,MATCH(CONCATENATE($O$5,LEFT($K$4,3)),Data!$1:$1,0),FALSE))","v":0.41870425416309998},null,{"$f":"SUM($K$40:$L$40)","v":91.935947837760096},{"$f":"SUM($M$40:$N$40)","v":7.6453479080768005}]
[]
[null,"West Midlands",null,null,null,{"$f":"VLOOKUP($B$42,Data!$A:$BH,MATCH($F$5,Data!$1:$1,0),FALSE)","v":25711},null,{"$f":"VLOOKUP($B$42,Data!$A:$BH,MATCH($H$5,Data!$1:$1,0),FALSE)","v":3.0523185058979001},null,null,{"$f":"IF($K$5=\"\",\"\",VLOOKUP($B$42,Data!$A:$BH,MATCH(CONCATENATE($K$5,LEFT($K$4,3)),Data!$1:$1,0),FALSE))","v":62.891369452763399},{"$f":"IF($L$5=\"\",\"\",VLOOKUP($B$42,Data!$A:$BH,MATCH(CONCATENATE($L$5,LEFT($K$4,3)),Data!$1:$1,0),FALSE))","v":29.4076465326125},{"$f":"IF($M$5=\"\",\"\",VLOOKUP($B$42,Data!$A:$BH,MATCH(CONCATENATE($M$5,LEFT($K$4,3)),Data!$1:$1,0),FALSE))","v":4.3133289253626996},{"$f":"IF($N$5=\"\",\"\",VLOOKUP($B$42,Data!$A:$BH,MATCH(CONCATENATE($N$5,LEFT($K$4,3)),Data!$1:$1,0),FALSE))","v":3.0337209754579999},{"$f":"IF($O$5=\"\",\"\",VLOOKUP($B$42,Data!$A:$BH,MATCH(CONCATENATE($O$5,LEFT($K$4,3)),Data!$1:$1,0),FALSE))","v":0.35393411380340001},null,{"$f":"SUM($K$42:$L$42)","v":92.299015985375902},{"$f":"SUM($M$42:$N$42)","v":7.3470499008207}]
[]
[]
[null,"1 The percentages shown in the table have been rounded and may not add up to 100."]
[null,"2 The data is representative of the views of parents and guardians who filled in the questionnaire, but response rates are low so any conclusions should be made with caution."]
[null,"3 The column 'Positive' is the combination of those responding with 'Strongly agree' and 'Agree', 'Negative'  is the combination of those responding with 'Strongly disagree' and 'Disagree'"]

{"sheet":"Data","index":5,"n_rows":18,"n_cols":60,"rows_kept":18,"cut":false,"hidden":true,"merged":[]}
["Group Description","Number of Submissions","Response Rate (%)","Strongly AgreeQ1.","AgreeQ1.","DisagreeQ1.","Strongly DisagreeQ1.","Don't KnowQ1.","Strongly AgreeQ2.","AgreeQ2.","DisagreeQ2.","Strongly DisagreeQ2.","Don't KnowQ2.","Strongly AgreeQ3.","AgreeQ3.","DisagreeQ3.","Strongly DisagreeQ3.","Don't KnowQ3.","Strongly AgreeQ4.","AgreeQ4.","DisagreeQ4.","Strongly DisagreeQ4.","Don't KnowQ4.","Strongly AgreeQ5.","AgreeQ5.","DisagreeQ5.","Strongly DisagreeQ5.","Don't KnowQ5.","Strongly AgreeQ6.","AgreeQ6.","DisagreeQ6.","Strongly DisagreeQ6.","Don't KnowQ6.","Strongly AgreeQ7.","AgreeQ7.","DisagreeQ7.","Strongly DisagreeQ7.","Don't KnowQ7.","Strongly AgreeQ8.","AgreeQ8.","DisagreeQ8.","Strongly DisagreeQ8.","Don't KnowQ8.","Strongly AgreeQ9.","AgreeQ9.","DisagreeQ9.","Strongly DisagreeQ9.","Don't KnowQ9.","Strongly AgreeQ10","AgreeQ10","DisagreeQ10","Strongly DisagreeQ10","Don't KnowQ10","Strongly AgreeQ11","AgreeQ11","DisagreeQ11","Strongly DisagreeQ11","Don't KnowQ11","YesQ12","NoQ12"]
["Average number of submissions per independent school",4,0,0,0,0,0,0,0,0,0,0,0,0,0,0,0,0,0,0,0,0,0,0,0,0,0,0,0,0,0,0,0,0,0,0,0,0,0,0,0,0,0,0,0,0,0,0,0,0,0,0,0,0,0,0,0,0,0,0]
["Average number of submissions per maintained school",13,0,0,0,0,0,0,0,0,0,0,0,0,0,0,0,0,0,0,0,0,0,0,0,0,0,0,0,0,0,0,0,0,0,0,0,0,0,0,0,0,0,0,0,0,0,0,0,0,0,0,0,0,0,0,0,0,0,0]
["East Midlands",24935,3.8154097567992,62.117505514337303,29.889713254461601,4.7002205734910998,2.8794866653299001,0.41307399238019998,62.526569079607,30.872267896531,3.6775616603168002,2.2257870463203999,0.69781431722480003,49.969921796671301,36.944054541808697,7.7722077401243004,3.4529777421294998,1.8608381792661,56.170042109484697,33.860036093844002,5.9474634048526003,2.6709444555844999,1.3515139362341999,48.425907359133703,37.870463204331301,7.6438740725886998,3.2524563866051999,2.8072989773410999,37.4092640866252,44.098656506917997,11.1570082213756,4.2510527371164999,3.0840184479646999,47.367154601965098,37.653900140364897,7.7280930419090001,4.2590735913374997,2.9917786244235001,36.719470623621397,30.639663124122698,6.5289753358732998,5.8271505915380004,20.284740324844599,50.086224182875497,31.0166432725085,7.4273110086224001,6.7736113896130004,4.6962101463805999,47.202727090435097,31.5219570884299,9.1718468016843993,6.6532985762983996,5.4501704431522002,44.126729496691397,38.427912572689003,11.2291959093643,4.6761580108281997,1.5400040104271,85.582514537798303,14.4174854622017]
["East of England",41271,4.8548052207771999,62.157447117830898,30.081655399675299,4.6109859223183003,2.6895398706112998,0.46037168956410002,62.4385161493543,31.0338978944053,3.5787841341378002,2.1128637542100002,0.83593806789269998,47.8883477502362,38.1551210292942,8.1800780208863006,3.7483947566087998,2.0280584429744999,55.053185045189103,34.997940442441397,5.764338155121,2.7331540306752999,1.4513823265731001,46.6986503840469,38.906253785951399,7.9765452739212002,3.6732814809429999,2.7452690751375002,36.073756390686,45.021928230476597,11.589251532553099,4.5504107000073004,2.7646531462769999,46.977296406677802,38.283540500593602,7.5888638511303004,4.2354195439896998,2.9148796976084999,34.656296188607001,31.021782849943101,7.0339948147609999,5.5608054081558,21.727120738533099,49.603838046085599,31.201085507983802,8.0201594339850999,7.1599912771680003,4.0149257347773997,45.5792202757384,32.497395265440602,9.4860798139128999,6.7601948099150002,5.6771098349931002,42.5359211068305,39.083133435099697,11.8606285285067,4.9259770783359,1.5943398512272999,85.311720094012699,14.688279905987301]
["Independent schools",3528,3.9952890016307001,77.210884353741505,17.233560090702898,3.0895691609977001,1.7573696145125,0.70861678004539996,78.7414965986395,16.581632653061199,2.2108843537415002,1.6156462585033999,0.85034013605439995,66.865079365079396,25.255102040816301,4.0249433106575996,2.4659863945578002,1.3888888888888999,75.396825396825406,18.5090702947846,3.4863945578230999,1.8707482993197,0.73696145124720003,67.431972789115605,24.376417233560101,4.3367346938775997,2.2675736961450998,1.5873015873016001,56.0374149659864,29.138321995464899,6.2641723356009003,2.8344671201814,5.7256235827664002,71.116780045351504,21.7687074829932,3.4580498866212999,2.1258503401361,1.530612244898,57.8514739229025,22.8741496598639,3.4580498866212999,3.2312925170067999,12.5850340136054,62.840136054421798,25.566893424036301,4.8185941043084002,5.1303854875282999,1.6439909297052,62.443310657596399,24.092970521542,5.5272108843536998,4.9886621315193,2.9478458049887002,61.0827664399093,29.024943310657601,6.1507936507937,2.5793650793651,1.1621315192743999,91.496598639455797,8.5034013605441992]
["London",35223,2.8816489285547999,66.746160179428202,26.837577719104001,3.3955086165289998,2.4784941657439998,0.54225931919479997,66.144280725662199,27.984555546092,2.8986741617692999,2.0952218720721998,0.87726769440420005,53.215228685801897,35.950941146410003,6.1834596712375003,2.9781676745308001,1.6722028220197001,58.725832552593502,32.586662124180201,4.6645657666864997,2.6687107855662,1.3542287709734999,52.607671123981497,36.382477358544101,5.8143826477017999,2.7822729466542002,2.4131959231183999,41.316753257814497,41.725577037731,9.9622405814382997,3.9207336115606002,3.0746955114555998,54.717088266189698,34.278738324390297,5.3005138687789,3.2308434829514998,2.4728160576896001,39.871674757970602,30.3040626863129,5.2692842744797002,4.3834994179939004,20.1714788632428,54.992476506827899,30.446015387672801,5.8910371064360998,5.1954688697725997,3.4750021292905,48.119126706981199,33.265196036680599,7.8641796553388001,5.3885245436220996,5.3629730573772996,47.815347926070999,37.191607756295603,9.6073588280384996,3.9377679357237998,1.4479175538711,88.5841637566363,11.4158362433637]
["Maintained schools and academies",285424,3.7332516758789001,63.966239699534697,28.424028813274301,4.3619317226302003,2.7884830988284,0.45931666573239999,64.331660967543002,29.183600538146798,3.4762318515612001,2.1960311676663,0.81247547508270002,50.931596502046098,36.279359829586902,7.5736448231402997,3.4818375469477001,1.7335612982791,57.689963002410501,32.7186921912663,5.5005885980156002,2.7453893155446001,1.345366892763,49.950950165367999,36.963254666741399,7.2611273053421996,3.2509529682156999,2.5737148943325998,38.7763467683166,43.172963731150901,10.8126856886597,4.3542238914737004,2.8837799203991001,49.562755759852003,36.503587645047403,7.0418044733449001,4.0865519367678003,2.8053001849879,37.328675934749697,30.243777678120999,6.5218762262459,5.4788665283927998,20.4268036324906,51.941672739503304,30.2231066763832,7.2211867257132996,6.6357419137843996,3.9782919446156999,48.146616962834202,31.321822972139699,8.9382812937944998,6.4122148102471996,5.1810639609843996,45.457985313078098,37.3854336005381,11.055482370088001,4.6839088513930003,1.4171898649026999,86.035161724311905,13.9648382756881]
["North East, Yorkshire and Humber",36957,3.2019192101285001,63.157182671753702,28.0894011959845,4.9949941824281998,3.2903103606894,0.4681115891441,63.2112996184755,29.431501474686801,3.9775955840571,2.5813783586330001,0.79822496414749999,52.249912059961602,34.797196742159798,7.481667884298,3.8666558432773002,1.6045674703032999,57.7968990989528,31.690884000324701,6.0150986281353997,3.2145466352788001,1.2825716373081999,51.018751522039103,35.487187812863603,7.3734339908541999,3.6123061936846002,2.5083204805585,39.5432529696674,42.2031009010472,10.650215114863199,4.6784100441053003,2.9250209703169001,48.559136293530301,35.971534486024296,7.5926076250778003,4.7298211434911002,3.1469004518764998,37.843980842600899,29.1122114890278,6.8890873176934999,6.2288605676867999,19.925859782991001,50.244879183916403,30.113375003382298,7.7766052439321003,7.3409638228210996,4.524176745948,48.854073653164498,29.577617230835799,9.3243499201775002,7.1813188299916,5.0626403658305996,46.481045539410701,35.7577725464729,11.2996184755256,5.1275807018968003,1.333982736694,84.509024000865907,15.490975999134101]
["North West",33935,3.2639191459851999,64.629438632680106,27.260940032414901,4.5263002799469998,3.0175335199646001,0.56578753499339995,65.304258140562794,27.814940327095901,3.6157359658170001,2.4605864152054999,0.80447915131869996,53.428613525858303,33.835273316634698,7.3964932960071001,3.7424487991749,1.5971710623249999,59.861499926329799,30.443494916752599,5.3956092529835997,2.9821717990276002,1.3172241049064,52.450272579932196,34.233092677176998,7.4082805363194,3.4949167526153002,2.4134374539560999,41.676734934433497,40.306468248121398,10.3933991454251,4.9447473110358002,2.6786503609842001,52.314719316340103,33.514071018122898,6.9780462649182002,4.5852364815088,2.6079269191101,40.554000294681003,27.608663621629599,6.5153970826579997,6.0085457492265002,19.3133932518049,53.481656107263902,28.156770296154399,7.2668336525711004,7.2020038308530996,3.8927361131575,50.620303521437997,28.277589509356101,8.9052600559894,6.9338441137468996,5.2630027994696,48.937674966848398,34.159422425224697,10.4611757772212,5.1392367761897999,1.3024900545160001,85.177545307204994,14.8224546927951]
["Nursery",2343,5.6658525379054003,85.616730687153193,13.1455399061033,0.64020486555699996,0.25608194622280001,0.3414425949637,83.824157063593702,14.639351259069601,0.64020486555699996,0.38412291933420001,0.51216389244560001,75.544174135723395,21.169440887750699,1.1096884336321,0.55484421681600005,1.6218523260777,80.921895006401996,16.8160478019633,0.85360648740930001,0.72556551429789995,0.68288518992739999,75.629534784464397,20.913358941527999,1.0243277848912,0.68288518992739999,1.7498932991891001,52.667520273154103,23.8583013230901,3.2863849765258002,0.81092616303880005,19.376867264191201,70.892018779342706,25.266752027315398,0.98164746052069995,0.5975245411865,2.2620571916347001,54.844216816047798,18.6513017498933,0.76824583866840002,0.64020486555699996,25.096030729833501,79.641485275288105,16.6453265044814,1.0243277848912,0.85360648740930001,1.8352539479300001,75.757575757575793,18.6513017498933,1.7072129748186,1.1523687580026001,2.7315407597097998,73.623559539052494,21.382842509603101,2.7315407597097998,0.98164746052069995,1.2804097311139999,97.823303457106306,2.1766965428937]
["Primary",196616,4.4885992920188,68.281319933271007,25.548785449810801,3.5521015583676001,2.2200634739797001,0.39772958457090002,68.4486511779306,25.848354152256199,3.0857102168693999,1.8864181958741999,0.73086625706959996,53.502258208894503,35.033771412295998,6.8773650160719004,3.1355535663424998,1.451051796395,60.778878626358001,30.750803596858901,4.9466981324001997,2.3914635634943,1.1321560808886,54.376042641494102,34.471253611099797,6.1902388411929996,2.7581682060463,2.2042967001667999,41.670057370712499,41.862310290108603,10.2870570045164,3.8928673149692998,2.2877080196931998,52.761219839687499,35.1919477560321,6.2492370915897002,3.5037840257150998,2.2938112869756,38.127619318875396,29.2941571387883,6.5864426089433001,5.3322211824063004,20.659559750986698,53.839972331855002,29.210237213654999,6.9623021524188999,6.5249013305123,3.4625869715588,49.567176628555202,31.055458355372899,8.5216869430768991,6.1342922244375,4.7213858485575999,45.9367498067299,37.338772022622798,11.027078162509699,4.4502990600967998,1.2471009480409001,87.034117264108701,12.9658827358913]
["Pupil Referral Unit",367,2.5777777777778002,54.495912806539501,28.882833787465898,6.8119891008174003,7.3569482288827999,2.4523160762942999,57.220708446866503,29.155313351498599,5.9945504087192996,5.7220708446866002,1.9073569482288999,52.316076294277899,28.882833787465898,7.0844686648500996,8.4468664850136008,3.2697547683924002,68.392370572207099,20.435967302452301,5.4495912806540003,4.6321525885558996,1.0899182561308001,56.130790190735702,28.337874659400502,6.8119891008174003,5.9945504087192996,2.7247956403270002,34.059945504087203,29.427792915531299,11.716621253406,10.899182561307899,13.8964577656676,47.138964577656701,33.787465940054503,5.1771117166213001,8.7193460490462993,5.1771117166213001,51.771117166212498,22.343324250681199,5.7220708446866002,5.1771117166213001,14.986376021798399,64.032697547683895,19.3460490463215,4.3596730245232003,9.2643051771116998,2.9972752043597,65.667574931880097,19.3460490463215,5.9945504087192996,6.8119891008174003,2.1798365122616001,63.215258855585802,25.340599455040898,4.0871934604905,6.5395095367847,0.81743869209810005,82.833787465940105,17.166212534059898]
["Secondary",80879,2.6025121889689,52.310241224545301,36.381508178884502,6.5097244031206998,4.2384302476539002,0.56009594579559996,53.4217782118968,38.150817888450597,4.5364062364766999,2.9748142286625998,0.91618343451329998,43.471111166062897,40.164937746510198,9.6155986102697,4.3830907899455003,2.3652616872118002,48.586159571705899,38.761606844792801,7.0908394020697996,3.6634973231618,1.8978968582697999,37.559811570370599,44.1931774626294,10.2251511517205,4.5376426513680999,3.4842171639115,31.463049740971101,47.716959903065103,12.3060374139146,5.4389891071848,3.0749638348644002,40.4752778842468,40.4802235438124,9.3707884617762005,5.6862720854609998,3.9874380247036001,33.755362949591401,33.362183014132199,6.7619530409623998,6.1350906910322998,19.9854103042817,45.4666848007517,33.825838598400097,8.2122677085523001,7.1155676998974,5.3796411923985001,42.606857156987601,33.070389099766302,10.3747573535776,7.3059755931700003,6.6420207964984996,42.2581881576182,38.822191174470497,11.6729929895276,5.3623313839191997,1.8842962944646,82.998058828620501,17.001941171379499]
["South East",56105,4.7250407621511998,65.092237768469801,28.181089029498299,3.9925140361821998,2.3063898048302001,0.42776936101950003,66.006594777649099,28.3040727207914,3.1209339631048998,1.7841547099188999,0.78424382853579999,49.9189020586401,36.98600837715,7.999287051065,3.3045183138757999,1.7912841992691999,58.4832011407183,32.685143926566298,5.1350147045718,2.3402548792442999,1.3563853488994,49.387755102040799,37.704304429195297,7.2863381160324003,2.9712146867481,2.6503876659833998,37.727475269583799,44.069156046698197,11.237857588450201,4.0655913020229999,2.8999197932448002,49.275465644773199,37.529631940112303,6.8942162017645003,3.5558328134747001,2.7448533998752001,36.233847250690701,30.986543088851299,6.4432760003564997,4.8783530879601003,21.457980572141501,53.168166830050801,30.008020675519099,6.9886819356564001,6.0565012031013001,3.7786293556724,48.4520096248106,31.890205864005001,8.9510738793333999,5.7606273950627997,4.9460832367882004,44.062026557347799,38.779074948756801,11.426789056233799,4.4167186525264999,1.315390785135,86.871045361376005,13.128954638624]
["South West",31287,4.4959433476938004,63.796464985457199,28.139482852302901,4.6281203055582001,3.0172276025186,0.41870425416309998,64.595518905615805,28.5613833221466,3.7395723463418999,2.1926039569150002,0.91092146898070003,50.573720714673797,36.8172084252245,7.6677214178412996,3.2761210726500001,1.6652283696104,57.9218205644517,32.237031354875803,5.9257838718956997,2.6081119953974001,1.3072522133794,49.643621951609298,37.549141816089801,7.3033528302489996,2.9692843673091001,2.5345990347429002,38.380157893054601,44.222840157253799,10.454821491354201,4.0080544635152,2.9341259948221001,48.0007670917634,37.536356953367203,7.4887333397258002,4.2349857768402002,2.7391568383034,36.206731230223397,31.3452871799789,6.8942372231278002,5.8267011857959998,19.7270431808738,51.960878320069,29.993287947070701,7.1978777127880997,7.0987950266883999,3.7491609933837999,48.320388659826797,31.3261098858951,9.1092146898073008,6.4052162239908004,4.8390705404801002,44.542461725317203,38.290663853996897,11.234698117429,4.4107776392750999,1.5213986639818,86.166778534215496,13.833221465784501]
["Special",5219,5.1156134521323997,72.983330139873502,20.2529220157118,3.0848821613336002,2.5483809158842998,1.1304847671967999,70.051734048668294,22.398926997509101,2.8549530561409999,2.3567733282238001,2.3376125694578,58.555278789040003,30.293159609120501,5.0967618317685002,3.5255796129527002,2.5292201571181998,71.220540333397196,21.2109599540142,3.8129909944434002,2.6250239509485001,1.1304847671967999,63.307146963019697,26.614293926039501,4.5027783100210996,2.8357922973749998,2.7399885035447,37.1910327648975,31.7685380341062,10.7875071852845,6.0547997700709004,14.198122245640899,60.490515424410802,29.5267292584786,3.6597049243150002,2.4908986395861001,3.8321517532093998,53.726767579996199,23.452768729641701,3.0082391262693999,3.0273998850354,16.784824679057301,67.484192374017994,19.409848630005801,4.5985821038513004,5.7865491473462001,2.7208277447786999,66.851887334738507,20.789423261161101,5.8248706648782997,5.3650124544931996,1.1688062847289,63.115539375359297,24.908986395861302,6.7829086031807,4.5027783100210996,0.68978731557770001,90.400459858210397,9.5995401417895998]
["West Midlands",25711,3.0523185058979001,62.891369452763399,29.4076465326125,4.3133289253626996,3.0337209754579999,0.35393411380340001,62.988604099412697,30.344988526311699,3.4576640348489001,2.4386449379643,0.77009840146240005,51.075415191941197,36.233518727392898,7.6348644549026004,3.5121154369725001,1.5440861887908,56.944498463692597,33.273696083388401,5.4684765275562999,3.0064952743962001,1.3068336509664999,49.780249698572597,37.155303177628298,7.2614834117692997,3.3254249154058999,2.4775387966240001,38.800513398934299,43.2344132861421,10.6919217455564,4.5389133055890003,2.7342382637781002,49.119054101357399,36.793590292092901,6.9542219283574997,4.2472093656411998,2.8859243125509999,37.4820115903699,30.671696939053302,6.6080665862860002,5.6201625763292,19.618062307961601,51.0209637898176,31.212321574423399,7.2381470965735,6.5730621134923002,3.9555054256933002,48.061141145813103,31.857959628174701,8.5566489051378998,6.6586286025436996,4.8656217183306998,46.307028120259801,36.369647232702,10.9836256855043,5.0017502236397,1.3379487378943,85.484811948193396,14.5151880518066]