{"text_format":"1","workbook":"xlsx","n_sheets":8,"sheets":["Cover","Notes","Summary of judgements","Pivot FE&S","Inspection data","Pivot SSA","Sector subject area data","PTT Data"],"not_rendered":{"charts":4,"images":1,"macros":1,"external_links":1,"defined_names":12,"comments":0,"pivot_tables":10},"unopened":[],"bounds":{"document_bytes":16777216,"sheet_cells":100000,"rows_first":2000,"rows_last":500,"rows_between":2000,"halvings":0,"cell_chars":16384,"cell_head_chars":4096},"cells_cut":0,"cells_raw":0,"read":"whole","date_system":"1900"}

{"sheet":"Cover","index":0,"n_rows":28,"n_cols":3,"rows_kept":28,"cut":false,"hidden":false,"merged":[[5,1,5,2]]}
[]
[]
[]
[]
[]
[null,"Management information"]
[null,"Policy area:","Further education and skills inspections and outcomes"]
[null,"Theme:","Education, children's services and skills"]
[null,"Published on:","16 June 2015"]
[null,"Coverage:","England"]
{"$rows_left_out":19}
{"sheet":"Notes","index":1,"n_rows":16,"n_cols":4,"rows_kept":16,"cut":false,"hidden":false,"merged":[[6,1,6,3],[7,1,7,3],[5,1,5,3],[0,1,0,3],[1,1,1,3],[2,1,2,3],[3,1,3,3],[4,1,4,3]]}
[null,"MANAGEMENT INFORMATION - INSPECTION OUTCOMES"]
[null,"Data show inspection judgements for further education and skills providers for the academic year 2014/15."]
[null,"The data cover outcomes for inspections which have taken place between 1 September 2014 and 30 April 2015, and where the inspection report has been published by 5 May 2015."]
[null,"The completeness of the data will improve incrementally over the coming months.  For example, the position shown here for inspections taking place between September 2014 and August 2015 is not yet complete."]
[null,"Adult and community learning providers are now known as community learning and skills providers. "]
[]
[null,"INDEX OF TABLES"]
[null,"To access the tables you can either click on the links below or on the tabs at the bottom of the spreadsheet:"]
[]
[null,"Summary of  judgements",null,"Summary of latest inspection judgements for providers"]
{"$rows_left_out":7}
{"sheet":"Summary of judgements","index":2,"n_rows":173,"n_cols":20,"rows_kept":173,"cut":false,"hidden":false,"merged":[[28,1,29,1],[28,2,29,2],[28,3,28,6],[4,1,5,1],[4,2,5,2],[4,3,4,6],[101,3,101,6],[53,1,54,1],[53,2,54,2],[53,3,53,6],[77,1,78,1],[77,2,78,2],[77,3,77,6],[101,1,102,1],[101,2,102,2]]}
["Summary of latest judgements"]
[]
[null,"Overall effectiveness of providers inspected since 1 September 2014"]
[null,null,null,1,2,3,4]
[null,"Provider type","Total number of providers inspected","Overall effectiveness"]
[null,null,null,"Outstanding","Good","Requires improvement","Inadequate",null,null,"Outstanding","Good","Requires improvement","Inadequate"]
[null,"Academy Converter",0,0,0,0,0,null,{"$f":"B7&\" \"&\"(\"&C7&\")\"","v":"Academy Converter (0)"},{"$f":"D7/$C7*100","v":{"$error":"#DIV/0!"}},{"$f":"E7/$C7*100","v":{"$error":"#DIV/0!"}},{"$error":"#DIV/0!"},{"$error":"#DIV/0!"}]
[null,"Community Learning and Skills",{"$f":"SUM(D8:G8)","v":40},{"$f":"IFERROR(GETPIVOTDATA(\"Provider Name\",'Pivot FE&S'!$A$5,\"Provider type\",\"Community Learning and Skills\",\"Overall Effectiveness\",1),0)","v":2},{"$f":"IFERROR(GETPIVOTDATA(\"Provider Name\",'Pivot FE&S'!$A$5,\"Provider type\",\"Community Learning and Skills\",\"Overall Effectiveness\",2),0)","v":19},{"$f":"IFERROR(GETPIVOTDATA(\"Provider Name\",'Pivot FE&S'!$A$5,\"Provider type\",\"Community Learning and Skills\",\"Overall Effectiveness\",3),0)","v":12},{"$f":"IFERROR(GETPIVOTDATA(\"Provider Name\",'Pivot FE&S'!$A$5,\"Provider type\",\"Community Learning and Skills\",\"Overall Effectiveness\",4),0)","v":7},null,{"$f":"B8&\" \"&\"(\"&C8&\")\"","v":"Community Learning and Skills (40)"},{"$f":"D8/$C8*100","v":5},47.5,30,17.5]
[null,"Employer",{"$f":"SUM(D9:G9)","v":7},{"$f":"IFERROR(GETPIVOTDATA(\"Provider Name\",'Pivot FE&S'!$A$5,\"Provider type\",\"Employer\",\"Overall Effectiveness\",1),0)","v":2},{"$f":"IFERROR(GETPIVOTDATA(\"Provider Name\",'Pivot FE&S'!$A$5,\"Provider type\",\"Employer\",\"Overall Effectiveness\",2),0)","v":2},{"$f":"IFERROR(GETPIVOTDATA(\"Provider Name\",'Pivot FE&S'!$A$5,\"Provider type\",\"Employer\",\"Overall Effectiveness\",3),0)","v":2},{"$f":"IFERROR(GETPIVOTDATA(\"Provider Name\",'Pivot FE&S'!$A$5,\"Provider type\",\"Employer\",\"Overall Effectiveness\",4),0)","v":1},null,{"$f":"B9&\" \"&\"(\"&C9&\")\"","v":"Employer (7)"},28.571428571428569,28.571428571428569,28.571428571428569,14.285714285714285]
[null,"Free School - 16-19",{"$f":"SUM(D10:G10)","v":5},{"$f":"IFERROR(GETPIVOTDATA(\"Provider Name\",'Pivot FE&S'!$A$5,\"Provider_type\",$B10,\"Overall Effectiveness\",D$4),0)","v":0},{"$f":"IFERROR(GETPIVOTDATA(\"Provider Name\",'Pivot FE&S'!$A$5,\"Provider type\",\"Free School - 16-19\",\"Overall Effectiveness\",2),0)","v":1},{"$f":"IFERROR(GETPIVOTDATA(\"Provider Name\",'Pivot FE&S'!$A$5,\"Provider type\",\"Free School - 16-19\",\"Overall Effectiveness\",3),0)","v":2},{"$f":"IFERROR(GETPIVOTDATA(\"Provider Name\",'Pivot FE&S'!$A$5,\"Provider type\",\"Free School - 16-19\",\"Overall Effectiveness\",4),0)","v":2},null,{"$f":"B10&\" \"&\"(\"&C10&\")\"","v":"Free School - 16-19 (5)"},0,20,40,40]
{"$rows_left_out":164}
{"sheet":"Pivot FE&S","index":3,"n_rows":209,"n_cols":6,"rows_kept":209,"cut":false,"hidden":true,"merged":[]}
[]
[]
["Overall effectiveness of providers inspected between 1 September 2014 and 30 April 2015"]
[]
["Count of Provider Name","Column Labels"]
["Row Labels",1,2,3,4,"Grand Total"]
["Community Learning and Skills",2,19,12,7,40]
["Employer",2,2,2,1,7]
["Free School - 16-19",null,1,2,2,5]
["General Further Education/Tertiary College",1,13,18,5,37]
{"$rows_left_out":200}
{"sheet":"Inspection data","index":4,"n_rows":186,"n_cols":67,"rows_kept":186,"cut":false,"hidden":false,"merged":[]}
["Inspection outcomes for further education and skills providers inspected from 1 September 2014"]
[]
[]
[]
["Report","Provider Name","URN","Provider type","Ofsted Region","Local Authority","REE Type of School","Inspection type","Inspection number","Inspection start date","Inspection end date","Inspection status","Inspection report published","Previous inspection number","Previous inspection date","Previous overall effectiveness","Overall Effectiveness","14-16 Overall Effectiveness Part Time","14-16 Overall Effectiveness Full Time","Traineeships Overall Effectiveness","16-19 study programmes Overall Effectiveness","19+ Overall Effectiveness","Apprenticeships Overall Effectiveness","Community Learning Overall Effectiveness","National Careers Services Overall Effectiveness","Employability Overall Effectiveness","Outcome for Learners","14-16 Outcome for Learners Part Time","14-16 Outcome for Learners Full Time","Traineeships Outcome for Learners","16-19 study programmes Outcome for Learners","19+ Outcome for Learners","Apprenticeships Outcome for Learners","Community Learning Outcome for Learners","National Careers Services Outcome for Learners","Employability Outcome for Learners","Teaching, learning and assessment","14-16 Teaching Part Time","14-16 Teaching Full Time","Traineeships Teaching","16-19 study programmes Teaching","19+ Teaching","Apprenticeships Teaching","Community Learning Teaching","National Careers Services Teaching","Employability Teaching","Leadership and Management","14-16 Leadership and Management Part Time","14-16 Leadership and Management Full Time","Traineeships Leadership and Management","16-19 study programmes Leadership and Management","19+ Leadership and Management","Apprenticeships Leadership and Management","Community Learning Leadership and Management","National Careers Services Leadership and Management","Employability Leadership and Management","How well all learners are safeguarded","14-16 How well all learners are safeguarded Part Time","14-16 How well all learners are safeguarded Full Time","Traineeships How well all learners are safeguarded","16-19 study programmes How well all learners are safeguarded","19+ How well all learners are safeguarded","Apprenticeships How well all learners are safeguarded","Community Learning How well all learners are safeguarded","National Careers Services How well all learners are safeguarded","Employability How well all learners are safeguarded","Current overall effectiveness outcome against Previous overall effectiveness outcome"]
[{"$f":"IF(C6 <> \"\", HYPERLINK(CONCATENATE(\"http://reports.ofsted.gov.uk/inspection-reports/find-inspection-report/provider/ELS/\",C6),\"Report\"),\"\")","v":"Report"},"Redcar & Cleveland Adult Learning Service",54087,"Community Learning and Skills","North East, Yorkshire & Humber","Redcar and Cleveland","ACL Local Authority","Adult and Community - full (regional)",446665,"2014-09-23","2014-09-26","Published","2014-10-29",329358,"2008-11-28",2,2,"-","-","-",2,2,2,2,"-","-",2,"-","-","-",2,2,2,2,"-","-",2,"-","-","-",2,2,2,2,"-","-",2,"-","-","-",2,2,2,2,"-","-",2,"-","-","-",2,2,2,2,"-","-",{"$f":"IF(P6=\"Null\",\"No previous inspection\",IF(Q6>P6,\"Declined\", IF(Q6=P6,\"Same\",IF(Q6<P6,\"Improved\"))))","v":"Same"}]
["Report","Beacon Employment",59072,"Community Learning and Skills","West Midlands","Worcestershire","ACL Voluntary organisation","WBL - full (regional)",434036,"2014-09-23","2014-09-26","Published","2014-10-29",385726,"2012-02-17",3,4,"-","-","-",4,"-","-","-","-",4,4,"-","-","-",4,"-","-","-","-",4,4,"-","-","-",4,"-","-","-","-",4,4,"-","-","-",4,"-","-","-","-",4,4,"-","-","-",4,"-","-","-","-",4,"Declined"]
["Report","Luton Borough Council",53201,"Community Learning and Skills","East of England","Luton","ACL Local Authority","Adult and community - full (national)",434069,"2014-09-29","2014-10-03","Published","2014-11-07",387972,"2012-06-15",3,2,"-","-","-","-","-",2,2,"-","-",2,"-","-","-","-","-",2,2,"-","-",2,"-","-","-","-","-",2,2,"-","-",2,"-","-","-","-","-",2,2,"-","-",2,"-","-","-","-","-",2,2,"-","-","Improved"]
["Report","The Marine Society College of the Sea",130414,"Community Learning and Skills","London","Lambeth","ACL Specialist Designated Institute","Adult and Community - full (regional)",446670,"2014-10-08","2014-10-10","Published","2014-11-24",330817,"2009-02-06",2,4,"-","-","-","-","-","-",4,"-","-",4,"-","-","-","-","-","-",4,"-","-",4,"-","-","-","-","-","-",4,"-","-",4,"-","-","-","-","-","-",4,"-","-",3,"-","-","-","-","-","-",3,"-","-","Declined"]
["Report","Southend-on-Sea Borough Council",54519,"Community Learning and Skills","East of England","Southend-On-Sea","ACL Local Authority","Adult and Community - full (regional)",446666,"2014-10-06","2014-10-10","Published","2014-11-12",329818,"2008-11-07",2,2,"-","-","-",2,2,2,2,"-",2,2,"-","-","-",2,2,2,2,"-",2,2,"-","-","-",2,2,2,2,"-",2,2,"-","-","-",2,2,2,2,"-",2,3,"-","-","-",3,3,3,3,"-",3,"Same"]
{"$rows_left_out":177}
{"sheet":"Pivot SSA","index":5,"n_rows":91,"n_cols":6,"rows_kept":91,"cut":false,"hidden":true,"merged":[]}
[]
[]
["Count of Inspection Number","Column Labels"]
["Row Labels",1,2,3,4,"Grand Total"]
["Agriculture, Horticulture and Animal Care",null,8,3,null,11]
["Arts, Media and Publishing",10,27,10,null,47]
["Business, Administration and Law",4,68,52,8,132]
["Community Development",null,null,1,null,1]
["Construction, Planning and the Built Environment",null,10,9,3,22]
["Education and Training",null,null,3,null,3]
{"$rows_left_out":82}
{"sheet":"Sector subject area data","index":6,"n_rows":666,"n_cols":17,"rows_kept":666,"cut":false,"hidden":false,"merged":[]}
["Sector subject area judgements for further education and skills providers inspected since 1 September 2014"]
[]
["Report","Provider Name","URN","Local authority","Ofsted region","Provider type","Inspection Type","Inspection Number","Inspection Start Date","Inspection End Date","Inspection Status","Inspection Report Published","SSA 1 code","SSA 1 descriptor","SSA 2 code","SSA 2 descriptor","Outcome"]
[{"$f":"IF(C4 <> \"\", HYPERLINK(CONCATENATE(\"http://reports.ofsted.gov.uk/inspection-reports/find-inspection-report/provider/ELS/\",C4),\"Report\"),\"\")","v":"Report"},"The Training & Recruitment Partnership Limited",55053,"Merton","London","Independent Learning Provider","Work Based Learning - full (national)",452983,"2015-02-23","2015-02-27","Published","2015-04-01",1,"Health, Public Services and Care",300,"Health and Social Care",3]
["Report","The Training & Recruitment Partnership Limited",55053,"Merton","London","Independent Learning Provider","Work Based Learning - full (national)",452983,"2015-02-23","2015-02-27","Published","2015-04-01",1,"Health, Public Services and Care",500,"Early Years and Playwork",3]
["Report","The Training & Recruitment Partnership Limited",55053,"Merton","London","Independent Learning Provider","Work Based Learning - full (national)",452983,"2015-02-23","2015-02-27","Published","2015-04-01",15,"Business, Administration and Law",600,"Business",3]
["Report","The Training & Recruitment Partnership Limited",55053,"Merton","London","Independent Learning Provider","Work Based Learning - full (national)",452983,"2015-02-23","2015-02-27","Published","2015-04-01",5,"Construction, Planning and the Built Environment",200,"Building and Construction",3]
["Report","Targeted Training Projects Limited",54744,"Dudley","West Midlands","Independent Learning Provider","WBL - full (regional)",446606,"2014-12-08","2014-12-12","Published","2015-01-27",5,"Construction, Planning and the Built Environment",200,"Building and Construction",4]
["Report","Solihull College",130481,"Solihull","West Midlands","General Further Education/Tertiary College","FE College - full inspection",452547,"2015-03-09","2015-03-13","Published","2015-04-21",3,"Agriculture, Horticulture and Animal Care",300,"Animal Care and Veterinary Science",2]
["Report","Solihull College",130481,"Solihull","West Midlands","General Further Education/Tertiary College","FE College - full inspection",452547,"2015-03-09","2015-03-13","Published","2015-04-21",6,"Information and Communication Technology",200,"ICT for Users",2]
{"$rows_left_out":657}
{"sheet":"PTT Data","index":7,"n_rows":208,"n_cols":23,"rows_kept":208,"cut":false,"hidden":true,"merged":[]}
["Provider Name","Provider Type","Provider URN","Inspection Number","UKPRN","Inspection Start Date","Inspection End Date","Ofsted Region","Inadequate","Inspection Publication Date","Link to report","Overall Effectiveness grade","Outcome for learners","Quality of Teaching Learning and Assessment","Effectiveness of Leadership and Management","Comparison OE","Comparison outcomes for learners","Comparison teaching","Comparison Effectiveness of leadership and management"]
["Unique Training North East Limited","WBL - requires improvement",56817,429793,10033129,"2014-09-09","2014-09-12","North East, Yorkshire and Humberside","N","2014-10-23T03:15:04.520","Link",3,2,2,3,{"$f":"VLOOKUP($D2,'Inspection data'!$I:$AU,9,FALSE)","v":3},{"$f":"VLOOKUP($D2,'Inspection data'!$I:$AU,19,FALSE)","v":2},{"$f":"VLOOKUP($D2,'Inspection data'!$I:$AU,29,FALSE)","v":2},{"$f":"VLOOKUP($D2,'Inspection data'!$I:$AU,39,FALSE)","v":3},{"$f":"IF(L2=P2,\"\",\"check\")","v":""},{"$f":"IF(M2=Q2,\"\",\"check\")","v":""},"",""]
["JBC Computer Training Limited","WBL - full (regional)",59153,446618,10019314,"2014-09-17","2014-09-19","West Midlands","N","2014-10-23T03:15:10.793","Link",2,2,2,2,{"$f":"VLOOKUP($D3,'Inspection data'!$I:$AU,9,FALSE)","v":2},{"$f":"VLOOKUP($D3,'Inspection data'!$I:$AU,19,FALSE)","v":2},{"$f":"VLOOKUP($D3,'Inspection data'!$I:$AU,29,FALSE)","v":2},{"$f":"VLOOKUP($D3,'Inspection data'!$I:$AU,39,FALSE)","v":2},{"$f":"IF(L3=P3,\"\",\"check\")","v":""},"","",""]
["The Learning Partnership for Cornwall and The Isles of Scilly Limited","WBL - full (regional)",59113,434062,10006735,"2014-09-16","2014-09-19","South West","N","2014-10-30T03:15:03.700","Link",3,3,3,3,{"$f":"VLOOKUP($D4,'Inspection data'!$I:$AU,9,FALSE)","v":3},{"$f":"VLOOKUP($D4,'Inspection data'!$I:$AU,19,FALSE)","v":3},{"$f":"VLOOKUP($D4,'Inspection data'!$I:$AU,29,FALSE)","v":3},{"$f":"VLOOKUP($D4,'Inspection data'!$I:$AU,39,FALSE)","v":3},"","","",""]
["Beacon Employment","WBL - full (regional)",59072,434036,10000588,"2014-09-23","2014-09-26","West Midlands","Y","2014-10-29T03:15:04.733","Link",4,4,4,4,{"$f":"VLOOKUP($D5,'Inspection data'!$I:$AU,9,FALSE)","v":4},{"$f":"VLOOKUP($D5,'Inspection data'!$I:$AU,19,FALSE)","v":4},{"$f":"VLOOKUP($D5,'Inspection data'!$I:$AU,29,FALSE)","v":4},{"$f":"VLOOKUP($D5,'Inspection data'!$I:$AU,39,FALSE)","v":4},"","","",""]
["Redcar & Cleveland Adult Learning Service","Adult and Community - full (regional)",54087,446665,10005413,"2014-09-23","2014-09-26","North East, Yorkshire and Humberside","N","2014-10-29T03:15:07.230","Link",2,2,2,2,{"$f":"VLOOKUP($D6,'Inspection data'!$I:$AU,9,FALSE)","v":2},{"$f":"VLOOKUP($D6,'Inspection data'!$I:$AU,19,FALSE)","v":2},{"$f":"VLOOKUP($D6,'Inspection data'!$I:$AU,29,FALSE)","v":2},{"$f":"VLOOKUP($D6,'Inspection data'!$I:$AU,39,FALSE)","v":2},"","","",""]
["Skills for Security Limited","WBL - requires improvement",50192,430258,10010523,"2014-09-22","2014-09-26","West Midlands","N","2014-10-28T03:15:03.413","Link",3,3,3,3,{"$f":"VLOOKUP($D7,'Inspection data'!$I:$AU,9,FALSE)","v":3},{"$f":"VLOOKUP($D7,'Inspection data'!$I:$AU,19,FALSE)","v":3},{"$f":"VLOOKUP($D7,'Inspection data'!$I:$AU,29,FALSE)","v":3},{"$f":"VLOOKUP($D7,'Inspection data'!$I:$AU,39,FALSE)","v":3},"","","",""]
["Acacia Training Limited","WBL - requires improvement",50304,430249,10000061,"2014-09-29","2014-10-03","West Midlands","N","2014-11-04T03:15:03.117","Link",3,3,3,3,{"$f":"VLOOKUP($D8,'Inspection data'!$I:$AU,9,FALSE)","v":3},{"$f":"VLOOKUP($D8,'Inspection data'!$I:$AU,19,FALSE)","v":3},{"$f":"VLOOKUP($D8,'Inspection data'!$I:$AU,29,FALSE)","v":3},{"$f":"VLOOKUP($D8,'Inspection data'!$I:$AU,39,FALSE)","v":3},"","","",""]
["Luton Borough Council","Adult and community - full (national)",53201,434069,10004124,"2014-09-29","2014-10-03","East of England","N","2014-11-07T03:15:05.350","Link",2,2,2,2,{"$f":"VLOOKUP($D9,'Inspection data'!$I:$AU,9,FALSE)","v":2},{"$f":"VLOOKUP($D9,'Inspection data'!$I:$AU,19,FALSE)","v":2},{"$f":"VLOOKUP($D9,'Inspection data'!$I:$AU,29,FALSE)","v":2},{"$f":"VLOOKUP($D9,'Inspection data'!$I:$AU,39,FALSE)","v":2},"","","",""]
["TQ Workforce Development Limited","WBL - requires improvement",58168,430261,10010939,"2014-09-29","2014-10-03","East Midlands","N","2014-11-07T03:15:04.063","Link",2,2,2,2,{"$f":"VLOOKUP($D10,'Inspection data'!$I:$AU,9,FALSE)","v":2},{"$f":"VLOOKUP($D10,'Inspection data'!$I:$AU,19,FALSE)","v":2},{"$f":"VLOOKUP($D10,'Inspection data'!$I:$AU,29,FALSE)","v":2},{"$f":"VLOOKUP($D10,'Inspection data'!$I:$AU,39,FALSE)","v":2},"","","",""]
{"$rows_left_out":198}