{"text_format":"1","workbook":"xlsx","n_sheets":12,"sheets":["Sheet1","Disclaimer","Navigation","s118 A&E Prices","A&E SQL Code","A&E SQL Output","Price Adjustments","2013-14 A&E Tariff ","2014-15 A&E Tariff","Manual adjustment requests","Prices","Link Sheet"],"not_rendered":{"charts":0,"images":0,"macros":1,"external_links":0,"defined_names":1,"comments":0,"pivot_tables":0},"unopened":[],"bounds":{"document_bytes":16777216,"sheet_cells":100000,"rows_first":2000,"rows_last":500,"rows_between":2000,"halvings":0,"cell_chars":16384,"cell_head_chars":4096},"cells_cut":0,"cells_raw":0,"read":"whole","date_system":"1900"}

{"sheet":"Sheet1","index":0,"n_rows":21,"n_cols":1,"rows_kept":21,"cut":false,"hidden":false,"merged":[]}
[]
[]
["2015/16 National Tariff Payment System:"]
["A consultation notice"]
[]
["Annex 5g: Accident and emergency (A&E) model"]
[]
[]
[]
[]
[]
[]
["26 November 2014"]
[]
["Monitor publication code: IRCP 14/14"]
[]
["NHS England Publications Gateway Reference 02457"]
["NHS England Document Classification: Official"]
[]
["The complete document set is hosted at:"]
{"$rows_left_out":2}
{"sheet":"Disclaimer","index":1,"n_rows":5,"n_cols":2,"rows_kept":5,"cut":false,"hidden":false,"merged":[]}
[]
[]
[null,"2015-16 A&E model"]
[]
[null,"Produced by: Monitor"]

{"sheet":"Navigation","index":2,"n_rows":11,"n_cols":5,"rows_kept":11,"cut":false,"hidden":false,"merged":[]}
[]
[null,"Steps","Worksheet / Intermediary steps","Overview","Data source"]
[null,"1 >> A&E Prices ","s118 A&E Prices","This worksheet has the s118 prices for A&E "]
[null,"2 >> SQL A&E code","OPATT SQL code","This worksheet shows the OPATT SQL codes","Monitor SQL"]
[null,"3 >> SQL inputs","A&E SQL Output","This worksheet has the total cost and activities.","Monitor SQL"]
[null,"4 >> Non SQL inputs","Price Adjustments","A variety of factors to adjust the prices. Includes: inflation, efficiency, CNST and quantum adjustment.","Mixed (Monitor & External)"]
[null,null,"2013-14 A&E Tariff"]
[null,null,"2014-15 A&E Tariff "]
[null,null,"Expert & Monitor Final Comments","This worksheet displays the changes to tariffs agreed by Monitor."]
[null,"5 >> Processing","A&E 15-16 Draft Model ","Derived table. This is the mapping for percentage split of each TFCs based on HRGs"]
[null,"6 >> Output","Link Sheet","Compares the 2015/16 final prices with that of 2014/15 and 2013/14","PbR 13/14 * 14/15 prices (for % diff calcs)"]

{"sheet":"s118 A&E Prices","index":3,"n_rows":17,"n_cols":4,"rows_kept":17,"cut":false,"hidden":false,"merged":[[2,2,2,3]]}
["2015-16 tariff - A&E"]
["Home"]
[null,null,"Tariff (£)"]
["HRG code","HRG name","Type 1 and 2 Departments","Type 3 Departments"]
["VB01Z","Any investigation with category 5 treatment",{"$f":"VLOOKUP('s118 A&E Prices'!A5,'Link Sheet'!B:E,3,FALSE)","v":238.63891859602694},{"$f":"VLOOKUP(A5,'Link Sheet'!B:E,4,FALSE)","v":55.6776570878149}]
["VB02Z","Category 3 investigation with category 4 treatment",{"$f":"VLOOKUP('s118 A&E Prices'!A6,'Link Sheet'!B:E,3,FALSE)","v":225.53348936432519},{"$f":"VLOOKUP(A6,'Link Sheet'!B:E,4,FALSE)","v":55.6776570878149}]
["VB03Z","Category 3 investigation with category 1-3 treatment",{"$f":"VLOOKUP('s118 A&E Prices'!A7,'Link Sheet'!B:E,3,FALSE)","v":191.56519723541047},{"$f":"VLOOKUP(A7,'Link Sheet'!B:E,4,FALSE)","v":55.6776570878149}]
["VB04Z","Category 2 investigation with category 4 treatment",{"$f":"VLOOKUP('s118 A&E Prices'!A8,'Link Sheet'!B:E,3,FALSE)","v":168.43992527763623},{"$f":"VLOOKUP(A8,'Link Sheet'!B:E,4,FALSE)","v":55.6776570878149}]
["VB05Z","Category 2 investigation with category 3 treatment",{"$f":"VLOOKUP('s118 A&E Prices'!A9,'Link Sheet'!B:E,3,FALSE)","v":146.01128780586535},{"$f":"VLOOKUP(A9,'Link Sheet'!B:E,4,FALSE)","v":55.6776570878149}]
["VB06Z","Category 1 investigation with category 3-4 treatment",{"$f":"VLOOKUP('s118 A&E Prices'!A10,'Link Sheet'!B:E,3,FALSE)","v":102.04545692217432},{"$f":"VLOOKUP(A10,'Link Sheet'!B:E,4,FALSE)","v":55.6776570878149}]
["VB07Z","Category 2 investigation with category 2 treatment",{"$f":"VLOOKUP('s118 A&E Prices'!A11,'Link Sheet'!B:E,3,FALSE)","v":127.76285406506283},{"$f":"VLOOKUP(A11,'Link Sheet'!B:E,4,FALSE)","v":55.6776570878149}]
["VB08Z","Category 2 investigation with category 1 treatment",{"$f":"VLOOKUP('s118 A&E Prices'!A12,'Link Sheet'!B:E,3,FALSE)","v":116.05498715997055},{"$f":"VLOOKUP(A12,'Link Sheet'!B:E,4,FALSE)","v":55.6776570878149}]
["VB09Z","Category 1 investigation with category 1-2 treatment",{"$f":"VLOOKUP('s118 A&E Prices'!A13,'Link Sheet'!B:E,3,FALSE)","v":81.081304380853908},{"$f":"VLOOKUP(A13,'Link Sheet'!B:E,4,FALSE)","v":55.6776570878149}]
["VB10Z","Dental Care",{"$f":"VLOOKUP('s118 A&E Prices'!A14,'Link Sheet'!B:E,3,FALSE)","v":56.382241507222588},{"$f":"VLOOKUP(A14,'Link Sheet'!B:E,4,FALSE)","v":55.6776570878149}]
["VB11Z","No investigation with no significant treatment",{"$f":"VLOOKUP('s118 A&E Prices'!A15,'Link Sheet'!B:E,3,FALSE)","v":55.6776570878149},{"$f":"VLOOKUP(A15,'Link Sheet'!B:E,4,FALSE)","v":55.6776570878149}]
[]
["Please note that patients who are dead on arrival (DOA) attract the tariff for VB09Z."]

{"sheet":"A&E SQL Code","index":4,"n_rows":1,"n_cols":1,"rows_kept":1,"cut":false,"hidden":false,"merged":[]}
["Home"]

{"sheet":"A&E SQL Output","index":5,"n_rows":21,"n_cols":4,"rows_kept":21,"cut":false,"hidden":false,"merged":[]}
["Home"]
[null,"AnE SQL Output"]
[]
[null,"Final A&E Total Activity and Cost Draft 33"]
[]
[]
[]
[]
[]
[null,"HRG","SumOfTotal Activity","SumOfTotal Cost"]
[null,"VB01Z",28002,6929753.5088057099]
[null,"VB02Z",80774,18891658.776388198]
[null,"VB03Z",393335,78138787.405618399]
[null,"VB04Z",597172,104311439.809515]
[null,"VB05Z",358112,54224152.002037302]
[null,"VB06Z",450490,47672320.590454802]
[null,"VB07Z",1536505,203575751.24986801]
[null,"VB08Z",4212098,506932036.780334]
[null,"VB09Z",3638615,305945659.161412]
[null,"VB10Z",2314,143090.62948237499]
{"$rows_left_out":2}
{"sheet":"Price Adjustments","index":6,"n_rows":131,"n_cols":8,"rows_kept":131,"cut":false,"hidden":false,"merged":[[59,1,60,2],[1,2,2,7],[72,1,73,6],[12,1,13,6]]}
["Home"]
[null,null,"Table 1 :  Price Adjustments : Inflation and Efficiency  for all models "]
[]
[null,null,"Adjustment Type","2012/13","2013/14","2014/15","2015/16","Total"]
[null,null,"Inflation",2.1999999999999999E-2,2.7E-2,2.5000000000000001E-2,1.92529689878824E-2,{"$f":"(D5+1)*(E5+1)*(F5+1)*(G5+1)-1","v":9.6546845750163923E-2}]
[null,null,"Efficiency*",-3.6999999999999998E-2,-0.04,-0.04,-3.7999999999999999E-2,-0.1462242304000001]
[null,null,"Inflation and Efficiency (total adjustment)",{"$f":"SUM(D5:D6)","v":-1.4999999999999999E-2},{"$f":"SUM(E5:E6)","v":-1.3000000000000001E-2},-1.4999999999999999E-2,{"$f":"(1+G5)*(1+G6)-1","v":-1.9478643833657161E-2},{"$f":"(1+D7)*(1+E7)*(1+F7)*(1+G7)-1","v":-6.1040909539734511E-2}]
[]
[]
[null,null,"* In 2012-13 the efficiency assumption of 4% was reduced by 0.3% to reflect that BPTs had the effect of reducing overall reimbursement"]
[null,null,"We use a chain linking the post adjustments for joining the efficiency and inflation adjustment together from 2015/16 onwards (this is a slight methodological change from the 13/14 DH method)."]
[]
[null,"Table 2:  Price Adjustments : CNST increase / decrease"]
[]
[null,"Sub-chapter","2012/13","2013/14","2014/15","2015/16","Total"]
[null,"AA",4.4999999999999997E-3,2.7120631448189769E-3,4.0331192887210765E-3,1.0177215451362853E-2,{"$f":"(1+C16)*(1+D16)*(1+E16)*(1+F16)-1","v":2.1578603878145808E-2}]
[null,"AB",3.0000000000000001E-3,4.6639054280992465E-3,2.5168995621460688E-3,6.6765943715936249E-3,{"$f":"(1+C17)*(1+D17)*(1+E17)*(1+F17)-1","v":1.6958911118215347E-2}]
[null,"BZ",2.5999999999999999E-3,1.7135629937548025E-3,2.2965609688603283E-3,1.0261263587219016E-2,1.6953735103538037E-2]
[null,"CZ",1.1999999999999999E-3,7.9831600546853565E-4,8.2227697699654989E-4,5.6058125571560868E-3,8.4448337773224136E-3]
[null,"DZ",4.0000000000000002E-4,2.0988348940491619E-3,1.1281882920322062E-5,1.9793446362510458E-3,4.4952992519378121E-3]
{"$rows_left_out":112}
{"sheet":"2013-14 A&E Tariff ","index":7,"n_rows":18,"n_cols":7,"rows_kept":18,"cut":false,"hidden":false,"merged":[[3,2,3,3]]}
["2013-14 tariff - A&E",null,null,null,null,"Source: ","https://www.gov.uk/government/publications/payment-by-results-pbr-operational-guidance-and-tariffs "]
["Home"]
[]
[null,null,"Tariff (£)"]
["HRG code","HRG name","Type 1 and 2 Departments","Type 3 Departments"]
["VB01Z","Any investigation with category 5 treatment",237,58]
["VB02Z","Category 3 investigation with category 4 treatment",210,58]
["VB03Z","Category 3 investigation with category 1-3 treatment",164,58]
["VB04Z","Category 2 investigation with category 4 treatment",139,58]
["VB05Z","Category 2 investigation with category 3 treatment",130,58]
["VB06Z","Category 1 investigation with category 3-4 treatment",102,58]
["VB07Z","Category 2 investigation with category 2 treatment",119,58]
["VB08Z","Category 2 investigation with category 1 treatment",110,58]
["VB09Z","Category 1 investigation with category 1-2 treatment",78,58]
["VB10Z","Dental Care",59,58]
["VB11Z","No investigation with no significant treatment",58,58]
[]
["Please note that patients who are dead on arrival (DOA) attract the tariff for VB09Z."]

{"sheet":"2014-15 A&E Tariff","index":8,"n_rows":17,"n_cols":4,"rows_kept":17,"cut":false,"hidden":false,"merged":[[2,2,2,3]]}
["2014-15 tariff - A&E",null,"Source: ","http://www.monitor.gov.uk/sites/all/modules/fckeditor/plugins/ktbrowser/_openTKFile.php?id=45704"]
["Home"]
[null,null,"Tariff (£)"]
["HRG code","HRG name","Type 1 and 2 Departments","Type 3 Departments"]
["VB01Z","Any investigation with category 5 treatment",235,57]
["VB02Z","Category 3 investigation with category 4 treatment",208,57]
["VB03Z","Category 3 investigation with category 1-3 treatment",163,57]
["VB04Z","Category 2 investigation with category 4 treatment",138,57]
["VB05Z","Category 2 investigation with category 3 treatment",129,57]
["VB06Z","Category 1 investigation with category 3-4 treatment",101,57]
["VB07Z","Category 2 investigation with category 2 treatment",118,57]
["VB08Z","Category 2 investigation with category 1 treatment",109,57]
["VB09Z","Category 1 investigation with category 1-2 treatment",77,57]
["VB10Z","Dental Care",58,57]
["VB11Z","No investigation with no significant treatment",57,57]
[]
["Please note that patients who are dead on arrival (DOA) attract the tariff for VB09Z."]

{"sheet":"Manual adjustment requests","index":9,"n_rows":13,"n_cols":7,"rows_kept":13,"cut":false,"hidden":false,"merged":[]}
["Home"]
["HRG","HRG description","Pre TED Expert comments","Monitor (pre TED) assessment","Summary of TED responses and other post TED comments","Monitor (post TED) assessment","Final (post TED) implementation instructions for manual adjustments"]
["VB01Z","Emergency Medicine, Any Investigation with Category 5 Treatment","It is difficult to justify reducing the tariff for the most injured/unwell patients as the cost of care will not have decreased. It is likely to have a disproportionate effect on large EDs as care of more complex cases is centralised","no action ","The NP should reflect the actual costs incurred, without any adj to reduce the impact on commissioners (which was done historically)","The s118 prices are acceptable in line with the updated cost base. No adjustment required","No Action"]
["VB02Z","Emergency Medicine, Category 3 Investigation with Category 4 Treatment",null,null,"The NP should reflect the actual costs incurred, without any adj to reduce the impact on commissioners (which was done historically)","The s118 prices are acceptable in line with the updated cost base. No adjustment required","No Action"]
["VB03Z","Emergency Medicine, Category 3 Investigation with Category 1-3 Treatment",null,null,"The NP should reflect the actual costs incurred, without any adj to reduce the impact on commissioners (which was done historically)","The s118 prices are acceptable in line with the updated cost base. No adjustment required","No Action"]
["VB04Z","Emergency Medicine, Category 2 Investigation with Category 4 Treatment",null,null,"The increase in VB04Z is too large to compensate the decreases in VB11Z. \nResults in a 5% increase (£900k) increase in revenue across providers.\n\nSince the 2011/12 RC model Providers have increased in size and the improved coding results in more activity in the more complex HRGs \n\nThe NP should reflect the actual costs incurred, without any adj to reduce the impact on commissioners (which was done historically)","The s118 prices are acceptable in line with the updated cost base. No adjustment required","No Action"]
["VB05Z","Emergency Medicine, Category 2 Investigation with Category 3 Treatment",null,null,"The NP should reflect the actual costs incurred, without any adj to reduce the impact on commissioners (which was done historically)","The s118 prices are acceptable in line with the updated cost base. No adjustment required","No Action"]
["VB06Z","Emergency Medicine, Category 1 Investigation with Category 3-4 Treatment",null,null,"The NP should reflect the actual costs incurred, without any adj to reduce the impact on commissioners (which was done historically)","The s118 prices are acceptable in line with the updated cost base. No adjustment required","No Action"]
["VB07Z","Emergency Medicine, Category 2 Investigation with Category 2 Treatment",null,null,"The NP should reflect the actual costs incurred, without any adj to reduce the impact on commissioners (which was done historically)","The s118 prices are acceptable in line with the updated cost base. No adjustment required","No Action"]
["VB08Z","Emergency Medicine, Category 2 Investigation with Category 1 Treatment",null,null,"The NP should reflect the actual costs incurred, without any adj to reduce the impact on commissioners (which was done historically)","The s118 prices are acceptable in line with the updated cost base. No adjustment required","No Action"]
["VB09Z","Emergency Medicine, Category 1 Investigation with Category 1-2 Treatment",null,null,"Want NP to reflect the Providers cost of provision.\n\nThe lower value NP's should be reduced to reflect the increase to the higher value NP's. So the cost quantum remains the same. \n\nThe NP changes mean additional provider income from the same service provided.\n\nThe NP should reflect the actual costs incurred, without any adj to reduce the impact on commissioners (which was done historically).","The s118 prices are acceptable in line with the updated cost base. No adjustment required","No Action"]
["VB10Z","Emergency Medicine, Dental Care",null,null,"The lower value NP's should be reduced to reflect the increase to the higher value NP's. So the cost quantum remains the same\n\nThe NP should reflect the actual costs incurred, without any adj to reduce the impact on commissioners (which was done historically)","The s118 prices are acceptable in line with the updated cost base. No adjustment required","No Action"]
["VB11Z","Emergency Medicine, No Investigation with No Significant Treatment",null,null,"The decrease (what decrease) in VB11Z is too small to compensate the increases in VB04Z. \nResults in a 5% increase (£900k) increase in revenue across providers.\n\nThe NP should reflect the actual costs incurred, without any adj to reduce the impact on commissioners (which was done historically)","The s118 prices are acceptable in line with the updated cost base. No adjustment required","No Action"]

{"sheet":"Prices","index":10,"n_rows":71,"n_cols":24,"rows_kept":71,"cut":false,"hidden":false,"merged":[[58,11,59,11],[19,13,19,17],[19,19,19,23],[58,2,59,2],[58,3,59,3],[58,4,59,4],[58,5,59,5],[57,2,57,5],[58,12,59,12],[38,12,39,12],[58,7,59,7],[58,8,59,8],[58,9,59,9],[58,10,59,10],[19,7,19,11],[37,2,37,5],[38,5,39,5],[38,4,39,4],[38,3,39,3],[38,2,39,2],[38,11,39,11],[38,10,39,10],[38,9,39,9],[38,8,39,8],[38,7,39,7]]}
[null,null,"Home"]
[null,null,"A&E Price Adjustments"]
[]
[]
[]
[]
[null,null,"Individual adjustment factors"]
[]
[null,null,"Adjustment Type",null,{"$f":"'Price Adjustments'!D4","v":"2012/13"},{"$f":"'Price Adjustments'!E4","v":"2013/14"},{"$f":"'Price Adjustments'!F4","v":"2014/15"},{"$f":"'Price Adjustments'!G4","v":"2015/16"},{"$f":"'Price Adjustments'!H4","v":"Total"}]
[null,null,"CNST (chapter V)",null,{"$f":"'Price Adjustments'!C55","v":1.61E-2},{"$f":"'Price Adjustments'!D55","v":1.1539171571975482E-2},{"$f":"'Price Adjustments'!E55","v":7.33525858395212E-3},{"$f":"'Price Adjustments'!F55","v":2.1468190008266497E-2},{"$f":"'Price Adjustments'!G55","v":5.7591711859506622E-2}]
[null,null,"Inflation",null,{"$f":"'Price Adjustments'!D5","v":2.1999999999999999E-2},{"$f":"'Price Adjustments'!E5","v":2.7E-2},{"$f":"'Price Adjustments'!F5","v":2.5000000000000001E-2},{"$f":"'Price Adjustments'!G5","v":1.92529689878824E-2},{"$f":"'Price Adjustments'!H5","v":9.6546845750163923E-2}]
[null,null,"Efficiency",null,{"$f":"'Price Adjustments'!D6","v":-3.6999999999999998E-2},{"$f":"'Price Adjustments'!E6","v":-0.04},{"$f":"'Price Adjustments'!F6","v":-0.04},{"$f":"'Price Adjustments'!G6","v":-3.7999999999999999E-2},{"$f":"'Price Adjustments'!H6","v":-0.1462242304000001}]
[null,null,"Inflation and Efficiency",null,{"$f":"'Price Adjustments'!D7+E14","v":-1.4999999999999999E-2},{"$f":"'Price Adjustments'!E7+F14","v":-8.3763400000000029E-2},{"$f":"'Price Adjustments'!F7+G14","v":-1.4999999999999999E-2},{"$f":"'Price Adjustments'!G7*(1+H14)","v":-1.9478643833657161E-2},{"$f":"(1+E13)*(1+F13)*(1+G13)*(1+H13)-1","v":-0.12835999535723797}]
[null,null,"Affordability",null,{"$f":"'Price Adjustments'!C95","v":0},{"$f":"'Price Adjustments'!D95","v":-7.0763400000000032E-2},{"$f":"'Price Adjustments'!E95","v":0},{"$f":"'Price Adjustments'!F95","v":0},{"$f":"(1+E14)*(1+F14)*(1+G14)*(1+H14)-1","v":-7.0763400000000032E-2}]
[]
[]
[]
[]
[]
[null,"A&E 2015/16 Tariff Method selector",null,null,null,"Tariff Selection",null,"A&E 2015/16 Final Tariff (£)",null,null,null,null,null,"Comparison with 14/15",null,null,null,null,null,"Comparison with 13/14"]
{"$rows_left_out":52}
{"sheet":"Link Sheet","index":11,"n_rows":14,"n_cols":16,"rows_kept":14,"cut":false,"hidden":false,"merged":[[1,3,1,4],[1,9,1,10],[1,14,1,15]]}
[null,"2015-16 tariff - accident & emergency",null,null,null,null,null,"2014-15 tariff - accident & emergency",null,null,null,null,null,"Difference between 2015/16 & 2013/14"]
[null,"Home",null,"Tariff (£)",null,null,null,null,null,"Tariff (£)",null,null,null,null,"Tariff (£)"]
[null,"HRG code","HRG name","Type 1 and 2 Departments","Type 3 Departments",null,null,"HRG code","HRG name","Type 1 and 2 Departments","Type 3 Departments",null,null,"HRG code","Type 1 and 2 Departments","Type 3 Departments"]
[null,"VB01Z","Emergency Medicine, Any Investigation with Category 5 Treatment",{"$f":"VLOOKUP(B4:B14,Prices!$C$21:$L$32,7,FALSE)","v":238.63891859602694},{"$f":"MIN($D$4:$D$14)","v":55.6776570878149},null,null,"VB01Z","Any investigation with category 5 treatment",{"$f":"VLOOKUP(H4,'2014-15 A&E Tariff'!$A$5:$D$15,3, FALSE)","v":235},{"$f":"VLOOKUP(I4,'2014-15 A&E Tariff'!$B$5:$E$15,3, FALSE)","v":57},null,null,"VB01Z",{"$f":"(D4/J4)-1","v":1.5484759983093399E-2},{"$f":"(E4/K4)-1","v":-2.3198998459387665E-2}]
[null,"VB02Z","Emergency Medicine, Category 3 Investigation with Category 4 Treatment",{"$f":"VLOOKUP(B5:B15,Prices!$C$21:$L$32,7,FALSE)","v":225.53348936432519},{"$f":"MIN($D$4:$D$14)","v":55.6776570878149},null,null,"VB02Z","Category 3 investigation with category 4 treatment",{"$f":"VLOOKUP(H5,'2014-15 A&E Tariff'!$A$5:$D$15,3, FALSE)","v":208},{"$f":"VLOOKUP(I5,'2014-15 A&E Tariff'!$B$5:$E$15,3, FALSE)","v":57},null,null,"VB02Z",{"$f":"(D5/J5)-1","v":8.429562194387108E-2},-2.3198998459387665E-2]
[null,"VB03Z","Emergency Medicine, Category 3 Investigation with Category 1-3 Treatment",{"$f":"VLOOKUP(B6:B16,Prices!$C$21:$L$32,7,FALSE)","v":191.56519723541047},55.6776570878149,null,null,"VB03Z","Category 3 investigation with category 1-3 treatment",{"$f":"VLOOKUP(H6,'2014-15 A&E Tariff'!$A$5:$D$15,3, FALSE)","v":163},{"$f":"VLOOKUP(I6,'2014-15 A&E Tariff'!$B$5:$E$15,3, FALSE)","v":57},null,null,"VB03Z",{"$f":"(D6/J6)-1","v":0.17524660880619924},{"$f":"(E6/K6)-1","v":-2.3198998459387665E-2}]
[null,"VB04Z","Emergency Medicine, Category 2 Investigation with Category 4 Treatment",{"$f":"VLOOKUP(B7:B17,Prices!$C$21:$L$32,7,FALSE)","v":168.43992527763623},55.6776570878149,null,null,"VB04Z","Category 2 investigation with category 4 treatment",{"$f":"VLOOKUP(H7,'2014-15 A&E Tariff'!$A$5:$D$15,3, FALSE)","v":138},{"$f":"VLOOKUP(I7,'2014-15 A&E Tariff'!$B$5:$E$15,3, FALSE)","v":57},null,null,"VB04Z",0.22057916867852345,-2.3198998459387665E-2]
[null,"VB05Z","Emergency Medicine, Category 2 Investigation with Category 3 Treatment",{"$f":"VLOOKUP(B8:B18,Prices!$C$21:$L$32,7,FALSE)","v":146.01128780586535},55.6776570878149,null,null,"VB05Z","Category 2 investigation with category 3 treatment",{"$f":"VLOOKUP(H8,'2014-15 A&E Tariff'!$A$5:$D$15,3, FALSE)","v":129},{"$f":"VLOOKUP(I8,'2014-15 A&E Tariff'!$B$5:$E$15,3, FALSE)","v":57},null,null,"VB05Z",0.13187044810748327,-2.3198998459387665E-2]
[null,"VB06Z","Emergency Medicine, Category 1 Investigation with Category 3-4 Treatment",{"$f":"VLOOKUP(B9:B19,Prices!$C$21:$L$32,7,FALSE)","v":102.04545692217432},55.6776570878149,null,null,"VB06Z","Category 1 investigation with category 3-4 treatment",{"$f":"VLOOKUP(H9,'2014-15 A&E Tariff'!$A$5:$D$15,3, FALSE)","v":101},{"$f":"VLOOKUP(I9,'2014-15 A&E Tariff'!$B$5:$E$15,3, FALSE)","v":57},null,null,"VB06Z",1.0351058635389432E-2,-2.3198998459387665E-2]
[null,"VB07Z","Emergency Medicine, Category 2 Investigation with Category 2 Treatment",{"$f":"VLOOKUP(B10:B20,Prices!$C$21:$L$32,7,FALSE)","v":127.76285406506283},55.6776570878149,null,null,"VB07Z","Category 2 investigation with category 2 treatment",{"$f":"VLOOKUP(H10,'2014-15 A&E Tariff'!$A$5:$D$15,3, FALSE)","v":118},{"$f":"VLOOKUP(I10,'2014-15 A&E Tariff'!$B$5:$E$15,3, FALSE)","v":57},null,null,"VB07Z",8.2736051398837551E-2,-2.3198998459387665E-2]
[null,"VB08Z","Emergency Medicine, Category 2 Investigation with Category 1 Treatment",{"$f":"VLOOKUP(B11:B21,Prices!$C$21:$L$32,7,FALSE)","v":116.05498715997055},55.6776570878149,null,null,"VB08Z","Category 2 investigation with category 1 treatment",{"$f":"VLOOKUP(H11,'2014-15 A&E Tariff'!$A$5:$D$15,3, FALSE)","v":109},{"$f":"VLOOKUP(I11,'2014-15 A&E Tariff'!$B$5:$E$15,3, FALSE)","v":57},null,null,"VB08Z",6.4724652843766606E-2,-2.3198998459387665E-2]
[null,"VB09Z","Emergency Medicine, Category 1 Investigation with Category 1-2 Treatment",{"$f":"VLOOKUP(B12:B22,Prices!$C$21:$L$32,7,FALSE)","v":81.081304380853908},55.6776570878149,null,null,"VB09Z","Category 1 investigation with category 1-2 treatment",{"$f":"VLOOKUP(H12,'2014-15 A&E Tariff'!$A$5:$D$15,3, FALSE)","v":77},{"$f":"VLOOKUP(I12,'2014-15 A&E Tariff'!$B$5:$E$15,3, FALSE)","v":57},null,null,"VB09Z",5.3003952998102788E-2,-2.3198998459387665E-2]
[null,"VB10Z","Emergency Medicine, Dental Care",{"$f":"VLOOKUP(B13:B23,Prices!$C$21:$L$32,7,FALSE)","v":56.382241507222588},55.6776570878149,null,null,"VB10Z","Dental Care",{"$f":"VLOOKUP(H13,'2014-15 A&E Tariff'!$A$5:$D$15,3, FALSE)","v":58},{"$f":"VLOOKUP(I13,'2014-15 A&E Tariff'!$B$5:$E$15,3, FALSE)","v":57},null,null,"VB10Z",-2.7892387806507157E-2,-2.3198998459387665E-2]
[null,"VB11Z","Emergency Medicine, No Investigation with No Significant Treatment",{"$f":"VLOOKUP(B14:B24,Prices!$C$21:$L$32,7,FALSE)","v":55.6776570878149},55.6776570878149,null,null,"VB11Z","No investigation with no significant treatment",{"$f":"VLOOKUP(H14,'2014-15 A&E Tariff'!$A$5:$D$15,3, FALSE)","v":57},{"$f":"VLOOKUP(I14,'2014-15 A&E Tariff'!$B$5:$E$15,3, FALSE)","v":57},null,null,"VB11Z",-2.3198998459387665E-2,-2.3198998459387665E-2]