application_source,rep_status,stage_resolved,final_decision,scheme,gender,age,main_injury,rejection_or_reduction_reasons,first_decision,review_decision,appeal_decision,value_of_award,days_to_first_decision
On-line application,Represented,Initial application,Full award,2001 Scheme,Female,0 to 17,BRAIN DAMAGE VERY SERIOUS,NO_DATA,Full award,,,326413,3506
On-line application,Represented,Initial application,Full award,2001 Scheme,Female,0 to 17,BRAIN DAMAGE VERY SERIOUS,NO_DATA,Full award,,,500000,2460
On-line application,Represented,Initial application,Full award,2001 Scheme,Female,0 to 17,BRAIN DAMAGE VERY SERIOUS,NO_DATA,Full award,,,500000,4171
On-line application,Represented,Initial application,Full award,2001 Scheme,Female,0 to 17,BRAIN DAMAGE VERY SERIOUS,NO_DATA,Full award,,,500000,2440
On-line application,Represented,Appeal,Full award,2001 Scheme,Male,0 to 17,BRAIN DAMAGE VERY SERIOUS,NO_DATA,Full award,Full award,Full award,500000,943
On-line application,Represented,Initial application,Full award,2001 Scheme,Male,0 to 17,BRAIN DAMAGE VERY SERIOUS,NO_DATA,Full award,,,386251,4522
On-line application,Represented,Appeal,Full award,2001 Scheme,Female,0 to 17,BRAIN DAMAGE VERY SERIOUS,NO_DATA,Nil award,Nil award,Full award,500000,1478
On-line application,Represented,Initial application,Full award,2001 Scheme,Male,0 to 17,BRAIN DAMAGE VERY SERIOUS,NO_DATA,Full award,,,500000,2703
On-line application,Represented,Initial application,Full award,2001 Scheme,Female,0 to 17,BRAIN DAMAGE VERY SERIOUS,NO_DATA,Full award,,,500000,2821
On-line application,Not represented,Initial application,Full award,2001 Scheme,Male,0 to 17,BRAIN DAMAGE VERY SERIOUS,NO_DATA,Full award,,,343238,3178
On-line application,Represented,Initial application,Full award,2001 Scheme,Male,0 to 17,BRAIN DAMAGE VERY SERIOUS,NO_DATA,Full award,,,461534,3293
On-line application,Represented,Initial application,Full award,2001 Scheme,Male,0 to 17,BRAIN DAMAGE VERY SERIOUS,NO_DATA,Full award,,,232371,2697
On-line application,Represented,Review,Full award,2001 Scheme,Male,0 to 17,BRAIN DAMAGE VERY SERIOUS,NO_DATA,Nil award,Full award,,454581,897
On-line application,Represented,Appeal,Full award,2001 Scheme,Male,0 to 17,BRAIN DAMAGE VERY SERIOUS,NO_DATA,Full award,Full award,Full award,500000,2420
On-line application,Not represented,Initial application,Full award,2001 Scheme,Female,0 to 17,BRAIN DAMAGE VERY SERIOUS,NO_DATA,Full award,,,500000,2240
On-line application,Represented,Initial application,Full award,2001 Scheme,Male,18 to 40,BRAIN DAMAGE VERY SERIOUS,NO_DATA,Full award,,,154320,2719
On-line application,Represented,Review,Full award,2001 Scheme,Female,18 to 40,BRAIN DAMAGE VERY SERIOUS,NO_DATA,Full award,Full award,,250585,3651
On-line application,Represented,Review,Full award,2001 Scheme,Male,18 to 40,BRAIN DAMAGE VERY SERIOUS,NO_DATA,Full award,Full award,,122251,1548
On-line application,Represented,Review,Full award,2001 Scheme,Male,18 to 40,BRAIN DAMAGE VERY SERIOUS,NO_DATA,Full award,Full award,,324960,3739
On-line application,Represented,Initial application,Full award,2001 Scheme,Male,18 to 40,BRAIN DAMAGE VERY SERIOUS,NO_DATA,Full award,,,500000,216
On-line application,Represented,Appeal,Full award,2001 Scheme,Male,18 to 40,BRAIN DAMAGE VERY SERIOUS,NO_DATA,Full award,Full award,Full award,500000,1727
On-line application,Represented,Initial application,Full award,2001 Scheme,Male,18 to 40,BRAIN DAMAGE VERY SERIOUS,NO_DATA,Full award,,,132010,3982
On-line application,Represented,Review,Full award,2001 Scheme,Female,18 to 40,BRAIN DAMAGE VERY SERIOUS,NO_DATA,Full award,Full award,,500000,2458
On-line application,Represented,Initial application,Full award,2001 Scheme,Female,18 to 40,BRAIN DAMAGE VERY SERIOUS,NO_DATA,Full award,,,499850,4173
On-line application,Represented,Appeal,Full award,2001 Scheme,Male,18 to 40,BRAIN DAMAGE VERY SERIOUS,NO_DATA,Full award,Full award,Full award,500000,2121
On-line application,Represented,Initial application,Full award,2001 Scheme,Male,18 to 40,BRAIN DAMAGE VERY SERIOUS,NO_DATA,Full award,,,196300,4277
On-line application,Represented,Review,Reduced award,2001 Scheme,Male,18 to 40,BRAIN DAMAGE VERY SERIOUS,Multiple,Nil award,Reduced award,,250000,1745
On-line application,Represented,Appeal,Full award,2001 Scheme,Male,18 to 40,BRAIN DAMAGE VERY SERIOUS,NO_DATA,Nil award,Full award,Full award,500000,1553
On-line application,Represented,Review,Full award,2001 Scheme,Male,41 to 64,BRAIN DAMAGE VERY SERIOUS,NO_DATA,Full award,Full award,,415037,2861
On-line application,Represented,Review,Full award,2001 Scheme,Male,41 to 64,BRAIN DAMAGE VERY SERIOUS,NO_DATA,Nil award,Full award,,193772,678
On-line application,Represented,Review,Full award,2001 Scheme,Male,41 to 64,BRAIN DAMAGE VERY SERIOUS,NO_DATA,Full award,Full award,,500000,722
On-line application,Represented,Initial application,Full award,2001 Scheme,Male,41 to 64,BRAIN DAMAGE VERY SERIOUS,NO_DATA,Full award,,,210521,2720
On-line application,Represented,Initial application,Full award,2001 Scheme,Male,41 to 64,BRAIN DAMAGE VERY SERIOUS,NO_DATA,Full award,,,140546,2306
On-line application,Represented,Initial application,Full award,2001 Scheme,Male,41 to 64,BRAIN DAMAGE VERY SERIOUS,NO_DATA,Full award,,,87500,2610
On-line application,Represented,Initial application,Full award,2001 Scheme,Male,41 to 64,BRAIN DAMAGE VERY SERIOUS,NO_DATA,Full award,,,198276,3363
On-line application,Represented,Appeal,Full award,2001 Scheme,Male,41 to 64,BRAIN DAMAGE VERY SERIOUS,NO_DATA,Full award,Full award,Full award,496724.5,3014
On-line application,Represented,Review,Full award,2001 Scheme,Male,41 to 64,BRAIN DAMAGE VERY SERIOUS,NO_DATA,Full award,Full award,,121519,487
On-line application,Represented,Appeal,Reduced award,2001 Scheme,Male,41 to 64,BRAIN DAMAGE VERY SERIOUS,Applicants criminal record/character,Nil award,Nil award,Reduced award,54238.75,434
On-line application,Represented,Review,Full award,2008 Scheme,Male,18 to 40,COLLAPSED LUNGS,NO_DATA,Nil award,Full award,,8950,28
On-line application,Not represented,Initial application,Full award,2012 Scheme,Male,18 to 40,COLLAPSED LUNGS,NO_DATA,Full award,,,6650,185
On-line application,Represented,Initial application,Full award,2008 Scheme,Male,18 to 40,COLLAPSED LUNGS,NO_DATA,Full award,,,9175,608
Telephone application,Represented,Initial application,Full award,2012 Scheme,Male,18 to 40,COLLAPSED LUNGS,NO_DATA,Full award,,,8750,654
On-line application,Not represented,Initial application,Full award,2008 Scheme,Male,18 to 40,DEPRESSED SKULL FRACTURE - OP,NO_DATA,Full award,,,30952,1282
On-line application,Represented,Initial application,Full award,2008 Scheme,Male,18 to 40,DEPRESSED SKULL FRACTURE - OP,NO_DATA,Full award,,,11646,794
On-line application,Not represented,Initial application,Reduced award,2008 Scheme,Male,18 to 40,DEPRESSED SKULL FRACTURE - OP,Applicants criminal record/character,Reduced award,,,5287.5,799
On-line application,Not represented,Initial application,Reduced award,2008 Scheme,Male,18 to 40,DEPRESSED SKULL FRACTURE - OP,Multiple,Reduced award,,,2836,902
Telephone application,Represented,Initial application,Full award,2008 Scheme,Male,18 to 40,DEPRESSED SKULL FRACTURE - OP,NO_DATA,Full award,,,8085,903
Telephone application,Represented,Initial application,Reduced award,2008 Scheme,Male,18 to 40,DEPRESSED SKULL FRACTURE - OP,Applicants criminal record/character,Reduced award,,,3637.5,829
Telephone application,Represented,Initial application,Full award,2008 Scheme,Male,18 to 40,DEPRESSED SKULL FRACTURE NO OP,NO_DATA,Full award,,,4400,514
On-line application,Not represented,Review,Full award,2008 Scheme,Male,18 to 40,DEPRESSED SKULL FRACTURE NO OP,NO_DATA,Full award,Full award,,5720,222
Telephone application,Not represented,Initial application,Full award,2008 Scheme,Male,18 to 40,DEPRESSED SKULL FRACTURE NO OP,NO_DATA,Full award,,,5390,753
Telephone application,Represented,Initial application,Full award,2008 Scheme,Male,18 to 40,DEPRESSED SKULL FRACTURE NO OP,NO_DATA,Full award,,,5075,535
On-line application,Represented,Initial application,Full award,2008 Scheme,Male,18 to 40,DEPRESSED SKULL FRACTURE NO OP,NO_DATA,Full award,,,6215,421
On-line application,Not represented,Review,Full award,2008 Scheme,Male,18 to 40,DEPRESSED SKULL FRACTURE NO OP,NO_DATA,Full award,Full award,,5390,314
Telephone application,Represented,Initial application,Full award,2008 Scheme,Male,18 to 40,DEPRESSED SKULL FRACTURE NO OP,NO_DATA,Full award,,,9285,830
On-line application,Not represented,Initial application,Reduced award,2008 Scheme,Male,18 to 40,DEPRESSED SKULL FRACTURE NO OP,Applicants criminal record/character,Reduced award,,,3300,714
On-line application,Not represented,Review,Full award,2008 Scheme,Male,18 to 40,EPILEPSY WELL CONTROLLED,NO_DATA,Full award,Full award,,5075,267
On-line application,Represented,Review,Full award,2012 Scheme,Male,18 to 40,EPILEPSY WELL CONTROLLED,NO_DATA,Full award,Full award,,6920,405
Telephone application,Not represented,Review,Full award,2012 Scheme,Male,18 to 40,EPILEPSY WELL CONTROLLED,NO_DATA,Nil award,Full award,,3100,360
On-line application,Represented,Review,Full award,2008 Scheme,Male,18 to 40,EPILEPSY WELL CONTROLLED,NO_DATA,Full award,Full award,,12722,604
On-line application,Represented,Review,Full award,2012 Scheme,Male,18 to 40,EPILEPSY WELL CONTROLLED,NO_DATA,Nil award,Full award,,1860,163
On-line application,Represented,Review,Full award,2008 Scheme,Male,18 to 40,FRAC MAND/MAX OP REQD LEVEL 12,NO_DATA,Full award,Full award,,9395,746
On-line application,Not represented,Review,Full award,2008 Scheme,Male,18 to 40,FRAC MAND/MAX OP REQD LEVEL 12,NO_DATA,Full award,Full award,,8565,442
On-line application,Represented,Review,Reduced award,2001 Scheme,Male,18 to 40,FRAC MAND/MAX OP REQD LEVEL 12,Applicants criminal record/character,Nil award,Reduced award,,23062.5,1578
On-line application,Not represented,Appeal,Reduced award,2008 Scheme,Male,18 to 40,FRAC MAND/MAX OP REQD LEVEL 12,Failure to report without delay,Nil award,Nil award,Reduced award,58103.74,3
Telephone application,Not represented,Appeal,Full award,2008 Scheme,Male,41 to 64,FRAC MAND/MAX OP REQD LEVEL 12,NO_DATA,Full award,Full award,Full award,9190,539
On-line application,Not represented,Review,Full award,2008 Scheme,Male,41 to 64,FRAC MAND/MAX OP REQD LEVEL 12,NO_DATA,Full award,Full award,,10015,569
On-line application,Not represented,Initial application,Full award,2008 Scheme,Male,41 to 64,FRAC MAND/MAX OP REQD LEVEL 12,NO_DATA,Full award,,,8200,534
On-line application,Not represented,Appeal,Reduced award,2008 Scheme,Male,41 to 64,FRAC MAND/MAX OP REQD LEVEL 12,Applicants criminal record/character,Nil award,Nil award,Reduced award,2125,274
On-line application,Represented,Appeal,Reduced award,2008 Scheme,Male,18 to 40,FRAC/DISL ANKLE SIGNF. DISAB,"Conduct before, during or after the incident",Nil award,Nil award,Reduced award,8023.25,262
On-line application,Represented,Review,Full award,2012 Scheme,Male,18 to 40,FRAC/DISL ANKLE SIGNF. DISAB,NO_DATA,Full award,Full award,,11450,321
On-line application,Not represented,Review,Full award,2008 Scheme,Male,18 to 40,FRAC/DISL ANKLE SIGNF. DISAB,NO_DATA,Full award,Full award,,12050,798
Telephone application,Not represented,Appeal,Full award,2012 Scheme,Male,18 to 40,FRAC/DISL ANKLE SIGNF. DISAB,NO_DATA,Full award,Full award,Full award,11720,132
On-line application,Represented,Appeal,Reduced award,2008 Scheme,Male,18 to 40,FRAC/DISL ANKLE SIGNF. DISAB,"Conduct before, during or after the incident",Full award,Nil award,Reduced award,8625,142
On-line application,Represented,Review,Full award,2001 Scheme,Male,18 to 40,FRAC/DISL ANKLE SIGNF. DISAB,NO_DATA,Full award,Full award,,4400,1128
Telephone application,Represented,Review,Full award,2008 Scheme,Male,41 to 64,FRAC/DISL ANKLE SIGNF. DISAB,NO_DATA,Full award,Full award,,12125,706
On-line application,Represented,Review,Full award,2008 Scheme,Male,41 to 64,FRAC/DISL ANKLE SIGNF. DISAB,NO_DATA,Full award,Full award,,65634.5,460
On-line application,Represented,Appeal,Full award,2008 Scheme,Male,41 to 64,FRAC/DISL ANKLE SIGNF. DISAB,NO_DATA,Full award,Full award,Full award,12515,199
On-line application,Represented,Review,Full award,2008 Scheme,Male,41 to 64,FRAC/DISL ANKLE SIGNF. DISAB,NO_DATA,Full award,Full award,,60483.5,669
Telephone application,Not represented,Review,Full award,2008 Scheme,Male,41 to 64,FRAC/DISL ANKLE SIGNF. DISAB,NO_DATA,Full award,Full award,,12635,580
On-line application,Not represented,Initial application,Full award,2008 Scheme,Male,18 to 40,INJ REQ THORACOTOMY ORGAN REMOVAL,NO_DATA,Full award,,,74732,1568
On-line application,Not represented,Review,Full award,2008 Scheme,Male,18 to 40,INJ REQ THORACOTOMY ORGAN REMOVAL,NO_DATA,Full award,Full award,,19335,854
Telephone application,Represented,Review,Full award,2008 Scheme,Male,18 to 40,INJ REQ THORACOTOMY ORGAN REMOVAL,NO_DATA,Nil award,Full award,,21450,113
On-line application,Represented,Review,Reduced award,2001 Scheme,Male,18 to 40,INJURY REQUIRING LAPAROTOMY,Applicants criminal record/character,Reduced award,Reduced award,,3592.5,1009
On-line application,Not represented,Initial application,Reduced award,2001 Scheme,Male,18 to 40,INJURY REQUIRING LAPAROTOMY,Applicants criminal record/character,Reduced award,,,1900,4138
On-line application,Represented,Initial application,Full award,2001 Scheme,Male,18 to 40,INJURY REQUIRING LAPAROTOMY,NO_DATA,Full award,,,4437.5,587
On-line application,Not represented,Initial application,Full award,2012 Scheme,Male,18 to 40,INJURY REQUIRING THORACOTOMY,NO_DATA,Full award,,,6800,264
On-line application,Not represented,Initial application,Full award,2012 Scheme,Male,18 to 40,INJURY REQUIRING THORACOTOMY,NO_DATA,Full award,,,6965,294
Telephone application,Not represented,Initial application,Full award,2008 Scheme,Male,18 to 40,INJURY REQUIRING THORACOTOMY,NO_DATA,Full award,,,10345,788
On-line application,Represented,Review,Full award,2008 Scheme,Male,18 to 40,INJURY REQUIRING THORACOTOMY,NO_DATA,Full award,Full award,,9527.5,590
Telephone application,Represented,Initial application,Full award,2008 Scheme,Male,18 to 40,INJURY REQUIRING THORACOTOMY,NO_DATA,Full award,,,9910,729
On-line application,Not represented,Initial application,Full award,2012 Scheme,Male,18 to 40,INJURY REQUIRING THORACOTOMY,NO_DATA,Full award,,,6161,545
On-line application,Represented,Initial application,Reduced award,2008 Scheme,Male,18 to 40,INJURY REQUIRING THORACOTOMY,Applicants criminal record/character,Reduced award,,,15431.8,1514
Telephone application,Not represented,Initial application,Full award,2012 Scheme,Male,18 to 40,INJURY REQUIRING THORACOTOMY,NO_DATA,Full award,,,6650,615
On-line application,Represented,Initial application,Full award,2012 Scheme,Male,18 to 40,INJURY REQUIRING THORACOTOMY,NO_DATA,Full award,,,6650,405
On-line application,Represented,Initial application,Full award,2012 Scheme,Male,18 to 40,INJURY REQUIRING THORACOTOMY,NO_DATA,Full award,,,7520,366
Telephone application,Not represented,Review,Full award,2008 Scheme,Male,18 to 40,INJURY REQUIRING THORACOTOMY,NO_DATA,Full award,Full award,,9715,526
On-line application,Represented,Initial application,Full award,2008 Scheme,Male,41 to 64,INJURY REQUIRING THORACOTOMY,NO_DATA,Full award,,,8650,850
On-line application,Not represented,Initial application,Full award,2012 Scheme,Male,41 to 64,INJURY REQUIRING THORACOTOMY,NO_DATA,Full award,,,6650,208
On-line application,Represented,Review,Full award,2012 Scheme,Male,41 to 64,INJURY REQUIRING THORACOTOMY,NO_DATA,Full award,Full award,,6740,84
On-line application,Represented,Initial application,Full award,2012 Scheme,Male,41 to 64,INJURY REQUIRING THORACOTOMY,NO_DATA,Full award,,,6200,468
Telephone application,Represented,Initial application,Full award,2008 Scheme,Male,41 to 64,INJURY REQUIRING THORACOTOMY,NO_DATA,Full award,,,8575,764
On-line application,Represented,Initial application,Full award,2012 Scheme,Male,41 to 64,INJURY REQUIRING THORACOTOMY,NO_DATA,Full award,,,6890,363
Telephone application,Not represented,Initial application,Full award,2012 Scheme,Male,41 to 64,INJURY REQUIRING THORACOTOMY,NO_DATA,Full award,,,6650,184
On-line application,Represented,Initial application,Full award,2008 Scheme,Male,18 to 40,LEG TENDON MODT DAMAGE LEVEL 5,NO_DATA,Full award,,,2000,910
On-line application,Represented,Initial application,Full award,2008 Scheme,Male,18 to 40,LEG TENDON MODT DAMAGE LEVEL 5,NO_DATA,Full award,,,0,1129
Telephone application,Represented,Initial application,Full award,2008 Scheme,Male,18 to 40,LEG TENDON MODT DAMAGE LEVEL 5,NO_DATA,Full award,,,2000,603
On-line application,Represented,Appeal,Full award,2008 Scheme,Male,18 to 40,LEG TENDON MODT DAMAGE LEVEL 5,NO_DATA,Nil award,Full award,Full award,2000,178
On-line application,Represented,Review,Full award,2008 Scheme,Female,18 to 40,LEG TENDON MODT DAMAGE LEVEL 5,NO_DATA,Nil award,Full award,,2000,167
Telephone application,Not represented,Review,Full award,2008 Scheme,Male,18 to 40,LEG TENDON MODT DAMAGE LEVEL 5,NO_DATA,Nil award,Full award,,2600,394
Telephone application,Represented,Initial application,Full award,2008 Scheme,Female,18 to 40,LEG TENDON MODT DAMAGE LEVEL 5,NO_DATA,Full award,,,2000,771
On-line application,Represented,Initial application,Full award,2008 Scheme,Male,18 to 40,LEG TENDON MODT DAMAGE LEVEL 5,NO_DATA,Full award,,,2600,910
Telephone application,Represented,Initial application,Full award,2008 Scheme,Male,18 to 40,LEG TENDON MODT DAMAGE LEVEL 5,NO_DATA,Full award,,,2000,715
Telephone application,Represented,Review,Full award,2008 Scheme,Male,18 to 40,LEG TENDON MODT DAMAGE LEVEL 5,NO_DATA,Full award,Full award,,2375,516
On-line application,Not represented,Review,Full award,2008 Scheme,Female,18 to 40,LEG TENDON MODT DAMAGE LEVEL 5,NO_DATA,Nil award,Full award,,2600,0
Telephone application,Represented,Initial application,Reduced award,2008 Scheme,Male,18 to 40,LEG TENDON MODT DAMAGE LEVEL 5,Applicants criminal record/character,Reduced award,,,2550,783
On-line application,Represented,Review,Full award,2008 Scheme,Female,18 to 40,LEG TENDON MODT DAMAGE LEVEL 5,NO_DATA,Full award,Full award,,0,325
Telephone application,Represented,Initial application,Full award,2008 Scheme,Female,18 to 40,LEG TENDON MODT DAMAGE LEVEL 5,NO_DATA,Full award,,,1900,680
On-line application,Represented,Initial application,Full award,2008 Scheme,Male,18 to 40,LEG TENDON MODT DAMAGE LEVEL 5,NO_DATA,Full award,,,2600,852
Telephone application,Represented,Initial application,Full award,2008 Scheme,Male,41 to 64,LEG TENDON MODT DAMAGE LEVEL 5,NO_DATA,Full award,,,1600,794
On-line application,Represented,Review,Full award,2008 Scheme,Male,41 to 64,LEG TENDON MODT DAMAGE LEVEL 5,NO_DATA,Nil award,Full award,,2000,138
On-line application,Represented,Appeal,Full award,2008 Scheme,Male,41 to 64,LEG TENDON MODT DAMAGE LEVEL 5,NO_DATA,Nil award,Nil award,Full award,53928,859
On-line application,Represented,Initial application,Full award,2008 Scheme,Male,41 to 64,LEG TENDON MODT DAMAGE LEVEL 5,NO_DATA,Full award,,,2000,811
On-line application,Represented,Initial application,Full award,2008 Scheme,Female,41 to 64,LEG TENDON MODT DAMAGE LEVEL 5,NO_DATA,Full award,,,73609,1969
On-line application,Not represented,Initial application,Full award,2008 Scheme,Male,41 to 64,LEG TENDON MODT DAMAGE LEVEL 5,NO_DATA,Full award,,,2600,804
On-line application,Not represented,Review,Full award,2008 Scheme,Male,41 to 64,LEG TENDON MODT DAMAGE LEVEL 5,NO_DATA,Nil award,Full award,,0,130
On-line application,Represented,Initial application,Full award,2008 Scheme,Female,41 to 64,LEG TENDON MODT DAMAGE LEVEL 5,NO_DATA,Full award,,,2750,1660
Telephone application,Represented,Appeal,Full award,2008 Scheme,Male,41 to 64,LEG TENDON MODT DAMAGE LEVEL 5,NO_DATA,Nil award,Nil award,Full award,2000,514
On-line application,Represented,Initial application,Full award,2008 Scheme,Male,41 to 64,LEG TENDON MODT DAMAGE LEVEL 5,NO_DATA,Full award,,,2600,1216
On-line application,Represented,Review,Full award,2008 Scheme,Male,41 to 64,LEG TENDON MODT DAMAGE LEVEL 5,NO_DATA,Nil award,Full award,,7426,856
On-line application,Represented,Initial application,Full award,2008 Scheme,Female,41 to 64,LEG TENDON MODT DAMAGE LEVEL 5,NO_DATA,Full award,,,2000,756
On-line application,Represented,Appeal,Full award,2008 Scheme,Male,41 to 64,LEG TENDON MODT DAMAGE LEVEL 5,NO_DATA,Nil award,Nil award,Full award,2000,204
On-line application,Represented,Appeal,Full award,2008 Scheme,Female,41 to 64,LEG TENDON MODT DAMAGE LEVEL 5,NO_DATA,Nil award,Nil award,Full award,2000,118
Telephone application,Represented,Initial application,Full award,2008 Scheme,Female,41 to 64,LEG TENDON MODT DAMAGE LEVEL 5,NO_DATA,Full award,,,0,803
Telephone application,Not represented,Initial application,Full award,2008 Scheme,Male,41 to 64,LEG TENDON MODT DAMAGE LEVEL 5,NO_DATA,Full award,,,2000,587
Telephone application,Not represented,Initial application,Full award,2008 Scheme,Male,41 to 64,LEG TENDON MODT DAMAGE LEVEL 5,NO_DATA,Full award,,,2000,630
Telephone application,Not represented,Initial application,Full award,2008 Scheme,Male,41 to 64,LEG TENDON MODT DAMAGE LEVEL 5,NO_DATA,Full award,,,2000,99
Telephone application,Represented,Initial application,Full award,2008 Scheme,Female,41 to 64,LEG TENDON MODT DAMAGE LEVEL 5,NO_DATA,Full award,,,2600,656
On-line application,Represented,Initial application,Full award,2008 Scheme,Male,18 to 40,LEG TENDON SEV DAMAGE LEVEL 12,NO_DATA,Full award,,,8800,1926
On-line application,Represented,Appeal,Full award,2008 Scheme,Male,18 to 40,LEG TENDON SEV DAMAGE LEVEL 12,NO_DATA,Nil award,Nil award,Full award,32338,1
On-line application,Represented,Appeal,Full award,2008 Scheme,Male,18 to 40,LEG TENDON SEV DAMAGE LEVEL 12,NO_DATA,Full award,Full award,Full award,46555,370
On-line application,Not represented,Appeal,Reduced award,2008 Scheme,Male,18 to 40,LEG TENDON SEV DAMAGE LEVEL 12,Applicants criminal record/character,Nil award,Nil award,Reduced award,21621.25,399
On-line application,Represented,Review,Full award,2001 Scheme,Male,18 to 40,LEG TENDON SEV DAMAGE LEVEL 12,NO_DATA,Full award,Full award,,22286,1241
On-line application,Not represented,Review,Full award,2001 Scheme,Male,18 to 40,LEG TENDON SEV DAMAGE LEVEL 12,NO_DATA,Full award,Full award,,0,479
Telephone application,Not represented,Appeal,Full award,2012 Scheme,Female,18 to 40,LOSS OF CROWNS,NO_DATA,Nil award,Nil award,Full award,1000,143
On-line application,Not represented,Review,Full award,2012 Scheme,Female,18 to 40,LOSS OF CROWNS,NO_DATA,Full award,Full award,,1000,274
On-line application,Not represented,Initial application,Full award,2012 Scheme,Male,18 to 40,LOSS OF CROWNS,NO_DATA,Full award,,,1000,359
Telephone application,Not represented,Initial application,Full award,2012 Scheme,Male,18 to 40,LOSS OF CROWNS,NO_DATA,Full award,,,1050,441
On-line application,Not represented,Initial application,Full award,2012 Scheme,Male,18 to 40,LOSS OF CROWNS,NO_DATA,Full award,,,1000,412
On-line application,Not represented,Initial application,Full award,2012 Scheme,Male,18 to 40,LOSS OF CROWNS,NO_DATA,Full award,,,1000,388
On-line application,Not represented,Initial application,Full award,2008 Scheme,Male,18 to 40,LOSS OF CROWNS,NO_DATA,Full award,,,3100,1230
On-line application,Not represented,Review,Full award,2008 Scheme,Male,18 to 40,LOSS OF CROWNS,NO_DATA,Nil award,Full award,,2950,90
On-line application,Not represented,Initial application,Full award,2012 Scheme,Male,18 to 40,LOSS OF CROWNS,NO_DATA,Full award,,,1000,614
On-line application,Not represented,Review,Full award,2008 Scheme,Male,18 to 40,LOSS OF CROWNS,NO_DATA,Nil award,Full award,,2500,663