application_source,rep_status,final_decision,scheme,gender,age,main_injury,rejection_reason,first_decision,review_decision,appeal_decision,value_of_award,days_to_first_decision, 
On-line application,Not represented ,Full award,2012 Scheme,Female,18-40,SEXUAL ASSAULT LEVEL B9,,Full award,,,11000,263, 
On-line application,Not represented ,Full award,2012 Scheme,Female,18-40,DISABLE MENTAL INJURY LEVEL A7,,Full award,,,6500,1165, 
On-line application,Represented,Full award,2008 Scheme,Female,0-17,SEXUAL ASSAULT CHILD LEVEL 17,,Full award,Full award ,Full award,22000,599, 
On-line application,Represented,Reduced award,2012 Scheme,Male,41-64,LOSS OF 4 OR MORE FRONT TEETH,Applicants criminal record/character,Reduced award ,,,3150,193, 
Telephone application,Not represented ,Full award,2012 Scheme,Male,41-64,FRACT WRIST COLLES SUBST. REC,,Nil award,Full award ,Full award,2850,358, 
On-line application,Represented,Full award,2012 Scheme,Female,65 and above,STRAINED BACK-13 WEEKS OR MORE,,Full award,,,800,465, 
On-line application,Not represented ,Full award,2012 Scheme,Male,41-64,FATAL-MULTIPLE QUALIFYING,,Full award,,,42999,54, 
On-line application,Not represented ,Full award,2012 Scheme,Male,18-40,SCAR FACE SIGNIFICANT DISFIGUR,,Full award,,,2400,286, 
On-line application,Represented,Full award,2012 Scheme,Female,41-64,SCAR FACE SIGNIFICANT DISFIGUR,,Full award,,,2400,572, 
On-line application,Represented,Full award,2012 Scheme,Male,18-40,DAMAGE TOOTH/TEETH REQ CROWNS,,Full award,,,1000,109, 
On-line application,Not represented ,Full award,2012 Scheme,Female,0-17,SEXUAL ASSAULT CHILD LEVEL B7,,Full award,,,6600,551, 
On-line application,Not represented ,Full award,2012 Scheme,Male,18-40,FRAC MAND/MAX OP REQD LEVEL A3,,Nil award,Full award ,,1800,188, 
On-line application,Not represented ,Full award,2012 Scheme,Female,41-64,SEXUAL ASSAULT CHILD LEVEL B4,,Full award,,,3300,296, 
Telephone application,Not represented ,Full award,2008 Scheme,Female,18-40,SEXUAL ASSAULT LEVEL 13,,Nil award,Full award ,,11000,581, 
On-line application,Not represented ,Nil award,2012 Scheme,Male,41-64,NO DATA,Applicants criminal record/character,Nil award,,,,336, 
On-line application,Represented,Nil award,2012 Scheme,Female,18-40,NO DATA,Failure to Cooperate with police in bringing assailant to justice,Nil award,,,,45, 
On-line application,Represented,Nil award,2012 Scheme,Male,41-64,NO DATA,Applicants criminal record/character,Nil award,,,,191, 
On-line application,Not represented ,Full award,2012 Scheme,Female,41-64,SEXUAL ASSAULT CHILD LEVEL B4,,Full award,,,3300,41, 
On-line application,Not represented ,Full award,2012 Scheme,Female,18-40,SCAR FACE SIGNIFICANT DISFIGUR,,Full award,,,2400,108, 
On-line application,Not represented ,Reduced award,2012 Scheme,Male,18-40,SCAR FACE SIGNIFICANT DISFIGUR,Applicants criminal record/character,Reduced award ,,,1920,1189, 
On-line application,Not represented ,Full award,2012 Scheme,Female,18-40,SEXUAL ASSAULT CHILD LEVEL B3,,Full award,,,2000,225, 
On-line application,Not represented ,Full award,2012 Scheme,Male,18-40,PERMANENT NUMBNESS SEVERE,,Full award,,,2940,758, 
On-line application,Not represented ,Full award,2012 Scheme,Male,18-40,FRAC MAND/MAX OP REQD LEVEL A3,,Full award,,,1800,621, 
On-line application,Represented,Full award,2012 Scheme,Female,41-64,FATAL-MULTIPLE QUALIFYING,,Full award,,,37413,1237, 
On-line application,Not represented ,Full award,2012 Scheme,Male,18-40,SERIOUS SCARRING LOWER LIMBS,,Full award,,,3500,145, 
On-line application,Represented,Nil award,2012 Scheme,Female,18-40,NO DATA,Multiple,Nil award,Nil award,,,132, 
On-line application,Represented,Full award,2012 Scheme,Male,41-64,FATAL-MULTIPLE QUALIFYING,,Full award,,,5500,385, 
On-line application,Not represented ,Full award,2012 Scheme,Male,18-40,FRAC MAND/MAX OP REQD LEVEL A3,,Full award,,,2250,414, 
On-line application,Represented,Full award,2012 Scheme,Female,41-64,TINNITUS LONGER THAN 13 WEEKS,,Full award,,,1466.5,232, 
On-line application,Represented,Full award,2012 Scheme,Male,18-40,SCAR FACE SIGNIFICANT DISFIGUR,,Full award,,,2400,240, 
On-line application,Not represented ,Full award,2012 Scheme,Female,18-40,SEXUAL ASSAULT LEVEL B9,,Full award,,,11300,134, 
On-line application,Not represented ,Full award,2012 Scheme,Female,0-17,SEXUAL ASSAULT CHILD LEVEL B11,,Full award,,,16500,145, 
Telephone application,Not represented ,Full award,2012 Scheme,Female,65 and above,STRAINED BACK-13 WEEKS OR MORE,,Full award,,,1300,748, 
On-line application,Not represented ,Full award,2012 Scheme,Male,18-40,FRAC/DISL ANKLE SUB RECOVERY,,Full award,,,2850,511, 
On-line application,Not represented ,Full award,2012 Scheme,Male,41-64,PARTIAL LOSS OF EAR(S),,Full award,,,2400,143, 
On-line application,Represented,Full award,2012 Scheme,Female,0-17,SEXUAL ASSAULT CHILD LEVEL B4.,,Full award,,,3250,157, 
On-line application,Represented,Full award,2008 Scheme,Male,18-40,DISABLE MENTAL ILLNESS LEVEL14,,Full award,Full award ,,43276,1471, 
On-line application,Not represented ,Full award,2012 Scheme,Female,18-40,SEXUAL ASSAULT LEVEL B9,,Full award,,,11000,99, 
Telephone application,Not represented ,Full award,2012 Scheme,Female,41-64,DIS/FRAC ELBOW SUBSTANTIAL REC,,Full award,,,1500,622, 
On-line application,Not represented ,Full award,2012 Scheme,Female,18-40,SEXUAL ASSAULT CHILD LEVEL B11,,Full award,,,16500,43, 
On-line application,Not represented ,Full award,2012 Scheme,Male,18-40,SEXUAL ASSAULT CHILD LEVEL B3,,Full award,,,2000,791, 
On-line application,Represented,Full award,2012 Scheme,Female,41-64,SEXUAL ASSAULT CHILD LEVEL B2,,Full award,,,1500,289, 
On-line application,Represented,Full award,2012 Scheme,Male,18-40,NO DATA,,Full award,,,2501,304, 
On-line application,Not represented ,Full award,2012 Scheme,Male,18-40,SCAR HEAD SIGNIFICANT DISF,,Nil award,Full award ,,1500,140, 
On-line application,Not represented ,Full award,2012 Scheme,Male,41-64,SEXUAL ASSAULT CHILD LEVEL B5,,Full award,,,4400,131, 
On-line application,Represented,Full award,2012 Scheme,Female,41-64,SEXUAL ASSAULT LEVEL B9,,Nil award,Full award ,,11000,564, 
On-line application,Not represented ,Full award,2012 Scheme,Female,18-40,DISABLE MENTAL INJURY LEVEL A4,,Full award,,,2400,898, 
On-line application,Not represented ,Full award,2012 Scheme,Female,18-40,SCAR FACE SIGNIFICANT DISFIGUR,,Full award,,,2400,399, 
On-line application,Not represented ,Full award,2012 Scheme,Female,18-40,SEXUAL ASSAULT CHILD LEVEL B7,,Full award,,,6600,324, 
On-line application,Not represented ,Full award,2012 Scheme,Female,41-64,SEXUAL ASSAULT 3YEARS LEVEL B11,,Full award,,,16480,85, 
On-line application,Not represented ,Full award,2012 Scheme,Male,41-64,MULTIPLE FRACTURES TO FACE,,Full award,Full award ,,11945,367, 
On-line application,Not represented ,Full award,2012 Scheme,Male,18-40,SCAR FACE SIGNIFICANT DISFIGUR,,Full award,,,2400,269, 
On-line application,Not represented ,Full award,2012 Scheme,Female,0-17,SEXUAL ASSAULT CHILD LEVEL B9,,Full award,,,11000,535, 
On-line application,Represented,Nil award,2012 Scheme,Male,41-64,NO DATA,Multiple,Nil award,Nil award,,,111, 
On-line application,Represented,Reduced award,2012 Scheme,Male,18-40,DISABLE MENTAL INJURY LEVEL A7,Applicants criminal record/character,Reduced award ,,,5580,1101, 
On-line application,Represented,Full award,2012 Scheme,Female,0-17,SEXUAL ASSAULT CHILD LEVEL B9,,Full award,,,11000,202, 
On-line application,Not represented ,Full award,2012 Scheme,Male,18-40,MULTIPLE FRACTURES TO FACE,,Full award,,,11945,903, 
On-line application,Represented,Full award,2012 Scheme,Male,65 and above,FRACTURED VERTEBRA SUBST. REC,,Full award,,,1000,241, 
On-line application,Not represented ,Reduced award,2012 Scheme,Male,41-64,PARTIAL LOSS OF VISION 6/36,"Conduct before, during or after the incident",Reduced award ,,,11875,638, 
Telephone application,Not represented ,Full award,2008 Scheme,Male,41-64,ORBITAL BLOW OUT NO OPERATION,,Nil award,Full award ,,3300,165, 
On-line application,Not represented ,Full award,2012 Scheme,Male,41-64,ORBITAL BLOW OUT NO OPERATION,,Full award,,,1800,667, 
On-line application,Not represented ,Full award,2012 Scheme,Female,0-17,SEXUAL ASSAULT CHILD LEVEL B9,,Full award,,,11000,216, 
On-line application,Not represented ,Full award,2012 Scheme,Female,18-40,SEXUAL ABUSE EXC 3YRS LEVEL B12,,Full award,,,22600,844, 
On-line application,Represented,Full award,2012 Scheme,Female,41-64,SIGN. SCARRING TO UPPER LIMBS,,Full award,,,950,461, 
On-line application,Not represented ,Full award,2012 Scheme,Female,18-40,DISABLE MENTAL INJURY LEVEL A7,,Full award,,,6200,930, 
On-line application,Represented,Nil award,2012 Scheme,Male,18-40,NO DATA,"Mainly, injury did not result from crime of violence",Nil award,,,,245, 
On-line application,Not represented ,Full award,2012 Scheme,Male,18-40,SCAR FACE SIGNIFICANT DISFIGUR,,Full award,,,2400,249, 
On-line application,Not represented ,Nil award,2012 Scheme,Male,18-40,NO DATA,Previous claim for same injury,Nil award,,,,155, 
On-line application,Represented,Nil award,2012 Scheme,Male,0-17,NO DATA,Injury does not qualify for compensation,Nil award,,,,480, 
On-line application,Not represented ,Full award,2012 Scheme,Female,18-40,SEXUAL ASSAULT CHILD LEVEL B12 EXCEEDING 3 YEARS,,Full award,,,22000,245, 
On-line application,Not represented ,Nil award,2012 Scheme,Male,41-64,NO DATA,Failure to Cooperate with the Authority,Nil award,Nil award,,,288, 
On-line application,Represented,Full award,2012 Scheme,Male,18-40,SCAR FACE SIGNIFICANT DISFIGUR,,Full award,,,2400,231, 
On-line application,Represented,Full award,2012 Scheme,Male,18-40,LOSS OF FRONT TOOTH,,Full award,,,1500,656, 
On-line application,Represented,Nil award,2012 Scheme,Male,41-64,NO DATA,Injury does not qualify for compensation,Nil award,Nil award,,,243, 
On-line application,Represented,Full award,2012 Scheme,Female,18-40,FRAC MAND/MAX OP REQD LEVEL A3,,Full award,,,1750,446, 
On-line application,Not represented ,Full award,2012 Scheme,Female,18-40,SEXUAL ASSAULT CHILD LEVEL B4,,Full award,,,3300,556, 
On-line application,Not represented ,Full award,2012 Scheme,Male,18-40,SCAR FACE SIGNIFICANT DISFIGUR,,Full award,,,2400,353, 
On-line application,Not represented ,Full award,2012 Scheme,Male,41-64,SCAR FACE SIGNIFICANT DISFIGUR,,Full award,,,2400,639, 
Telephone application,Not represented ,Nil award,2008 Scheme,Female,0-17,NO DATA,Failure to Cooperate with police in bringing assailant to justice,Nil award,,,,1571, 
On-line application,Represented,Nil award,2012 Scheme,Male,41-64,NO DATA,Multiple,Nil award,Nil award,Nil award ,,503, 
On-line application,Represented,Full award,2012 Scheme,Female,0-17,SEXUAL ASSAULT CHILD LEVEL B11,,Full award,,,16500,246, 
On-line application,Not represented ,Full award,2012 Scheme,Female,41-64,SEXUAL ASSAULT CHILD LEVEL B11,,Full award,,,16500,530, 
On-line application,Not represented ,Full award,2012 Scheme,Male,18-40,ORBITAL BLOW OUT OPERATION,,Full award,,,2850,409, 
On-line application,Not represented ,Full award,2012 Scheme,Male,18-40,SCAR FACE SIGNIFICANT DISFIGUR,,Full award,,,2850,481, 
On-line application,Represented,Full award,2012 Scheme,Female,18-40,SEXUAL ASSAULT LEVEL B9,,Full award,,,11000,157, 
On-line application,Not represented ,Full award,2012 Scheme,Female,18-40,SEXUAL ASSAULT CHILD LEVEL B7,,Full award,,,6600,156, 
On-line application,Not represented ,Full award,2012 Scheme,Female,41-64,SEXUAL ASSAULT CHILD LEVEL B2,,Full award,,,1500,43, 
On-line application,Represented,Full award,2012 Scheme,Female,65 and above,NO DATA,,Full award,,,3687,157, 
On-line application,Not represented ,Full award,2012 Scheme,Female,41-64,FRACT WRIST-SCAPHOID SUBST.REC,,Full award,,,2350,317, 
On-line application,Represented,Full award,2012 Scheme,Female,18-40,SEXUAL ASSAULT LEVEL B9,,Full award,,,17061,632, 
On-line application,Not represented ,Full award,2012 Scheme,Female,18-40,SCAR FACE SIGNIFICANT DISFIGUR,,Full award,,,2365,638, 
On-line application,Not represented ,Full award,2012 Scheme,Male,18-40,PARTIAL LOSS OF VISION 6/36,,Full award,,,17220,332, 
On-line application,Not represented ,Full award,2012 Scheme,Male,65 and above,DISABLE MENTAL INJURY LEVEL A7,,Full award,,,6200,481, 
On-line application,Represented,Full award,2012 Scheme,Female,18-40,SEXUAL ASSAULT LEVEL B9,,Full award,,,11000,328, 
On-line application,Not represented ,Full award,2012 Scheme,Male,41-64,FRAC MAND/MAX OP REQD LEVEL A7,,Full award,Full award ,,6920,23, 
On-line application,Represented,Full award,2012 Scheme,Female,18-40,PARTIAL LOSS OF VISION 6/24,,Full award,,,14700,714, 
On-line application,Represented,Full award,2012 Scheme,Male,41-64,SCAR FACE SIGNIFICANT DISFIGUR,,Full award,,,2850,322, 
On-line application,Represented,Full award,2012 Scheme,Female,18-40,SEXUAL ASSAULT CHILD LEVEL B9,,Full award,,,11000,759, 
Telephone application,Not represented ,Full award,2012 Scheme,Male,65 and above,PERM TINNITUS NOT VERY SEVERE,,Full award,Full award ,,8060,758, 
On-line application,Represented,Full award,2012 Scheme,Male,41-64,SCAR FACE SIGNIFICANT DISFIGUR,,Full award,,,2700,693, 
On-line application,Not represented ,Nil award,2012 Scheme,Male,18-40,NO DATA,Multiple,Nil award,Nil award,Nil award ,,55, 
On-line application,Not represented ,Full award,2012 Scheme,Male,0-17,SEXUAL ASSAULT CHILD LEVEL B9,,Full award,,,11000,350, 
On-line application,Not represented ,Full award,2012 Scheme,Male,41-64,SCAR FACE SIGNIFICANT DISFIGUR,,Full award,,,2400,337, 
On-line application,Represented,Full award,2012 Scheme,Male,18-40,SCAR FACE SERIOUS DISFIGUREMENT,,Full award,,,13550,667, 
On-line application,Not represented ,Nil award,2012 Scheme,Male,18-40,NO DATA,Injury does not qualify for compensation,Nil award,,,,616, 
On-line application,Not represented ,Full award,2012 Scheme,Female,18-40,DISABLE MENTAL INJURY LEVEL A1,,Full award,,,1000,1171, 
On-line application,Represented,Nil award,2012 Scheme,Male,18-40,NO DATA,Failure to Cooperate with police in bringing assailant to justice,Nil award,,,,323, 
On-line application,Represented,Nil award,2012 Scheme,Male,18-40,NO DATA,Injury does not qualify for compensation,Nil award,,,,397, 
On-line application,Not represented ,Nil award,2012 Scheme,Male,18-40,NO DATA,Failure to report without delay,Nil award,,,,14, 
On-line application,Not represented ,Full award,2012 Scheme,Female,0-17,SEXUAL ASSAULT LEVEL B9,,Full award,,,11000,410, 
On-line application,Represented,Full award,2012 Scheme,Female,18-40,SCAR FACE SIGNIFICANT DISFIGUR,,Full award,,,2400,135, 
On-line application,Not represented ,Full award,2012 Scheme,Male,18-40,MODT. DAMAGE TENDON SIGNF. DIS,,Nil award,Full award ,,2250,561, 
On-line application,Not represented ,Full award,2012 Scheme,Male,41-64,DISABLE MENTAL INJURY LEVEL A9,,Full award,,,13500,853, 
On-line application,Not represented ,Full award,2012 Scheme,Male,41-64,SCAR FACE SIGNIFICANT DISFIGUR,,Full award,,,2400,539, 
On-line application,Not represented ,Full award,2012 Scheme,Male,41-64,SEXUAL ASSAULT CHILD LEVEL B12 EXCEEDING 3 YEARS,,Full award,,,22000,403, 
On-line application,Not represented ,Full award,2012 Scheme,Female,18-40,SEXUAL ASSAULT SEVERE LEVEL B4,,Full award,,,3300,202, 
On-line application,Not represented ,Full award,2012 Scheme,Male,18-40,LOSS OF SIGHT ONE EYE,,Full award,,,19450,343, 
On-line application,Represented,Full award,2012 Scheme,Female,18-40,PHYSICAL ABUSE CHILD LEVEL B6,,Nil award,Full award ,,5450,4, 
On-line application,Represented,Full award,2012 Scheme,Female,41-64,LOSS OF CROWNS,,Full award,,,990,416, 
On-line application,Represented,Full award,2012 Scheme,Female,0-17,SEXUAL ASSAULT CHILD LEVEL B4,,Full award,,,3300,113, 
On-line application,Represented,Full award,2012 Scheme,Male,41-64,PHYSICAL ABUSE CHILD LEVEL B6,,Full award,,,6490,669, 
On-line application,Represented,Full award,2012 Scheme,Female,0-17,SEXUAL ASSAULT 3YEARS LEVEL B11,,Full award,,,38500,725, 
On-line application,Represented,Nil award,2012 Scheme,Male,41-64,NO DATA,"Conduct before, during or after the incident",Nil award,,,,318, 
On-line application,Not represented ,Nil award,2012 Scheme,Male,41-64,NO DATA,Multiple,Nil award,Nil award,,,1, 
Telephone application,Not represented ,Nil award,2012 Scheme,Male,18-40,NO DATA,Multiple,Nil award,,,,1211, 
On-line application,Represented,Nil award,2012 Scheme,Male,18-40,NO DATA,Failure to Cooperate with police in bringing assailant to justice,Nil award,Nil award,,,418, 
On-line application,Represented,Nil award,2012 Scheme,Male,41-64,NO DATA,Injury does not qualify for compensation,Nil award,Nil award,,,299, 
On-line application,Represented,Full award,2012 Scheme,Female,41-64,COLLAPSED LUNG,,Full award,,,2060,365, 
On-line application,Represented,Full award,2012 Scheme,Female,18-40,LOSS OF 2 OR 3 FRONT TEETH,,Full award,,,2400,527, 
On-line application,Represented,Full award,2012 Scheme,Male,18-40,SCAR NECK SIGNIFICANT DISFIGUR,,Full award,,,1500,453, 
On-line application,Not represented ,Nil award,2012 Scheme,Female,41-64,NO DATA,Injury does not qualify for compensation,Nil award,,,,153, 
On-line application,Not represented ,Nil award,2012 Scheme,Female,18-40,NO DATA,Injury does not qualify for compensation,Nil award,,,,193, 
On-line application,Represented,Full award,2012 Scheme,Female,18-40,SEXUAL ASSAULT CHILD LEVEL B11,,Full award,,,16500,258, 
On-line application,Represented,Full award,2012 Scheme,Female,18-40,FRAC MAND/MAX OP REQD LEVEL A3,,Full award,,,2200,461, 
Telephone application,Represented,Reduced award,2008 Scheme,Male,41-64,FRAC/DISL ANKLE SUBST. RECOV,"Conduct before, during or after the incident",Reduced award ,Reduced award,,3773,192, 
On-line application,Not represented ,Full award,2012 Scheme,Male,41-64,SCAR HEAD SIGNIFICANT DISF,,Full award,,,1500,256, 
On-line application,Represented,Nil award,2012 Scheme,Male,18-40,NO DATA,Injury does not qualify for compensation,Nil award,,,,197, 
On-line application,Represented,Nil award,2012 Scheme,Female,18-40,NO DATA,Previous claim for same injury,Nil award,,,,233, 
On-line application,Not represented ,Reduced award,2012 Scheme,Male,18-40,DISABLE MENTAL INJURY LEVEL A9,Applicants criminal record/character,Reduced award ,,,10750,748, 
On-line application,Not represented ,Full award,2012 Scheme,Female,41-64,SEXUAL ASSAULT CHILD LEVEL B12 EXCEEDING 3 YEARS,,Full award,,,22000,343, 
Telephone application,Not represented ,Full award,2012 Scheme,Female,41-64,SEXUAL ASSAULT SERIOUS LEVEL B3,,Full award,Full award ,,2300,587, 
Telephone application,Not represented ,Full award,2008 Scheme,Male,41-64,PROLAPSED INV. DISC(S) (RECOV),,Full award,,,8100,1617, 
On-line application,Represented,Full award,2012 Scheme,Male,18-40,ORBITAL BLOW OUT OPERATION,,Full award,,,2700,904, 
On-line application,Represented,Full award,2012 Scheme,Female,41-64,SEXUAL ASSAULT CHILD LEVEL B11,,Full award,,,16500,274, 
On-line application,Not represented ,Full award,2012 Scheme,Female,18-40,SEXUAL ASSAULT CHILD LEVEL B12 EXCEEDING 3 YEARS,,Full award,,,27500,329, 
On-line application,Not represented ,Full award,2012 Scheme,Female,18-40,SEXUAL ASSAULT CHILD LEVEL B8,,Full award,,,8200,209, 
On-line application,Not represented ,Full award,2012 Scheme,Female,18-40,SEXUAL ASSAULT CHILD LEVEL B11,,Full award,,,16500,264, 
On-line application,Represented,Full award,2012 Scheme,Female,18-40,SEXUAL ASSAULT CHILD LEVEL B11,,Full award,,,16500,309, 
On-line application,Represented,Full award,2012 Scheme,Female,0-17,SEXUAL ASSAULT CHILD LEVEL B11,,Full award,,,16500,371, 
On-line application,Represented,Full award,2012 Scheme,Male,41-64,SCAR FACE SIGNIFICANT DISFIGUR,,Full award,Full award ,Full award,2940,323, 
On-line application,Represented,Full award,2012 Scheme,Male,0-17,LOSS OF FRONT TOOTH,,Full award,,,1500,112, 
On-line application,Not represented ,Full award,2012 Scheme,Male,41-64,SCAR FACE SIGNIFICANT DISFIGUR,,Full award,,,2700,468, 
On-line application,Not represented ,Full award,2012 Scheme,Female,18-40,SEXUAL ASSAULT LEVEL B9,,Full award,Full award ,,12416,154, 
On-line application,Not represented ,Full award,2012 Scheme,Female,18-40,SEXUAL ASSAULT LEVEL B9,,Full award,,,11000,467, 
On-line application,Not represented ,Full award,2012 Scheme,Female,0-17,PHYSICAL ABUSE CHILD LEVEL B6,,Nil award,Full award ,,5500,6, 
On-line application,Represented,Full award,2008 Scheme,Female,41-64,PERM MENTAL ILLNESS LEVEL 18,,Full award,,,27000,1854, 
On-line application,Not represented ,Nil award,2012 Scheme,Female,18-40,NO DATA,Failure to Cooperate with the Authority,Nil award,,,,628, 
On-line application,Represented,Nil award,2012 Scheme,Male,18-40,NO DATA,Previous claim for same injury,Nil award,,,,330, 
On-line application,Not represented ,Nil award,2012 Scheme,Female,18-40,NO DATA,Injury does not qualify for compensation,Nil award,,,,274, 
On-line application,Represented,Nil award,2012 Scheme,Male,41-64,NO DATA,Claim not submited within time limit,Nil award,,,,282, 
On-line application,Not represented ,Nil award,2012 Scheme,Male,18-40,NO DATA,Failure to Cooperate with the Authority,Nil award,,,,750, 
On-line application,Not represented ,Nil award,2012 Scheme,Male,18-40,NO DATA,Failure to Cooperate with police in bringing assailant to justice,Nil award,,,,120, 
On-line application,Not represented ,Nil award,2012 Scheme,Female,18-40,NO DATA,Failure to Cooperate with the Authority,Nil award,,,,412, 
On-line application,Not represented ,Nil award,2012 Scheme,Male,18-40,NO DATA,Injury does not qualify for compensation,Nil award,,,,26, 
On-line application,Not represented ,Full award,2012 Scheme,Female,18-40,CLICKING JAW PERMANENT,,Full award,,,3500,549, 
On-line application,Not represented ,Full award,2012 Scheme,Female,41-64,DISABLE MENTAL INJURY LEVEL A9,,Full award,Full award ,,13500,766, 
On-line application,Not represented ,Full award,2012 Scheme,Female,18-40,SIGN. SCARRING TO UPPER LIMBS,,Full award,,,1300,1097, 
On-line application,Not represented ,Full award,2012 Scheme,Male,18-40,SCAR HEAD SIGNIFICANT DISF,,Full award,Full award ,,1500,303, 
On-line application,Not represented ,Full award,2012 Scheme,Male,18-40,SCAR FACE SIGNIFICANT DISFIGUR,,Full award,,,2400,1036, 
On-line application,Not represented ,Full award,2012 Scheme,Female,18-40,SEXUAL ASSAULT CHILD LEVEL B9,,Full award,,,11000,638, 
On-line application,Represented,Full award,2012 Scheme,Male,18-40,FRAC MAND/MAX OP REQD LEVEL A3,,Full award,,,1800,110, 
On-line application,Not represented ,Full award,2012 Scheme,Male,18-40,FRAC ZYGOMA OP REQD SUB RECOV,,Full award,,,1000,665, 
On-line application,Not represented ,Full award,2012 Scheme,Female,18-40,SEXUAL ASSAULT LEVEL B9,,Full award,,,11000,473, 
On-line application,Represented,Full award,2012 Scheme,Male,18-40,FRACTURED VERTEBRA SUBST. REC,,Full award,,,950,730, 
On-line application,Not represented ,Full award,2012 Scheme,Male,18-40,FRAC MAND/MAX NO OP LEVEL A2,,Full award,,,1450,347, 
On-line application,Represented,Full award,2012 Scheme,Male,41-64,SEXUAL ASSAULT CHILD LEVEL B12 EXCEEDING 3 YEARS,,Full award,,,22000,349, 
On-line application,Represented,Full award,2012 Scheme,Female,41-64,SEXUAL ASSAULT SEVERE LEVEL B4,,Full award,,,3300,314, 
On-line application,Not represented ,Full award,2012 Scheme,Female,0-17,DISABLE MENTAL INJURY LEVEL A4,,Full award,,,2350,1121, 
Telephone application,Not represented ,Full award,2012 Scheme,Female,41-64,SER DISORDER 28 WKS NOT PERM,,Full award,,,3100,853, 
On-line application,Represented,Full award,2012 Scheme,Female,18-40,SEXUAL ASSAULT SERIOUS LEVEL B3,,Full award,,,2000,145, 
On-line application,Represented,Nil award,2012 Scheme,Male,18-40,NO DATA,Injury does not qualify for compensation,Nil award,Nil award,,,576, 