{"text_format":"1","workbook":"xlsx","n_sheets":2,"sheets":["Change Request Form","Notes"],"not_rendered":{"charts":0,"images":1,"macros":1,"external_links":0,"defined_names":5,"comments":0,"pivot_tables":0},"unopened":[],"bounds":{"document_bytes":16777216,"sheet_cells":100000,"rows_first":2000,"rows_last":500,"rows_between":2000,"halvings":0,"cell_chars":16384,"cell_head_chars":4096},"cells_cut":0,"cells_raw":0,"read":"whole","date_system":"1900"}

{"sheet":"Change Request Form","index":0,"n_rows":45,"n_cols":255,"rows_kept":45,"cut":false,"hidden":false,"merged":[[6,7,7,8],[5,7,5,8],[39,0,39,8],[27,3,27,6],[33,3,33,6],[32,3,32,6],[31,3,31,6],[30,3,30,6],[11,3,11,6]]}
["AAAAABAAABB%",null,null,null,null,null,null,null,null,null,null,null,null,null,null,null,null,null,null,null,null,null,null,null,null,null,null,null,null,null,null,null,null,null,null,null,null,null,null,null,null,null,null,null,null,null,null,null,null,null,null,null,null,null,null,null,null,null,null,null,null,null,null,null,null,null,null,null,null,null,null,null,null,null,null,null,null,null,null,null,null,null,null,null,null,null,null,null,null,null,null,null,null,null,null,null,null,null,null,null,null,null,null,null,null,null,null,null,null,null,null,null,null,null,null,null,null,null,null,null,null,null,null,null,null,null,null,null,null,null,null,null,null,null,null,null,null,null,null,null,null,null,null,null,null,null,null,null,null,null,null,null,null,null,null,null,null,null,null,null,null,null,null,null,null,null,null,null,null,null,null,null,null,null,null,null,null,null,null,null,null,null,null,null,null,null,null,null,null,null,null,null,null,null,null,null,null,null,null,null,null,null,null,null,null,null,null,null,null,null,null,null,null,null,null,null,null,null,null,null,null,null,null,null,null,null,null,null,null,null,null,null,null,null,null,null,null,null,null,null,null,null,null,null,null,null,null,null,null,null,null,null,null,null,"2013 to 2014"]
[null,null,null,null,null,null,null,null,null,null,null,null,null,null,null,null,null,null,null,null,null,null,null,null,null,null,null,null,null,null,null,null,null,null,null,null,null,null,null,null,null,null,null,null,null,null,null,null,null,null,null,null,null,null,null,null,null,null,null,null,null,null,null,null,null,null,null,null,null,null,null,null,null,null,null,null,null,null,null,null,null,null,null,null,null,null,null,null,null,null,null,null,null,null,null,null,null,null,null,null,null,null,null,null,null,null,null,null,null,null,null,null,null,null,null,null,null,null,null,null,null,null,null,null,null,null,null,null,null,null,null,null,null,null,null,null,null,null,null,null,null,null,null,null,null,null,null,null,null,null,null,null,null,null,null,null,null,null,null,null,null,null,null,null,null,null,null,null,null,null,null,null,null,null,null,null,null,null,null,null,null,null,null,null,null,null,null,null,null,null,null,null,null,null,null,null,null,null,null,null,null,null,null,null,null,null,null,null,null,null,null,null,null,null,null,null,null,null,null,null,null,null,null,null,null,null,null,null,null,null,null,null,null,null,null,null,null,null,null,null,null,null,null,null,null,null,null,null,null,null,null,null,null,null,"2014 to 2015"]
[]
[]
[]
[null,null,null,null,null,null,null,"Completion Status"]
["Apprenticeship Grant for Employers facility: change request form for 2015 to 2016 financial year",null,null,null,null,null,null,{"$f":"IF(Notes!$N$36<>11,\"INCOMPLETE\",\"COMPLETE\")","v":"INCOMPLETE"}]
[]
["Please read the notes page before completing this form. Please only complete the cells in yellow."]
["All cells in yellow must be completed for your request to be processed."]
[]
[null,null,"Provider Name",null,null,null,null,null,{"$f":"IF(D12<>\"\",\"ü\",\"û\")","v":"û"}]
[]
[null,null,"UK Provider Registration Number (UKPRN)",{"$f":"IFERROR(VLOOKUP($D12,Notes!$G$27:$H$1048576,2,FALSE),\"\")","v":""}]
[]
[]
["AGE facility requested change for 2015 to 2016 financial year - apprentice starts between 1 January 2015 to 31 December 2015"]
["Please use the dropdown boxes to indicate which age range you are requesting a change to and enter the amounts in the yellow boxes."]
["All boxes in yellow must be completed. "]
[null,null,"Please tell us what you want","Please select:",null,"Please tell us the TOTAL facility you require"]
[null,null,"for 16- to 18-year-olds",null,null,null,{"$f":"IFERROR(VLOOKUP($D21,Notes!$J$30:$M$38,2,FALSE),0)","v":0},{"$f":"IF(D21=\"No change to existing facility\",1,IF(D21=\"No current facility\",1,IF(D21=\"\",1,0)))","v":1},{"$f":"IF(AND(J21=1,F21<1500),\"û\",IF(D21<>\"\",\"ü\",\"û\"))","v":"û"},{"$f":"IF(D21=\"Request a reduced facility\",1,IF(D21=\"Increased facility\",1,IF(D21=\"Request a facility for the first time\",1,0)))","v":0}]
[null,null,"for 19- to 24-year-olds",null,null,null,{"$f":"IFERROR(VLOOKUP($D22,Notes!$J$30:$M$38,2,FALSE),0)","v":0},{"$f":"IF(D22=\"No change to existing facility\",1,IF(D22=\"No current facility\",1,IF(D22=\"\",1,0)))","v":1},{"$f":"IF(AND(J22=1,F22<1500),\"û\",IF(D22<>\"\",\"ü\",\"û\"))","v":"û"},{"$f":"IF(D22=\"Request a reduced facility\",1,IF(D22=\"Increased facility\",1,IF(D22=\"Request a facility for the first time\",1,0)))","v":0}]
[]
[null,null,null,"Total",null,{"$f":"SUMIF($H$21:$H$22,0,$F$21:$F$22)","v":0}]
[]
["Please note that the Agency cannot guarantee that proposals will be accepted."]
[]
[null,null,"Reason for Change Request",null,null,null,null,null,{"$f":"IF(D28<>\"\",\"ü\",\"û\")","v":"û"}]
[]
["Request completed by"]
[null,null,"Name",null,null,null,null,null,{"$f":"IF(D31<>\"\",\"ü\",\"û\")","v":"û"}]
[null,null,"Position in Organisation",null,null,null,null,null,"û"]
[null,null,"Email Address",null,null,null,null,null,"û"]
[null,null,"Date of Request",null,null,null,null,null,"û"]
[]
[null,null,"Please tick to confirm that you have the authority to act on behalf of the applicant organisation named in this form.",null,null,null,null,null,{"$f":"IF(Notes!$N$38=TRUE,\"ü\",\"û\")","v":"û"}]
[]
["Please note that the Agency will copy confirmation of the request to the Head of the Organisation."]
[]
["Once completed, please email this form to 'ProviderAGEFacilityManagement@sfa.bis.gov.uk' using 'Apprenticeship Grant for Employers - Change Request 2015-16 FY' as the subject line."]
[]
["Alternatively, click this button to create an email automatically:"]
[]
[]
[null,null,null,"24plusallfacilityrequests@skillsfundingagency.bis.gov.uk"]

{"sheet":"Notes","index":1,"n_rows":1046,"n_cols":14,"rows_kept":1046,"cut":false,"hidden":false,"merged":[]}
["General information"]
["Macro security","The AGE Facility Change Request Form contains a number of macros within it.  When opening the spreadsheet you must enable macros. To do this left click on the security warning options and enable the content.  You will need to do this each time you open the form."]
[]
["Field","Description"]
["Completion Status","This box stays INCOMPLETE and coloured red until all the yellow boxes are complete.  Once all the yellow boxes are complete, it changes to COMPLETE coloured green.  The macro to send the email automatically will not work unless the Completion Status is COMPLETE."]
["Provider Name","Pick your provider name from the drop down box.  If your provider name does not appear (this should only happen if you are a new provider), please enter the trading name of your organisation in full."]
["UKPRN","The UK Provider Registration Number as it appears on the UK Register of Learning Providers (UKRLP) will automatically populate once you select your provider name. If you have manually entered your provider name you will also need to manually enter the UKPRN."]
["Please tell us what you want for 16-to 18-year-olds/for 19-to 24-year-olds","For each age group, please indicate whether you want to (a) increase your facility; (b) request a facility for the first time (ie, you do not currently have a facility); (c) reduce your facility (reducing it to zero will remove it altogether).  If none of these options apply, then select either (d) no change or (e) no current facility."]
["Please tell us the TOTAL facility you require","Please enter the TOTAL facility you are requesting for each age group.  For example, if your current facility is £45,000 and you are requesting £15,000 growth funding, enter £60,000.  Your request must be in multiples of £1,500 (as each AGE grant is £1,500 per learner).  [This section will be blank if you have indicated no change or no current facility in the previous section.]"]
["Reason for change request","Please select an option from the drop-down menu."]
["Request completed by","Please ensure you complete all four boxes (name, position, email address date of request) and TICK THE BOX to confirm that you have authority to request additional funding for your organisation."]
["Email the completed form button","If you enabled the macros, this button will create a copy of your request form and create an email to send it to.  If your email does not allow macros, you can simply send this form as an attachment to the email address (ProviderAGEFacilityManagement@sfa.bis.gov.uk).  Please put 'Apprenticeship Grant for Employers - Change Request 2015-16 FY' in the subject line of your email."]
[]
[]
[]
[]
[]
[]
[]
[]
[]
[]
[]
[null,null,null,null,null,null,null,null,null,"To meet potential demand based on discussions with employers"]
[null,null,null,null,null,null,null,null,null,"Current AGE facility fully committed",null,null,"Completion Flags"]
[null,null,null,null,null,null,"Provider Name","UKPRN",null,"To request a reduction to the facility",null,null,"ProvName",{"$f":"IF('Change Request Form'!D12=\"\",0,1)","v":0}]
[null,null,null,null,null,null,"1LIFE MANAGEMENT SOLUTIONS LIMITED",10003876,null,"To request removal of the facility",null,null,"Want16-18",{"$f":"IF('Change Request Form'!D21=\"\",0,1)","v":0}]
[null,null,null,null,null,null,"5 E LTD.",10000020,null,"Provider requesting AGE facility for the first time",null,null,"Want19-24",{"$f":"IF('Change Request Form'!D22=\"\",0,1)","v":0}]
[null,null,null,null,null,null,"A4E LTD",10000115,null,null,null,null,"Amount16-18",{"$f":"IF('Change Request Form'!H21=1,1,IF(AND('Change Request Form'!H21=0,'Change Request Form'!F21=\"\"),0,1))","v":1}]
[null,null,null,null,null,null,"ABA TRAINING LIMITED",10010933,null,"Increased facility",1,null,"Amount19-24",{"$f":"IF('Change Request Form'!H22=1,1,IF(AND('Change Request Form'!H22=0,'Change Request Form'!F22=\"\"),0,1))","v":1}]
[null,null,null,null,null,null,"ABACUS TRAINING GROUP",10035281,null,"Request a facility for the first time",1,null,"Reason",{"$f":"IF('Change Request Form'!D28=\"\",0,1)","v":0}]
[null,null,null,null,null,null,"ABILITY PROFESSIONAL TRAINING LIMITED",10000054,null,"Request a reduced facility",1,null,"Name",{"$f":"IF('Change Request Form'!D31=\"\",0,1)","v":0}]
[null,null,null,null,null,null,"ABINGDON AND WITNEY COLLEGE",10000055,null,"No change to existing facility",0,null,"Position",{"$f":"IF('Change Request Form'!D32=\"\",0,1)","v":0}]
[null,null,null,null,null,null,"ABIS RESOURCES LIMITED",10019646,null,"No current facility",0,null,"Email Address",{"$f":"IF('Change Request Form'!D33=\"\",0,1)","v":0}]
[null,null,null,null,null,null,"ACACIA TRAINING AND DEVELOPMENT LTD",10000060,null,null,null,null,"Date of Request",{"$f":"IF('Change Request Form'!D34=\"\",0,1)","v":0}]
[null,null,null,null,null,null,"ACACIA TRAINING LIMITED",10000061,null,null,null,null,null,{"$f":"SUM(N26:N35)+N39","v":2}]
[null,null,null,null,null,null,"ACADEMIES ENTERPRISE TRUST",10033736,null,null,null,null,null,{"$f":"COUNTA(N26:N35)","v":10}]
[null,null,null,null,null,null,"ACADEMY EDUCATION LIMITED",10000191,null,null,null,null,"Radio button output",false]
[null,null,null,null,null,null,"ACADEMY TRAINING GROUP LIMITED",10024597,null,null,null,null,"Check box confirmed",{"$f":"IF(N38=TRUE,1,0)","v":0}]
[null,null,null,null,null,null,"ACADEMY TRANSFORMATION TRUST",10039859]
[null,null,null,null,null,null,"ACCESS TO MUSIC LIMITED",10000080]
[null,null,null,null,null,null,"ACCESS TRAINING (EAST MIDLANDS) LTD",10010584]
[null,null,null,null,null,null,"ACCESS TRAINING LIMITED",10009059]
[null,null,null,null,null,null,"ACCRINGTON AND ROSSENDALE COLLEGE",10000093]
[null,null,null,null,null,null,"ACHIEVE THROUGH LEARNING LIMITED",10019431]
[null,null,null,null,null,null,"ACHIEVEMENT TRAINING LIMITED",10000099]
[null,null,null,null,null,null,"ACORN TRAINING LTD",10023489]
[null,null,null,null,null,null,"ACTIV8LEARNING",10007706]
[null,null,null,null,null,null,"ACTIVATE LEARNING",10004927]
[null,null,null,null,null,null,"AGE UK TRADING LIMITED",10032745]
[null,null,null,null,null,null,"AGILISYS LIMITED",10036303]
[null,null,null,null,null,null,"ALDER TRAINING LIMITED",10000201]
[null,null,null,null,null,null,"ALL TRADES TRAINING LIMITED",10027693]
[null,null,null,null,null,null,"ALLIANCE LEARNING",10000238]
[null,null,null,null,null,null,"ALPHA BUILDING SERVICES ENGINEERING LTD",10022311]
[null,null,null,null,null,null,"ALPHA CARE AGENCY LTD",10022070]
[null,null,null,null,null,null,"ALT VALLEY COMMUNITY TRUST LIMITED",10001777]
[null,null,null,null,null,null,"ALTON COLLEGE",10000256]
[null,null,null,null,null,null,"AMERSHAM & WYCOMBE COLLEGE",10000275]
[null,null,null,null,null,null,"ANDERSON STOCKLEY ACCREDITED TRAINING LTD",10023918]
[null,null,null,null,null,null,"ANDREW COLLINGE TRAINING LIMITED",10000285]
[null,null,null,null,null,null,"ANNE CLARKE ASSOCIATES LIMITED",10022210]
[null,null,null,null,null,null,"APPLE CONSTRUCTION TRAINING LIMITED",10030987]
[null,null,null,null,null,null,"APPRENTICE FUNDING ASSISTANT LIMITED",10030249]
[null,null,null,null,null,null,"APPRENTICESHIPS & TRAINING SERVICES CONSORTIUM LIMITED",10032404]
[null,null,null,null,null,null,"APPRIS CHARITY LIMITED",10000848]
[null,null,null,null,null,null,"AQT LIMITED",10024244]
[null,null,null,null,null,null,"AQUINAS COLLEGE",10000330]
[null,null,null,null,null,null,"ARTS UNIVERSITY BOURNEMOUTH, THE",10000385]
[null,null,null,null,null,null,"ASHTON SIXTH FORM COLLEGE",10000409]
[null,null,null,null,null,null,"ASKHAM BRYAN COLLEGE",10000415]
[null,null,null,null,null,null,"ASPIRATION TRAINING LIMITED",10000421]
[null,null,null,null,null,null,"ASPIRE ACHIEVE ADVANCE LIMITED",10031241]
[null,null,null,null,null,null,"ASPIRE TRAINING TEAM LIMITED",10006942]
[null,null,null,null,null,null,"ASSET TRAINING & CONSULTANCY LIMITED",10000427]
[null,null,null,null,null,null,"ASSOCIATED TRAINING SOLUTIONS LIMITED",10037337]
[null,null,null,null,null,null,"ASTRAL TRAINING LTD",10026028]
[null,null,null,null,null,null,"ASTUTE MINDS LTD",10020307]
[null,null,null,null,null,null,"ATG TRAINING",10000476]
[null,null,null,null,null,null,"AURELIA TRAINING LIMITED",10000452]
[null,null,null,null,null,null,"AVANT PARTNERSHIP LIMITED",10022513]
[null,null,null,null,null,null,"AVANTA ENTERPRISE LIMITED",10036431]
[null,null,null,null,null,null,"AWAAZ ENTERPRISES LIMITED",10018436]
[null,null,null,null,null,null,"AWE PLC",10008081]
[null,null,null,null,null,null,"AXIA SOLUTIONS LIMITED",10000470]
[null,null,null,null,null,null,"AYLESBURY COLLEGE",10000473]
[null,null,null,null,null,null,"B L TRAINING LIMITED",10000486]
[null,null,null,null,null,null,"B2B ENGAGE LIMITED",10029186]
[null,null,null,null,null,null,"BABCOCK SKILLS DEVELOPMENT AND TRAINING LIMITED",10037348]
[null,null,null,null,null,null,"BABCOCK TRAINING LIMITED",10003161]
[null,null,null,null,null,null,"BABINGTON BUSINESS COLLEGE LIMITED",10000494]
[null,null,null,null,null,null,"BAE SYSTEMS PLC",10000501]
[null,null,null,null,null,null,"BALTIC TRAINING SERVICES LIMITED",10019026]
[null,null,null,null,null,null,"BARCHESTER HEALTHCARE LIMITED",10000524]
[null,null,null,null,null,null,"BARFORD EDUCATION AND TRAINING (NORTH EAST) LIMITED",10000525]
[null,null,null,null,null,null,"BARKING & DAGENHAM LONDON BOROUGH COUNCIL",10000143]
[null,null,null,null,null,null,"BARKING AND DAGENHAM COLLEGE",10000528]
[null,null,null,null,null,null,"BARNARDO'S",10000532]
[null,null,null,null,null,null,"BARNET & SOUTHGATE COLLEGE",10000533]
[null,null,null,null,null,null,"BARNFIELD COLLEGE",10000534]
[null,null,null,null,null,null,"BARNSLEY COLLEGE",10000536]
[null,null,null,null,null,null,"BARNSLEY METROPOLITAN BOROUGH COUNCIL",10000538]
[null,null,null,null,null,null,"BARROW-IN-FURNESS SIXTH FORM COLLEGE",10000546]
[null,null,null,null,null,null,"BARTON PEVERIL SIXTH FORM COLLEGE",10000552]
[null,null,null,null,null,null,"BASINGSTOKE COLLEGE OF TECHNOLOGY",10000560]
[null,null,null,null,null,null,"BASINGSTOKE YOUTH ACTION TRUST LIMITED",10000561]
[null,null,null,null,null,null,"BCTG LIMITED",10006600]
[null,null,null,null,null,null,"BE TOTALLY YOU",10019227]
[null,null,null,null,null,null,"BE WISER INSURANCE SERVICES LTD ",10045359]
[null,null,null,null,null,null,"BEACON EDUCATION PARTNERSHIP LIMITED",10033608]
[null,null,null,null,null,null,"BECKETT CORPORATION LIMITED",10020123]
[null,null,null,null,null,null,"BEDFORD COLLEGE",10000610]
[null,null,null,null,null,null,"BELLIS TRAINING LIMITED",10000631]
[null,null,null,null,null,null,"BERKSHIRE COLLEGE OF AGRICULTURE, THE (BCA)",10000654]
[null,null,null,null,null,null,"BESTLAND SOLUTIONS LIMITED",10018344]
[null,null,null,null,null,null,"BEXHILL COLLEGE",10000670]
[null,null,null,null,null,null,"BEXLEY COLLEGE",10000671]
[null,null,null,null,null,null,"BEXLEY LONDON BOROUGH COUNCIL",10000146]
[null,null,null,null,null,null,"BEXLEY YOUTH TRAINING GROUP",10000673]
[null,null,null,null,null,null,"BHS LIMITED",10019980]
[null,null,null,null,null,null,"BICTON COLLEGE",10000683]
[null,null,null,null,null,null,"BIMM LIMITED",10037544]
[null,null,null,null,null,null,"BIRKENHEAD SIXTH FORM COLLEGE",10000702]
[null,null,null,null,null,null,"BIRMINGHAM CITY COUNCIL",10000703]
[null,null,null,null,null,null,"BIRMINGHAM ELECTRICAL TRAINING LTD",10000715]
[null,null,null,null,null,null,"BIRMINGHAM METROPOLITAN COLLEGE",10006442]
[null,null,null,null,null,null,"BISHOP AUCKLAND COLLEGE",10000720]
[null,null,null,null,null,null,"BISHOP BURTON COLLEGE",10000721]
[null,null,null,null,null,null,"BLACKBURN COLLEGE",10000747]
[null,null,null,null,null,null,"BLACKBURN WITH DARWEN UNITARY AUTHORITY",10000748]
[null,null,null,null,null,null,"BLACKPOOL AND THE FYLDE COLLEGE",10000754]
[null,null,null,null,null,null,"BLACKPOOL UNITARY AUTHORITY",10000755]
[null,null,null,null,null,null,"BLUE TRAINING (U.K.) LIMITED",10013208]
[null,null,null,null,null,null,"BMC (BROOKSBY MELTON COLLEGE)",10000952]
[null,null,null,null,null,null,"BOCK CONSULTANCY & PERSONNEL DEVELOPMENT LIMITED",10025267]
[null,null,null,null,null,null,"BOLTON COLLEGE",10000794]
[null,null,null,null,null,null,"BOLTON METROPOLITAN BOROUGH COUNCIL",10000795]
[null,null,null,null,null,null,"BOOTS OPTICIANS PROFESSIONAL SERVICES LIMITED",10028930]
[null,null,null,null,null,null,"BOSCH AUTOMOTIVE SERVICE SOLUTIONS LTD",10042884]
[null,null,null,null,null,null,"BOSTON COLLEGE",10000812]
[null,null,null,null,null,null,"BOURNEMOUTH AND POOLE COLLEGE, THE",10000820]
[null,null,null,null,null,null,"BOURNVILLE COLLEGE",10000825]
[null,null,null,null,null,null,"BOWLING COLLEGE",10009975]
[null,null,null,null,null,null,"BPP HOLDINGS LIMITED",10000831]
[null,null,null,null,null,null,"BRACKNELL AND WOKINGHAM COLLEGE",10000833]
[null,null,null,null,null,null,"BRACKNELL FOREST BOROUGH COUNCIL",10000834]
[null,null,null,null,null,null,"BRADFORD CITY COUNCIL",10000850]
[null,null,null,null,null,null,"BRADFORD COLLEGE",10000840]
[null,null,null,null,null,null,"BRENIKOV ASSOCIATES LIMITED",10009005]
[null,null,null,null,null,null,"BRENT LONDON BOROUGH COUNCIL",10000863]
[null,null,null,null,null,null,"BRIDGWATER COLLEGE",10000878]
[null,null,null,null,null,null,"BRIGHT HORIZONS FAMILY SOLUTIONS LIMITED",10003609]
[null,null,null,null,null,null,"BRIGHTON & HOVE CITY COUNCIL",10000883]
[null,null,null,null,null,null,"BRIGHTON HOVE AND SUSSEX SIXTH FORM COLLEGE",10000887]
[null,null,null,null,null,null,"BRINSWORTH TRAINING LIMITED",10022320]
[null,null,null,null,null,null,"BRISTOL CITY COUNCIL",10000896]
[null,null,null,null,null,null,"BRITISH ARMY",10033440]
[null,null,null,null,null,null,"BRITISH GAS SERVICES LIMITED",10000915]
[null,null,null,null,null,null,"BRITISH PRINTING INDUSTRIES FEDERATION LTD",10000929]
[null,null,null,null,null,null,"BRITISH TELECOMMUNICATIONS PUBLIC LIMITED COMPANY",10027662]
[null,null,null,null,null,null,"BROADLAND DISTRICT COUNCIL",10000941]
[null,null,null,null,null,null,"BROCKENHURST COLLEGE",10000944]
[null,null,null,null,null,null,"BROMLEY COLLEGE OF FURTHER AND HIGHER EDUCATION",10000948]
[null,null,null,null,null,null,"BROMLEY LONDON BOROUGH COUNCIL",10003987]
[null,null,null,null,null,null,"BROOKLANDS COLLEGE",10000950]
[null,null,null,null,null,null,"BROOKS & KIRK LIMITED",10039535]
[null,null,null,null,null,null,"B-SKILL LIMITED",10000488]
[null,null,null,null,null,null,"BUCKINGHAMSHIRE COUNTY COUNCIL",10000976]
[null,null,null,null,null,null,"BUCKINGHAMSHIRE NEW UNIVERSITY",10000975]
[null,null,null,null,null,null,"BUILDING CRAFTS COLLEGE",10009063]
[null,null,null,null,null,null,"BUILDING ENGINEERING SERVICES TRAINING LIMITED",10000984]
[null,null,null,null,null,null,"BURNLEY COLLEGE",10001000]
[null,null,null,null,null,null,"BURTON AND SOUTH DERBYSHIRE COLLEGE",10001004]
[null,null,null,null,null,null,"BURY COLLEGE",10001005]
[null,null,null,null,null,null,"BURY METROPOLITAN BOROUGH COUNCIL",10001008]
[null,null,null,null,null,null,"BUSINESS IMPACT UK LIMITED",10023403]
[null,null,null,null,null,null,"BUSINESS MANAGEMENT RESOURCES (UK) LTD",10001055]
[null,null,null,null,null,null,"BUSY BEES NURSERIES LIMITED",10030637]
[null,null,null,null,null,null,"CABLECOM TRAINING LIMITED",10001078]
[null,null,null,null,null,null,"CALDERDALE COLLEGE",10001093]
[null,null,null,null,null,null,"CALDERDALE METROPOLITAN BOROUGH COUNCIL",10001094]
[null,null,null,null,null,null,"CAMBRIDGE REGIONAL COLLEGE",10001116]
[null,null,null,null,null,null,"CAMBRIDGESHIRE COUNTY COUNCIL",10001123]
[null,null,null,null,null,null,"CAMDEN LONDON BOROUGH COUNCIL",10003988]
[null,null,null,null,null,null,"CAMPBELL PAGE UK LIMITED",10032266]
[null,null,null,null,null,null,"CANTERBURY COLLEGE",10001144]
[null,null,null,null,null,null,"CAPEL MANOR COLLEGE",10001148]
[null,null,null,null,null,null,"CAPITA PLC",10001149]
[null,null,null,null,null,null,"CAPITAL ENGINEERING GROUP HOLDINGS LTD",10022461]
[null,null,null,null,null,null,"CARDINAL NEWMAN COLLEGE",10001165]
[null,null,null,null,null,null,"CARE TRAINING EAST MIDLANDS LIMITED",10001174]
[null,null,null,null,null,null,"CAREER DEVELOPMENT CENTER LIMITED",10001177]
[null,null,null,null,null,null,"CARILLION CONSTRUCTION LIMITED",10001193]
[null,null,null,null,null,null,"CARLISLE COLLEGE",10001196]
[null,null,null,null,null,null,"CARMEL COLLEGE",10001201]
[null,null,null,null,null,null,"CARSHALTON COLLEGE",10001207]
[null,null,null,null,null,null,"CATCH 22 CHARITY LIMITED",10025727]
[null,null,null,null,null,null,"CENTRAL BEDFORDSHIRE COLLEGE",10002061]
[null,null,null,null,null,null,"CENTRAL BEDFORDSHIRE COUNCIL",10024292]
[null,null,null,null,null,null,"CENTRAL COLLEGE NOTTINGHAM",10005991]
{"$rows_left_out":846}