{"text_format":"1","workbook":"xlsx","n_sheets":7,"sheets":["Guidance","Organisation user","BFR3Y 2020","Preparer declaration ","Approver declaration","Min Max table","Trust validations table"],"not_rendered":{"charts":0,"images":0,"macros":1,"external_links":0,"defined_names":0,"comments":1,"pivot_tables":0},"unopened":[],"bounds":{"document_bytes":16777216,"sheet_cells":100000,"rows_first":2000,"rows_last":500,"rows_between":2000,"halvings":0,"cell_chars":16384,"cell_head_chars":4096},"cells_cut":0,"cells_raw":0,"read":"whole","date_system":"1900"}

{"sheet":"Guidance","index":0,"n_rows":264,"n_cols":2,"rows_kept":264,"cut":false,"hidden":false,"merged":[[6,1,7,1]]}
[null,"Budget forecast return three year 2020"]
[]
[null,"Guidance: Section 1"]
[]
[null,"Introduction to this workbook"]
[]
[null,"This document is designed for use as a workbook to assist in preparing the online BFR return. Note that the spreadsheet cannot be used to submit the BFR, this must be submitted via an online form that is published on the gov.uk website."]
[]
[null,"The workbook can be used to process and validate information before completing the online form."]
[null,"Most numbers (especially income and expenditure) are positive figures. A few numbers are negative, but this will be clear when inputting the figures either on the workbook or the online form."]
[null,"All figures in the online form will need to be entered in thousands, except for line number 299 which requires a percentage value and line 999 which are pupil numbers."]
[]
[]
[null,"The main features in the 2020 version of the spreadsheet are:"]
[null,"This year the BFR3Y financial return will be different. Trusts will need to complete forecasts up to the end of next academic year 2020/21 as usual. However, we will not be collecting the forecasts for the academic years 2021/22 and 2022/23 at this time. Academy trust governing bodies must still review and agree longer term forecasts – this is in accordance with the Academies Financial Handbook. In the BFR3Y 2021 we will resume collecting the forecasts for 2022/23 and 2023/24 as usual. "]
[null,"This year an additional request for the summary 2018/19 revenue income and expenditure totals has been included in this return.  This is part of the Department's assessment of the impact of COVID-19. The summary data is limited to 8 input fields."]
[null,"a) Additional column I - on the workbook (this will be a separate section on the online form). This is to collect the summary revenue and expenditure totals. Line 410 will be pre populated if your previous BFR3Y form was submitted on time."]
[null,"b) Additional Finance Question. - FQ6 - 'Please use this section to summarise how COVID-19 has had a material impact on any actuals, forecast or pupil numbers as a result of COVID-19 for your academy trust'  This optional question is to allow for you to tell us about anything that will help provide context for any changes as a result of school closures. Please provide a short summary of this and where any of these are shown in the return."]
[null,"c) GAG pooling – we have introduced an option(row 232) to confirm that your reserves are pooled and therefore removing the need to input for each academy. How you answer this will affect the corresponding line 800s. This will either show each academy in your trust, not pooled, or if pooled is selected the form will not show a breakdown for each academy in your trust. "]
[null,"d) and if even if not pooling, we have hidden the majority of line 800s to save on scrolling. Use the small \"1\" and \"2\" buttons on the far left on the screen to filter the view."]
[null,"e) context sensitive help text - beside each row, hover over the \"i\" icon"]
[null,"f) the workbook works the same as the online form but cannot mirror all its functionality (please note comment in a re the additional column - column I on the BFR3Y 2020 tab)"]
[null,"g) a series of validations and queries to test the robustness of the data"]
[null,"h) a series of finance questions at the top of the BFR worksheet, reduced this year to only 5 questions, excluding the question re the impact of COVID 19."]
[null,"i) trust validations table where the trust can: 1) provide responses to any queries raised; 2) review queries and responses; and 3) review the number of outstanding validations and queries at any time"]
[null,"j) a slight reorder of some lines to increase the natural flow"]
[]
[null,"Once all the validations have been cleared in the workbook, then the completion of the online form should not result in any more validations being triggered. Note that comments entered into the workbook can be copied and pasted into the online form for ease. "]
[]
[null,"Protected sheets"]
{"$rows_left_out":235}
{"sheet":"Organisation user","index":1,"n_rows":132,"n_cols":23,"rows_kept":132,"cut":false,"hidden":false,"merged":[[131,1,131,9],[131,11,131,16],[14,11,14,16],[18,11,18,16],[20,11,20,16],[128,1,128,9],[128,11,128,16],[129,1,129,9],[129,11,129,16],[130,1,130,9],[130,11,130,16],[125,1,125,9],[125,11,125,16],[126,1,126,9],[126,11,126,16],[127,1,127,9],[127,11,127,16],[122,1,122,9],[122,11,122,16],[123,1,123,9],[123,11,123,16],[124,1,124,9],[124,11,124,16],[119,1,119,9],[119,11,119,16],[120,1,120,9],[120,11,120,16],[121,1,121,9],[121,11,121,16],[116,1,116,9],[116,11,116,16],[117,1,117,9],[117,11,117,16],[118,1,118,9],[118,11,118,16],[113,1,113,9],[113,11,113,16],[114,1,114,9],[114,11,114,16],[115,1,115,9],[115,11,115,16],[110,1,110,9],[110,11,110,16],[111,1,111,9],[111,11,111,16],[112,1,112,9],[112,11,112,16],[107,1,107,9],[107,11,107,16],[108,1,108,9],[108,11,108,16],[109,1,109,9],[109,11,109,16],[104,1,104,9],[104,11,104,16],[105,1,105,9],[105,11,105,16],[106,1,106,9],[106,11,106,16],[101,1,101,9],[101,11,101,16],[102,1,102,9],[102,11,102,16],[103,1,103,9],[103,11,103,16],[98,1,98,9],[98,11,98,16],[99,1,99,9],[99,11,99,16],[100,1,100,9],[100,11,100,16],[95,1,95,9],[95,11,95,16],[96,1,96,9],[96,11,96,16],[97,1,97,9],[97,11,97,16],[92,1,92,9],[92,11,92,16],[93,1,93,9],[93,11,93,16],[94,1,94,9],[94,11,94,16],[89,1,89,9],[89,11,89,16],[90,1,90,9],[90,11,90,16],[91,1,91,9],[91,11,91,16],[86,1,86,9],[86,11,86,16],[87,1,87,9],[87,11,87,16],[88,1,88,9],[88,11,88,16],[83,1,83,9],[83,11,83,16],[84,1,84,9],[84,11,84,16],[85,1,85,9],[85,11,85,16],[80,1,80,9],[80,11,80,16],[81,1,81,9],[81,11,81,16],[82,1,82,9],[82,11,82,16],[77,1,77,9],[77,11,77,16],[78,1,78,9],[78,11,78,16],[79,1,79,9],[79,11,79,16],[74,1,74,9],[74,11,74,16],[75,1,75,9],[75,11,75,16],[76,1,76,9],[76,11,76,16],[71,1,71,9],[71,11,71,16],[72,1,72,9],[72,11,72,16],[73,1,73,9],[73,11,73,16],[68,1,68,9],[68,11,68,16],[69,1,69,9],[69,11,69,16],[70,1,70,9],[70,11,70,16],[65,1,65,9],[65,11,65,16],[66,1,66,9],[66,11,66,16],[67,1,67,9],[67,11,67,16],[62,1,62,9],[62,11,62,16],[63,1,63,9],[63,11,63,16],[64,1,64,9],[64,11,64,16],[59,1,59,9],[59,11,59,16],[60,1,60,9],[60,11,60,16],[61,1,61,9],[61,11,61,16],[56,1,56,9],[56,11,56,16],[57,1,57,9],[57,11,57,16],[58,1,58,9],[58,11,58,16],[53,1,53,9],[53,11,53,16],[54,1,54,9],[54,11,54,16],[55,1,55,9],[55,11,55,16],[50,1,50,9],[50,11,50,16],[51,1,51,9],[51,11,51,16],[52,1,52,9],[52,11,52,16],[47,1,47,9],[47,11,47,16],[48,1,48,9],[48,11,48,16],[49,1,49,9],[49,11,49,16],[44,1,44,9],[44,11,44,16],[45,1,45,9],[45,11,45,16],[46,1,46,9],[46,11,46,16],[41,1,41,9],[41,11,41,16],[42,1,42,9],[42,11,42,16],[43,1,43,9],[43,11,43,16],[38,1,38,9],[38,11,38,16],[39,1,39,9],[39,11,39,16],[40,1,40,9],[40,11,40,16],[36,1,36,9],[36,11,36,16],[37,1,37,9],[37,11,37,16],[32,1,32,9],[32,11,32,16],[33,1,33,9],[33,11,33,16],[34,1,34,9],[34,11,34,16],[31,1,31,9],[31,11,31,16],[16,11,16,16],[23,3,23,9],[23,11,23,16],[24,3,24,9],[24,11,24,16],[35,1,35,9],[35,11,35,16],[4,1,4,9],[4,11,4,16],[6,11,6,16],[8,11,8,16],[10,11,10,16],[28,1,28,9],[29,1,29,9],[29,11,29,16],[30,1,30,9],[30,11,30,16]]}
["Budget forecast return 3 year 2020"]
["This form is to be used to help prepare for the online form."]
[]
[null,null,null,null,null,null,null,null,null,null,null,null,null,null,null,null,null,"Initial validation","Outstanding validation"]
["Trust name:",null,null,null,null,null,null,null,null,null,null,{"$f":"IF(R5=1,U5,\"\")","v":"Please enter the name your trust."},null,null,null,null,null,{"$f":"IF(B5=\"\",1,0)","v":1},{"$f":"R5","v":1},null,"Please enter the name your trust."]
[]
["Trust type ",null,null,null,null,null,null,null,null,null,null,{"$f":"IF(R7=1,U7,\"\")","v":"Please state whether your trust is a MAT or a SAT."},null,null,null,null,null,{"$f":"IF(B7=\"\",1,0)","v":1},{"$f":"R7","v":1},null,"Please state whether your trust is a MAT or a SAT."]
[]
["Trust UPIN",null,null,null,null,null,null,null,null,null,null,{"$f":"IF(R9=1,U9,\"\")","v":"Please enter your trust UPIN."},null,null,null,null,null,{"$f":"IF(B9=\"\",1,0)","v":1},{"$f":"R9","v":1},null,"Please enter your trust UPIN."]
[]
["Company House Number ",null,null,null,null,null,null,null,null,null,null,{"$f":"IF(R11=1,U11,\"\")","v":"Please enter your trust company house number."},null,null,null,null,null,{"$f":"IF(B11=\"\",1,0)","v":1},{"$f":"R11","v":1},null,"Please enter your trust company house number."]
[]
["What are the contact details for this trust as we may need to contact you?"]
[]
["Full name",null,null,null,null,null,null,null,null,null,null,{"$f":"IF(R15=1,U15,\"\")","v":"Please enter your fulll name."},null,null,null,null,null,{"$f":"IF(B15=\"\",1,0)","v":1},{"$f":"R15","v":1},null,"Please enter your fulll name."]
[]
["UK telephone number",null,null,null,null,null,null,null,null,null,null,{"$f":"IF(R17=1,U17,\"\")","v":"Please enter a full UK telephone number."},null,null,null,null,null,{"$f":"IF(B17=\"\",1,0)","v":1},{"$f":"R17","v":1},null,"Please enter a full UK telephone number."]
[]
["Email Address",null,null,null,null,null,null,null,null,null,null,{"$f":"IF(R19=1,U19,\"\")","v":"Please enter your email address."},null,null,null,null,null,{"$f":"IF(B19=\"\",1,0)","v":1},{"$f":"R19","v":1},null,"Please enter your email address."]
[]
["Role in trust",null,null,null,null,null,null,null,null,null,null,{"$f":"IF(R21=1,U21,\"\")","v":"Please enter your role within the trust."},null,null,null,null,null,{"$f":"IF(B21=\"\",1,0)","v":1},{"$f":"R21","v":1},null,"Please enter your role within the trust."]
[]
[]
["No of academies in trust",null,null,null,null,null,null,null,null,null,null,{"$f":"IF(B24-B25=0,\"\",IF(D24=\"\",\"FQ10: Please explain why the number of academies in the return are different to the number of academies in the trust. Please explain if there have been new academy openers, transfers, mergers, closures or demergers during the period.\",\"\"))","v":""},null,null,null,null,null,"MAT","Yes",null,{"$f":"IF(B24-B25=0,0,IF(D24=\"\",1,0))","v":0}]
["No of academies in return",null,null,null,null,null,null,null,null,null,null,{"$f":"IF(COUNT(A30:A151)-B25=0,\"\",\"Can you ensure the correct details are input for the academy reserves below. This includes the upin as well as the academy name. The number should match the number input in cell B23. This helps to complete the workbook reserves section\")","v":""},null,null,null,null,null,"SAT","No"]
[]
["Which academies do you want to include in this return?"]
[]
["Academy UPIN","Academy Name"]
[null,null,null,null,null,null,null,null,null,null,null,{"$f":"IF(S30=\"Y\",IF(W30<4,$U$30,$V$30),\"\")","v":""},null,null,null,null,null,1,{"$f":"IF(R30<=$T$30,\"Y\",\"N\")","v":"N"},{"$f":"B25","v":0},"Please Enter Details for Academy","Details have been entered",{"$f":"(IF(A30=\"\",1,2)+(IF(B30=\"\",1,2)))","v":2}]
{"$rows_left_out":103}
{"sheet":"BFR3Y 2020","index":2,"n_rows":334,"n_cols":37,"rows_kept":334,"cut":false,"hidden":false,"merged":[[132,1,133,3],[130,14,130,16],[15,10,15,16],[16,10,16,16],[17,10,17,16],[18,10,18,16],[24,10,24,12],[24,14,24,16],[60,10,60,12],[60,14,60,16],[85,10,85,12],[85,14,85,16],[101,10,101,12],[101,14,101,16],[130,10,130,12],[101,6,101,8],[130,6,130,8],[159,6,159,8],[174,6,174,8],[199,10,199,12],[199,14,199,16],[199,6,199,8],[159,10,159,12],[159,14,159,16],[174,10,174,12],[174,14,174,16]]}
["Budget forecast return three year 2020",null,null,null,null,null,null,null,null,null,null,null,null,null,null,null,null,null,null,null,null,null,null,null,null,null,"hidden from here"]
["This form  is part of the annual return for all established trusts. This is not the correct form for a newly opened academy.  This form should be completed on an accruals and prepayments basis"]
["Workbook only - not for submission"]
[]
[]
["Trust name:",{"$f":"'Organisation user'!B5","v":0}]
[]
["Trust type ","SAT"]
[]
["Trust UPIN",{"$f":"'Organisation user'!B9","v":0}]
[]
["Trust Companies House number:",{"$f":"'Organisation user'!B11","v":0}]
[]
[]
["Finance Questions",null,null,null,null,null,null,null,null,null,null,null,null,null,null,null,null,null,null,null,null,null,null,"Query No",null,"Query",null,"Test  No","Formula","Text for test","Formula"]
["FQ1","Have you had any provisions during this period, excluding pension liability?","No"]
["FQ2","Have you had any loans during the period?","No"]
["FQ3","Have you had any investments during the period?","No"]
["FQ4","Have you had any overdrafts during the period?","No"]
["FQ5","Are you in a different scheme from the Risk Protection Assurance scheme?","No","i",{"$f":"IF(AND(C20=\"Yes\",AA20=0),\"Please respond in the validations table\",\"\")","v":""},null,null,null,null,null,null,null,null,null,null,null,null,null,null,null,null,null,null,{"$f":"AB20","v":"FQ5"},{"$f":"IF(Z20=\"\",\"\",\"Please refer to \"&X20&\" in the validations table\")","v":""},{"$f":"IF(ISERROR(AC20),\"You have input something incorrectly\",IF(AC20>0,AD20,\"\"))","v":""},{"$f":"VLOOKUP(A20,'Trust validations table'!$A$15:$D$170,4,FALSE)","v":0},"FQ5",{"$f":"IF(C20=\"YES\",1,IF(C20=\"no\",0,\"Error\"))","v":0},"Are you in a different scheme from the Risk Protection Assurance scheme?","=IF(C20'=\"YES\",1,IF(C20'=\"no\",0,\"Error\"))"]
["FQ6","Please use this section to summarise how COVID-19 has had material impact on any actuals, forecast or pupil numbers for your academy trust",null,"i","Please respond in the validations table",null,null,null,null,null,null,null,null,null,null,null,null,null,null,null,null,null,null,{"$f":"AB21","v":"FQ6"},"Please refer to FQ6 in the validations table","Please provide a short summary of this and and where any of these are shown in the return.",{"$f":"VLOOKUP(A21,'Trust validations table'!$A$15:$D$170,4,FALSE)","v":0},"FQ6",1,"Please provide a short summary of this and and where any of these are shown in the return.","=IF(C21'=\"YES\",1,IF(C21'=\"no\",0,\"Error\"))"]
[]
[]
[]
[null,"REVENUE ",null,null,null,null,null,null,"Revenue summary 2018/19",null,"Yr1",null,null,null,"Yr2"]
[null,"1    REVENUE INCOME",null,null,null,null,null,null,"TOTAL",null,"Actuals","Calculated","TOTAL",null,"Forecast","Calculated","TOTAL",null,null,null,null,null,null,null,null,null,"hidden from here"]
[null,"DfE ESFA income",null,null,null,null,null,null,"2018/19",null,"Sep 19 - Mar 20","Apr 20 - Aug 20","2019/20",null,"Sep 20 - Mar 21","Apr 21 - Aug 21","2020/21"]
[null,"Category","Line no.",null,"Validation",null,null,null,"£'000",null,"£'000","£'000","£'000",null,"£'000","£'000","£'000","Help Text Guidance","Rounded £000 test","Minimum value test","Maximum value test","Minimum value £'000","Maximum value £'000","Query No",null,"Query",null,"Test  No","Formula","Text for test","Formula"]
[null,"Rates reclaim",101,null,{"$f":"IF(AND(AA29=0,OR(S29<>\"\",T29<>\"\",U29<>\"\",Z29<>\"\")),\"Check- see columns N-U for info\",\"\")","v":""},null,null,null,null,null,null,{"$f":"+M29-K29","v":0},null,null,null,{"$f":"+Q29-O29","v":0},null,null,{"$f":"IF(OR(K29-ROUND(K29,)<>0,M29-ROUND(M29,)<>0,O29-ROUND(O29,)<>0,Q29-ROUND(Q29,)<>0),\"No decimal places\",\"\")","v":""},{"$f":"IF(OR(K29<V29,L29<V29,M29<V29,O29<V29,P29<V29,Q29<V29),\"A value is below the minimum value allowed\",\"\")","v":""},{"$f":"IF(OR(K29>W29,L29>W29,M29>W29,O29>W29,P29>W29,Q29>W29),\"Input value is too high\",\"\")","v":""},{"$f":"VLOOKUP($C29,'Min Max table'!$A$4:$C$209,2,FALSE)","v":-100000},{"$f":"VLOOKUP($C29,'Min Max table'!$A$4:$C$209,3,FALSE)","v":100000},null,null,null,null,null,null,null,null,null,null,null,null,"List boxes"]
[null,"General Academy Grant (GAG) (excluding Student Service Grant)",102,"i","Check- see columns N-U for info",null,null,null,null,null,null,0,null,null,null,{"$f":"+Q30-O30","v":0},null,"Please note that this value will need to be the gross figure for trusts in the RPA scheme , i.e. the value before the RPA contribution is deducted from your GAG payment. Similarly where income is deducted for repayment of a loan.",{"$f":"IF(OR(K30-ROUND(K30,)<>0,M30-ROUND(M30,)<>0,O30-ROUND(O30,)<>0,Q30-ROUND(Q30,)<>0),\"No decimal places\",\"\")","v":""},{"$f":"IF(OR(K30<V30,L30<V30,M30<V30,O30<V30,P30<V30,Q30<V30),\"A value is below the minimum value allowed\",\"\")","v":""},{"$f":"IF(OR(K30>W30,L30>W30,M30>W30,O30>W30,P30>W30,Q30>W30),\"Input value is too high\",\"\")","v":""},{"$f":"VLOOKUP($C30,'Min Max table'!$A$4:$C$209,2,FALSE)","v":0},{"$f":"VLOOKUP($C30,'Min Max table'!$A$4:$C$209,3,FALSE)","v":800000},{"$f":"\"QU\"&AB30","v":"QU1"},{"$f":"IF(Z30=\"\",\"\",\"Please refer to \"&X30&\" in the validations table\")","v":"Please refer to QU1 in the validations table"},{"$f":"IF(ISERROR(AC30),\"You have input something incorrectly\",IF(AC30>0,AD30,\"\"))","v":"You have forecast zero for GAG income for next year (102).  Please provide an explanation why this value is zero?"},{"$f":"VLOOKUP(X30,'Trust validations table'!$A$15:$D$345,4,FALSE)","v":0},1,{"$f":"IF(Q30=0,AB30,0)","v":1},"You have forecast zero for GAG income for next year (102).  Please provide an explanation why this value is zero?","IF(Q30=0,AB30,0)",null,null,null,null,"Yes","SAT"]
{"$rows_left_out":305}
{"sheet":"Preparer declaration ","index":3,"n_rows":52,"n_cols":15,"rows_kept":52,"cut":false,"hidden":false,"merged":[[47,2,47,3],[42,12,42,13],[42,14,42,15],[43,2,43,3],[43,4,43,5],[43,6,43,7],[43,8,43,9],[43,10,43,11],[43,12,43,13],[43,14,43,15],[42,2,42,3],[42,4,42,5],[42,6,42,7],[42,8,42,9],[42,10,42,11],[35,2,35,3],[38,6,38,7],[20,2,20,7],[9,2,9,7],[13,2,13,9],[17,2,17,7],[23,2,26,10],[28,4,28,6],[30,2,33,11]]}
[]
[null,null,"Preparer Declaration"]
[]
[null,null,"Contact details of person completing the form\n"]
[]
[null,null,"Please enter these details, so DFE/ESFA can contact you if there are any questions."]
[]
[null,null,"Contact name:"]
[]
[]
[]
[null,null,"Contact email address:"]
[]
[]
[]
[null,null,"Contact phone number:"]
[]
[]
[]
[null,null,"Job title:"]
[]
[]
[null,null,"Are there any other comments you wish to add in relation to this submission?"]
[]
[]
[]
[]
[]
[null,null,"Date:"]
[]
{"$rows_left_out":23}
{"sheet":"Approver declaration","index":4,"n_rows":62,"n_cols":21,"rows_kept":62,"cut":false,"hidden":false,"merged":[[58,2,58,3],[53,12,53,13],[53,14,53,15],[54,2,54,3],[54,4,54,5],[54,6,54,7],[54,8,54,9],[54,10,54,11],[54,12,54,13],[54,14,54,15],[53,2,53,3],[53,4,53,5],[53,6,53,7],[53,8,53,9],[53,10,53,11],[50,6,50,7],[46,2,47,11],[36,2,36,10],[22,4,22,9],[26,4,26,11],[37,4,37,6],[44,2,44,11],[40,2,42,10],[40,12,42,16],[8,2,8,7],[12,2,12,9],[16,2,16,7],[32,2,35,10]]}
[]
[null,null,"Academy Trust Declaration (approver)"]
[]
[null,null,"Contact details of person completing the form\n"]
[null,null,"Please enter these details, so DFE/ESFA can contact you if there are any questions."]
[]
[null,null,"Contact name:"]
[]
[]
[]
[null,null,"Contact email address:"]
[]
[]
[]
[null,null,"Contact phone number:"]
[]
[]
[]
[null,null,"Are you the Accounting Officer?",null,null,null,"No"]
[]
[null,null,null,null,"Name of Accounting Officer (if different to name above):"]
[]
[]
[]
[null,null,null,null,"E-mail address:"]
[]
[]
[]
[]
[null,null,"Approve or reject submission?",null,null,null,"Reject"]
{"$rows_left_out":33}
{"sheet":"Min Max table","index":5,"n_rows":194,"n_cols":4,"rows_kept":194,"cut":false,"hidden":false,"merged":[]}
["Table of min and max values"]
[]
["Line no.","Minimum value","Maximum value","Description"]
[101,{"$f":"-100000","v":-100000},{"$f":"100000","v":100000},"Rates reclaim"]
[102,0,{"$f":"800000","v":800000},"General Academy Grant (GAG) (excluding Student Service Grant)"]
[103,0,{"$f":"100000","v":100000},"Student Services Grant (Academy Post 16 Bursary Funding)"]
[105,0,100000,"Start Up Grants"]
[108,0,100000,"Pupil Premium & Service Premium"]
[132,{"$f":"-100000","v":-100000},100000,"Pupil Number Adjustment"]
[135,0,100000,"Other DfE/ESFA revenue grants"]
[136,0,100000,"Universal Infant Free School Meals"]
[137,0,100000,"Insurance"]
[138,0,{"$f":"300000","v":300000},"Sponsor Capacity Grant"]
[150,{"$f":"-100000","v":-100000},{"$f":"300000","v":300000},"Other DfE/ESFA family revenue Grants"]
[199,{"$f":"-300000","v":-300000},{"$f":"2200000","v":2200000},"Total DfE/ESFA revenue Income"]
[200,{"$f":"-400000","v":-400000},{"$f":"100000","v":100000},"Local authority revenue income"]
[205,-400000,{"$f":"100000","v":100000},"Other government grants"]
[210,-400000,{"$f":"100000","v":100000},"Income from trading activities"]
[211,-400000,{"$f":"100000","v":100000},"Income from trading activities"]
[212,-400000,{"$f":"400000","v":400000},"Revenue surplus transfer of an existing academy into the trust"]
[215,-400000,{"$f":"400000","v":400000},"Revenue surplus transfer to academy on conversion"]
[218,{"$f":"-800000","v":-800000},{"$f":"800000","v":800000},"Subtotal transfers surplus"]
[220,0,{"$f":"100000","v":100000},"Other income, including investment income"]
[250,{"$f":"-1600000","v":-1600000},{"$f":"500000","v":500000},"Total Other revenue Income"]
[255,{"$f":"-400000","v":-400000},{"$f":"400000","v":400000},"Transfers between Revenue and Capital (line 585)"]
[298,null,null,"Total Revenue Income"]
[299,{"$f":"-60","v":-60},{"$f":"100","v":100},"Proportion of revenue income that will come from a public body"]
[310,0,{"$f":"800000","v":800000},"Wages and Salaries"]
[311,0,{"$f":"200000","v":200000},"Social Security Costs"]
[320,0,{"$f":"200000","v":200000},"Pension Cost: Teaching staff"]
{"$rows_left_out":165}
{"sheet":"Trust validations table","index":6,"n_rows":143,"n_cols":5,"rows_kept":143,"cut":false,"hidden":false,"merged":[]}
["Validations table"]
["Trust responses to queries",null,"Please complete your answers in this table. You can then review your answers and paste into the on line form."]
[]
[]
["No of validations outstanding",null,{"$f":"COUNTIF('BFR3Y 2020'!E29:E334,\"=Check- see columns N-U for info\")","v":8}]
["No of finance questions outstanding",null,{"$f":"COUNTIF('BFR3Y 2020'!$E$16:$E$20,\"Please respond in the validations table\")+'Organisation user'!U24","v":0}]
[]
["Query reference",null,"Query","Trust Response","STATUS"]
[]
[]
["FQ1",{"$f":"RIGHT(A11,2)","v":"Q1"}]
["FQ2","Q2"]
["FQ3","Q3"]
["FQ4","Q4"]
["FQ5",{"$f":"RIGHT(A15,2)","v":"Q5"},{"$f":"IF(VLOOKUP($A15,'BFR3Y 2020'!$X$1:$AA$337,3,FALSE)=0,\"\",VLOOKUP($A15,'BFR3Y 2020'!$X$1:$AA$336,3,FALSE))","v":""},null,{"$f":"IF(C15=\"\",\"OK\",IF(D15=\"\",\"Response Outstanding\",\"Response Provided\"))","v":"OK"}]
["FQ6",{"$f":"RIGHT(A16,2)","v":"Q6"},{"$f":"IF(VLOOKUP($A16,'BFR3Y 2020'!$X$1:$AA$337,3,FALSE)=0,\"\",VLOOKUP($A16,'BFR3Y 2020'!$X$1:$AA$336,3,FALSE))","v":"Please provide a short summary of this and and where any of these are shown in the return."}]
["QU1",1,{"$f":"IF(VLOOKUP($A17,'BFR3Y 2020'!$X$29:$AA$337,3,FALSE)=0,\"\",VLOOKUP($A17,'BFR3Y 2020'!$X$29:$AA$336,3,FALSE))","v":"You have forecast zero for GAG income for next year (102).  Please provide an explanation why this value is zero?"},null,"Response Outstanding"]
["QU2",2,{"$f":"IF(VLOOKUP($A18,'BFR3Y 2020'!$X$29:$AA$337,3,FALSE)=0,\"\",VLOOKUP($A18,'BFR3Y 2020'!$X$29:$AA$336,3,FALSE))","v":""},null,"OK"]
["QU3",3,{"$f":"IF(VLOOKUP($A19,'BFR3Y 2020'!$X$29:$AA$337,3,FALSE)=0,\"\",VLOOKUP($A19,'BFR3Y 2020'!$X$29:$AA$336,3,FALSE))","v":"Your Yr 1 or Y2 income or expenditure totals in either year is NIL. Is this correct?"},null,"Response Outstanding"]
["QU4",4,{"$f":"IF(VLOOKUP($A20,'BFR3Y 2020'!$X$29:$AA$337,3,FALSE)=0,\"\",VLOOKUP($A20,'BFR3Y 2020'!$X$29:$AA$336,3,FALSE))","v":"Your Yr 1 or Y2 income or expenditure totals in either year is NIL. Is this correct?"},null,"Response Outstanding"]
["QU5",5,{"$f":"IF(VLOOKUP($A21,'BFR3Y 2020'!$X$29:$AA$337,3,FALSE)=0,\"\",VLOOKUP($A21,'BFR3Y 2020'!$X$29:$AA$336,3,FALSE))","v":""},null,"OK"]
["QU6",6,{"$f":"IF(VLOOKUP($A22,'BFR3Y 2020'!$X$29:$AA$337,3,FALSE)=0,\"\",VLOOKUP($A22,'BFR3Y 2020'!$X$29:$AA$336,3,FALSE))","v":""},null,"OK"]
["QU7",7,{"$f":"IF(VLOOKUP($A23,'BFR3Y 2020'!$X$29:$AA$337,3,FALSE)=0,\"\",VLOOKUP($A23,'BFR3Y 2020'!$X$29:$AA$336,3,FALSE))","v":"Please provide details where the opening balance (410) has been derived- this should be derived from the prior year Accounts Return."},null,"Response Outstanding"]
["QU8",8,{"$f":"IF(VLOOKUP($A24,'BFR3Y 2020'!$X$29:$AA$337,3,FALSE)=0,\"\",VLOOKUP($A24,'BFR3Y 2020'!$X$29:$AA$336,3,FALSE))","v":"Please explain why the balance brought forward from previous period (410) is £0"},null,"Response Outstanding"]
["QU9",9,{"$f":"IF(VLOOKUP($A25,'BFR3Y 2020'!$X$29:$AA$337,3,FALSE)=0,\"\",VLOOKUP($A25,'BFR3Y 2020'!$X$29:$AA$336,3,FALSE))","v":""},null,"OK"]
["QU10",10,{"$f":"IF(VLOOKUP($A26,'BFR3Y 2020'!$X$29:$AA$337,3,FALSE)=0,\"\",VLOOKUP($A26,'BFR3Y 2020'!$X$29:$AA$336,3,FALSE))","v":""},null,"OK"]
["QU11",11,{"$f":"IF(VLOOKUP($A27,'BFR3Y 2020'!$X$29:$AA$337,3,FALSE)=0,\"\",VLOOKUP($A27,'BFR3Y 2020'!$X$29:$AA$336,3,FALSE))","v":""},null,"OK"]
["QU12",12,{"$f":"IF(VLOOKUP($A28,'BFR3Y 2020'!$X$29:$AA$337,3,FALSE)=0,\"\",VLOOKUP($A28,'BFR3Y 2020'!$X$29:$AA$336,3,FALSE))","v":""},null,"OK"]
["QU13",13,{"$f":"IF(VLOOKUP($A29,'BFR3Y 2020'!$X$29:$AA$337,3,FALSE)=0,\"\",VLOOKUP($A29,'BFR3Y 2020'!$X$29:$AA$336,3,FALSE))","v":""},null,"OK"]
["QU14",14,{"$f":"IF(VLOOKUP($A30,'BFR3Y 2020'!$X$29:$AA$337,3,FALSE)=0,\"\",VLOOKUP($A30,'BFR3Y 2020'!$X$29:$AA$336,3,FALSE))","v":""},null,"OK"]
{"$rows_left_out":113}