Application Channel,Representative Status,Scheme,Gender,Age,Main Injury,Rejection Reasons,First Decision,Review Decision,Appeal Decision,Final Decision, Value of Compensation payment ,Number of days to First Decision
Online,Not represented,2012 Scheme,Female,41,,Injury does not qualify for compensation,Nil ,,,Nil,  ,148
Online,Not represented,2012 Scheme,Male,48,,Multiple,Nil ,,,Nil,  ,413
Online,Represented,2012 Scheme,Male,27,,Injury does not qualify for compensation,Nil ,,,Nil,  ,357
Online,Represented,2012 Scheme,Male,33,,Multiple,Nil ,,,Nil,  ,732
Online,Represented,2012 Scheme,Female,37,,"Mainly, injury did not result from crime of violence",Nil ,,,Nil,  ,312
Online,Represented,2012 Scheme,Male,29,,"Mainly, injury did not result from crime of violence",Nil ,,,Nil,  ,50
Online,Represented,2012 Scheme,Male,37,,Multiple,Nil ,,,Nil,  ,422
Online,Not represented,2012 Scheme,Male,47,,Applicants criminal record/character,Nil ,,,Nil,  ,493
Online,Not represented,2012 Scheme,Female,44,,"Mainly, injury did not result from crime of violence",Nil ,,,Nil,  ,100
Online,Represented,2012 Scheme,Male,39,,Injury does not qualify for compensation,Nil ,,,Nil,  ,330
Online,Not represented,2012 Scheme,Female,35,,Injury does not qualify for compensation,Nil ,,,Nil,  ,325
Online,Not represented,2012 Scheme,Male,58,,Multiple,Nil ,,,Nil,  ,441
Online,Represented,2012 Scheme,Male,47,,"Mainly, injury did not result from crime of violence",Nil ,,,Nil,  ,113
Online,Represented,2012 Scheme,Male,23,,Applicants criminal record/character,Nil ,,,Nil,  ,161
Online,Not represented,2012 Scheme,Female,1,,Injury does not qualify for compensation,Nil ,,,Nil,  ,234
Online,Represented,2012 Scheme,Female,6,,"Mainly, injury did not result from crime of violence",Nil ,,,Nil,  ,308
Online,Represented,2012 Scheme,Female,5,,"Mainly, injury did not result from crime of violence",Nil ,,,Nil,  ,74
Online,Not represented,2012 Scheme,Female,25,,"Mainly, injury did not result from crime of violence",Nil ,,,Nil,  ,442
Online,Not represented,2012 Scheme,Male,40,,Injury does not qualify for compensation,Nil ,,,Nil,  ,649
Online,Not represented,2012 Scheme,Female,26,,Previous claim for same injury,Nil ,,,Nil,  ,45
Online,Not represented,2012 Scheme,Male,30,,Multiple,Nil ,,,Nil,  ,221
Online,Not represented,2012 Scheme,Female,42,,Claim not submited within time limit,Nil ,,,Nil,  ,142
Online,Not represented,2012 Scheme,Male,27,,"Mainly, injury did not result from crime of violence",Nil ,,,Nil,  ,69
Online,Not represented,2012 Scheme,Male,21,,Multiple,Nil ,,,Nil,  ,6
Online,Represented,2012 Scheme,Female,14,,Previous claim for same injury,Nil ,,,Nil,  ,150
Telephone ,Not represented,2012 Scheme,Male,35,,Failure to Cooperate with the Authority,Nil ,,,Nil,  ,1002
Online,Not represented,2012 Scheme,Male,13,,"Mainly, injury did not result from crime of violence",Nil ,,,Nil,  ,282
Online,Not represented,2012 Scheme,Male,28,,Injury does not qualify for compensation,Nil ,,,Nil,  ,617
Online,Not represented,2012 Scheme,Male,47,,Multiple,Nil ,,,Nil,  ,268
Online,Not represented,2012 Scheme,Female,17,,Multiple,Nil ,,,Nil,  ,399
Online,Not represented,2012 Scheme,Male,19,,Multiple,Nil ,,,Nil,  ,94
Online,Not represented,2012 Scheme,Male,56,,Failure to Cooperate with the Authority,Nil ,,,Nil,  ,535
Online,Represented,2012 Scheme,Male,29,,Applicants criminal record/character,Nil ,,,Nil,  ,85
Online,Represented,2012 Scheme,Male,31,,Failure to Cooperate with the Authority,Nil ,,,Nil,  ,94
Online,Represented,2012 Scheme,Male,58,,Failure to Cooperate with the Authority,Nil ,,,Nil,  ,76
Online,Represented,2012 Scheme,Female,20,,Failure to Cooperate with police in bringing assailant to justice,Nil ,,,Nil,  ,111
Online,Not represented,2012 Scheme,Female,25,,Failure to Cooperate with the Authority,Nil ,,,Nil,  ,156
Online,Represented,2012 Scheme,Male,31,,Injury does not qualify for compensation,Nil ,,,Nil,  ,464
Online,Represented,2012 Scheme,Male,32,,"Conduct before, during or after the incident",Nil ,,,Nil,  ,55
Online,Represented,2012 Scheme,Male,24,,Applicants criminal record/character,Nil ,,,Nil,  ,15
Online,Not represented,2012 Scheme,Male,45,,,Nil ,Nil,,,  ,309
Online,Represented,2012 Scheme,Male,37,SEXUAL ASSAULT CHILD LEVEL B12 EXCEEDING 3 YEARS,,Full,,,Full," �22,000 ",137
Online,Represented,2012 Scheme,Male,21,FRAC MAND/MAX NO OP LEVEL A2,,Full,,,Full," �1,450 ",142
Online,Not represented,2012 Scheme,Female,50,SEXUAL ASSAULT 3YEARS LEVEL B11,,Full,,,Full," �16,500 ",246
Online,Represented,2012 Scheme,Female,7,SEXUAL ASSAULT CHILD LEVEL B3,,Full,,,Full," �2,000 ",441
Online,Represented,2012 Scheme,Male,38,FRAC MAND/MAX NO OP LEVEL A2,,Full,,,Full," �1,475 ",302
Online,Not represented,2012 Scheme,Male,27,FRAC MAND/MAX OP REQD LEVEL A3,,Full,,,Full," �1,800 ",344
Online,Not represented,2008 Scheme,Female,40,SEXUAL ASSAULT CHILD LEVEL 15,,Nil ,Full,,Full," �16,500 ",338
Online,Represented,2012 Scheme,Male,42,SEXUAL ASSAULT CHILD LEVEL B12 EXCEEDING 3 YEARS,,Full,,,Full," �22,000 ",310
Online,Not represented,2012 Scheme,Female,46,SEXUAL ASSAULT LEVEL B9,,Full,,,Full," �11,000 ",289
Online,Not represented,2012 Scheme,Female,25,SCAR FACE SIGNIFICANT DISFIGUR,,Full,Full,,Full," �2,400 ",250
Online,Not represented,2012 Scheme,Female,24,SCAR FACE SERIOUS DISFIGUREMENT,,Full,,,Full," �11,000 ",229
Online,Represented,2012 Scheme,Female,17,SEXUAL ASSAULT CHILD LEVEL B4,,Full,,,Full," �3,600 ",111
Online,Represented,2012 Scheme,Female,19,SEXUAL ASSAULT CHILD LEVEL B11,,Full,,,Full," �16,500 ",20
Online,Represented,2012 Scheme,Female,27,FRACT WRIST COLLES SUBST. REC,,Nil ,Full,,Full," �2,400 ",449
Online,Not represented,2001 Scheme,Male,32,,Previous claim for same injury,Nil ,,,Nil,  ,5373
Online,Represented,2001 Scheme,Male,33,,Applicant withdrew application,Nil ,,,Nil,  ,3961
Online,Represented,2001 Scheme,Male,55,,Applicant withdrew application,Nil ,,,Nil,  ,4136
Online,Represented,2001 Scheme,Male,15,,"Mainly, injury did not result from crime of violence",Nil ,,,Nil,  ,5772
Online,Represented,1996 Scheme,Male,28,,Applicant withdrew application,Nil ,Nil,,Nil,  ,105
Online,Represented,1996 Scheme,Male,14,,Failure to Cooperate with the Authority,Nil ,,,Nil,  ,7756
Online,Not represented,2001 Scheme,Male,32,,Applicant withdrew application,Nil ,,,Nil,  ,3778
Online,Represented,2001 Scheme,Female,18,,"Mainly, injury did not result from crime of violence",Nil ,,,Nil,  ,4092
Online,Represented,2001 Scheme,Male,35,,"Mainly, injury did not result from crime of violence",Nil ,,,Nil,  ,4023
Online,Represented,1996 Scheme,Female,8,,Applicant withdrew application,Nil ,Nil,,Nil,  ,170
Telephone ,Represented,1996 Scheme,Female,31,,Applicant withdrew application,Nil ,Nil,,Nil,  ,59
Telephone ,Not represented,1996 Scheme,Male,35,,"Mainly, injury did not result from crime of violence",Nil ,Nil,,Nil,  ,310
Online,Not represented,2001 Scheme,Female,29,,"Mainly, injury did not result from crime of violence",Nil ,Nil,,Nil,  ,158
Online,Represented,2001 Scheme,Female,31,,Applicant withdrew application,Nil ,Nil,,Nil,  ,163
Online,Represented,2001 Scheme,Male,61,,Applicant withdrew application,Nil ,Nil,,Nil,  ,170
Online,Represented,2001 Scheme,Male,29,,Applicant withdrew application,Nil ,Nil,,Nil,  ,837
Online,Not represented,2001 Scheme,Female,19,,Previous claim for same injury,Nil ,Nil,,Nil,  ,148
Online,Not represented,2012 Scheme,Male,15,,Injury does not qualify for compensation,Nil ,Nil,,Nil,  ,244
Online,Not represented,2012 Scheme,Male,38,,Applicants criminal record/character,Nil ,Nil,,Nil,  ,616
Online,Not represented,2012 Scheme,Female,46,,Applicants criminal record/character,Nil ,Nil,,Nil,  ,215
Online,Represented,2012 Scheme,Female,35,,Multiple,Nil ,Nil,,Nil,  ,625
Online,Not represented,2012 Scheme,Female,28,,Multiple,Nil ,Nil,,Nil,  ,519
Online,Not represented,2012 Scheme,Male,29,,"Mainly, injury did not result from crime of violence",Nil ,Nil,,Nil,  ,411
Online,Represented,2008 Scheme,Female,22,,Failure to Cooperate with the Authority,Nil ,Nil,,Nil,  ,245
Online,Represented,2012 Scheme,Female,27,,Multiple,Nil ,Nil,,Nil,  ,893
Online,Not represented,2012 Scheme,Female,71,,"Mainly, injury did not result from crime of violence",Nil ,Nil,,Nil,  ,98
Online,Not represented,2012 Scheme,Female,47,,Multiple,Nil ,Nil,,Nil,  ,337
Online,Not represented,2001 Scheme,Female,32,,Applicant withdrew application,Nil ,,,Nil,  ,3998
Online,Not represented,2001 Scheme,Male,78,,Previous claim for same injury,Nil ,,,Nil,  ,5128
Telephone ,Not represented,2012 Scheme,Male,25,,Injury does not qualify for compensation,Nil ,Nil,,Nil,  ,749
Online,Represented,2012 Scheme,Male,47,,Failure to Cooperate with police in bringing assailant to justice,Nil ,Nil,,Nil,  ,26
Online,Represented,2012 Scheme,Male,49,,Failure to Cooperate with police in bringing assailant to justice,Nil ,Nil,,Nil,  ,167
Online,Represented,2012 Scheme,Male,30,,Multiple,Nil ,Nil,,Nil,  ,12
Online,Represented,2012 Scheme,Male,13,,Failure to Cooperate with the Authority,Nil ,Nil,,Nil,  ,154
Online,Represented,2008 Scheme,Female,53,,Applicant withdrew application,Nil ,,,Nil,  ,2177
Online,Represented,2008 Scheme,Male,49,,"Applicant died of an unrelated cause before the claim was settled. No qualifying relatives, or qualifying relatives were not eligible for compensation under the terms of the Scheme",Nil ,,,Nil,  ,2267
Online,Represented,2008 Scheme,Male,61,,Injury does not qualify for compensation,Nil ,Nil,,Nil,  ,2140
Telephone ,Not represented,2012 Scheme,Male,36,,Applicants criminal record/character,Nil ,,,Nil,  ,44
Telephone ,Not represented,2012 Scheme,Male,26,,Applicants criminal record/character,Nil ,,,Nil,  ,44
Online,Represented,2012 Scheme,Female,4,,"Mainly, injury did not result from crime of violence",Nil ,,,Nil,  ,838
Online,Represented,2012 Scheme,Male,38,,Multiple,Nil ,,,Nil,  ,194
Online,Not represented,2012 Scheme,Female,56,,Failure to Cooperate with the Authority,Nil ,,,Nil,  ,281
Online,Not represented,2012 Scheme,Male,34,,Injury does not qualify for compensation,Nil ,,,Nil,  ,15
Online,Not represented,2012 Scheme,Female,23,,Injury does not qualify for compensation,Nil ,,,Nil,  ,30
Online,Represented,2012 Scheme,Male,36,,Not a qualifying claimant for a bereavement award,Nil ,,,Nil,  ,144
Online,Not represented,2012 Scheme,Female,18,,"Mainly, injury did not result from crime of violence",Nil ,,,Nil,  ,29
Online,Not represented,2012 Scheme,Male,22,,Failure to report without delay,Nil ,,,Nil,  ,29
Online,Not represented,2012 Scheme,Male,30,,Failure to report without delay,Nil ,,,Nil,  ,30
Online,Represented,2012 Scheme,Male,34,,Multiple,Nil ,,,Nil,  ,851
Online,Not represented,2012 Scheme,Male,26,,Failure to report without delay,Nil ,,,Nil,  ,30
Online,Not represented,2012 Scheme,Male,28,,Claim not submited within time limit,Nil ,,,Nil,  ,30
Online,Not represented,2012 Scheme,Female,61,,"Mainly, injury did not result from crime of violence",Nil ,,,Nil,  ,484
Online,Not represented,2012 Scheme,Female,40,,Injury does not qualify for compensation,Nil ,,,Nil,  ,1417
Online,Represented,2012 Scheme,Female,41,SCAR FACE SIGNIFICANT DISFIGUR,,Full,,,Full," �2,400 ",310
Online,Not represented,2012 Scheme,Male,39,MODT. DAMAGE TENDON SIGNF. DIS,,Full,,,Full," �2,850 ",189
Online,Represented,2012 Scheme,Male,42,,Applicants criminal record/character,Nil ,,,Nil,  ,668
Online,Not represented,2012 Scheme,Female,78,,"Mainly, injury did not result from crime of violence",Nil ,,,Nil,  ,42
Online,Not represented,2012 Scheme,Male,30,,Injury does not qualify for compensation,Nil ,,,Nil,  ,1164
Online,Not represented,2012 Scheme,Male,24,,Injury does not qualify for compensation,Nil ,,,Nil,  ,305
Online,Not represented,2012 Scheme,Female,49,,Multiple,Nil ,,,Nil,  ,335
Online,Not represented,2012 Scheme,Female,40,,Injury does not qualify for compensation,Nil ,,,Nil,  ,135
Online,Not represented,2012 Scheme,Male,25,,"Mainly, injury did not result from crime of violence",Nil ,,,Nil,  ,270
Online,Not represented,2012 Scheme,Male,27,SIGNIFICANT SCARRING TO TORSO,,Full,,,Full," �1,000 ",290
Online,Represented,2012 Scheme,Female,35,DISABLE MENTAL INJURY LEVEL A9,,Full,,,Full," �13,500 ",1096
Online,Not represented,2012 Scheme,Female,25,SEXUAL ASSAULT LEVEL B9,,Full,,,Full," �11,000 ",594
Online,Not represented,2012 Scheme,Female,26,SCAR FACE SIGNIFICANT DISFIGUR,,Nil ,Full,,Full," �2,400 ",340
Online,Not represented,2012 Scheme,Female,69,SIGN. SCARRING TO UPPER LIMBS,,Full,,,Full," �1,000 ",319
Online,Represented,2012 Scheme,Male,27,,Failure to Cooperate with the Authority,Nil ,Nil,,Nil,  ,640
Online,Not represented,2012 Scheme,Male,26,SIGNF. SCARRING LOWER LIMBS,,Full,,,Full, �950 ,302
Online,Not represented,2012 Scheme,Male,26,SEVERE DAMAGE TENDON SUBST.REC,,Full,,,Full," �1,500 ",245
Online,Represented,2012 Scheme,Male,29,FRAC ZYGOMA OP REQD CONT DISB,,Full,,,Full," �4,445 ",344
Online,Not represented,2012 Scheme,Male,26,SEVERE DAMAGE TENDON SUBST.REC,,Full,,,Full," �1,800 ",499
Telephone ,Not represented,2012 Scheme,Male,40,MODERATE BRAIN DAMAGE-SEVERE,,Full,,,Full," �110,000 ",1487
Online,Represented,2012 Scheme,Male,14,DISABLE MENTAL INJURY LEVEL A4,,Full,Full,,Full," �2,400 ",881
Online,Not represented,2012 Scheme,Female,16,SEXUAL ASSAULT CHILD LEVEL B11,,Full,,,Full," �16,500 ",133
Online,Represented,2012 Scheme,Female,27,SERIOUS SCARRING TO UPPER LIMB,,Full,,,Full," �3,750 ",281
Online,Not represented,2012 Scheme,Male,29,SCAR FACE SIGNIFICANT DISFIGUR,,Nil ,Full,,Full," �2,400 ",118
Telephone ,Represented,2012 Scheme,Female,5,MODERATE BRAIN DAMAGE-SEVERE,,Full,,,Full," �500,000 ",1470
Online,Represented,2012 Scheme,Male,25,SCAR FACE SIGNIFICANT DISFIGUR,,Full,,,Full," �2,400 ",89
Online,Represented,2012 Scheme,Female,14,SEXUAL ASSAULT CHILD LEVEL B9,,Full,,,Full," �11,000 ",268
Online,Not represented,2012 Scheme,Female,42,SEXUAL ASSAULT CHILD LEVEL B12 EXCEEDING 3 YEARS,,Full,,,Full," �22,000 ",15
Online,Not represented,2012 Scheme,Male,55,FRAC MAND/MAX NO OP LEVEL A2,,Full,,,Full," �1,500 ",88
Online,Not represented,2012 Scheme,Male,32,PERM TINNITUS NOT VERY SEVERE,,Full,,,Full," �6,690 ",383
Online,Not represented,2012 Scheme,Female,38,SEXUAL ASSAULT CHILD LEVEL B12 EXCEEDING 3 YEARS,,Full,,,Full," �22,000 ",182
Online,Not represented,2012 Scheme,Male,31,PERMANENT NUMBNESS MODERATE,,Full,,,Full," �1,750 ",342
Online,Represented,2012 Scheme,Female,39,SEXUAL ASSAULT CHILD LEVEL B11,,Full,,,Full," �16,500 ",81
Online,Not represented,2012 Scheme,Male,19,SEXUAL ASSAULT 3YEARS LEVEL B11,,Full,,,Full," �16,500 ",64
Online,Not represented,2012 Scheme,Male,39,BLUR/DOUBLE VISION SLIGHT,,Full,,,Full," �2,850 ",617
Online,Not represented,2012 Scheme,Male,35,SEXUAL ASSAULT CHILD LEVEL B11,,Full,,,Full," �16,500 ",98
Online,Represented,2012 Scheme,Male,27,MINOR HEAD INJURY OVER 28 WEEKS,,Full,,,Full," �1,500 ",759
Online,Not represented,2012 Scheme,Female,49,SEXUAL ASSAULT CHILD LEVEL B9,,Full,,,Full," �11,000 ",229
Online,Not represented,2012 Scheme,Male,26,FRAC MAND/MAX OP REQD LEVEL A3,,Full,,,Full," �1,800 ",280
Online,Represented,2012 Scheme,Female,24,SCAR FACE SIGNIFICANT DISFIGUR,,Full,,,Full," �2,850 ",514
Online,Not represented,2012 Scheme,Female,36,FATAL-MULTIPLE QUALIFYING,,Full,,,Full," �18,138 ",491
Online,Not represented,2012 Scheme,Female,28,SEXUAL ASSAULT LEVEL B9,,Full,,,Full," �11,000 ",23
Online,Represented,2012 Scheme,Male,37,LOSS OF 2 OR 3 FRONT TEETH,,Full,,,Full," �2,400 ",371
Online,Not represented,2012 Scheme,Female,37,SEXUAL ASSAULT LEVEL B9,,Full,,,Full," �11,000 ",145
Online,Represented,2012 Scheme,Male,21,LOSS OF FRONT TOOTH,,Full,,,Full," �1,500 ",323
Online,Not represented,2012 Scheme,Female,28,SEXUAL ASSAULT CHILD LEVEL B12 EXCEEDING 3 YEARS,,Nil ,Full,,Full," �27,500 ",140
Online,Not represented,2012 Scheme,Male,29,COLLAPSED LUNG,,Full,,,Full," �2,100 ",251
Online,Represented,2012 Scheme,Female,15,SEXUAL ASSAULT CHILD LEVEL B9,,Full,,,Full," �11,000 ",87
Online,Not represented,2012 Scheme,Female,21,SEXUAL ASSAULT CHILD LEVEL B11,,Full,,,Full," �16,500 ",305
Online,Not represented,2012 Scheme,Male,19,FRAC/DISL ANKLE SUB RECOVERY,,Full,,,Full," �2,400 ",340
Online,Not represented,2012 Scheme,Male,21,FRAC MAND/MAX NO OP LEVEL A2,,Full,,,Full," �1,500 ",165
Telephone ,Not represented,2012 Scheme,Male,27,SCAR FACE SIGNIFICANT DISFIGUR,,Full,,,Full," �3,000 ",854
Online,Not represented,2012 Scheme,Female,25,SEXUAL ASSAULT CHILD LEVEL B5,,Full,,,Full," �4,400 ",155
Online,Represented,2012 Scheme,Male,16,SCAR NECK SIGNIFICANT DISFIGUR,,Full,,,Full," �1,950 ",466
Online,Represented,2012 Scheme,Female,44,SCAR FACE SIGNIFICANT DISFIGUR,,Full,,,Full," �2,400 ",127
Online,Not represented,2012 Scheme,Male,30,SCAR FACE SIGNIFICANT DISFIGUR,,Full,,,Full," �2,400 ",322
Online,Not represented,2012 Scheme,Male,29,FRAC MAND/MAX OP REQD LEVEL A3,,Full,,,Full," �2,220 ",266
Online,Represented,2012 Scheme,Male,35,,"Conduct before, during or after the incident",Nil ,,,Nil,  ,62
Online,Not represented,2012 Scheme,Female,45,,Injury does not qualify for compensation,Nil ,,,Nil,  ,4
Online,Not represented,2012 Scheme,Male,49,,Failure to Cooperate with the Authority,Nil ,,,Nil,  ,242
Online,Not represented,2012 Scheme,Male,27,,Injury does not qualify for compensation,Nil ,,,Nil,  ,653
Online,Represented,2012 Scheme,Female,27,,Failure to Cooperate with police in bringing assailant to justice,Nil ,,,Nil,  ,36
Online,Not represented,2012 Scheme,Male,51,,Injury does not qualify for compensation,Nil ,,,Nil,  ,612
Online,Represented,2012 Scheme,Male,47,,Multiple,Nil ,,,Nil,  ,77
Online,Not represented,2012 Scheme,Female,24,,Failure to Cooperate with the Authority,Nil ,,,Nil,  ,78
Online,Represented,2012 Scheme,Female,58,,"Mainly, injury did not result from crime of violence",Nil ,,,Nil,  ,52
Online,Represented,2012 Scheme,Female,52,,Previous claim for same injury,Nil ,,,Nil,  ,9
Online,Represented,2012 Scheme,Female,82,,Previous claim for same injury,Nil ,,,Nil,  ,10
Online,Not represented,2012 Scheme,Female,35,STRAINED BACK-13 WEEKS OR MORE,,Nil ,Full,,Full," �1,000 ",382
Online,Represented,2012 Scheme,Female,37,SEXUAL ASSAULT LEVEL B9,,Full,,,Full," �11,000 ",1630
Online,Not represented,2012 Scheme,Male,49,SEXUAL ASSAULT CHILD LEVEL B12 EXCEEDING 3 YEARS,,Full,Full,,Full," �22,000 ",203
Online,Not represented,2012 Scheme,Female,30,SEXUAL ASSAULT LEVEL B9,,Full,,,Full," �11,000 ",15
Online,Represented,2012 Scheme,Female,27,FRACTURED RADIUS SUBST. RECOV,,Full,,,Full," �1,461 ",206
Online,Not represented,2012 Scheme,Female,39,SEXUAL ABUSE EXC 3YRS LEVEL B12,,Full,,,Full," �22,000 ",447
Online,Not represented,2012 Scheme,Male,27,SEXUAL ASSAULT CHILD LEVEL B9,,Full,,,Full," �11,000 ",80
Online,Represented,2012 Scheme,Male,20,SIMPLE SKULL FRACTURE NO OP,,Full,,,Full," �1,000 ",345
Telephone ,Not represented,2012 Scheme,Male,36,FRAC MAND/MAX NO OP LEVEL A2,,Nil ,Full,,Full," �1,500 ",239
Online,Not represented,2012 Scheme,Male,44,SCAR NECK SERIOUS DISFIGUREMENT,,Full,,,Full," �4,600 ",186
Online,Not represented,2012 Scheme,Male,20,SCAR FACE SIGNIFICANT DISFIGUR,,Full,,,Full," �2,400 ",435
Online,Represented,2012 Scheme,Female,16,FATAL-MULTIPLE QUALIFYING,,Full,,,Full," �5,500 ",233
Online,Not represented,2012 Scheme,Female,45,SEXUAL ASSAULT CHILD LEVEL B4,,Full,,,Full," �3,300 ",158
Online,Not represented,2012 Scheme,Male,31,SERIOUS SCARRING TO TORSO,,Full,,,Full," �4,040 ",273
Online,Represented,2012 Scheme,Male,17,FRACTURED HUMERUS SUBST. RECOV,,Full,,,Full," �1,790 ",646
Online,Represented,2012 Scheme,Male,49,SCAR FACE SIGNIFICANT DISFIGUR,,Full,,,Full," �2,350 ",625
Online,Not represented,2012 Scheme,Male,37,SEXUAL ASSAULT CHILD LEVEL B12 EXCEEDING 3 YEARS,,Full,,,Full," �22,000 ",174
Online,Not represented,2012 Scheme,Male,47,FRAC/DISL ANKLE SUB RECOVERY,,Full,,,Full," �1,400 ",334
Online,Not represented,2012 Scheme,Female,40,PHYSICAL ABUSE ADULT - SEVERE,,Full,,,Full," �5,500 ",285
Online,Not represented,2012 Scheme,Male,38,MINOR HEAD INJURY OVER 28 WEEKS,,Full,,,Full," �1,500 ",686
Online,Represented,2012 Scheme,Male,39,DISABLE MENTAL INJURY LEVEL A9,,Nil ,Full,,Full," �20,380 ",836
Online,Not represented,2012 Scheme,Male,18,INJ REQ LAPAROTOMY ONE ORGAN,,Full,,,Full," �2,100 ",201
Online,Not represented,2012 Scheme,Male,26,ORBITAL BLOW OUT NO OPERATION,,Full,,,Full," �1,800 ",326
Online,Not represented,2012 Scheme,Male,40,FRAC MAND/MAX OP REQD LEVEL A3,,Full,,,Full," �1,800 ",361
Online,Represented,2012 Scheme,Female,21,SCAR FACE SIGNIFICANT DISFIGUR,,Full,Full,,Full," �2,400 ",647
Online,Represented,2012 Scheme,Male,38,SCAR FACE SIGNIFICANT DISFIGUR,,Nil ,Full,,Full," �1,900 ",118
Online,Not represented,2012 Scheme,Male,24,,Applicants criminal record/character,Nil ,Nil,,Nil,  ,349
Online,Not represented,2012 Scheme,Female,18,,"Mainly, injury did not result from crime of violence",Nil ,Nil,,Nil,  ,490
Online,Not represented,2012 Scheme,Male,53,,Multiple,Nil ,Nil,,Nil,  ,75
Online,Represented,2012 Scheme,Female,44,,Multiple,Nil ,Nil,,Nil,  ,495
Online,Not represented,2012 Scheme,Female,43,,Failure to Cooperate with the Authority,Nil ,Nil,,Nil,  ,266
Online,Not represented,2012 Scheme,Female,48,,Assailant would have benefited from award,Nil ,Nil,,Nil,  ,336
Online,Represented,2012 Scheme,Male,51,,Injury does not qualify for compensation,Nil ,,,Nil,  ,241
Online,Not represented,2012 Scheme,Female,48,,Multiple,Nil ,Nil,,Nil,  ,89
Online,Represented,2012 Scheme,Male,32,,Multiple,Nil ,Nil,,Nil,  ,314
Online,Represented,2012 Scheme,Female,22,,Injury does not qualify for compensation,Nil ,Nil,,Nil,  ,617
Online,Not represented,2012 Scheme,Male,37,,Claim not submited within time limit,Nil ,Nil,,Nil,  ,269
Online,Not represented,2012 Scheme,Female,55,,"Conduct before, during or after the incident",Nil ,Nil,,Nil,  ,162
Online,Not represented,2012 Scheme,Male,46,,Claim not submited within time limit,Nil ,Nil,,Nil,  ,387
Online,Represented,2012 Scheme,Male,30,,Accidental inj sustained in law enforcement: risk not justifiable,Nil ,Nil,,Nil,  ,438
Online,Represented,2008 Scheme,Female,37,,Applicant withdrew application,Nil ,,,Nil,  ,1969
Online,Not represented,2012 Scheme,Male,36,,Violence between adults in the same family,Nil ,Nil,,Nil,  ,22
Online,Not represented,2012 Scheme,Female,41,,Claim not submited within time limit,Nil ,Nil,,Nil,  ,22
Online,Represented,2012 Scheme,Female,53,,Claim not submited within time limit,Nil ,Nil,,Nil,  ,19
Online,Not represented,2012 Scheme,Male,35,,Injury does not qualify for compensation,Nil ,Nil,,Nil,  ,21
Online,Not represented,2012 Scheme,Female,47,,Injury sustained in family setting before 1 October 1979,Nil ,Nil,,Nil,  ,18
Online,Represented,2012 Scheme,Male,22,,Failure to report without delay,Nil ,Nil,,Nil,  ,15
Online,Not represented,2012 Scheme,Male,58,,Injury does not qualify for compensation,Nil ,Nil,,Nil,  ,7
Online,Not represented,2012 Scheme,Female,27,,Injury does not qualify for compensation,Nil ,Nil,,Nil,  ,6
Online,Not represented,2012 Scheme,Male,56,,Injury does not qualify for compensation,Nil ,Nil,,Nil,  ,4
Online,Not represented,2012 Scheme,Male,48,,Claim not submited within time limit,Nil ,Nil,,Nil,  ,26
Online,Not represented,2012 Scheme,Male,23,,Claim not submited within time limit,Nil ,Nil,,Nil,  ,3
Online,Represented,2012 Scheme,Female,24,,Previous claim for same injury,Nil ,,,Nil,  ,288
Online,Represented,2012 Scheme,Male,46,,Injury does not qualify for compensation,Nil ,,,Nil,  ,840
Online,Represented,2012 Scheme,Female,23,SEXUAL ASSAULT LEVEL B9,,Full,,,Full," �11,000 ",523
Online,Not represented,2012 Scheme,Male,25,SCAR HEAD SIGNIFICANT DISF,,Nil ,Full,,Full," �1,500 ",280
Online,Represented,2012 Scheme,Male,44,,Failure to Cooperate with the Authority,Nil ,,,Nil,  ,135